lucene-dev mailing list archives

Site index · List index
Message view « Date » · « Thread »
Top « Date » · « Thread »
From Policeman Jenkins Server <jenk...@thetaphi.de>
Subject [JENKINS] Lucene-Solr-4.x-Windows (64bit/jdk1.7.0_25) - Build # 3085 - Failure!
Date Sat, 17 Aug 2013 03:19:31 GMT
Build: http://jenkins.thetaphi.de/job/Lucene-Solr-4.x-Windows/3085/
Java: 64bit/jdk1.7.0_25 -XX:+UseCompressedOops -XX:+UseSerialGC

14 tests failed.
REGRESSION:  org.apache.solr.cloud.AliasIntegrationTest.testDistribSearch

Error Message:
Unexpected internal error near index 1 \  ^

Stack Trace:
java.util.regex.PatternSyntaxException: Unexpected internal error near index 1
\
 ^
	at __randomizedtesting.SeedInfo.seed([458667C837549B73:C460E9D0400BFB4F]:0)
	at java.util.regex.Pattern.error(Pattern.java:1924)
	at java.util.regex.Pattern.compile(Pattern.java:1671)
	at java.util.regex.Pattern.<init>(Pattern.java:1337)
	at java.util.regex.Pattern.compile(Pattern.java:1022)
	at java.lang.String.split(String.java:2313)
	at java.lang.String.split(String.java:2355)
	at org.apache.solr.cloud.AbstractFullDistribZkTestBase.getRelativeSolrHomePath(AbstractFullDistribZkTestBase.java:485)
	at org.apache.solr.cloud.AbstractFullDistribZkTestBase.createJetty(AbstractFullDistribZkTestBase.java:463)
	at org.apache.solr.cloud.AbstractFullDistribZkTestBase.createJettys(AbstractFullDistribZkTestBase.java:348)
	at org.apache.solr.cloud.AbstractFullDistribZkTestBase.createServers(AbstractFullDistribZkTestBase.java:294)
	at org.apache.solr.BaseDistributedSearchTestCase.testDistribSearch(BaseDistributedSearchTestCase.java:833)
	at sun.reflect.NativeMethodAccessorImpl.invoke0(Native Method)
	at sun.reflect.NativeMethodAccessorImpl.invoke(NativeMethodAccessorImpl.java:57)
	at sun.reflect.DelegatingMethodAccessorImpl.invoke(DelegatingMethodAccessorImpl.java:43)
	at java.lang.reflect.Method.invoke(Method.java:606)
	at com.carrotsearch.randomizedtesting.RandomizedRunner.invoke(RandomizedRunner.java:1559)
	at com.carrotsearch.randomizedtesting.RandomizedRunner.access$600(RandomizedRunner.java:79)
	at com.carrotsearch.randomizedtesting.RandomizedRunner$6.evaluate(RandomizedRunner.java:737)
	at com.carrotsearch.randomizedtesting.RandomizedRunner$7.evaluate(RandomizedRunner.java:773)
	at com.carrotsearch.randomizedtesting.RandomizedRunner$8.evaluate(RandomizedRunner.java:787)
	at com.carrotsearch.randomizedtesting.rules.SystemPropertiesRestoreRule$1.evaluate(SystemPropertiesRestoreRule.java:53)
	at org.apache.lucene.util.TestRuleSetupTeardownChained$1.evaluate(TestRuleSetupTeardownChained.java:50)
	at org.apache.lucene.util.TestRuleFieldCacheSanity$1.evaluate(TestRuleFieldCacheSanity.java:51)
	at org.apache.lucene.util.AbstractBeforeAfterRule$1.evaluate(AbstractBeforeAfterRule.java:46)
	at com.carrotsearch.randomizedtesting.rules.SystemPropertiesInvariantRule$1.evaluate(SystemPropertiesInvariantRule.java:55)
	at org.apache.lucene.util.TestRuleThreadAndTestName$1.evaluate(TestRuleThreadAndTestName.java:49)
	at org.apache.lucene.util.TestRuleIgnoreAfterMaxFailures$1.evaluate(TestRuleIgnoreAfterMaxFailures.java:70)
	at org.apache.lucene.util.TestRuleMarkFailure$1.evaluate(TestRuleMarkFailure.java:48)
	at com.carrotsearch.randomizedtesting.rules.StatementAdapter.evaluate(StatementAdapter.java:36)
	at com.carrotsearch.randomizedtesting.ThreadLeakControl$StatementRunner.run(ThreadLeakControl.java:358)
	at com.carrotsearch.randomizedtesting.ThreadLeakControl.forkTimeoutingTask(ThreadLeakControl.java:782)
	at com.carrotsearch.randomizedtesting.ThreadLeakControl$3.evaluate(ThreadLeakControl.java:442)
	at com.carrotsearch.randomizedtesting.RandomizedRunner.runSingleTest(RandomizedRunner.java:746)
	at com.carrotsearch.randomizedtesting.RandomizedRunner$3.evaluate(RandomizedRunner.java:648)
	at com.carrotsearch.randomizedtesting.RandomizedRunner$4.evaluate(RandomizedRunner.java:682)
	at com.carrotsearch.randomizedtesting.RandomizedRunner$5.evaluate(RandomizedRunner.java:693)
	at com.carrotsearch.randomizedtesting.rules.StatementAdapter.evaluate(StatementAdapter.java:36)
	at com.carrotsearch.randomizedtesting.rules.SystemPropertiesRestoreRule$1.evaluate(SystemPropertiesRestoreRule.java:53)
	at org.apache.lucene.util.AbstractBeforeAfterRule$1.evaluate(AbstractBeforeAfterRule.java:46)
	at org.apache.lucene.util.TestRuleStoreClassName$1.evaluate(TestRuleStoreClassName.java:42)
	at com.carrotsearch.randomizedtesting.rules.SystemPropertiesInvariantRule$1.evaluate(SystemPropertiesInvariantRule.java:55)
	at com.carrotsearch.randomizedtesting.rules.NoShadowingOrOverridesOnMethodsRule$1.evaluate(NoShadowingOrOverridesOnMethodsRule.java:39)
	at com.carrotsearch.randomizedtesting.rules.NoShadowingOrOverridesOnMethodsRule$1.evaluate(NoShadowingOrOverridesOnMethodsRule.java:39)
	at com.carrotsearch.randomizedtesting.rules.StatementAdapter.evaluate(StatementAdapter.java:36)
	at org.apache.lucene.util.TestRuleAssertionsRequired$1.evaluate(TestRuleAssertionsRequired.java:43)
	at org.apache.lucene.util.TestRuleMarkFailure$1.evaluate(TestRuleMarkFailure.java:48)
	at org.apache.lucene.util.TestRuleIgnoreAfterMaxFailures$1.evaluate(TestRuleIgnoreAfterMaxFailures.java:70)
	at org.apache.lucene.util.TestRuleIgnoreTestSuites$1.evaluate(TestRuleIgnoreTestSuites.java:55)
	at com.carrotsearch.randomizedtesting.rules.StatementAdapter.evaluate(StatementAdapter.java:36)
	at com.carrotsearch.randomizedtesting.ThreadLeakControl$StatementRunner.run(ThreadLeakControl.java:358)
	at java.lang.Thread.run(Thread.java:724)


REGRESSION:  org.apache.solr.cloud.BasicDistributedZk2Test.testDistribSearch

Error Message:
Unexpected internal error near index 1 \  ^

Stack Trace:
java.util.regex.PatternSyntaxException: Unexpected internal error near index 1
\
 ^
	at __randomizedtesting.SeedInfo.seed([458667C837549B73:C460E9D0400BFB4F]:0)
	at java.util.regex.Pattern.error(Pattern.java:1924)
	at java.util.regex.Pattern.compile(Pattern.java:1671)
	at java.util.regex.Pattern.<init>(Pattern.java:1337)
	at java.util.regex.Pattern.compile(Pattern.java:1022)
	at java.lang.String.split(String.java:2313)
	at java.lang.String.split(String.java:2355)
	at org.apache.solr.cloud.AbstractFullDistribZkTestBase.getRelativeSolrHomePath(AbstractFullDistribZkTestBase.java:485)
	at org.apache.solr.cloud.AbstractFullDistribZkTestBase.createJetty(AbstractFullDistribZkTestBase.java:463)
	at org.apache.solr.BaseDistributedSearchTestCase.createJetty(BaseDistributedSearchTestCase.java:356)
	at org.apache.solr.cloud.AbstractFullDistribZkTestBase.createServers(AbstractFullDistribZkTestBase.java:271)
	at org.apache.solr.BaseDistributedSearchTestCase.testDistribSearch(BaseDistributedSearchTestCase.java:833)
	at sun.reflect.NativeMethodAccessorImpl.invoke0(Native Method)
	at sun.reflect.NativeMethodAccessorImpl.invoke(NativeMethodAccessorImpl.java:57)
	at sun.reflect.DelegatingMethodAccessorImpl.invoke(DelegatingMethodAccessorImpl.java:43)
	at java.lang.reflect.Method.invoke(Method.java:606)
	at com.carrotsearch.randomizedtesting.RandomizedRunner.invoke(RandomizedRunner.java:1559)
	at com.carrotsearch.randomizedtesting.RandomizedRunner.access$600(RandomizedRunner.java:79)
	at com.carrotsearch.randomizedtesting.RandomizedRunner$6.evaluate(RandomizedRunner.java:737)
	at com.carrotsearch.randomizedtesting.RandomizedRunner$7.evaluate(RandomizedRunner.java:773)
	at com.carrotsearch.randomizedtesting.RandomizedRunner$8.evaluate(RandomizedRunner.java:787)
	at com.carrotsearch.randomizedtesting.rules.SystemPropertiesRestoreRule$1.evaluate(SystemPropertiesRestoreRule.java:53)
	at org.apache.lucene.util.TestRuleSetupTeardownChained$1.evaluate(TestRuleSetupTeardownChained.java:50)
	at org.apache.lucene.util.TestRuleFieldCacheSanity$1.evaluate(TestRuleFieldCacheSanity.java:51)
	at org.apache.lucene.util.AbstractBeforeAfterRule$1.evaluate(AbstractBeforeAfterRule.java:46)
	at com.carrotsearch.randomizedtesting.rules.SystemPropertiesInvariantRule$1.evaluate(SystemPropertiesInvariantRule.java:55)
	at org.apache.lucene.util.TestRuleThreadAndTestName$1.evaluate(TestRuleThreadAndTestName.java:49)
	at org.apache.lucene.util.TestRuleIgnoreAfterMaxFailures$1.evaluate(TestRuleIgnoreAfterMaxFailures.java:70)
	at org.apache.lucene.util.TestRuleMarkFailure$1.evaluate(TestRuleMarkFailure.java:48)
	at com.carrotsearch.randomizedtesting.rules.StatementAdapter.evaluate(StatementAdapter.java:36)
	at com.carrotsearch.randomizedtesting.ThreadLeakControl$StatementRunner.run(ThreadLeakControl.java:358)
	at com.carrotsearch.randomizedtesting.ThreadLeakControl.forkTimeoutingTask(ThreadLeakControl.java:782)
	at com.carrotsearch.randomizedtesting.ThreadLeakControl$3.evaluate(ThreadLeakControl.java:442)
	at com.carrotsearch.randomizedtesting.RandomizedRunner.runSingleTest(RandomizedRunner.java:746)
	at com.carrotsearch.randomizedtesting.RandomizedRunner$3.evaluate(RandomizedRunner.java:648)
	at com.carrotsearch.randomizedtesting.RandomizedRunner$4.evaluate(RandomizedRunner.java:682)
	at com.carrotsearch.randomizedtesting.RandomizedRunner$5.evaluate(RandomizedRunner.java:693)
	at com.carrotsearch.randomizedtesting.rules.StatementAdapter.evaluate(StatementAdapter.java:36)
	at com.carrotsearch.randomizedtesting.rules.SystemPropertiesRestoreRule$1.evaluate(SystemPropertiesRestoreRule.java:53)
	at org.apache.lucene.util.AbstractBeforeAfterRule$1.evaluate(AbstractBeforeAfterRule.java:46)
	at org.apache.lucene.util.TestRuleStoreClassName$1.evaluate(TestRuleStoreClassName.java:42)
	at com.carrotsearch.randomizedtesting.rules.SystemPropertiesInvariantRule$1.evaluate(SystemPropertiesInvariantRule.java:55)
	at com.carrotsearch.randomizedtesting.rules.NoShadowingOrOverridesOnMethodsRule$1.evaluate(NoShadowingOrOverridesOnMethodsRule.java:39)
	at com.carrotsearch.randomizedtesting.rules.NoShadowingOrOverridesOnMethodsRule$1.evaluate(NoShadowingOrOverridesOnMethodsRule.java:39)
	at com.carrotsearch.randomizedtesting.rules.StatementAdapter.evaluate(StatementAdapter.java:36)
	at org.apache.lucene.util.TestRuleAssertionsRequired$1.evaluate(TestRuleAssertionsRequired.java:43)
	at org.apache.lucene.util.TestRuleMarkFailure$1.evaluate(TestRuleMarkFailure.java:48)
	at org.apache.lucene.util.TestRuleIgnoreAfterMaxFailures$1.evaluate(TestRuleIgnoreAfterMaxFailures.java:70)
	at org.apache.lucene.util.TestRuleIgnoreTestSuites$1.evaluate(TestRuleIgnoreTestSuites.java:55)
	at com.carrotsearch.randomizedtesting.rules.StatementAdapter.evaluate(StatementAdapter.java:36)
	at com.carrotsearch.randomizedtesting.ThreadLeakControl$StatementRunner.run(ThreadLeakControl.java:358)
	at java.lang.Thread.run(Thread.java:724)


REGRESSION:  org.apache.solr.cloud.BasicDistributedZkTest.testDistribSearch

Error Message:
Unexpected internal error near index 1 \  ^

Stack Trace:
java.util.regex.PatternSyntaxException: Unexpected internal error near index 1
\
 ^
	at __randomizedtesting.SeedInfo.seed([458667C837549B73:C460E9D0400BFB4F]:0)
	at java.util.regex.Pattern.error(Pattern.java:1924)
	at java.util.regex.Pattern.compile(Pattern.java:1671)
	at java.util.regex.Pattern.<init>(Pattern.java:1337)
	at java.util.regex.Pattern.compile(Pattern.java:1022)
	at java.lang.String.split(String.java:2313)
	at java.lang.String.split(String.java:2355)
	at org.apache.solr.cloud.AbstractFullDistribZkTestBase.getRelativeSolrHomePath(AbstractFullDistribZkTestBase.java:485)
	at org.apache.solr.cloud.AbstractFullDistribZkTestBase.createJetty(AbstractFullDistribZkTestBase.java:463)
	at org.apache.solr.BaseDistributedSearchTestCase.createJetty(BaseDistributedSearchTestCase.java:356)
	at org.apache.solr.cloud.AbstractFullDistribZkTestBase.createServers(AbstractFullDistribZkTestBase.java:271)
	at org.apache.solr.BaseDistributedSearchTestCase.testDistribSearch(BaseDistributedSearchTestCase.java:833)
	at sun.reflect.NativeMethodAccessorImpl.invoke0(Native Method)
	at sun.reflect.NativeMethodAccessorImpl.invoke(NativeMethodAccessorImpl.java:57)
	at sun.reflect.DelegatingMethodAccessorImpl.invoke(DelegatingMethodAccessorImpl.java:43)
	at java.lang.reflect.Method.invoke(Method.java:606)
	at com.carrotsearch.randomizedtesting.RandomizedRunner.invoke(RandomizedRunner.java:1559)
	at com.carrotsearch.randomizedtesting.RandomizedRunner.access$600(RandomizedRunner.java:79)
	at com.carrotsearch.randomizedtesting.RandomizedRunner$6.evaluate(RandomizedRunner.java:737)
	at com.carrotsearch.randomizedtesting.RandomizedRunner$7.evaluate(RandomizedRunner.java:773)
	at com.carrotsearch.randomizedtesting.RandomizedRunner$8.evaluate(RandomizedRunner.java:787)
	at com.carrotsearch.randomizedtesting.rules.SystemPropertiesRestoreRule$1.evaluate(SystemPropertiesRestoreRule.java:53)
	at org.apache.lucene.util.TestRuleSetupTeardownChained$1.evaluate(TestRuleSetupTeardownChained.java:50)
	at org.apache.lucene.util.TestRuleFieldCacheSanity$1.evaluate(TestRuleFieldCacheSanity.java:51)
	at org.apache.lucene.util.AbstractBeforeAfterRule$1.evaluate(AbstractBeforeAfterRule.java:46)
	at com.carrotsearch.randomizedtesting.rules.SystemPropertiesInvariantRule$1.evaluate(SystemPropertiesInvariantRule.java:55)
	at org.apache.lucene.util.TestRuleThreadAndTestName$1.evaluate(TestRuleThreadAndTestName.java:49)
	at org.apache.lucene.util.TestRuleIgnoreAfterMaxFailures$1.evaluate(TestRuleIgnoreAfterMaxFailures.java:70)
	at org.apache.lucene.util.TestRuleMarkFailure$1.evaluate(TestRuleMarkFailure.java:48)
	at com.carrotsearch.randomizedtesting.rules.StatementAdapter.evaluate(StatementAdapter.java:36)
	at com.carrotsearch.randomizedtesting.ThreadLeakControl$StatementRunner.run(ThreadLeakControl.java:358)
	at com.carrotsearch.randomizedtesting.ThreadLeakControl.forkTimeoutingTask(ThreadLeakControl.java:782)
	at com.carrotsearch.randomizedtesting.ThreadLeakControl$3.evaluate(ThreadLeakControl.java:442)
	at com.carrotsearch.randomizedtesting.RandomizedRunner.runSingleTest(RandomizedRunner.java:746)
	at com.carrotsearch.randomizedtesting.RandomizedRunner$3.evaluate(RandomizedRunner.java:648)
	at com.carrotsearch.randomizedtesting.RandomizedRunner$4.evaluate(RandomizedRunner.java:682)
	at com.carrotsearch.randomizedtesting.RandomizedRunner$5.evaluate(RandomizedRunner.java:693)
	at com.carrotsearch.randomizedtesting.rules.StatementAdapter.evaluate(StatementAdapter.java:36)
	at com.carrotsearch.randomizedtesting.rules.SystemPropertiesRestoreRule$1.evaluate(SystemPropertiesRestoreRule.java:53)
	at org.apache.lucene.util.AbstractBeforeAfterRule$1.evaluate(AbstractBeforeAfterRule.java:46)
	at org.apache.lucene.util.TestRuleStoreClassName$1.evaluate(TestRuleStoreClassName.java:42)
	at com.carrotsearch.randomizedtesting.rules.SystemPropertiesInvariantRule$1.evaluate(SystemPropertiesInvariantRule.java:55)
	at com.carrotsearch.randomizedtesting.rules.NoShadowingOrOverridesOnMethodsRule$1.evaluate(NoShadowingOrOverridesOnMethodsRule.java:39)
	at com.carrotsearch.randomizedtesting.rules.NoShadowingOrOverridesOnMethodsRule$1.evaluate(NoShadowingOrOverridesOnMethodsRule.java:39)
	at com.carrotsearch.randomizedtesting.rules.StatementAdapter.evaluate(StatementAdapter.java:36)
	at org.apache.lucene.util.TestRuleAssertionsRequired$1.evaluate(TestRuleAssertionsRequired.java:43)
	at org.apache.lucene.util.TestRuleMarkFailure$1.evaluate(TestRuleMarkFailure.java:48)
	at org.apache.lucene.util.TestRuleIgnoreAfterMaxFailures$1.evaluate(TestRuleIgnoreAfterMaxFailures.java:70)
	at org.apache.lucene.util.TestRuleIgnoreTestSuites$1.evaluate(TestRuleIgnoreTestSuites.java:55)
	at com.carrotsearch.randomizedtesting.rules.StatementAdapter.evaluate(StatementAdapter.java:36)
	at com.carrotsearch.randomizedtesting.ThreadLeakControl$StatementRunner.run(ThreadLeakControl.java:358)
	at java.lang.Thread.run(Thread.java:724)


REGRESSION:  org.apache.solr.cloud.ChaosMonkeyNothingIsSafeTest.testDistribSearch

Error Message:
Unexpected internal error near index 1 \  ^

Stack Trace:
java.util.regex.PatternSyntaxException: Unexpected internal error near index 1
\
 ^
	at __randomizedtesting.SeedInfo.seed([458667C837549B73:C460E9D0400BFB4F]:0)
	at java.util.regex.Pattern.error(Pattern.java:1924)
	at java.util.regex.Pattern.compile(Pattern.java:1671)
	at java.util.regex.Pattern.<init>(Pattern.java:1337)
	at java.util.regex.Pattern.compile(Pattern.java:1022)
	at java.lang.String.split(String.java:2313)
	at java.lang.String.split(String.java:2355)
	at org.apache.solr.cloud.AbstractFullDistribZkTestBase.getRelativeSolrHomePath(AbstractFullDistribZkTestBase.java:485)
	at org.apache.solr.cloud.AbstractFullDistribZkTestBase.createJetty(AbstractFullDistribZkTestBase.java:463)
	at org.apache.solr.BaseDistributedSearchTestCase.createJetty(BaseDistributedSearchTestCase.java:356)
	at org.apache.solr.cloud.AbstractFullDistribZkTestBase.createServers(AbstractFullDistribZkTestBase.java:271)
	at org.apache.solr.BaseDistributedSearchTestCase.testDistribSearch(BaseDistributedSearchTestCase.java:833)
	at sun.reflect.NativeMethodAccessorImpl.invoke0(Native Method)
	at sun.reflect.NativeMethodAccessorImpl.invoke(NativeMethodAccessorImpl.java:57)
	at sun.reflect.DelegatingMethodAccessorImpl.invoke(DelegatingMethodAccessorImpl.java:43)
	at java.lang.reflect.Method.invoke(Method.java:606)
	at com.carrotsearch.randomizedtesting.RandomizedRunner.invoke(RandomizedRunner.java:1559)
	at com.carrotsearch.randomizedtesting.RandomizedRunner.access$600(RandomizedRunner.java:79)
	at com.carrotsearch.randomizedtesting.RandomizedRunner$6.evaluate(RandomizedRunner.java:737)
	at com.carrotsearch.randomizedtesting.RandomizedRunner$7.evaluate(RandomizedRunner.java:773)
	at com.carrotsearch.randomizedtesting.RandomizedRunner$8.evaluate(RandomizedRunner.java:787)
	at com.carrotsearch.randomizedtesting.rules.SystemPropertiesRestoreRule$1.evaluate(SystemPropertiesRestoreRule.java:53)
	at org.apache.lucene.util.TestRuleSetupTeardownChained$1.evaluate(TestRuleSetupTeardownChained.java:50)
	at org.apache.lucene.util.TestRuleFieldCacheSanity$1.evaluate(TestRuleFieldCacheSanity.java:51)
	at org.apache.lucene.util.AbstractBeforeAfterRule$1.evaluate(AbstractBeforeAfterRule.java:46)
	at com.carrotsearch.randomizedtesting.rules.SystemPropertiesInvariantRule$1.evaluate(SystemPropertiesInvariantRule.java:55)
	at org.apache.lucene.util.TestRuleThreadAndTestName$1.evaluate(TestRuleThreadAndTestName.java:49)
	at org.apache.lucene.util.TestRuleIgnoreAfterMaxFailures$1.evaluate(TestRuleIgnoreAfterMaxFailures.java:70)
	at org.apache.lucene.util.TestRuleMarkFailure$1.evaluate(TestRuleMarkFailure.java:48)
	at com.carrotsearch.randomizedtesting.rules.StatementAdapter.evaluate(StatementAdapter.java:36)
	at com.carrotsearch.randomizedtesting.ThreadLeakControl$StatementRunner.run(ThreadLeakControl.java:358)
	at com.carrotsearch.randomizedtesting.ThreadLeakControl.forkTimeoutingTask(ThreadLeakControl.java:782)
	at com.carrotsearch.randomizedtesting.ThreadLeakControl$3.evaluate(ThreadLeakControl.java:442)
	at com.carrotsearch.randomizedtesting.RandomizedRunner.runSingleTest(RandomizedRunner.java:746)
	at com.carrotsearch.randomizedtesting.RandomizedRunner$3.evaluate(RandomizedRunner.java:648)
	at com.carrotsearch.randomizedtesting.RandomizedRunner$4.evaluate(RandomizedRunner.java:682)
	at com.carrotsearch.randomizedtesting.RandomizedRunner$5.evaluate(RandomizedRunner.java:693)
	at com.carrotsearch.randomizedtesting.rules.StatementAdapter.evaluate(StatementAdapter.java:36)
	at com.carrotsearch.randomizedtesting.rules.SystemPropertiesRestoreRule$1.evaluate(SystemPropertiesRestoreRule.java:53)
	at org.apache.lucene.util.AbstractBeforeAfterRule$1.evaluate(AbstractBeforeAfterRule.java:46)
	at org.apache.lucene.util.TestRuleStoreClassName$1.evaluate(TestRuleStoreClassName.java:42)
	at com.carrotsearch.randomizedtesting.rules.SystemPropertiesInvariantRule$1.evaluate(SystemPropertiesInvariantRule.java:55)
	at com.carrotsearch.randomizedtesting.rules.NoShadowingOrOverridesOnMethodsRule$1.evaluate(NoShadowingOrOverridesOnMethodsRule.java:39)
	at com.carrotsearch.randomizedtesting.rules.NoShadowingOrOverridesOnMethodsRule$1.evaluate(NoShadowingOrOverridesOnMethodsRule.java:39)
	at com.carrotsearch.randomizedtesting.rules.StatementAdapter.evaluate(StatementAdapter.java:36)
	at org.apache.lucene.util.TestRuleAssertionsRequired$1.evaluate(TestRuleAssertionsRequired.java:43)
	at org.apache.lucene.util.TestRuleMarkFailure$1.evaluate(TestRuleMarkFailure.java:48)
	at org.apache.lucene.util.TestRuleIgnoreAfterMaxFailures$1.evaluate(TestRuleIgnoreAfterMaxFailures.java:70)
	at org.apache.lucene.util.TestRuleIgnoreTestSuites$1.evaluate(TestRuleIgnoreTestSuites.java:55)
	at com.carrotsearch.randomizedtesting.rules.StatementAdapter.evaluate(StatementAdapter.java:36)
	at com.carrotsearch.randomizedtesting.ThreadLeakControl$StatementRunner.run(ThreadLeakControl.java:358)
	at java.lang.Thread.run(Thread.java:724)


REGRESSION:  org.apache.solr.cloud.ChaosMonkeySafeLeaderTest.testDistribSearch

Error Message:
Unexpected internal error near index 1 \  ^

Stack Trace:
java.util.regex.PatternSyntaxException: Unexpected internal error near index 1
\
 ^
	at __randomizedtesting.SeedInfo.seed([458667C837549B73:C460E9D0400BFB4F]:0)
	at java.util.regex.Pattern.error(Pattern.java:1924)
	at java.util.regex.Pattern.compile(Pattern.java:1671)
	at java.util.regex.Pattern.<init>(Pattern.java:1337)
	at java.util.regex.Pattern.compile(Pattern.java:1022)
	at java.lang.String.split(String.java:2313)
	at java.lang.String.split(String.java:2355)
	at org.apache.solr.cloud.AbstractFullDistribZkTestBase.getRelativeSolrHomePath(AbstractFullDistribZkTestBase.java:485)
	at org.apache.solr.cloud.AbstractFullDistribZkTestBase.createJetty(AbstractFullDistribZkTestBase.java:463)
	at org.apache.solr.BaseDistributedSearchTestCase.createJetty(BaseDistributedSearchTestCase.java:356)
	at org.apache.solr.cloud.AbstractFullDistribZkTestBase.createServers(AbstractFullDistribZkTestBase.java:271)
	at org.apache.solr.BaseDistributedSearchTestCase.testDistribSearch(BaseDistributedSearchTestCase.java:833)
	at sun.reflect.NativeMethodAccessorImpl.invoke0(Native Method)
	at sun.reflect.NativeMethodAccessorImpl.invoke(NativeMethodAccessorImpl.java:57)
	at sun.reflect.DelegatingMethodAccessorImpl.invoke(DelegatingMethodAccessorImpl.java:43)
	at java.lang.reflect.Method.invoke(Method.java:606)
	at com.carrotsearch.randomizedtesting.RandomizedRunner.invoke(RandomizedRunner.java:1559)
	at com.carrotsearch.randomizedtesting.RandomizedRunner.access$600(RandomizedRunner.java:79)
	at com.carrotsearch.randomizedtesting.RandomizedRunner$6.evaluate(RandomizedRunner.java:737)
	at com.carrotsearch.randomizedtesting.RandomizedRunner$7.evaluate(RandomizedRunner.java:773)
	at com.carrotsearch.randomizedtesting.RandomizedRunner$8.evaluate(RandomizedRunner.java:787)
	at com.carrotsearch.randomizedtesting.rules.SystemPropertiesRestoreRule$1.evaluate(SystemPropertiesRestoreRule.java:53)
	at org.apache.lucene.util.TestRuleSetupTeardownChained$1.evaluate(TestRuleSetupTeardownChained.java:50)
	at org.apache.lucene.util.TestRuleFieldCacheSanity$1.evaluate(TestRuleFieldCacheSanity.java:51)
	at org.apache.lucene.util.AbstractBeforeAfterRule$1.evaluate(AbstractBeforeAfterRule.java:46)
	at com.carrotsearch.randomizedtesting.rules.SystemPropertiesInvariantRule$1.evaluate(SystemPropertiesInvariantRule.java:55)
	at org.apache.lucene.util.TestRuleThreadAndTestName$1.evaluate(TestRuleThreadAndTestName.java:49)
	at org.apache.lucene.util.TestRuleIgnoreAfterMaxFailures$1.evaluate(TestRuleIgnoreAfterMaxFailures.java:70)
	at org.apache.lucene.util.TestRuleMarkFailure$1.evaluate(TestRuleMarkFailure.java:48)
	at com.carrotsearch.randomizedtesting.rules.StatementAdapter.evaluate(StatementAdapter.java:36)
	at com.carrotsearch.randomizedtesting.ThreadLeakControl$StatementRunner.run(ThreadLeakControl.java:358)
	at com.carrotsearch.randomizedtesting.ThreadLeakControl.forkTimeoutingTask(ThreadLeakControl.java:782)
	at com.carrotsearch.randomizedtesting.ThreadLeakControl$3.evaluate(ThreadLeakControl.java:442)
	at com.carrotsearch.randomizedtesting.RandomizedRunner.runSingleTest(RandomizedRunner.java:746)
	at com.carrotsearch.randomizedtesting.RandomizedRunner$3.evaluate(RandomizedRunner.java:648)
	at com.carrotsearch.randomizedtesting.RandomizedRunner$4.evaluate(RandomizedRunner.java:682)
	at com.carrotsearch.randomizedtesting.RandomizedRunner$5.evaluate(RandomizedRunner.java:693)
	at com.carrotsearch.randomizedtesting.rules.StatementAdapter.evaluate(StatementAdapter.java:36)
	at com.carrotsearch.randomizedtesting.rules.SystemPropertiesRestoreRule$1.evaluate(SystemPropertiesRestoreRule.java:53)
	at org.apache.lucene.util.AbstractBeforeAfterRule$1.evaluate(AbstractBeforeAfterRule.java:46)
	at org.apache.lucene.util.TestRuleStoreClassName$1.evaluate(TestRuleStoreClassName.java:42)
	at com.carrotsearch.randomizedtesting.rules.SystemPropertiesInvariantRule$1.evaluate(SystemPropertiesInvariantRule.java:55)
	at com.carrotsearch.randomizedtesting.rules.NoShadowingOrOverridesOnMethodsRule$1.evaluate(NoShadowingOrOverridesOnMethodsRule.java:39)
	at com.carrotsearch.randomizedtesting.rules.NoShadowingOrOverridesOnMethodsRule$1.evaluate(NoShadowingOrOverridesOnMethodsRule.java:39)
	at com.carrotsearch.randomizedtesting.rules.StatementAdapter.evaluate(StatementAdapter.java:36)
	at org.apache.lucene.util.TestRuleAssertionsRequired$1.evaluate(TestRuleAssertionsRequired.java:43)
	at org.apache.lucene.util.TestRuleMarkFailure$1.evaluate(TestRuleMarkFailure.java:48)
	at org.apache.lucene.util.TestRuleIgnoreAfterMaxFailures$1.evaluate(TestRuleIgnoreAfterMaxFailures.java:70)
	at org.apache.lucene.util.TestRuleIgnoreTestSuites$1.evaluate(TestRuleIgnoreTestSuites.java:55)
	at com.carrotsearch.randomizedtesting.rules.StatementAdapter.evaluate(StatementAdapter.java:36)
	at com.carrotsearch.randomizedtesting.ThreadLeakControl$StatementRunner.run(ThreadLeakControl.java:358)
	at java.lang.Thread.run(Thread.java:724)


REGRESSION:  org.apache.solr.cloud.CollectionsAPIDistributedZkTest.testDistribSearch

Error Message:
Unexpected internal error near index 1 \  ^

Stack Trace:
java.util.regex.PatternSyntaxException: Unexpected internal error near index 1
\
 ^
	at __randomizedtesting.SeedInfo.seed([458667C837549B73:C460E9D0400BFB4F]:0)
	at java.util.regex.Pattern.error(Pattern.java:1924)
	at java.util.regex.Pattern.compile(Pattern.java:1671)
	at java.util.regex.Pattern.<init>(Pattern.java:1337)
	at java.util.regex.Pattern.compile(Pattern.java:1022)
	at java.lang.String.split(String.java:2313)
	at java.lang.String.split(String.java:2355)
	at org.apache.solr.cloud.AbstractFullDistribZkTestBase.getRelativeSolrHomePath(AbstractFullDistribZkTestBase.java:485)
	at org.apache.solr.cloud.AbstractFullDistribZkTestBase.createJetty(AbstractFullDistribZkTestBase.java:463)
	at org.apache.solr.BaseDistributedSearchTestCase.createJetty(BaseDistributedSearchTestCase.java:356)
	at org.apache.solr.cloud.AbstractFullDistribZkTestBase.createServers(AbstractFullDistribZkTestBase.java:271)
	at org.apache.solr.BaseDistributedSearchTestCase.testDistribSearch(BaseDistributedSearchTestCase.java:833)
	at sun.reflect.NativeMethodAccessorImpl.invoke0(Native Method)
	at sun.reflect.NativeMethodAccessorImpl.invoke(NativeMethodAccessorImpl.java:57)
	at sun.reflect.DelegatingMethodAccessorImpl.invoke(DelegatingMethodAccessorImpl.java:43)
	at java.lang.reflect.Method.invoke(Method.java:606)
	at com.carrotsearch.randomizedtesting.RandomizedRunner.invoke(RandomizedRunner.java:1559)
	at com.carrotsearch.randomizedtesting.RandomizedRunner.access$600(RandomizedRunner.java:79)
	at com.carrotsearch.randomizedtesting.RandomizedRunner$6.evaluate(RandomizedRunner.java:737)
	at com.carrotsearch.randomizedtesting.RandomizedRunner$7.evaluate(RandomizedRunner.java:773)
	at com.carrotsearch.randomizedtesting.RandomizedRunner$8.evaluate(RandomizedRunner.java:787)
	at com.carrotsearch.randomizedtesting.rules.SystemPropertiesRestoreRule$1.evaluate(SystemPropertiesRestoreRule.java:53)
	at org.apache.lucene.util.TestRuleSetupTeardownChained$1.evaluate(TestRuleSetupTeardownChained.java:50)
	at org.apache.lucene.util.TestRuleFieldCacheSanity$1.evaluate(TestRuleFieldCacheSanity.java:51)
	at org.apache.lucene.util.AbstractBeforeAfterRule$1.evaluate(AbstractBeforeAfterRule.java:46)
	at com.carrotsearch.randomizedtesting.rules.SystemPropertiesInvariantRule$1.evaluate(SystemPropertiesInvariantRule.java:55)
	at org.apache.lucene.util.TestRuleThreadAndTestName$1.evaluate(TestRuleThreadAndTestName.java:49)
	at org.apache.lucene.util.TestRuleIgnoreAfterMaxFailures$1.evaluate(TestRuleIgnoreAfterMaxFailures.java:70)
	at org.apache.lucene.util.TestRuleMarkFailure$1.evaluate(TestRuleMarkFailure.java:48)
	at com.carrotsearch.randomizedtesting.rules.StatementAdapter.evaluate(StatementAdapter.java:36)
	at com.carrotsearch.randomizedtesting.ThreadLeakControl$StatementRunner.run(ThreadLeakControl.java:358)
	at com.carrotsearch.randomizedtesting.ThreadLeakControl.forkTimeoutingTask(ThreadLeakControl.java:782)
	at com.carrotsearch.randomizedtesting.ThreadLeakControl$3.evaluate(ThreadLeakControl.java:442)
	at com.carrotsearch.randomizedtesting.RandomizedRunner.runSingleTest(RandomizedRunner.java:746)
	at com.carrotsearch.randomizedtesting.RandomizedRunner$3.evaluate(RandomizedRunner.java:648)
	at com.carrotsearch.randomizedtesting.RandomizedRunner$4.evaluate(RandomizedRunner.java:682)
	at com.carrotsearch.randomizedtesting.RandomizedRunner$5.evaluate(RandomizedRunner.java:693)
	at com.carrotsearch.randomizedtesting.rules.StatementAdapter.evaluate(StatementAdapter.java:36)
	at com.carrotsearch.randomizedtesting.rules.SystemPropertiesRestoreRule$1.evaluate(SystemPropertiesRestoreRule.java:53)
	at org.apache.lucene.util.AbstractBeforeAfterRule$1.evaluate(AbstractBeforeAfterRule.java:46)
	at org.apache.lucene.util.TestRuleStoreClassName$1.evaluate(TestRuleStoreClassName.java:42)
	at com.carrotsearch.randomizedtesting.rules.SystemPropertiesInvariantRule$1.evaluate(SystemPropertiesInvariantRule.java:55)
	at com.carrotsearch.randomizedtesting.rules.NoShadowingOrOverridesOnMethodsRule$1.evaluate(NoShadowingOrOverridesOnMethodsRule.java:39)
	at com.carrotsearch.randomizedtesting.rules.NoShadowingOrOverridesOnMethodsRule$1.evaluate(NoShadowingOrOverridesOnMethodsRule.java:39)
	at com.carrotsearch.randomizedtesting.rules.StatementAdapter.evaluate(StatementAdapter.java:36)
	at org.apache.lucene.util.TestRuleAssertionsRequired$1.evaluate(TestRuleAssertionsRequired.java:43)
	at org.apache.lucene.util.TestRuleMarkFailure$1.evaluate(TestRuleMarkFailure.java:48)
	at org.apache.lucene.util.TestRuleIgnoreAfterMaxFailures$1.evaluate(TestRuleIgnoreAfterMaxFailures.java:70)
	at org.apache.lucene.util.TestRuleIgnoreTestSuites$1.evaluate(TestRuleIgnoreTestSuites.java:55)
	at com.carrotsearch.randomizedtesting.rules.StatementAdapter.evaluate(StatementAdapter.java:36)
	at com.carrotsearch.randomizedtesting.ThreadLeakControl$StatementRunner.run(ThreadLeakControl.java:358)
	at java.lang.Thread.run(Thread.java:724)


REGRESSION:  org.apache.solr.cloud.CustomCollectionTest.testDistribSearch

Error Message:
Unexpected internal error near index 1 \  ^

Stack Trace:
java.util.regex.PatternSyntaxException: Unexpected internal error near index 1
\
 ^
	at __randomizedtesting.SeedInfo.seed([458667C837549B73:C460E9D0400BFB4F]:0)
	at java.util.regex.Pattern.error(Pattern.java:1924)
	at java.util.regex.Pattern.compile(Pattern.java:1671)
	at java.util.regex.Pattern.<init>(Pattern.java:1337)
	at java.util.regex.Pattern.compile(Pattern.java:1022)
	at java.lang.String.split(String.java:2313)
	at java.lang.String.split(String.java:2355)
	at org.apache.solr.cloud.AbstractFullDistribZkTestBase.getRelativeSolrHomePath(AbstractFullDistribZkTestBase.java:485)
	at org.apache.solr.cloud.AbstractFullDistribZkTestBase.createJetty(AbstractFullDistribZkTestBase.java:463)
	at org.apache.solr.BaseDistributedSearchTestCase.createJetty(BaseDistributedSearchTestCase.java:356)
	at org.apache.solr.cloud.AbstractFullDistribZkTestBase.createServers(AbstractFullDistribZkTestBase.java:271)
	at org.apache.solr.BaseDistributedSearchTestCase.testDistribSearch(BaseDistributedSearchTestCase.java:833)
	at sun.reflect.NativeMethodAccessorImpl.invoke0(Native Method)
	at sun.reflect.NativeMethodAccessorImpl.invoke(NativeMethodAccessorImpl.java:57)
	at sun.reflect.DelegatingMethodAccessorImpl.invoke(DelegatingMethodAccessorImpl.java:43)
	at java.lang.reflect.Method.invoke(Method.java:606)
	at com.carrotsearch.randomizedtesting.RandomizedRunner.invoke(RandomizedRunner.java:1559)
	at com.carrotsearch.randomizedtesting.RandomizedRunner.access$600(RandomizedRunner.java:79)
	at com.carrotsearch.randomizedtesting.RandomizedRunner$6.evaluate(RandomizedRunner.java:737)
	at com.carrotsearch.randomizedtesting.RandomizedRunner$7.evaluate(RandomizedRunner.java:773)
	at com.carrotsearch.randomizedtesting.RandomizedRunner$8.evaluate(RandomizedRunner.java:787)
	at com.carrotsearch.randomizedtesting.rules.SystemPropertiesRestoreRule$1.evaluate(SystemPropertiesRestoreRule.java:53)
	at org.apache.lucene.util.TestRuleSetupTeardownChained$1.evaluate(TestRuleSetupTeardownChained.java:50)
	at org.apache.lucene.util.TestRuleFieldCacheSanity$1.evaluate(TestRuleFieldCacheSanity.java:51)
	at org.apache.lucene.util.AbstractBeforeAfterRule$1.evaluate(AbstractBeforeAfterRule.java:46)
	at com.carrotsearch.randomizedtesting.rules.SystemPropertiesInvariantRule$1.evaluate(SystemPropertiesInvariantRule.java:55)
	at org.apache.lucene.util.TestRuleThreadAndTestName$1.evaluate(TestRuleThreadAndTestName.java:49)
	at org.apache.lucene.util.TestRuleIgnoreAfterMaxFailures$1.evaluate(TestRuleIgnoreAfterMaxFailures.java:70)
	at org.apache.lucene.util.TestRuleMarkFailure$1.evaluate(TestRuleMarkFailure.java:48)
	at com.carrotsearch.randomizedtesting.rules.StatementAdapter.evaluate(StatementAdapter.java:36)
	at com.carrotsearch.randomizedtesting.ThreadLeakControl$StatementRunner.run(ThreadLeakControl.java:358)
	at com.carrotsearch.randomizedtesting.ThreadLeakControl.forkTimeoutingTask(ThreadLeakControl.java:782)
	at com.carrotsearch.randomizedtesting.ThreadLeakControl$3.evaluate(ThreadLeakControl.java:442)
	at com.carrotsearch.randomizedtesting.RandomizedRunner.runSingleTest(RandomizedRunner.java:746)
	at com.carrotsearch.randomizedtesting.RandomizedRunner$3.evaluate(RandomizedRunner.java:648)
	at com.carrotsearch.randomizedtesting.RandomizedRunner$4.evaluate(RandomizedRunner.java:682)
	at com.carrotsearch.randomizedtesting.RandomizedRunner$5.evaluate(RandomizedRunner.java:693)
	at com.carrotsearch.randomizedtesting.rules.StatementAdapter.evaluate(StatementAdapter.java:36)
	at com.carrotsearch.randomizedtesting.rules.SystemPropertiesRestoreRule$1.evaluate(SystemPropertiesRestoreRule.java:53)
	at org.apache.lucene.util.AbstractBeforeAfterRule$1.evaluate(AbstractBeforeAfterRule.java:46)
	at org.apache.lucene.util.TestRuleStoreClassName$1.evaluate(TestRuleStoreClassName.java:42)
	at com.carrotsearch.randomizedtesting.rules.SystemPropertiesInvariantRule$1.evaluate(SystemPropertiesInvariantRule.java:55)
	at com.carrotsearch.randomizedtesting.rules.NoShadowingOrOverridesOnMethodsRule$1.evaluate(NoShadowingOrOverridesOnMethodsRule.java:39)
	at com.carrotsearch.randomizedtesting.rules.NoShadowingOrOverridesOnMethodsRule$1.evaluate(NoShadowingOrOverridesOnMethodsRule.java:39)
	at com.carrotsearch.randomizedtesting.rules.StatementAdapter.evaluate(StatementAdapter.java:36)
	at org.apache.lucene.util.TestRuleAssertionsRequired$1.evaluate(TestRuleAssertionsRequired.java:43)
	at org.apache.lucene.util.TestRuleMarkFailure$1.evaluate(TestRuleMarkFailure.java:48)
	at org.apache.lucene.util.TestRuleIgnoreAfterMaxFailures$1.evaluate(TestRuleIgnoreAfterMaxFailures.java:70)
	at org.apache.lucene.util.TestRuleIgnoreTestSuites$1.evaluate(TestRuleIgnoreTestSuites.java:55)
	at com.carrotsearch.randomizedtesting.rules.StatementAdapter.evaluate(StatementAdapter.java:36)
	at com.carrotsearch.randomizedtesting.ThreadLeakControl$StatementRunner.run(ThreadLeakControl.java:358)
	at java.lang.Thread.run(Thread.java:724)


REGRESSION:  org.apache.solr.cloud.DeleteShardTest.testDistribSearch

Error Message:
Unexpected internal error near index 1 \  ^

Stack Trace:
java.util.regex.PatternSyntaxException: Unexpected internal error near index 1
\
 ^
	at __randomizedtesting.SeedInfo.seed([458667C837549B73:C460E9D0400BFB4F]:0)
	at java.util.regex.Pattern.error(Pattern.java:1924)
	at java.util.regex.Pattern.compile(Pattern.java:1671)
	at java.util.regex.Pattern.<init>(Pattern.java:1337)
	at java.util.regex.Pattern.compile(Pattern.java:1022)
	at java.lang.String.split(String.java:2313)
	at java.lang.String.split(String.java:2355)
	at org.apache.solr.cloud.AbstractFullDistribZkTestBase.getRelativeSolrHomePath(AbstractFullDistribZkTestBase.java:485)
	at org.apache.solr.cloud.AbstractFullDistribZkTestBase.createJetty(AbstractFullDistribZkTestBase.java:463)
	at org.apache.solr.BaseDistributedSearchTestCase.createJetty(BaseDistributedSearchTestCase.java:356)
	at org.apache.solr.cloud.AbstractFullDistribZkTestBase.createServers(AbstractFullDistribZkTestBase.java:271)
	at org.apache.solr.BaseDistributedSearchTestCase.testDistribSearch(BaseDistributedSearchTestCase.java:833)
	at sun.reflect.NativeMethodAccessorImpl.invoke0(Native Method)
	at sun.reflect.NativeMethodAccessorImpl.invoke(NativeMethodAccessorImpl.java:57)
	at sun.reflect.DelegatingMethodAccessorImpl.invoke(DelegatingMethodAccessorImpl.java:43)
	at java.lang.reflect.Method.invoke(Method.java:606)
	at com.carrotsearch.randomizedtesting.RandomizedRunner.invoke(RandomizedRunner.java:1559)
	at com.carrotsearch.randomizedtesting.RandomizedRunner.access$600(RandomizedRunner.java:79)
	at com.carrotsearch.randomizedtesting.RandomizedRunner$6.evaluate(RandomizedRunner.java:737)
	at com.carrotsearch.randomizedtesting.RandomizedRunner$7.evaluate(RandomizedRunner.java:773)
	at com.carrotsearch.randomizedtesting.RandomizedRunner$8.evaluate(RandomizedRunner.java:787)
	at com.carrotsearch.randomizedtesting.rules.SystemPropertiesRestoreRule$1.evaluate(SystemPropertiesRestoreRule.java:53)
	at org.apache.lucene.util.TestRuleSetupTeardownChained$1.evaluate(TestRuleSetupTeardownChained.java:50)
	at org.apache.lucene.util.TestRuleFieldCacheSanity$1.evaluate(TestRuleFieldCacheSanity.java:51)
	at org.apache.lucene.util.AbstractBeforeAfterRule$1.evaluate(AbstractBeforeAfterRule.java:46)
	at com.carrotsearch.randomizedtesting.rules.SystemPropertiesInvariantRule$1.evaluate(SystemPropertiesInvariantRule.java:55)
	at org.apache.lucene.util.TestRuleThreadAndTestName$1.evaluate(TestRuleThreadAndTestName.java:49)
	at org.apache.lucene.util.TestRuleIgnoreAfterMaxFailures$1.evaluate(TestRuleIgnoreAfterMaxFailures.java:70)
	at org.apache.lucene.util.TestRuleMarkFailure$1.evaluate(TestRuleMarkFailure.java:48)
	at com.carrotsearch.randomizedtesting.rules.StatementAdapter.evaluate(StatementAdapter.java:36)
	at com.carrotsearch.randomizedtesting.ThreadLeakControl$StatementRunner.run(ThreadLeakControl.java:358)
	at com.carrotsearch.randomizedtesting.ThreadLeakControl.forkTimeoutingTask(ThreadLeakControl.java:782)
	at com.carrotsearch.randomizedtesting.ThreadLeakControl$3.evaluate(ThreadLeakControl.java:442)
	at com.carrotsearch.randomizedtesting.RandomizedRunner.runSingleTest(RandomizedRunner.java:746)
	at com.carrotsearch.randomizedtesting.RandomizedRunner$3.evaluate(RandomizedRunner.java:648)
	at com.carrotsearch.randomizedtesting.RandomizedRunner$4.evaluate(RandomizedRunner.java:682)
	at com.carrotsearch.randomizedtesting.RandomizedRunner$5.evaluate(RandomizedRunner.java:693)
	at com.carrotsearch.randomizedtesting.rules.StatementAdapter.evaluate(StatementAdapter.java:36)
	at com.carrotsearch.randomizedtesting.rules.SystemPropertiesRestoreRule$1.evaluate(SystemPropertiesRestoreRule.java:53)
	at org.apache.lucene.util.AbstractBeforeAfterRule$1.evaluate(AbstractBeforeAfterRule.java:46)
	at org.apache.lucene.util.TestRuleStoreClassName$1.evaluate(TestRuleStoreClassName.java:42)
	at com.carrotsearch.randomizedtesting.rules.SystemPropertiesInvariantRule$1.evaluate(SystemPropertiesInvariantRule.java:55)
	at com.carrotsearch.randomizedtesting.rules.NoShadowingOrOverridesOnMethodsRule$1.evaluate(NoShadowingOrOverridesOnMethodsRule.java:39)
	at com.carrotsearch.randomizedtesting.rules.NoShadowingOrOverridesOnMethodsRule$1.evaluate(NoShadowingOrOverridesOnMethodsRule.java:39)
	at com.carrotsearch.randomizedtesting.rules.StatementAdapter.evaluate(StatementAdapter.java:36)
	at org.apache.lucene.util.TestRuleAssertionsRequired$1.evaluate(TestRuleAssertionsRequired.java:43)
	at org.apache.lucene.util.TestRuleMarkFailure$1.evaluate(TestRuleMarkFailure.java:48)
	at org.apache.lucene.util.TestRuleIgnoreAfterMaxFailures$1.evaluate(TestRuleIgnoreAfterMaxFailures.java:70)
	at org.apache.lucene.util.TestRuleIgnoreTestSuites$1.evaluate(TestRuleIgnoreTestSuites.java:55)
	at com.carrotsearch.randomizedtesting.rules.StatementAdapter.evaluate(StatementAdapter.java:36)
	at com.carrotsearch.randomizedtesting.ThreadLeakControl$StatementRunner.run(ThreadLeakControl.java:358)
	at java.lang.Thread.run(Thread.java:724)


REGRESSION:  org.apache.solr.cloud.RecoveryZkTest.testDistribSearch

Error Message:
Unexpected internal error near index 1 \  ^

Stack Trace:
java.util.regex.PatternSyntaxException: Unexpected internal error near index 1
\
 ^
	at java.util.regex.Pattern.error(Pattern.java:1924)
	at java.util.regex.Pattern.compile(Pattern.java:1671)
	at java.util.regex.Pattern.<init>(Pattern.java:1337)
	at java.util.regex.Pattern.compile(Pattern.java:1022)
	at java.lang.String.split(String.java:2313)
	at java.lang.String.split(String.java:2355)
	at org.apache.solr.cloud.AbstractFullDistribZkTestBase.getRelativeSolrHomePath(AbstractFullDistribZkTestBase.java:485)
	at org.apache.solr.cloud.AbstractFullDistribZkTestBase.createJetty(AbstractFullDistribZkTestBase.java:463)
	at org.apache.solr.BaseDistributedSearchTestCase.createJetty(BaseDistributedSearchTestCase.java:356)
	at org.apache.solr.cloud.AbstractFullDistribZkTestBase.createServers(AbstractFullDistribZkTestBase.java:271)
	at org.apache.solr.BaseDistributedSearchTestCase.testDistribSearch(BaseDistributedSearchTestCase.java:833)
	at sun.reflect.NativeMethodAccessorImpl.invoke0(Native Method)
	at sun.reflect.NativeMethodAccessorImpl.invoke(NativeMethodAccessorImpl.java:57)
	at sun.reflect.DelegatingMethodAccessorImpl.invoke(DelegatingMethodAccessorImpl.java:43)
	at java.lang.reflect.Method.invoke(Method.java:606)
	at com.carrotsearch.randomizedtesting.RandomizedRunner.invoke(RandomizedRunner.java:1559)
	at com.carrotsearch.randomizedtesting.RandomizedRunner.access$600(RandomizedRunner.java:79)
	at com.carrotsearch.randomizedtesting.RandomizedRunner$6.evaluate(RandomizedRunner.java:737)
	at com.carrotsearch.randomizedtesting.RandomizedRunner$7.evaluate(RandomizedRunner.java:773)
	at com.carrotsearch.randomizedtesting.RandomizedRunner$8.evaluate(RandomizedRunner.java:787)
	at com.carrotsearch.randomizedtesting.rules.SystemPropertiesRestoreRule$1.evaluate(SystemPropertiesRestoreRule.java:53)
	at org.apache.lucene.util.TestRuleSetupTeardownChained$1.evaluate(TestRuleSetupTeardownChained.java:50)
	at org.apache.lucene.util.TestRuleFieldCacheSanity$1.evaluate(TestRuleFieldCacheSanity.java:51)
	at org.apache.lucene.util.AbstractBeforeAfterRule$1.evaluate(AbstractBeforeAfterRule.java:46)
	at com.carrotsearch.randomizedtesting.rules.SystemPropertiesInvariantRule$1.evaluate(SystemPropertiesInvariantRule.java:55)
	at org.apache.lucene.util.TestRuleThreadAndTestName$1.evaluate(TestRuleThreadAndTestName.java:49)
	at org.apache.lucene.util.TestRuleIgnoreAfterMaxFailures$1.evaluate(TestRuleIgnoreAfterMaxFailures.java:70)
	at org.apache.lucene.util.TestRuleMarkFailure$1.evaluate(TestRuleMarkFailure.java:48)
	at com.carrotsearch.randomizedtesting.rules.StatementAdapter.evaluate(StatementAdapter.java:36)
	at com.carrotsearch.randomizedtesting.ThreadLeakControl$StatementRunner.run(ThreadLeakControl.java:358)
	at com.carrotsearch.randomizedtesting.ThreadLeakControl.forkTimeoutingTask(ThreadLeakControl.java:782)
	at com.carrotsearch.randomizedtesting.ThreadLeakControl$3.evaluate(ThreadLeakControl.java:442)
	at com.carrotsearch.randomizedtesting.RandomizedRunner.runSingleTest(RandomizedRunner.java:746)
	at com.carrotsearch.randomizedtesting.RandomizedRunner$3.evaluate(RandomizedRunner.java:648)
	at com.carrotsearch.randomizedtesting.RandomizedRunner$4.evaluate(RandomizedRunner.java:682)
	at com.carrotsearch.randomizedtesting.RandomizedRunner$5.evaluate(RandomizedRunner.java:693)
	at com.carrotsearch.randomizedtesting.rules.StatementAdapter.evaluate(StatementAdapter.java:36)
	at com.carrotsearch.randomizedtesting.rules.SystemPropertiesRestoreRule$1.evaluate(SystemPropertiesRestoreRule.java:53)
	at org.apache.lucene.util.AbstractBeforeAfterRule$1.evaluate(AbstractBeforeAfterRule.java:46)
	at org.apache.lucene.util.TestRuleStoreClassName$1.evaluate(TestRuleStoreClassName.java:42)
	at com.carrotsearch.randomizedtesting.rules.SystemPropertiesInvariantRule$1.evaluate(SystemPropertiesInvariantRule.java:55)
	at com.carrotsearch.randomizedtesting.rules.NoShadowingOrOverridesOnMethodsRule$1.evaluate(NoShadowingOrOverridesOnMethodsRule.java:39)
	at com.carrotsearch.randomizedtesting.rules.NoShadowingOrOverridesOnMethodsRule$1.evaluate(NoShadowingOrOverridesOnMethodsRule.java:39)
	at com.carrotsearch.randomizedtesting.rules.StatementAdapter.evaluate(StatementAdapter.java:36)
	at org.apache.lucene.util.TestRuleAssertionsRequired$1.evaluate(TestRuleAssertionsRequired.java:43)
	at org.apache.lucene.util.TestRuleMarkFailure$1.evaluate(TestRuleMarkFailure.java:48)
	at org.apache.lucene.util.TestRuleIgnoreAfterMaxFailures$1.evaluate(TestRuleIgnoreAfterMaxFailures.java:70)
	at org.apache.lucene.util.TestRuleIgnoreTestSuites$1.evaluate(TestRuleIgnoreTestSuites.java:55)
	at com.carrotsearch.randomizedtesting.rules.StatementAdapter.evaluate(StatementAdapter.java:36)
	at com.carrotsearch.randomizedtesting.ThreadLeakControl$StatementRunner.run(ThreadLeakControl.java:358)
	at java.lang.Thread.run(Thread.java:724)


FAILED:  junit.framework.TestSuite.org.apache.solr.cloud.RecoveryZkTest

Error Message:
4 threads leaked from SUITE scope at org.apache.solr.cloud.RecoveryZkTest:     1) Thread[id=3550, name=SessionTracker, state=TIMED_WAITING, group=TGRP-RecoveryZkTest]         at java.lang.Object.wait(Native Method)         at org.apache.zookeeper.server.SessionTrackerImpl.run(SessionTrackerImpl.java:146)    2) Thread[id=3548, name=Thread-1364, state=WAITING, group=TGRP-RecoveryZkTest]         at java.lang.Object.wait(Native Method)         at java.lang.Thread.join(Thread.java:1260)         at java.lang.Thread.join(Thread.java:1334)         at org.apache.zookeeper.server.NIOServerCnxnFactory.join(NIOServerCnxnFactory.java:302)         at org.apache.solr.cloud.ZkTestServer$ZKServerMain.runFromConfig(ZkTestServer.java:107)         at org.apache.solr.cloud.ZkTestServer$2.run(ZkTestServer.java:221)    3) Thread[id=3552, name=ProcessThread(sid:0 cport:-1):, state=WAITING, group=TGRP-RecoveryZkTest]         at sun.misc.Unsafe.park(Native Method)         at java.util.concurrent.locks.LockSupport.park(LockSupport.java:186)         at java.util.concurrent.locks.AbstractQueuedSynchronizer$ConditionObject.await(AbstractQueuedSynchronizer.java:2043)         at java.util.concurrent.LinkedBlockingQueue.take(LinkedBlockingQueue.java:442)         at org.apache.zookeeper.server.PrepRequestProcessor.run(PrepRequestProcessor.java:120)    4) Thread[id=3549, name=NIOServerCxn.Factory:0.0.0.0/0.0.0.0:0, state=RUNNABLE, group=TGRP-RecoveryZkTest]         at sun.nio.ch.WindowsSelectorImpl$SubSelector.poll0(Native Method)         at sun.nio.ch.WindowsSelectorImpl$SubSelector.poll(WindowsSelectorImpl.java:295)         at sun.nio.ch.WindowsSelectorImpl$SubSelector.access$400(WindowsSelectorImpl.java:277)         at sun.nio.ch.WindowsSelectorImpl.doSelect(WindowsSelectorImpl.java:158)         at sun.nio.ch.SelectorImpl.lockAndDoSelect(SelectorImpl.java:87)         at sun.nio.ch.SelectorImpl.select(SelectorImpl.java:98)         at org.apache.zookeeper.server.NIOServerCnxnFactory.run(NIOServerCnxnFactory.java:178)         at java.lang.Thread.run(Thread.java:724)

Stack Trace:
com.carrotsearch.randomizedtesting.ThreadLeakError: 4 threads leaked from SUITE scope at org.apache.solr.cloud.RecoveryZkTest: 
   1) Thread[id=3550, name=SessionTracker, state=TIMED_WAITING, group=TGRP-RecoveryZkTest]
        at java.lang.Object.wait(Native Method)
        at org.apache.zookeeper.server.SessionTrackerImpl.run(SessionTrackerImpl.java:146)
   2) Thread[id=3548, name=Thread-1364, state=WAITING, group=TGRP-RecoveryZkTest]
        at java.lang.Object.wait(Native Method)
        at java.lang.Thread.join(Thread.java:1260)
        at java.lang.Thread.join(Thread.java:1334)
        at org.apache.zookeeper.server.NIOServerCnxnFactory.join(NIOServerCnxnFactory.java:302)
        at org.apache.solr.cloud.ZkTestServer$ZKServerMain.runFromConfig(ZkTestServer.java:107)
        at org.apache.solr.cloud.ZkTestServer$2.run(ZkTestServer.java:221)
   3) Thread[id=3552, name=ProcessThread(sid:0 cport:-1):, state=WAITING, group=TGRP-RecoveryZkTest]
        at sun.misc.Unsafe.park(Native Method)
        at java.util.concurrent.locks.LockSupport.park(LockSupport.java:186)
        at java.util.concurrent.locks.AbstractQueuedSynchronizer$ConditionObject.await(AbstractQueuedSynchronizer.java:2043)
        at java.util.concurrent.LinkedBlockingQueue.take(LinkedBlockingQueue.java:442)
        at org.apache.zookeeper.server.PrepRequestProcessor.run(PrepRequestProcessor.java:120)
   4) Thread[id=3549, name=NIOServerCxn.Factory:0.0.0.0/0.0.0.0:0, state=RUNNABLE, group=TGRP-RecoveryZkTest]
        at sun.nio.ch.WindowsSelectorImpl$SubSelector.poll0(Native Method)
        at sun.nio.ch.WindowsSelectorImpl$SubSelector.poll(WindowsSelectorImpl.java:295)
        at sun.nio.ch.WindowsSelectorImpl$SubSelector.access$400(WindowsSelectorImpl.java:277)
        at sun.nio.ch.WindowsSelectorImpl.doSelect(WindowsSelectorImpl.java:158)
        at sun.nio.ch.SelectorImpl.lockAndDoSelect(SelectorImpl.java:87)
        at sun.nio.ch.SelectorImpl.select(SelectorImpl.java:98)
        at org.apache.zookeeper.server.NIOServerCnxnFactory.run(NIOServerCnxnFactory.java:178)
        at java.lang.Thread.run(Thread.java:724)
	at __randomizedtesting.SeedInfo.seed([458667C837549B73]:0)


FAILED:  junit.framework.TestSuite.org.apache.solr.cloud.RecoveryZkTest

Error Message:
There are still zombie threads that couldn't be terminated:    1) Thread[id=3549, name=NIOServerCxn.Factory:0.0.0.0/0.0.0.0:0, state=RUNNABLE, group=TGRP-RecoveryZkTest]         at java.lang.Object.notifyAll(Native Method)         at sun.nio.ch.WindowsSelectorImpl$StartLock.startThreads(WindowsSelectorImpl.java:188)         at sun.nio.ch.WindowsSelectorImpl$StartLock.access$300(WindowsSelectorImpl.java:180)         at sun.nio.ch.WindowsSelectorImpl.doSelect(WindowsSelectorImpl.java:152)         at sun.nio.ch.SelectorImpl.lockAndDoSelect(SelectorImpl.java:87)         at sun.nio.ch.SelectorImpl.select(SelectorImpl.java:98)         at org.apache.zookeeper.server.NIOServerCnxnFactory.run(NIOServerCnxnFactory.java:178)         at java.lang.Thread.run(Thread.java:724)

Stack Trace:
com.carrotsearch.randomizedtesting.ThreadLeakError: There are still zombie threads that couldn't be terminated:
   1) Thread[id=3549, name=NIOServerCxn.Factory:0.0.0.0/0.0.0.0:0, state=RUNNABLE, group=TGRP-RecoveryZkTest]
        at java.lang.Object.notifyAll(Native Method)
        at sun.nio.ch.WindowsSelectorImpl$StartLock.startThreads(WindowsSelectorImpl.java:188)
        at sun.nio.ch.WindowsSelectorImpl$StartLock.access$300(WindowsSelectorImpl.java:180)
        at sun.nio.ch.WindowsSelectorImpl.doSelect(WindowsSelectorImpl.java:152)
        at sun.nio.ch.SelectorImpl.lockAndDoSelect(SelectorImpl.java:87)
        at sun.nio.ch.SelectorImpl.select(SelectorImpl.java:98)
        at org.apache.zookeeper.server.NIOServerCnxnFactory.run(NIOServerCnxnFactory.java:178)
        at java.lang.Thread.run(Thread.java:724)
	at __randomizedtesting.SeedInfo.seed([458667C837549B73]:0)


REGRESSION:  org.apache.solr.cloud.ShardRoutingTest.testDistribSearch

Error Message:
Unexpected internal error near index 1 \  ^

Stack Trace:
java.util.regex.PatternSyntaxException: Unexpected internal error near index 1
\
 ^
	at __randomizedtesting.SeedInfo.seed([458667C837549B73:C460E9D0400BFB4F]:0)
	at java.util.regex.Pattern.error(Pattern.java:1924)
	at java.util.regex.Pattern.compile(Pattern.java:1671)
	at java.util.regex.Pattern.<init>(Pattern.java:1337)
	at java.util.regex.Pattern.compile(Pattern.java:1022)
	at java.lang.String.split(String.java:2313)
	at java.lang.String.split(String.java:2355)
	at org.apache.solr.cloud.AbstractFullDistribZkTestBase.getRelativeSolrHomePath(AbstractFullDistribZkTestBase.java:485)
	at org.apache.solr.cloud.AbstractFullDistribZkTestBase.createJetty(AbstractFullDistribZkTestBase.java:463)
	at org.apache.solr.BaseDistributedSearchTestCase.createJetty(BaseDistributedSearchTestCase.java:356)
	at org.apache.solr.cloud.AbstractFullDistribZkTestBase.createServers(AbstractFullDistribZkTestBase.java:271)
	at org.apache.solr.BaseDistributedSearchTestCase.testDistribSearch(BaseDistributedSearchTestCase.java:833)
	at sun.reflect.NativeMethodAccessorImpl.invoke0(Native Method)
	at sun.reflect.NativeMethodAccessorImpl.invoke(NativeMethodAccessorImpl.java:57)
	at sun.reflect.DelegatingMethodAccessorImpl.invoke(DelegatingMethodAccessorImpl.java:43)
	at java.lang.reflect.Method.invoke(Method.java:606)
	at com.carrotsearch.randomizedtesting.RandomizedRunner.invoke(RandomizedRunner.java:1559)
	at com.carrotsearch.randomizedtesting.RandomizedRunner.access$600(RandomizedRunner.java:79)
	at com.carrotsearch.randomizedtesting.RandomizedRunner$6.evaluate(RandomizedRunner.java:737)
	at com.carrotsearch.randomizedtesting.RandomizedRunner$7.evaluate(RandomizedRunner.java:773)
	at com.carrotsearch.randomizedtesting.RandomizedRunner$8.evaluate(RandomizedRunner.java:787)
	at com.carrotsearch.randomizedtesting.rules.SystemPropertiesRestoreRule$1.evaluate(SystemPropertiesRestoreRule.java:53)
	at org.apache.lucene.util.TestRuleSetupTeardownChained$1.evaluate(TestRuleSetupTeardownChained.java:50)
	at org.apache.lucene.util.TestRuleFieldCacheSanity$1.evaluate(TestRuleFieldCacheSanity.java:51)
	at org.apache.lucene.util.AbstractBeforeAfterRule$1.evaluate(AbstractBeforeAfterRule.java:46)
	at com.carrotsearch.randomizedtesting.rules.SystemPropertiesInvariantRule$1.evaluate(SystemPropertiesInvariantRule.java:55)
	at org.apache.lucene.util.TestRuleThreadAndTestName$1.evaluate(TestRuleThreadAndTestName.java:49)
	at org.apache.lucene.util.TestRuleIgnoreAfterMaxFailures$1.evaluate(TestRuleIgnoreAfterMaxFailures.java:70)
	at org.apache.lucene.util.TestRuleMarkFailure$1.evaluate(TestRuleMarkFailure.java:48)
	at com.carrotsearch.randomizedtesting.rules.StatementAdapter.evaluate(StatementAdapter.java:36)
	at com.carrotsearch.randomizedtesting.ThreadLeakControl$StatementRunner.run(ThreadLeakControl.java:358)
	at com.carrotsearch.randomizedtesting.ThreadLeakControl.forkTimeoutingTask(ThreadLeakControl.java:782)
	at com.carrotsearch.randomizedtesting.ThreadLeakControl$3.evaluate(ThreadLeakControl.java:442)
	at com.carrotsearch.randomizedtesting.RandomizedRunner.runSingleTest(RandomizedRunner.java:746)
	at com.carrotsearch.randomizedtesting.RandomizedRunner$3.evaluate(RandomizedRunner.java:648)
	at com.carrotsearch.randomizedtesting.RandomizedRunner$4.evaluate(RandomizedRunner.java:682)
	at com.carrotsearch.randomizedtesting.RandomizedRunner$5.evaluate(RandomizedRunner.java:693)
	at com.carrotsearch.randomizedtesting.rules.StatementAdapter.evaluate(StatementAdapter.java:36)
	at com.carrotsearch.randomizedtesting.rules.SystemPropertiesRestoreRule$1.evaluate(SystemPropertiesRestoreRule.java:53)
	at org.apache.lucene.util.AbstractBeforeAfterRule$1.evaluate(AbstractBeforeAfterRule.java:46)
	at org.apache.lucene.util.TestRuleStoreClassName$1.evaluate(TestRuleStoreClassName.java:42)
	at com.carrotsearch.randomizedtesting.rules.SystemPropertiesInvariantRule$1.evaluate(SystemPropertiesInvariantRule.java:55)
	at com.carrotsearch.randomizedtesting.rules.NoShadowingOrOverridesOnMethodsRule$1.evaluate(NoShadowingOrOverridesOnMethodsRule.java:39)
	at com.carrotsearch.randomizedtesting.rules.NoShadowingOrOverridesOnMethodsRule$1.evaluate(NoShadowingOrOverridesOnMethodsRule.java:39)
	at com.carrotsearch.randomizedtesting.rules.StatementAdapter.evaluate(StatementAdapter.java:36)
	at org.apache.lucene.util.TestRuleAssertionsRequired$1.evaluate(TestRuleAssertionsRequired.java:43)
	at org.apache.lucene.util.TestRuleMarkFailure$1.evaluate(TestRuleMarkFailure.java:48)
	at org.apache.lucene.util.TestRuleIgnoreAfterMaxFailures$1.evaluate(TestRuleIgnoreAfterMaxFailures.java:70)
	at org.apache.lucene.util.TestRuleIgnoreTestSuites$1.evaluate(TestRuleIgnoreTestSuites.java:55)
	at com.carrotsearch.randomizedtesting.rules.StatementAdapter.evaluate(StatementAdapter.java:36)
	at com.carrotsearch.randomizedtesting.ThreadLeakControl$StatementRunner.run(ThreadLeakControl.java:358)
	at java.lang.Thread.run(Thread.java:724)


REGRESSION:  org.apache.solr.cloud.SyncSliceTest.testDistribSearch

Error Message:
Unexpected internal error near index 1 \  ^

Stack Trace:
java.util.regex.PatternSyntaxException: Unexpected internal error near index 1
\
 ^
	at __randomizedtesting.SeedInfo.seed([458667C837549B73:C460E9D0400BFB4F]:0)
	at java.util.regex.Pattern.error(Pattern.java:1924)
	at java.util.regex.Pattern.compile(Pattern.java:1671)
	at java.util.regex.Pattern.<init>(Pattern.java:1337)
	at java.util.regex.Pattern.compile(Pattern.java:1022)
	at java.lang.String.split(String.java:2313)
	at java.lang.String.split(String.java:2355)
	at org.apache.solr.cloud.AbstractFullDistribZkTestBase.getRelativeSolrHomePath(AbstractFullDistribZkTestBase.java:485)
	at org.apache.solr.cloud.AbstractFullDistribZkTestBase.createJetty(AbstractFullDistribZkTestBase.java:463)
	at org.apache.solr.BaseDistributedSearchTestCase.createJetty(BaseDistributedSearchTestCase.java:356)
	at org.apache.solr.cloud.AbstractFullDistribZkTestBase.createServers(AbstractFullDistribZkTestBase.java:271)
	at org.apache.solr.BaseDistributedSearchTestCase.testDistribSearch(BaseDistributedSearchTestCase.java:833)
	at sun.reflect.NativeMethodAccessorImpl.invoke0(Native Method)
	at sun.reflect.NativeMethodAccessorImpl.invoke(NativeMethodAccessorImpl.java:57)
	at sun.reflect.DelegatingMethodAccessorImpl.invoke(DelegatingMethodAccessorImpl.java:43)
	at java.lang.reflect.Method.invoke(Method.java:606)
	at com.carrotsearch.randomizedtesting.RandomizedRunner.invoke(RandomizedRunner.java:1559)
	at com.carrotsearch.randomizedtesting.RandomizedRunner.access$600(RandomizedRunner.java:79)
	at com.carrotsearch.randomizedtesting.RandomizedRunner$6.evaluate(RandomizedRunner.java:737)
	at com.carrotsearch.randomizedtesting.RandomizedRunner$7.evaluate(RandomizedRunner.java:773)
	at com.carrotsearch.randomizedtesting.RandomizedRunner$8.evaluate(RandomizedRunner.java:787)
	at com.carrotsearch.randomizedtesting.rules.SystemPropertiesRestoreRule$1.evaluate(SystemPropertiesRestoreRule.java:53)
	at org.apache.lucene.util.TestRuleSetupTeardownChained$1.evaluate(TestRuleSetupTeardownChained.java:50)
	at org.apache.lucene.util.TestRuleFieldCacheSanity$1.evaluate(TestRuleFieldCacheSanity.java:51)
	at org.apache.lucene.util.AbstractBeforeAfterRule$1.evaluate(AbstractBeforeAfterRule.java:46)
	at com.carrotsearch.randomizedtesting.rules.SystemPropertiesInvariantRule$1.evaluate(SystemPropertiesInvariantRule.java:55)
	at org.apache.lucene.util.TestRuleThreadAndTestName$1.evaluate(TestRuleThreadAndTestName.java:49)
	at org.apache.lucene.util.TestRuleIgnoreAfterMaxFailures$1.evaluate(TestRuleIgnoreAfterMaxFailures.java:70)
	at org.apache.lucene.util.TestRuleMarkFailure$1.evaluate(TestRuleMarkFailure.java:48)
	at com.carrotsearch.randomizedtesting.rules.StatementAdapter.evaluate(StatementAdapter.java:36)
	at com.carrotsearch.randomizedtesting.ThreadLeakControl$StatementRunner.run(ThreadLeakControl.java:358)
	at com.carrotsearch.randomizedtesting.ThreadLeakControl.forkTimeoutingTask(ThreadLeakControl.java:782)
	at com.carrotsearch.randomizedtesting.ThreadLeakControl$3.evaluate(ThreadLeakControl.java:442)
	at com.carrotsearch.randomizedtesting.RandomizedRunner.runSingleTest(RandomizedRunner.java:746)
	at com.carrotsearch.randomizedtesting.RandomizedRunner$3.evaluate(RandomizedRunner.java:648)
	at com.carrotsearch.randomizedtesting.RandomizedRunner$4.evaluate(RandomizedRunner.java:682)
	at com.carrotsearch.randomizedtesting.RandomizedRunner$5.evaluate(RandomizedRunner.java:693)
	at com.carrotsearch.randomizedtesting.rules.StatementAdapter.evaluate(StatementAdapter.java:36)
	at com.carrotsearch.randomizedtesting.rules.SystemPropertiesRestoreRule$1.evaluate(SystemPropertiesRestoreRule.java:53)
	at org.apache.lucene.util.AbstractBeforeAfterRule$1.evaluate(AbstractBeforeAfterRule.java:46)
	at org.apache.lucene.util.TestRuleStoreClassName$1.evaluate(TestRuleStoreClassName.java:42)
	at com.carrotsearch.randomizedtesting.rules.SystemPropertiesInvariantRule$1.evaluate(SystemPropertiesInvariantRule.java:55)
	at com.carrotsearch.randomizedtesting.rules.NoShadowingOrOverridesOnMethodsRule$1.evaluate(NoShadowingOrOverridesOnMethodsRule.java:39)
	at com.carrotsearch.randomizedtesting.rules.NoShadowingOrOverridesOnMethodsRule$1.evaluate(NoShadowingOrOverridesOnMethodsRule.java:39)
	at com.carrotsearch.randomizedtesting.rules.StatementAdapter.evaluate(StatementAdapter.java:36)
	at org.apache.lucene.util.TestRuleAssertionsRequired$1.evaluate(TestRuleAssertionsRequired.java:43)
	at org.apache.lucene.util.TestRuleMarkFailure$1.evaluate(TestRuleMarkFailure.java:48)
	at org.apache.lucene.util.TestRuleIgnoreAfterMaxFailures$1.evaluate(TestRuleIgnoreAfterMaxFailures.java:70)
	at org.apache.lucene.util.TestRuleIgnoreTestSuites$1.evaluate(TestRuleIgnoreTestSuites.java:55)
	at com.carrotsearch.randomizedtesting.rules.StatementAdapter.evaluate(StatementAdapter.java:36)
	at com.carrotsearch.randomizedtesting.ThreadLeakControl$StatementRunner.run(ThreadLeakControl.java:358)
	at java.lang.Thread.run(Thread.java:724)


REGRESSION:  org.apache.solr.cloud.UnloadDistributedZkTest.testDistribSearch

Error Message:
Unexpected internal error near index 1 \  ^

Stack Trace:
java.util.regex.PatternSyntaxException: Unexpected internal error near index 1
\
 ^
	at __randomizedtesting.SeedInfo.seed([458667C837549B73:C460E9D0400BFB4F]:0)
	at java.util.regex.Pattern.error(Pattern.java:1924)
	at java.util.regex.Pattern.compile(Pattern.java:1671)
	at java.util.regex.Pattern.<init>(Pattern.java:1337)
	at java.util.regex.Pattern.compile(Pattern.java:1022)
	at java.lang.String.split(String.java:2313)
	at java.lang.String.split(String.java:2355)
	at org.apache.solr.cloud.AbstractFullDistribZkTestBase.getRelativeSolrHomePath(AbstractFullDistribZkTestBase.java:485)
	at org.apache.solr.cloud.AbstractFullDistribZkTestBase.createJetty(AbstractFullDistribZkTestBase.java:463)
	at org.apache.solr.BaseDistributedSearchTestCase.createJetty(BaseDistributedSearchTestCase.java:356)
	at org.apache.solr.cloud.AbstractFullDistribZkTestBase.createServers(AbstractFullDistribZkTestBase.java:271)
	at org.apache.solr.BaseDistributedSearchTestCase.testDistribSearch(BaseDistributedSearchTestCase.java:833)
	at sun.reflect.NativeMethodAccessorImpl.invoke0(Native Method)
	at sun.reflect.NativeMethodAccessorImpl.invoke(NativeMethodAccessorImpl.java:57)
	at sun.reflect.DelegatingMethodAccessorImpl.invoke(DelegatingMethodAccessorImpl.java:43)
	at java.lang.reflect.Method.invoke(Method.java:606)
	at com.carrotsearch.randomizedtesting.RandomizedRunner.invoke(RandomizedRunner.java:1559)
	at com.carrotsearch.randomizedtesting.RandomizedRunner.access$600(RandomizedRunner.java:79)
	at com.carrotsearch.randomizedtesting.RandomizedRunner$6.evaluate(RandomizedRunner.java:737)
	at com.carrotsearch.randomizedtesting.RandomizedRunner$7.evaluate(RandomizedRunner.java:773)
	at com.carrotsearch.randomizedtesting.RandomizedRunner$8.evaluate(RandomizedRunner.java:787)
	at com.carrotsearch.randomizedtesting.rules.SystemPropertiesRestoreRule$1.evaluate(SystemPropertiesRestoreRule.java:53)
	at org.apache.lucene.util.TestRuleSetupTeardownChained$1.evaluate(TestRuleSetupTeardownChained.java:50)
	at org.apache.lucene.util.TestRuleFieldCacheSanity$1.evaluate(TestRuleFieldCacheSanity.java:51)
	at org.apache.lucene.util.AbstractBeforeAfterRule$1.evaluate(AbstractBeforeAfterRule.java:46)
	at com.carrotsearch.randomizedtesting.rules.SystemPropertiesInvariantRule$1.evaluate(SystemPropertiesInvariantRule.java:55)
	at org.apache.lucene.util.TestRuleThreadAndTestName$1.evaluate(TestRuleThreadAndTestName.java:49)
	at org.apache.lucene.util.TestRuleIgnoreAfterMaxFailures$1.evaluate(TestRuleIgnoreAfterMaxFailures.java:70)
	at org.apache.lucene.util.TestRuleMarkFailure$1.evaluate(TestRuleMarkFailure.java:48)
	at com.carrotsearch.randomizedtesting.rules.StatementAdapter.evaluate(StatementAdapter.java:36)
	at com.carrotsearch.randomizedtesting.ThreadLeakControl$StatementRunner.run(ThreadLeakControl.java:358)
	at com.carrotsearch.randomizedtesting.ThreadLeakControl.forkTimeoutingTask(ThreadLeakControl.java:782)
	at com.carrotsearch.randomizedtesting.ThreadLeakControl$3.evaluate(ThreadLeakControl.java:442)
	at com.carrotsearch.randomizedtesting.RandomizedRunner.runSingleTest(RandomizedRunner.java:746)
	at com.carrotsearch.randomizedtesting.RandomizedRunner$3.evaluate(RandomizedRunner.java:648)
	at com.carrotsearch.randomizedtesting.RandomizedRunner$4.evaluate(RandomizedRunner.java:682)
	at com.carrotsearch.randomizedtesting.RandomizedRunner$5.evaluate(RandomizedRunner.java:693)
	at com.carrotsearch.randomizedtesting.rules.StatementAdapter.evaluate(StatementAdapter.java:36)
	at com.carrotsearch.randomizedtesting.rules.SystemPropertiesRestoreRule$1.evaluate(SystemPropertiesRestoreRule.java:53)
	at org.apache.lucene.util.AbstractBeforeAfterRule$1.evaluate(AbstractBeforeAfterRule.java:46)
	at org.apache.lucene.util.TestRuleStoreClassName$1.evaluate(TestRuleStoreClassName.java:42)
	at com.carrotsearch.randomizedtesting.rules.SystemPropertiesInvariantRule$1.evaluate(SystemPropertiesInvariantRule.java:55)
	at com.carrotsearch.randomizedtesting.rules.NoShadowingOrOverridesOnMethodsRule$1.evaluate(NoShadowingOrOverridesOnMethodsRule.java:39)
	at com.carrotsearch.randomizedtesting.rules.NoShadowingOrOverridesOnMethodsRule$1.evaluate(NoShadowingOrOverridesOnMethodsRule.java:39)
	at com.carrotsearch.randomizedtesting.rules.StatementAdapter.evaluate(StatementAdapter.java:36)
	at org.apache.lucene.util.TestRuleAssertionsRequired$1.evaluate(TestRuleAssertionsRequired.java:43)
	at org.apache.lucene.util.TestRuleMarkFailure$1.evaluate(TestRuleMarkFailure.java:48)
	at org.apache.lucene.util.TestRuleIgnoreAfterMaxFailures$1.evaluate(TestRuleIgnoreAfterMaxFailures.java:70)
	at org.apache.lucene.util.TestRuleIgnoreTestSuites$1.evaluate(TestRuleIgnoreTestSuites.java:55)
	at com.carrotsearch.randomizedtesting.rules.StatementAdapter.evaluate(StatementAdapter.java:36)
	at com.carrotsearch.randomizedtesting.ThreadLeakControl$StatementRunner.run(ThreadLeakControl.java:358)
	at java.lang.Thread.run(Thread.java:724)




Build Log:
[...truncated 9580 lines...]
   [junit4] Suite: org.apache.solr.cloud.CollectionsAPIDistributedZkTest
   [junit4]   2> 20636 T42 oas.BaseDistributedSearchTestCase.initHostContext Setting hostContext system property: /
   [junit4]   2> 20651 T42 oas.SolrTestCaseJ4.setUp ###Starting testDistribSearch
   [junit4]   2> Creating dataDir: C:\Users\JenkinsSlave\workspace\Lucene-Solr-4.x-Windows\solr\build\solr-core\test\J0\.\solrtest-CollectionsAPIDistributedZkTest-1376707999901
   [junit4]   2> 20659 T42 oasc.ZkTestServer.run STARTING ZK TEST SERVER
   [junit4]   2> 20665 T43 oasc.ZkTestServer$ZKServerMain.runFromConfig Starting server
   [junit4]   2> 20865 T42 oasc.ZkTestServer.run start zk server on port:57296
   [junit4]   2> 21039 T42 oascc.ConnectionManager.waitForConnected Waiting for client to connect to ZooKeeper
   [junit4]   2> 21135 T49 oascc.ConnectionManager.process Watcher org.apache.solr.common.cloud.ConnectionManager@6ca42f39 name:ZooKeeperConnection Watcher:127.0.0.1:57296 got event WatchedEvent state:SyncConnected type:None path:null path:null type:None
   [junit4]   2> 21136 T42 oascc.ConnectionManager.waitForConnected Client is connected to ZooKeeper
   [junit4]   2> 21140 T42 oascc.SolrZkClient.makePath makePath: /solr
   [junit4]   2> 21217 T42 oascc.ConnectionManager.waitForConnected Waiting for client to connect to ZooKeeper
   [junit4]   2> 21219 T44 oazs.NIOServerCnxn.doIO WARN caught end of stream exception EndOfStreamException: Unable to read additional data from client sessionid 0x1408a30f96e0000, likely client has closed socket
   [junit4]   2> 	at org.apache.zookeeper.server.NIOServerCnxn.doIO(NIOServerCnxn.java:220)
   [junit4]   2> 	at org.apache.zookeeper.server.NIOServerCnxnFactory.run(NIOServerCnxnFactory.java:208)
   [junit4]   2> 	at java.lang.Thread.run(Thread.java:724)
   [junit4]   2> 
   [junit4]   2> 21224 T51 oascc.ConnectionManager.process Watcher org.apache.solr.common.cloud.ConnectionManager@607a8e25 name:ZooKeeperConnection Watcher:127.0.0.1:57296/solr got event WatchedEvent state:SyncConnected type:None path:null path:null type:None
   [junit4]   2> 21225 T42 oascc.ConnectionManager.waitForConnected Client is connected to ZooKeeper
   [junit4]   2> 21234 T42 oascc.SolrZkClient.makePath makePath: /collections/collection1
   [junit4]   2> 21242 T42 oascc.SolrZkClient.makePath makePath: /collections/collection1/shards
   [junit4]   2> 21250 T42 oascc.SolrZkClient.makePath makePath: /collections/control_collection
   [junit4]   2> 21255 T42 oascc.SolrZkClient.makePath makePath: /collections/control_collection/shards
   [junit4]   2> 21262 T42 oasc.AbstractZkTestCase.putConfig put C:\Users\JenkinsSlave\workspace\Lucene-Solr-4.x-Windows\solr\build\solr-core\test-files\solr\collection1\conf\solrconfig-tlog.xml to /configs/conf1/solrconfig.xml
   [junit4]   2> 21282 T42 oascc.SolrZkClient.makePath makePath: /configs/conf1/solrconfig.xml
   [junit4]   2> 21295 T42 oasc.AbstractZkTestCase.putConfig put C:\Users\JenkinsSlave\workspace\Lucene-Solr-4.x-Windows\solr\build\solr-core\test-files\solr\collection1\conf\schema.xml to /configs/conf1/schema.xml
   [junit4]   2> 21295 T42 oascc.SolrZkClient.makePath makePath: /configs/conf1/schema.xml
   [junit4]   2> 21303 T42 oasc.AbstractZkTestCase.putConfig put C:\Users\JenkinsSlave\workspace\Lucene-Solr-4.x-Windows\solr\build\solr-core\test-files\solr\collection1\conf\solrconfig.snippet.randomindexconfig.xml to /configs/conf1/solrconfig.snippet.randomindexconfig.xml
   [junit4]   2> 21303 T42 oascc.SolrZkClient.makePath makePath: /configs/conf1/solrconfig.snippet.randomindexconfig.xml
   [junit4]   2> 21312 T42 oasc.AbstractZkTestCase.putConfig put C:\Users\JenkinsSlave\workspace\Lucene-Solr-4.x-Windows\solr\build\solr-core\test-files\solr\collection1\conf\stopwords.txt to /configs/conf1/stopwords.txt
   [junit4]   2> 21312 T42 oascc.SolrZkClient.makePath makePath: /configs/conf1/stopwords.txt
   [junit4]   2> 21319 T42 oasc.AbstractZkTestCase.putConfig put C:\Users\JenkinsSlave\workspace\Lucene-Solr-4.x-Windows\solr\build\solr-core\test-files\solr\collection1\conf\protwords.txt to /configs/conf1/protwords.txt
   [junit4]   2> 21319 T42 oascc.SolrZkClient.makePath makePath: /configs/conf1/protwords.txt
   [junit4]   2> 21327 T42 oasc.AbstractZkTestCase.putConfig put C:\Users\JenkinsSlave\workspace\Lucene-Solr-4.x-Windows\solr\build\solr-core\test-files\solr\collection1\conf\currency.xml to /configs/conf1/currency.xml
   [junit4]   2> 21329 T42 oascc.SolrZkClient.makePath makePath: /configs/conf1/currency.xml
   [junit4]   2> 21336 T42 oasc.AbstractZkTestCase.putConfig put C:\Users\JenkinsSlave\workspace\Lucene-Solr-4.x-Windows\solr\build\solr-core\test-files\solr\collection1\conf\open-exchange-rates.json to /configs/conf1/open-exchange-rates.json
   [junit4]   2> 21337 T42 oascc.SolrZkClient.makePath makePath: /configs/conf1/open-exchange-rates.json
   [junit4]   2> 21344 T42 oasc.AbstractZkTestCase.putConfig put C:\Users\JenkinsSlave\workspace\Lucene-Solr-4.x-Windows\solr\build\solr-core\test-files\solr\collection1\conf\mapping-ISOLatin1Accent.txt to /configs/conf1/mapping-ISOLatin1Accent.txt
   [junit4]   2> 21344 T42 oascc.SolrZkClient.makePath makePath: /configs/conf1/mapping-ISOLatin1Accent.txt
   [junit4]   2> 21355 T42 oasc.AbstractZkTestCase.putConfig put C:\Users\JenkinsSlave\workspace\Lucene-Solr-4.x-Windows\solr\build\solr-core\test-files\solr\collection1\conf\old_synonyms.txt to /configs/conf1/old_synonyms.txt
   [junit4]   2> 21356 T42 oascc.SolrZkClient.makePath makePath: /configs/conf1/old_synonyms.txt
   [junit4]   2> 21361 T42 oasc.AbstractZkTestCase.putConfig put C:\Users\JenkinsSlave\workspace\Lucene-Solr-4.x-Windows\solr\build\solr-core\test-files\solr\collection1\conf\synonyms.txt to /configs/conf1/synonyms.txt
   [junit4]   2> 21361 T42 oascc.SolrZkClient.makePath makePath: /configs/conf1/synonyms.txt
   [junit4]   2> !!!! WARNING: best effort to remove C:\Users\JenkinsSlave\workspace\Lucene-Solr-4.x-Windows\solr\build\solr-core\test\J0\.\org.apache.solr.cloud.CollectionsAPIDistributedZkTest-1376707999899\zookeeper\server1\data\version-2\log.1 FAILED !!!!!
   [junit4]   2> !!!! WARNING: best effort to remove C:\Users\JenkinsSlave\workspace\Lucene-Solr-4.x-Windows\solr\build\solr-core\test\J0\.\org.apache.solr.cloud.CollectionsAPIDistributedZkTest-1376707999899\zookeeper\server1\data\version-2 FAILED !!!!!
   [junit4]   2> !!!! WARNING: best effort to remove C:\Users\JenkinsSlave\workspace\Lucene-Solr-4.x-Windows\solr\build\solr-core\test\J0\.\org.apache.solr.cloud.CollectionsAPIDistributedZkTest-1376707999899\zookeeper\server1\data FAILED !!!!!
   [junit4]   2> !!!! WARNING: best effort to remove C:\Users\JenkinsSlave\workspace\Lucene-Solr-4.x-Windows\solr\build\solr-core\test\J0\.\org.apache.solr.cloud.CollectionsAPIDistributedZkTest-1376707999899\zookeeper\server1 FAILED !!!!!
   [junit4]   2> !!!! WARNING: best effort to remove C:\Users\JenkinsSlave\workspace\Lucene-Solr-4.x-Windows\solr\build\solr-core\test\J0\.\org.apache.solr.cloud.CollectionsAPIDistributedZkTest-1376707999899\zookeeper FAILED !!!!!
   [junit4]   2> !!!! WARNING: best effort to remove C:\Users\JenkinsSlave\workspace\Lucene-Solr-4.x-Windows\solr\build\solr-core\test\J0\.\org.apache.solr.cloud.CollectionsAPIDistributedZkTest-1376707999899 FAILED !!!!!
   [junit4]   2> 21811 T42 oas.SolrTestCaseJ4.tearDown ###Ending testDistribSearch
   [junit4]   2> 21814 T42 oasc.ZkTestServer.send4LetterWord connecting to 127.0.0.1:57296 57296
   [junit4]   1> client port:0.0.0.0/0.0.0.0:0
   [junit4]   2> NOTE: reproduce with: ant test  -Dtestcase=CollectionsAPIDistributedZkTest -Dtests.method=testDistribSearch -Dtests.seed=458667C837549B73 -Dtests.slow=true -Dtests.locale=ms_MY -Dtests.timezone=Africa/Bujumbura -Dtests.file.encoding=US-ASCII
   [junit4] ERROR   3.46s | CollectionsAPIDistributedZkTest.testDistribSearch <<<
   [junit4]    > Throwable #1: java.util.regex.PatternSyntaxException: Unexpected internal error near index 1
   [junit4]    > \
   [junit4]    >  ^
   [junit4]    > 	at __randomizedtesting.SeedInfo.seed([458667C837549B73:C460E9D0400BFB4F]:0)
   [junit4]    > 	at java.util.regex.Pattern.error(Pattern.java:1924)
   [junit4]    > 	at java.util.regex.Pattern.compile(Pattern.java:1671)
   [junit4]    > 	at java.util.regex.Pattern.<init>(Pattern.java:1337)
   [junit4]    > 	at java.util.regex.Pattern.compile(Pattern.java:1022)
   [junit4]    > 	at java.lang.String.split(String.java:2313)
   [junit4]    > 	at java.lang.String.split(String.java:2355)
   [junit4]    > 	at org.apache.solr.cloud.AbstractFullDistribZkTestBase.getRelativeSolrHomePath(AbstractFullDistribZkTestBase.java:485)
   [junit4]    > 	at org.apache.solr.cloud.AbstractFullDistribZkTestBase.createJetty(AbstractFullDistribZkTestBase.java:463)
   [junit4]    > 	at org.apache.solr.BaseDistributedSearchTestCase.createJetty(BaseDistributedSearchTestCase.java:356)
   [junit4]    > 	at org.apache.solr.cloud.AbstractFullDistribZkTestBase.createServers(AbstractFullDistribZkTestBase.java:271)
   [junit4]    > 	at org.apache.solr.BaseDistributedSearchTestCase.testDistribSearch(BaseDistributedSearchTestCase.java:833)
   [junit4]    > 	at java.lang.Thread.run(Thread.java:724)
   [junit4]   2> 24101 T42 oas.SolrTestCaseJ4.deleteCore ###deleteCore
   [junit4]   2> NOTE: test params are: codec=Lucene42: {}, docValues:{}, sim=RandomSimilarityProvider(queryNorm=false,coord=yes): {}, locale=ms_MY, timezone=Africa/Bujumbura
   [junit4]   2> NOTE: Windows 7 6.1 amd64/Oracle Corporation 1.7.0_25 (64-bit)/cpus=2,threads=1,free=11493992,total=40558592
   [junit4]   2> NOTE: All tests run in this JVM: [TestFastOutputStream, ScriptEngineTest, TestQueryTypes, TestDynamicFieldResource, PolyFieldTest, CollectionsAPIDistributedZkTest]
   [junit4] Completed in 3.52s, 1 test, 1 error <<< FAILURES!

[...truncated 111 lines...]
   [junit4] Suite: org.apache.solr.cloud.BasicDistributedZkTest
   [junit4]   2> 263441 T411 oas.BaseDistributedSearchTestCase.initHostContext Setting hostContext system property: /hul/
   [junit4]   2> 263447 T411 oas.SolrTestCaseJ4.setUp ###Starting testDistribSearch
   [junit4]   2> Creating dataDir: C:\Users\JenkinsSlave\workspace\Lucene-Solr-4.x-Windows\solr\build\solr-core\test\J0\.\solrtest-BasicDistributedZkTest-1376708242698
   [junit4]   2> 263452 T411 oasc.ZkTestServer.run STARTING ZK TEST SERVER
   [junit4]   2> 263455 T412 oasc.ZkTestServer$ZKServerMain.runFromConfig Starting server
   [junit4]   2> 263565 T411 oasc.ZkTestServer.run start zk server on port:57439
   [junit4]   2> 263568 T411 oascc.ConnectionManager.waitForConnected Waiting for client to connect to ZooKeeper
   [junit4]   2> 263587 T418 oascc.ConnectionManager.process Watcher org.apache.solr.common.cloud.ConnectionManager@661f8366 name:ZooKeeperConnection Watcher:127.0.0.1:57439 got event WatchedEvent state:SyncConnected type:None path:null path:null type:None
   [junit4]   2> 263588 T411 oascc.ConnectionManager.waitForConnected Client is connected to ZooKeeper
   [junit4]   2> 263589 T411 oascc.SolrZkClient.makePath makePath: /solr
   [junit4]   2> 263601 T413 oazs.NIOServerCnxn.doIO WARN caught end of stream exception EndOfStreamException: Unable to read additional data from client sessionid 0x1408a34ad190000, likely client has closed socket
   [junit4]   2> 	at org.apache.zookeeper.server.NIOServerCnxn.doIO(NIOServerCnxn.java:220)
   [junit4]   2> 	at org.apache.zookeeper.server.NIOServerCnxnFactory.run(NIOServerCnxnFactory.java:208)
   [junit4]   2> 	at java.lang.Thread.run(Thread.java:724)
   [junit4]   2> 
   [junit4]   2> 263607 T411 oascc.ConnectionManager.waitForConnected Waiting for client to connect to ZooKeeper
   [junit4]   2> 263611 T420 oascc.ConnectionManager.process Watcher org.apache.solr.common.cloud.ConnectionManager@27ca182c name:ZooKeeperConnection Watcher:127.0.0.1:57439/solr got event WatchedEvent state:SyncConnected type:None path:null path:null type:None
   [junit4]   2> 263612 T411 oascc.ConnectionManager.waitForConnected Client is connected to ZooKeeper
   [junit4]   2> 263612 T411 oascc.SolrZkClient.makePath makePath: /collections/collection1
   [junit4]   2> 263623 T411 oascc.SolrZkClient.makePath makePath: /collections/collection1/shards
   [junit4]   2> 263638 T411 oascc.SolrZkClient.makePath makePath: /collections/control_collection
   [junit4]   2> 263656 T411 oascc.SolrZkClient.makePath makePath: /collections/control_collection/shards
   [junit4]   2> 263673 T411 oasc.AbstractZkTestCase.putConfig put C:\Users\JenkinsSlave\workspace\Lucene-Solr-4.x-Windows\solr\build\solr-core\test-files\solr\collection1\conf\solrconfig-tlog.xml to /configs/conf1/solrconfig.xml
   [junit4]   2> 263674 T411 oascc.SolrZkClient.makePath makePath: /configs/conf1/solrconfig.xml
   [junit4]   2> 263697 T411 oasc.AbstractZkTestCase.putConfig put C:\Users\JenkinsSlave\workspace\Lucene-Solr-4.x-Windows\solr\build\solr-core\test-files\solr\collection1\conf\schema.xml to /configs/conf1/schema.xml
   [junit4]   2> 263700 T411 oascc.SolrZkClient.makePath makePath: /configs/conf1/schema.xml
   [junit4]   2> 263717 T411 oasc.AbstractZkTestCase.putConfig put C:\Users\JenkinsSlave\workspace\Lucene-Solr-4.x-Windows\solr\build\solr-core\test-files\solr\collection1\conf\solrconfig.snippet.randomindexconfig.xml to /configs/conf1/solrconfig.snippet.randomindexconfig.xml
   [junit4]   2> 263718 T411 oascc.SolrZkClient.makePath makePath: /configs/conf1/solrconfig.snippet.randomindexconfig.xml
   [junit4]   2> 263729 T411 oasc.AbstractZkTestCase.putConfig put C:\Users\JenkinsSlave\workspace\Lucene-Solr-4.x-Windows\solr\build\solr-core\test-files\solr\collection1\conf\stopwords.txt to /configs/conf1/stopwords.txt
   [junit4]   2> 263730 T411 oascc.SolrZkClient.makePath makePath: /configs/conf1/stopwords.txt
   [junit4]   2> 263741 T411 oasc.AbstractZkTestCase.putConfig put C:\Users\JenkinsSlave\workspace\Lucene-Solr-4.x-Windows\solr\build\solr-core\test-files\solr\collection1\conf\protwords.txt to /configs/conf1/protwords.txt
   [junit4]   2> 263741 T411 oascc.SolrZkClient.makePath makePath: /configs/conf1/protwords.txt
   [junit4]   2> 263759 T411 oasc.AbstractZkTestCase.putConfig put C:\Users\JenkinsSlave\workspace\Lucene-Solr-4.x-Windows\solr\build\solr-core\test-files\solr\collection1\conf\currency.xml to /configs/conf1/currency.xml
   [junit4]   2> 263761 T411 oascc.SolrZkClient.makePath makePath: /configs/conf1/currency.xml
   [junit4]   2> 263780 T411 oasc.AbstractZkTestCase.putConfig put C:\Users\JenkinsSlave\workspace\Lucene-Solr-4.x-Windows\solr\build\solr-core\test-files\solr\collection1\conf\open-exchange-rates.json to /configs/conf1/open-exchange-rates.json
   [junit4]   2> 263780 T411 oascc.SolrZkClient.makePath makePath: /configs/conf1/open-exchange-rates.json
   [junit4]   2> 263792 T411 oasc.AbstractZkTestCase.putConfig put C:\Users\JenkinsSlave\workspace\Lucene-Solr-4.x-Windows\solr\build\solr-core\test-files\solr\collection1\conf\mapping-ISOLatin1Accent.txt to /configs/conf1/mapping-ISOLatin1Accent.txt
   [junit4]   2> 263794 T411 oascc.SolrZkClient.makePath makePath: /configs/conf1/mapping-ISOLatin1Accent.txt
   [junit4]   2> 263803 T411 oasc.AbstractZkTestCase.putConfig put C:\Users\JenkinsSlave\workspace\Lucene-Solr-4.x-Windows\solr\build\solr-core\test-files\solr\collection1\conf\old_synonyms.txt to /configs/conf1/old_synonyms.txt
   [junit4]   2> 263804 T411 oascc.SolrZkClient.makePath makePath: /configs/conf1/old_synonyms.txt
   [junit4]   2> 263813 T411 oasc.AbstractZkTestCase.putConfig put C:\Users\JenkinsSlave\workspace\Lucene-Solr-4.x-Windows\solr\build\solr-core\test-files\solr\collection1\conf\synonyms.txt to /configs/conf1/synonyms.txt
   [junit4]   2> 263814 T411 oascc.SolrZkClient.makePath makePath: /configs/conf1/synonyms.txt
   [junit4]   2> 263827 T413 oazs.NIOServerCnxn.doIO WARN caught end of stream exception EndOfStreamException: Unable to read additional data from client sessionid 0x1408a34ad190001, likely client has closed socket
   [junit4]   2> 	at org.apache.zookeeper.server.NIOServerCnxn.doIO(NIOServerCnxn.java:220)
   [junit4]   2> 	at org.apache.zookeeper.server.NIOServerCnxnFactory.run(NIOServerCnxnFactory.java:208)
   [junit4]   2> 	at java.lang.Thread.run(Thread.java:724)
   [junit4]   2> 
   [junit4]   2> !!!! WARNING: best effort to remove C:\Users\JenkinsSlave\workspace\Lucene-Solr-4.x-Windows\solr\build\solr-core\test\J0\.\org.apache.solr.cloud.BasicDistributedZkTest-1376708242696\zookeeper\server1\data\version-2\log.1 FAILED !!!!!
   [junit4]   2> !!!! WARNING: best effort to remove C:\Users\JenkinsSlave\workspace\Lucene-Solr-4.x-Windows\solr\build\solr-core\test\J0\.\org.apache.solr.cloud.BasicDistributedZkTest-1376708242696\zookeeper\server1\data\version-2 FAILED !!!!!
   [junit4]   2> !!!! WARNING: best effort to remove C:\Users\JenkinsSlave\workspace\Lucene-Solr-4.x-Windows\solr\build\solr-core\test\J0\.\org.apache.solr.cloud.BasicDistributedZkTest-1376708242696\zookeeper\server1\data FAILED !!!!!
   [junit4]   2> !!!! WARNING: best effort to remove C:\Users\JenkinsSlave\workspace\Lucene-Solr-4.x-Windows\solr\build\solr-core\test\J0\.\org.apache.solr.cloud.BasicDistributedZkTest-1376708242696\zookeeper\server1 FAILED !!!!!
   [junit4]   2> !!!! WARNING: best effort to remove C:\Users\JenkinsSlave\workspace\Lucene-Solr-4.x-Windows\solr\build\solr-core\test\J0\.\org.apache.solr.cloud.BasicDistributedZkTest-1376708242696\zookeeper FAILED !!!!!
   [junit4]   2> !!!! WARNING: best effort to remove C:\Users\JenkinsSlave\workspace\Lucene-Solr-4.x-Windows\solr\build\solr-core\test\J0\.\org.apache.solr.cloud.BasicDistributedZkTest-1376708242696 FAILED !!!!!
   [junit4]   2> 264350 T411 oas.SolrTestCaseJ4.tearDown ###Ending testDistribSearch
   [junit4]   2> 264353 T411 oasc.ZkTestServer.send4LetterWord connecting to 127.0.0.1:57439 57439
   [junit4]   1> client port:0.0.0.0/0.0.0.0:0
   [junit4]   2> NOTE: reproduce with: ant test  -Dtestcase=BasicDistributedZkTest -Dtests.method=testDistribSearch -Dtests.seed=458667C837549B73 -Dtests.slow=true -Dtests.locale=ga_IE -Dtests.timezone=Asia/Chongqing -Dtests.file.encoding=US-ASCII
   [junit4] ERROR   3.40s | BasicDistributedZkTest.testDistribSearch <<<
   [junit4]    > Throwable #1: java.util.regex.PatternSyntaxException: Unexpected internal error near index 1
   [junit4]    > \
   [junit4]    >  ^
   [junit4]    > 	at __randomizedtesting.SeedInfo.seed([458667C837549B73:C460E9D0400BFB4F]:0)
   [junit4]    > 	at java.util.regex.Pattern.error(Pattern.java:1924)
   [junit4]    > 	at java.util.regex.Pattern.compile(Pattern.java:1671)
   [junit4]    > 	at java.util.regex.Pattern.<init>(Pattern.java:1337)
   [junit4]    > 	at java.util.regex.Pattern.compile(Pattern.java:1022)
   [junit4]    > 	at java.lang.String.split(String.java:2313)
   [junit4]    > 	at java.lang.String.split(String.java:2355)
   [junit4]    > 	at org.apache.solr.cloud.AbstractFullDistribZkTestBase.getRelativeSolrHomePath(AbstractFullDistribZkTestBase.java:485)
   [junit4]    > 	at org.apache.solr.cloud.AbstractFullDistribZkTestBase.createJetty(AbstractFullDistribZkTestBase.java:463)
   [junit4]    > 	at org.apache.solr.BaseDistributedSearchTestCase.createJetty(BaseDistributedSearchTestCase.java:356)
   [junit4]    > 	at org.apache.solr.cloud.AbstractFullDistribZkTestBase.createServers(AbstractFullDistribZkTestBase.java:271)
   [junit4]    > 	at org.apache.solr.BaseDistributedSearchTestCase.testDistribSearch(BaseDistributedSearchTestCase.java:833)
   [junit4]    > 	at java.lang.Thread.run(Thread.java:724)
   [junit4]   2> 266845 T411 oas.SolrTestCaseJ4.deleteCore ###deleteCore
   [junit4]   2> NOTE: test params are: codec=Lucene40, sim=RandomSimilarityProvider(queryNorm=false,coord=yes): {}, locale=ga_IE, timezone=Asia/Chongqing
   [junit4]   2> NOTE: Windows 7 6.1 amd64/Oracle Corporation 1.7.0_25 (64-bit)/cpus=2,threads=1,free=23765952,total=68362240
   [junit4]   2> NOTE: All tests run in this JVM: [TestFastOutputStream, ScriptEngineTest, TestQueryTypes, TestDynamicFieldResource, PolyFieldTest, CollectionsAPIDistributedZkTest, TestFiltering, BlockCacheTest, CurrencyFieldXmlFileTest, JsonLoaderTest, SolrPluginUtilsTest, XmlUpdateRequestHandlerTest, SuggesterTest, TestAtomicUpdateErrorCases, TestFieldTypeResource, RequiredFieldsTest, RequestHandlersTest, ConvertedLegacyTest, AddBlockUpdateTest, HdfsRecoveryZkTest, TestSolrDeletionPolicy2, TestQuerySenderNoQuery, TestFieldResource, TestConfig, TestPostingsSolrHighlighter, NumericFieldsTest, BasicZkTest, TestSolrDeletionPolicy1, SoftAutoCommitTest, CSVRequestHandlerTest, TestCopyFieldCollectionResource, TestStressRecovery, DistributedSpellCheckComponentTest, TestDynamicFieldCollectionResource, TestIndexingPerformance, TestPHPSerializedResponseWriter, TestHashPartitioner, URLClassifyProcessorTest, BasicDistributedZkTest]
   [junit4] Completed in 3.45s, 1 test, 1 error <<< FAILURES!

[...truncated 7 lines...]
   [junit4] Suite: org.apache.solr.cloud.ChaosMonkeyNothingIsSafeTest
   [junit4]   2> 273827 T445 oas.BaseDistributedSearchTestCase.initHostContext Setting hostContext system property: /kw_pon/rq
   [junit4]   2> 273836 T445 oas.SolrTestCaseJ4.setUp ###Starting testDistribSearch
   [junit4]   2> Creating dataDir: C:\Users\JenkinsSlave\workspace\Lucene-Solr-4.x-Windows\solr\build\solr-core\test\J0\.\solrtest-ChaosMonkeyNothingIsSafeTest-1376708253086
   [junit4]   2> 273839 T445 oasc.ZkTestServer.run STARTING ZK TEST SERVER
   [junit4]   2> 273840 T446 oasc.ZkTestServer$ZKServerMain.runFromConfig Starting server
   [junit4]   2> 273939 T445 oasc.ZkTestServer.run start zk server on port:57452
   [junit4]   2> 273941 T445 oascc.ConnectionManager.waitForConnected Waiting for client to connect to ZooKeeper
   [junit4]   2> 273950 T452 oascc.ConnectionManager.process Watcher org.apache.solr.common.cloud.ConnectionManager@374a3ae2 name:ZooKeeperConnection Watcher:127.0.0.1:57452 got event WatchedEvent state:SyncConnected type:None path:null path:null type:None
   [junit4]   2> 273951 T445 oascc.ConnectionManager.waitForConnected Client is connected to ZooKeeper
   [junit4]   2> 273951 T445 oascc.SolrZkClient.makePath makePath: /solr
   [junit4]   2> 273965 T445 oascc.ConnectionManager.waitForConnected Waiting for client to connect to ZooKeeper
   [junit4]   2> 273971 T454 oascc.ConnectionManager.process Watcher org.apache.solr.common.cloud.ConnectionManager@3128a8f7 name:ZooKeeperConnection Watcher:127.0.0.1:57452/solr got event WatchedEvent state:SyncConnected type:None path:null path:null type:None
   [junit4]  

[...truncated too long message...]


   [junit4]   2> 	        at sun.nio.ch.WindowsSelectorImpl$StartLock.startThreads(WindowsSelectorImpl.java:188)
   [junit4]   2> 	        at sun.nio.ch.WindowsSelectorImpl$StartLock.access$300(WindowsSelectorImpl.java:180)
   [junit4]   2> 	        at sun.nio.ch.WindowsSelectorImpl.doSelect(WindowsSelectorImpl.java:152)
   [junit4]   2> 	        at sun.nio.ch.SelectorImpl.lockAndDoSelect(SelectorImpl.java:87)
   [junit4]   2> 	        at sun.nio.ch.SelectorImpl.select(SelectorImpl.java:98)
   [junit4]   2> 	        at org.apache.zookeeper.server.NIOServerCnxnFactory.run(NIOServerCnxnFactory.java:178)
   [junit4]   2> 	        at java.lang.Thread.run(Thread.java:724)
   [junit4]   2> NOTE: test params are: codec=Lucene42: {}, docValues:{}, sim=DefaultSimilarity, locale=sl_SI, timezone=HST
   [junit4]   2> NOTE: Windows 7 6.1 amd64/Oracle Corporation 1.7.0_25 (64-bit)/cpus=2,threads=3,free=110701856,total=168660992
   [junit4]   2> NOTE: All tests run in this JVM: [TestFastOutputStream, ScriptEngineTest, TestQueryTypes, TestDynamicFieldResource, PolyFieldTest, CollectionsAPIDistributedZkTest, TestFiltering, BlockCacheTest, CurrencyFieldXmlFileTest, JsonLoaderTest, SolrPluginUtilsTest, XmlUpdateRequestHandlerTest, SuggesterTest, TestAtomicUpdateErrorCases, TestFieldTypeResource, RequiredFieldsTest, RequestHandlersTest, ConvertedLegacyTest, AddBlockUpdateTest, HdfsRecoveryZkTest, TestSolrDeletionPolicy2, TestQuerySenderNoQuery, TestFieldResource, TestConfig, TestPostingsSolrHighlighter, NumericFieldsTest, BasicZkTest, TestSolrDeletionPolicy1, SoftAutoCommitTest, CSVRequestHandlerTest, TestCopyFieldCollectionResource, TestStressRecovery, DistributedSpellCheckComponentTest, TestDynamicFieldCollectionResource, TestIndexingPerformance, TestPHPSerializedResponseWriter, TestHashPartitioner, URLClassifyProcessorTest, BasicDistributedZkTest, CoreAdminCreateDiscoverTest, ShowFileRequestHandlerTest, ChaosMonkeyNothingIsSafeTest, ResourceLoaderTest, OverseerCollectionProcessorTest, ShardRoutingTest, OutputWriterTest, TestDocSet, RAMDirectoryFactoryTest, PreAnalyzedUpdateProcessorTest, SolrRequestParserTest, BadCopyFieldTest, TestReplicationHandler, TestStressVersions, TimeZoneUtilsTest, OpenCloseCoreStressTest, TestFaceting, TestZkChroot, ZkSolrClientTest, DOMUtilTest, StatsComponentTest, CustomCollectionTest, MoreLikeThisHandlerTest, QueryParsingTest, HighlighterTest, AutoCommitTest, DistanceFunctionTest, TestCollationField, TestManagedSchema, IndexSchemaRuntimeFieldTest, LeaderElectionTest, CopyFieldTest, TestArbitraryIndexDir, MinimalSchemaTest, TermVectorComponentDistributedTest, DocumentAnalysisRequestHandlerTest, BadComponentTest, TestCollationKeyRangeQueries, NotRequiredUniqueKeyTest, TestSolrQueryParserDefaultOperatorResource, IndexSchemaTest, StressHdfsTest, TestCodecSupport, TestRemoteStreaming, MBeansHandlerTest, MultiTermTest, DeleteShardTest, TestPartialUpdateDeduplication, TestSolrCoreProperties, FileUtilsTest, WordBreakSolrSpellCheckerTest, TestStressLucene, UnloadDistributedZkTest, SpellCheckComponentTest, TestQueryUtils, TestDefaultSearchFieldResource, HighlighterConfigTest, DirectSolrConnectionTest, TestSolr4Spatial, TestDistributedGrouping, TestAddFieldRealTimeGet, TestInfoStreamLogging, ClusterStateUpdateTest, TestSchemaResource, TestRecovery, TestSchemaNameResource, TestPseudoReturnFields, PrimitiveFieldTypeTest, FieldMutatingUpdateProcessorTest, CachingDirectoryFactoryTest, DirectUpdateHandlerOptimizeTest, ExternalFileFieldSortTest, PingRequestHandlerTest, SolrXmlInZkTest, DisMaxRequestHandlerTest, UniqFieldsUpdateProcessorFactoryTest, TestBM25SimilarityFactory, TestRandomFaceting, TestGroupingSearch, DateMathParserTest, DocValuesMultiTest, TestSolrXml, LoggingHandlerTest, FastVectorHighlighterTest, TestRealTimeGet, AddSchemaFieldsUpdateProcessorFactoryTest, TestReloadAndDeleteDocs, TestPhraseSuggestions, TestReversedWildcardFilterFactory, TestLMDirichletSimilarityFactory, BasicFunctionalityTest, TestShardHandlerFactory, TestRandomMergePolicy, TestFunctionQuery, SuggesterWFSTTest, TestIndexSearcher, CoreMergeIndexesAdminHandlerTest, HdfsLockFactoryTest, SimplePostToolTest, SliceStateUpdateTest, CoreAdminHandlerTest, BadIndexSchemaTest, AssignTest, ZkNodePropsTest, QueryElevationComponentTest, BinaryUpdateRequestHandlerTest, AliasIntegrationTest, SearchHandlerTest, BJQParserTest, TestJmxIntegration, InfoHandlerTest, TestXIncludeConfig, TestLuceneMatchVersion, ZkControllerTest, ChaosMonkeySafeLeaderTest, BasicDistributedZk2Test, SyncSliceTest, OverseerTest, LeaderElectionIntegrationTest, RecoveryZkTest]
   [junit4]   2> NOTE: reproduce with: ant test  -Dtestcase=RecoveryZkTest -Dtests.seed=458667C837549B73 -Dtests.slow=true -Dtests.locale=sl_SI -Dtests.timezone=HST -Dtests.file.encoding=US-ASCII
   [junit4] ERROR   0.00s | RecoveryZkTest (suite) <<<
   [junit4]    > Throwable #1: com.carrotsearch.randomizedtesting.ThreadLeakError: 4 threads leaked from SUITE scope at org.apache.solr.cloud.RecoveryZkTest: 
   [junit4]    >    1) Thread[id=3550, name=SessionTracker, state=TIMED_WAITING, group=TGRP-RecoveryZkTest]
   [junit4]    >         at java.lang.Object.wait(Native Method)
   [junit4]    >         at org.apache.zookeeper.server.SessionTrackerImpl.run(SessionTrackerImpl.java:146)
   [junit4]    >    2) Thread[id=3548, name=Thread-1364, state=WAITING, group=TGRP-RecoveryZkTest]
   [junit4]    >         at java.lang.Object.wait(Native Method)
   [junit4]    >         at java.lang.Thread.join(Thread.java:1260)
   [junit4]    >         at java.lang.Thread.join(Thread.java:1334)
   [junit4]    >         at org.apache.zookeeper.server.NIOServerCnxnFactory.join(NIOServerCnxnFactory.java:302)
   [junit4]    >         at org.apache.solr.cloud.ZkTestServer$ZKServerMain.runFromConfig(ZkTestServer.java:107)
   [junit4]    >         at org.apache.solr.cloud.ZkTestServer$2.run(ZkTestServer.java:221)
   [junit4]    >    3) Thread[id=3552, name=ProcessThread(sid:0 cport:-1):, state=WAITING, group=TGRP-RecoveryZkTest]
   [junit4]    >         at sun.misc.Unsafe.park(Native Method)
   [junit4]    >         at java.util.concurrent.locks.LockSupport.park(LockSupport.java:186)
   [junit4]    >         at java.util.concurrent.locks.AbstractQueuedSynchronizer$ConditionObject.await(AbstractQueuedSynchronizer.java:2043)
   [junit4]    >         at java.util.concurrent.LinkedBlockingQueue.take(LinkedBlockingQueue.java:442)
   [junit4]    >         at org.apache.zookeeper.server.PrepRequestProcessor.run(PrepRequestProcessor.java:120)
   [junit4]    >    4) Thread[id=3549, name=NIOServerCxn.Factory:0.0.0.0/0.0.0.0:0, state=RUNNABLE, group=TGRP-RecoveryZkTest]
   [junit4]    >         at sun.nio.ch.WindowsSelectorImpl$SubSelector.poll0(Native Method)
   [junit4]    >         at sun.nio.ch.WindowsSelectorImpl$SubSelector.poll(WindowsSelectorImpl.java:295)
   [junit4]    >         at sun.nio.ch.WindowsSelectorImpl$SubSelector.access$400(WindowsSelectorImpl.java:277)
   [junit4]    >         at sun.nio.ch.WindowsSelectorImpl.doSelect(WindowsSelectorImpl.java:158)
   [junit4]    >         at sun.nio.ch.SelectorImpl.lockAndDoSelect(SelectorImpl.java:87)
   [junit4]    >         at sun.nio.ch.SelectorImpl.select(SelectorImpl.java:98)
   [junit4]    >         at org.apache.zookeeper.server.NIOServerCnxnFactory.run(NIOServerCnxnFactory.java:178)
   [junit4]    >         at java.lang.Thread.run(Thread.java:724)
   [junit4]    > 	at __randomizedtesting.SeedInfo.seed([458667C837549B73]:0)Throwable #2: com.carrotsearch.randomizedtesting.ThreadLeakError: There are still zombie threads that couldn't be terminated:
   [junit4]    >    1) Thread[id=3549, name=NIOServerCxn.Factory:0.0.0.0/0.0.0.0:0, state=RUNNABLE, group=TGRP-RecoveryZkTest]
   [junit4]    >         at java.lang.Object.notifyAll(Native Method)
   [junit4]    >         at sun.nio.ch.WindowsSelectorImpl$StartLock.startThreads(WindowsSelectorImpl.java:188)
   [junit4]    >         at sun.nio.ch.WindowsSelectorImpl$StartLock.access$300(WindowsSelectorImpl.java:180)
   [junit4]    >         at sun.nio.ch.WindowsSelectorImpl.doSelect(WindowsSelectorImpl.java:152)
   [junit4]    >         at sun.nio.ch.SelectorImpl.lockAndDoSelect(SelectorImpl.java:87)
   [junit4]    >         at sun.nio.ch.SelectorImpl.select(SelectorImpl.java:98)
   [junit4]    >         at org.apache.zookeeper.server.NIOServerCnxnFactory.run(NIOServerCnxnFactory.java:178)
   [junit4]    >         at java.lang.Thread.run(Thread.java:724)
   [junit4]    > 	at __randomizedtesting.SeedInfo.seed([458667C837549B73]:0)
   [junit4] Completed in 24.11s, 1 test, 3 errors <<< FAILURES!

[...truncated 483 lines...]
BUILD FAILED
C:\Users\JenkinsSlave\workspace\Lucene-Solr-4.x-Windows\build.xml:395: The following error occurred while executing this line:
C:\Users\JenkinsSlave\workspace\Lucene-Solr-4.x-Windows\build.xml:375: The following error occurred while executing this line:
C:\Users\JenkinsSlave\workspace\Lucene-Solr-4.x-Windows\build.xml:39: The following error occurred while executing this line:
C:\Users\JenkinsSlave\workspace\Lucene-Solr-4.x-Windows\solr\build.xml:181: The following error occurred while executing this line:
C:\Users\JenkinsSlave\workspace\Lucene-Solr-4.x-Windows\solr\common-build.xml:450: The following error occurred while executing this line:
C:\Users\JenkinsSlave\workspace\Lucene-Solr-4.x-Windows\lucene\common-build.xml:1233: The following error occurred while executing this line:
C:\Users\JenkinsSlave\workspace\Lucene-Solr-4.x-Windows\lucene\common-build.xml:876: There were test failures: 322 suites, 1375 tests, 2 suite-level errors, 12 errors, 636 ignored (11 assumptions)

Total time: 51 minutes 20 seconds
Build step 'Invoke Ant' marked build as failure
Description set: Java: 64bit/jdk1.7.0_25 -XX:+UseCompressedOops -XX:+UseSerialGC
Archiving artifacts
Recording test results
Email was triggered for: Failure
Sending email for trigger: Failure



Mime
View raw message