lucene-dev mailing list archives

Site index · List index
Message view « Date » · « Thread »
Top « Date » · « Thread »
From Apache Jenkins Server <jenk...@builds.apache.org>
Subject [JENKINS] Lucene-Solr-Tests-4.x-Java7 - Build # 1468 - Still Failing
Date Thu, 01 Aug 2013 08:42:18 GMT
Build: https://builds.apache.org/job/Lucene-Solr-Tests-4.x-Java7/1468/

1 tests failed.
FAILED:  org.apache.solr.cloud.CollectionsAPIDistributedZkTest.testDistribSearch

Error Message:
IOException occured when talking to server at: http://127.0.0.1:32493/gf/jn

Stack Trace:
org.apache.solr.client.solrj.SolrServerException: IOException occured when talking to server at: http://127.0.0.1:32493/gf/jn
	at __randomizedtesting.SeedInfo.seed([5651F12EA4745678:D7B77F36D32B3644]:0)
	at org.apache.solr.client.solrj.impl.HttpSolrServer.request(HttpSolrServer.java:435)
	at org.apache.solr.client.solrj.impl.HttpSolrServer.request(HttpSolrServer.java:180)
	at org.apache.solr.cloud.AbstractFullDistribZkTestBase.createCollection(AbstractFullDistribZkTestBase.java:1535)
	at org.apache.solr.cloud.CollectionsAPIDistributedZkTest.testCustomCollectionsAPI(CollectionsAPIDistributedZkTest.java:677)
	at org.apache.solr.cloud.CollectionsAPIDistributedZkTest.doTest(CollectionsAPIDistributedZkTest.java:159)
	at org.apache.solr.BaseDistributedSearchTestCase.testDistribSearch(BaseDistributedSearchTestCase.java:835)
	at sun.reflect.NativeMethodAccessorImpl.invoke0(Native Method)
	at sun.reflect.NativeMethodAccessorImpl.invoke(NativeMethodAccessorImpl.java:57)
	at sun.reflect.DelegatingMethodAccessorImpl.invoke(DelegatingMethodAccessorImpl.java:43)
	at java.lang.reflect.Method.invoke(Method.java:606)
	at com.carrotsearch.randomizedtesting.RandomizedRunner.invoke(RandomizedRunner.java:1559)
	at com.carrotsearch.randomizedtesting.RandomizedRunner.access$600(RandomizedRunner.java:79)
	at com.carrotsearch.randomizedtesting.RandomizedRunner$6.evaluate(RandomizedRunner.java:737)
	at com.carrotsearch.randomizedtesting.RandomizedRunner$7.evaluate(RandomizedRunner.java:773)
	at com.carrotsearch.randomizedtesting.RandomizedRunner$8.evaluate(RandomizedRunner.java:787)
	at com.carrotsearch.randomizedtesting.rules.SystemPropertiesRestoreRule$1.evaluate(SystemPropertiesRestoreRule.java:53)
	at org.apache.lucene.util.TestRuleSetupTeardownChained$1.evaluate(TestRuleSetupTeardownChained.java:50)
	at org.apache.lucene.util.TestRuleFieldCacheSanity$1.evaluate(TestRuleFieldCacheSanity.java:51)
	at org.apache.lucene.util.AbstractBeforeAfterRule$1.evaluate(AbstractBeforeAfterRule.java:46)
	at com.carrotsearch.randomizedtesting.rules.SystemPropertiesInvariantRule$1.evaluate(SystemPropertiesInvariantRule.java:55)
	at org.apache.lucene.util.TestRuleThreadAndTestName$1.evaluate(TestRuleThreadAndTestName.java:49)
	at org.apache.lucene.util.TestRuleIgnoreAfterMaxFailures$1.evaluate(TestRuleIgnoreAfterMaxFailures.java:70)
	at org.apache.lucene.util.TestRuleMarkFailure$1.evaluate(TestRuleMarkFailure.java:48)
	at com.carrotsearch.randomizedtesting.rules.StatementAdapter.evaluate(StatementAdapter.java:36)
	at com.carrotsearch.randomizedtesting.ThreadLeakControl$StatementRunner.run(ThreadLeakControl.java:358)
	at com.carrotsearch.randomizedtesting.ThreadLeakControl.forkTimeoutingTask(ThreadLeakControl.java:782)
	at com.carrotsearch.randomizedtesting.ThreadLeakControl$3.evaluate(ThreadLeakControl.java:442)
	at com.carrotsearch.randomizedtesting.RandomizedRunner.runSingleTest(RandomizedRunner.java:746)
	at com.carrotsearch.randomizedtesting.RandomizedRunner$3.evaluate(RandomizedRunner.java:648)
	at com.carrotsearch.randomizedtesting.RandomizedRunner$4.evaluate(RandomizedRunner.java:682)
	at com.carrotsearch.randomizedtesting.RandomizedRunner$5.evaluate(RandomizedRunner.java:693)
	at com.carrotsearch.randomizedtesting.rules.StatementAdapter.evaluate(StatementAdapter.java:36)
	at com.carrotsearch.randomizedtesting.rules.SystemPropertiesRestoreRule$1.evaluate(SystemPropertiesRestoreRule.java:53)
	at org.apache.lucene.util.AbstractBeforeAfterRule$1.evaluate(AbstractBeforeAfterRule.java:46)
	at org.apache.lucene.util.TestRuleStoreClassName$1.evaluate(TestRuleStoreClassName.java:42)
	at com.carrotsearch.randomizedtesting.rules.SystemPropertiesInvariantRule$1.evaluate(SystemPropertiesInvariantRule.java:55)
	at com.carrotsearch.randomizedtesting.rules.NoShadowingOrOverridesOnMethodsRule$1.evaluate(NoShadowingOrOverridesOnMethodsRule.java:39)
	at com.carrotsearch.randomizedtesting.rules.NoShadowingOrOverridesOnMethodsRule$1.evaluate(NoShadowingOrOverridesOnMethodsRule.java:39)
	at com.carrotsearch.randomizedtesting.rules.StatementAdapter.evaluate(StatementAdapter.java:36)
	at org.apache.lucene.util.TestRuleAssertionsRequired$1.evaluate(TestRuleAssertionsRequired.java:43)
	at org.apache.lucene.util.TestRuleMarkFailure$1.evaluate(TestRuleMarkFailure.java:48)
	at org.apache.lucene.util.TestRuleIgnoreAfterMaxFailures$1.evaluate(TestRuleIgnoreAfterMaxFailures.java:70)
	at org.apache.lucene.util.TestRuleIgnoreTestSuites$1.evaluate(TestRuleIgnoreTestSuites.java:55)
	at com.carrotsearch.randomizedtesting.rules.StatementAdapter.evaluate(StatementAdapter.java:36)
	at com.carrotsearch.randomizedtesting.ThreadLeakControl$StatementRunner.run(ThreadLeakControl.java:358)
	at java.lang.Thread.run(Thread.java:724)
Caused by: org.apache.http.conn.ConnectTimeoutException: Connect to 127.0.0.1:32493 timed out
	at org.apache.http.conn.scheme.PlainSocketFactory.connectSocket(PlainSocketFactory.java:129)
	at org.apache.http.impl.conn.DefaultClientConnectionOperator.openConnection(DefaultClientConnectionOperator.java:180)
	at org.apache.http.impl.conn.ManagedClientConnectionImpl.open(ManagedClientConnectionImpl.java:294)
	at org.apache.http.impl.client.DefaultRequestDirector.tryConnect(DefaultRequestDirector.java:645)
	at org.apache.http.impl.client.DefaultRequestDirector.execute(DefaultRequestDirector.java:480)
	at org.apache.http.impl.client.AbstractHttpClient.execute(AbstractHttpClient.java:906)
	at org.apache.http.impl.client.AbstractHttpClient.execute(AbstractHttpClient.java:805)
	at org.apache.http.impl.client.AbstractHttpClient.execute(AbstractHttpClient.java:784)
	at org.apache.solr.client.solrj.impl.HttpSolrServer.request(HttpSolrServer.java:365)
	... 45 more




Build Log:
[...truncated 9344 lines...]
   [junit4] Suite: org.apache.solr.cloud.CollectionsAPIDistributedZkTest
   [junit4]   2> 38892 T91 oas.BaseDistributedSearchTestCase.initHostContext Setting hostContext system property: /gf/jn
   [junit4]   2> 38900 T91 oas.SolrTestCaseJ4.setUp ###Starting testDistribSearch
   [junit4]   2> Creating dataDir: /usr/home/hudson/hudson-slave/workspace/Lucene-Solr-Tests-4.x-Java7/solr/build/solr-core/test/J1/./solrtest-CollectionsAPIDistributedZkTest-1375343618161
   [junit4]   2> 38912 T91 oasc.ZkTestServer.run STARTING ZK TEST SERVER
   [junit4]   2> 38922 T92 oasc.ZkTestServer$ZKServerMain.runFromConfig Starting server
   [junit4]   2> 39225 T91 oasc.ZkTestServer.run start zk server on port:63525
   [junit4]   2> 39560 T91 oascc.ConnectionManager.waitForConnected Waiting for client to connect to ZooKeeper
   [junit4]   2> 39719 T98 oascc.ConnectionManager.process Watcher org.apache.solr.common.cloud.ConnectionManager@2c11fe36 name:ZooKeeperConnection Watcher:127.0.0.1:63525 got event WatchedEvent state:SyncConnected type:None path:null path:null type:None
   [junit4]   2> 39720 T91 oascc.ConnectionManager.waitForConnected Client is connected to ZooKeeper
   [junit4]   2> 39726 T91 oascc.SolrZkClient.makePath makePath: /solr
   [junit4]   2> 39875 T91 oascc.ConnectionManager.waitForConnected Waiting for client to connect to ZooKeeper
   [junit4]   2> 39886 T100 oascc.ConnectionManager.process Watcher org.apache.solr.common.cloud.ConnectionManager@72b428f3 name:ZooKeeperConnection Watcher:127.0.0.1:63525/solr got event WatchedEvent state:SyncConnected type:None path:null path:null type:None
   [junit4]   2> 39886 T91 oascc.ConnectionManager.waitForConnected Client is connected to ZooKeeper
   [junit4]   2> 39901 T91 oascc.SolrZkClient.makePath makePath: /collections/collection1
   [junit4]   2> 39908 T91 oascc.SolrZkClient.makePath makePath: /collections/collection1/shards
   [junit4]   2> 39913 T91 oascc.SolrZkClient.makePath makePath: /collections/control_collection
   [junit4]   2> 39917 T91 oascc.SolrZkClient.makePath makePath: /collections/control_collection/shards
   [junit4]   2> 39922 T91 oasc.AbstractZkTestCase.putConfig put /usr/home/hudson/hudson-slave/workspace/Lucene-Solr-Tests-4.x-Java7/solr/build/solr-core/test-files/solr/collection1/conf/solrconfig-tlog.xml to /configs/conf1/solrconfig.xml
   [junit4]   2> 39946 T91 oascc.SolrZkClient.makePath makePath: /configs/conf1/solrconfig.xml
   [junit4]   2> 39960 T91 oasc.AbstractZkTestCase.putConfig put /usr/home/hudson/hudson-slave/workspace/Lucene-Solr-Tests-4.x-Java7/solr/build/solr-core/test-files/solr/collection1/conf/schema.xml to /configs/conf1/schema.xml
   [junit4]   2> 39961 T91 oascc.SolrZkClient.makePath makePath: /configs/conf1/schema.xml
   [junit4]   2> 40068 T91 oasc.AbstractZkTestCase.putConfig put /usr/home/hudson/hudson-slave/workspace/Lucene-Solr-Tests-4.x-Java7/solr/build/solr-core/test-files/solr/collection1/conf/stopwords.txt to /configs/conf1/stopwords.txt
   [junit4]   2> 40069 T91 oascc.SolrZkClient.makePath makePath: /configs/conf1/stopwords.txt
   [junit4]   2> 40073 T91 oasc.AbstractZkTestCase.putConfig put /usr/home/hudson/hudson-slave/workspace/Lucene-Solr-Tests-4.x-Java7/solr/build/solr-core/test-files/solr/collection1/conf/protwords.txt to /configs/conf1/protwords.txt
   [junit4]   2> 40074 T91 oascc.SolrZkClient.makePath makePath: /configs/conf1/protwords.txt
   [junit4]   2> 40077 T91 oasc.AbstractZkTestCase.putConfig put /usr/home/hudson/hudson-slave/workspace/Lucene-Solr-Tests-4.x-Java7/solr/build/solr-core/test-files/solr/collection1/conf/currency.xml to /configs/conf1/currency.xml
   [junit4]   2> 40078 T91 oascc.SolrZkClient.makePath makePath: /configs/conf1/currency.xml
   [junit4]   2> 40087 T91 oasc.AbstractZkTestCase.putConfig put /usr/home/hudson/hudson-slave/workspace/Lucene-Solr-Tests-4.x-Java7/solr/build/solr-core/test-files/solr/collection1/conf/open-exchange-rates.json to /configs/conf1/open-exchange-rates.json
   [junit4]   2> 40087 T91 oascc.SolrZkClient.makePath makePath: /configs/conf1/open-exchange-rates.json
   [junit4]   2> 40096 T91 oasc.AbstractZkTestCase.putConfig put /usr/home/hudson/hudson-slave/workspace/Lucene-Solr-Tests-4.x-Java7/solr/build/solr-core/test-files/solr/collection1/conf/mapping-ISOLatin1Accent.txt to /configs/conf1/mapping-ISOLatin1Accent.txt
   [junit4]   2> 40097 T91 oascc.SolrZkClient.makePath makePath: /configs/conf1/mapping-ISOLatin1Accent.txt
   [junit4]   2> 40101 T91 oasc.AbstractZkTestCase.putConfig put /usr/home/hudson/hudson-slave/workspace/Lucene-Solr-Tests-4.x-Java7/solr/build/solr-core/test-files/solr/collection1/conf/old_synonyms.txt to /configs/conf1/old_synonyms.txt
   [junit4]   2> 40102 T91 oascc.SolrZkClient.makePath makePath: /configs/conf1/old_synonyms.txt
   [junit4]   2> 40106 T91 oasc.AbstractZkTestCase.putConfig put /usr/home/hudson/hudson-slave/workspace/Lucene-Solr-Tests-4.x-Java7/solr/build/solr-core/test-files/solr/collection1/conf/synonyms.txt to /configs/conf1/synonyms.txt
   [junit4]   2> 40107 T91 oascc.SolrZkClient.makePath makePath: /configs/conf1/synonyms.txt
   [junit4]   2> 40324 T91 oejs.Server.doStart jetty-8.1.10.v20130312
   [junit4]   2> 40328 T91 oejs.AbstractConnector.doStart Started SocketConnector@127.0.0.1:40981
   [junit4]   2> 40329 T91 oass.SolrDispatchFilter.init SolrDispatchFilter.init()
   [junit4]   2> 40329 T91 oasc.SolrResourceLoader.locateSolrHome JNDI not configured for solr (NoInitialContextEx)
   [junit4]   2> 40330 T91 oasc.SolrResourceLoader.locateSolrHome using system property solr.solr.home: /usr/home/hudson/hudson-slave/workspace/Lucene-Solr-Tests-4.x-Java7/solr/build/solr-core/test/J1/./org.apache.solr.cloud.CollectionsAPIDistributedZkTest-controljetty-1375343619377
   [junit4]   2> 40330 T91 oasc.SolrResourceLoader.<init> new SolrResourceLoader for directory: '/usr/home/hudson/hudson-slave/workspace/Lucene-Solr-Tests-4.x-Java7/solr/build/solr-core/test/J1/./org.apache.solr.cloud.CollectionsAPIDistributedZkTest-controljetty-1375343619377/'
   [junit4]   2> 40357 T91 oasc.ConfigSolr.fromFile Loading container configuration from /usr/home/hudson/hudson-slave/workspace/Lucene-Solr-Tests-4.x-Java7/solr/build/solr-core/test/J1/./org.apache.solr.cloud.CollectionsAPIDistributedZkTest-controljetty-1375343619377/solr.xml
   [junit4]   2> 40427 T91 oasc.ConfigSolrXml.<init> Config-defined core root directory: 
   [junit4]   2> 40432 T91 oasc.CoreContainer.<init> New CoreContainer 901305989
   [junit4]   2> 40432 T91 oasc.CoreContainer.load Loading cores into CoreContainer [instanceDir=/usr/home/hudson/hudson-slave/workspace/Lucene-Solr-Tests-4.x-Java7/solr/build/solr-core/test/J1/./org.apache.solr.cloud.CollectionsAPIDistributedZkTest-controljetty-1375343619377/]
   [junit4]   2> 40434 T91 oashc.HttpShardHandlerFactory.getParameter Setting socketTimeout to: 120000
   [junit4]   2> 40434 T91 oashc.HttpShardHandlerFactory.getParameter Setting urlScheme to: http://
   [junit4]   2> 40435 T91 oashc.HttpShardHandlerFactory.getParameter Setting connTimeout to: 15000
   [junit4]   2> 40435 T91 oashc.HttpShardHandlerFactory.getParameter Setting maxConnectionsPerHost to: 20
   [junit4]   2> 40436 T91 oashc.HttpShardHandlerFactory.getParameter Setting corePoolSize to: 0
   [junit4]   2> 40436 T91 oashc.HttpShardHandlerFactory.getParameter Setting maximumPoolSize to: 2147483647
   [junit4]   2> 40436 T91 oashc.HttpShardHandlerFactory.getParameter Setting maxThreadIdleTime to: 5
   [junit4]   2> 40437 T91 oashc.HttpShardHandlerFactory.getParameter Setting sizeOfQueue to: -1
   [junit4]   2> 40437 T91 oashc.HttpShardHandlerFactory.getParameter Setting fairnessPolicy to: false
   [junit4]   2> 40438 T91 oascsi.HttpClientUtil.createClient Creating new http client, config:maxConnectionsPerHost=20&maxConnections=10000&socketTimeout=120000&connTimeout=15000&retry=false
   [junit4]   2> 40452 T91 oasc.ZkContainer.initZooKeeper Zookeeper client=127.0.0.1:63525/solr
   [junit4]   2> 40479 T91 oasc.ZkController.checkChrootPath zkHost includes chroot
   [junit4]   2> 40481 T91 oascc.ConnectionManager.waitForConnected Waiting for client to connect to ZooKeeper
   [junit4]   2> 40485 T111 oascc.ConnectionManager.process Watcher org.apache.solr.common.cloud.ConnectionManager@352c11d name:ZooKeeperConnection Watcher:127.0.0.1:63525 got event WatchedEvent state:SyncConnected type:None path:null path:null type:None
   [junit4]   2> 40485 T91 oascc.ConnectionManager.waitForConnected Client is connected to ZooKeeper
   [junit4]   2> 40502 T91 oascsi.HttpClientUtil.createClient Creating new http client, config:maxConnections=500&maxConnectionsPerHost=16&socketTimeout=120000&connTimeout=15000
   [junit4]   2> 40524 T91 oascc.ConnectionManager.waitForConnected Waiting for client to connect to ZooKeeper
   [junit4]   2> 40527 T113 oascc.ConnectionManager.process Watcher org.apache.solr.common.cloud.ConnectionManager@3687804b name:ZooKeeperConnection Watcher:127.0.0.1:63525/solr got event WatchedEvent state:SyncConnected type:None path:null path:null type:None
   [junit4]   2> 40528 T91 oascc.ConnectionManager.waitForConnected Client is connected to ZooKeeper
   [junit4]   2> 40539 T91 oascc.SolrZkClient.makePath makePath: /overseer/queue
   [junit4]   2> 40554 T91 oascc.SolrZkClient.makePath makePath: /overseer/collection-queue-work
   [junit4]   2> 40573 T91 oascc.SolrZkClient.makePath makePath: /live_nodes
   [junit4]   2> 40577 T91 oasc.ZkController.createEphemeralLiveNode Register node as live in ZooKeeper:/live_nodes/127.0.0.1:40981_gf%2Fjn
   [junit4]   2> 40584 T91 oascc.SolrZkClient.makePath makePath: /live_nodes/127.0.0.1:40981_gf%2Fjn
   [junit4]   2> 40590 T91 oascc.SolrZkClient.makePath makePath: /overseer_elect/election
   [junit4]   2> 40613 T91 oascc.SolrZkClient.makePath makePath: /overseer_elect/leader
   [junit4]   2> 40618 T91 oasc.Overseer.start Overseer (id=90134519388110851-127.0.0.1:40981_gf%2Fjn-n_0000000000) starting
   [junit4]   2> 40644 T91 oascc.SolrZkClient.makePath makePath: /overseer/queue-work
   [junit4]   2> 40669 T115 oasc.OverseerCollectionProcessor.run Process current queue of collection creations
   [junit4]   2> 40670 T91 oascc.SolrZkClient.makePath makePath: /clusterstate.json
   [junit4]   2> 40674 T91 oascc.SolrZkClient.makePath makePath: /aliases.json
   [junit4]   2> 40682 T91 oascc.ZkStateReader.createClusterStateWatchersAndUpdate Updating cluster state from ZooKeeper... 
   [junit4]   2> 40711 T114 oasc.Overseer$ClusterStateUpdater.run Starting to work on the main queue
   [junit4]   2> 40716 T91 oasc.CorePropertiesLocator.discover Looking for core definitions underneath /usr/home/hudson/hudson-slave/workspace/Lucene-Solr-Tests-4.x-Java7/solr/build/solr-core/test/J1/./org.apache.solr.cloud.CollectionsAPIDistributedZkTest-controljetty-1375343619377
   [junit4]   2> 40734 T91 oasc.CorePropertiesLocator.discoverUnder Found core conf in /usr/home/hudson/hudson-slave/workspace/Lucene-Solr-Tests-4.x-Java7/solr/build/solr-core/test/J1/./org.apache.solr.cloud.CollectionsAPIDistributedZkTest-controljetty-1375343619377/conf/
   [junit4]   2> 40856 T91 oasc.CorePropertiesLocator.discover Found 1 core definitions
   [junit4]   2> 40857 T91 oass.SolrDispatchFilter.init user.dir=/usr/home/hudson/hudson-slave/workspace/Lucene-Solr-Tests-4.x-Java7/solr/build/solr-core/test/J1
   [junit4]   2> 40857 T91 oass.SolrDispatchFilter.init SolrDispatchFilter.init() done
   [junit4]   2> 40858 T91 oascsi.HttpClientUtil.createClient Creating new http client, config:maxConnections=128&maxConnectionsPerHost=32&followRedirects=false
   [junit4]   2> 40872 T91 oascsi.HttpClientUtil.createClient Creating new http client, config:
   [junit4]   2> 40879 T91 oascc.ConnectionManager.waitForConnected Waiting for client to connect to ZooKeeper
   [junit4]   2> 40888 T118 oascc.ConnectionManager.process Watcher org.apache.solr.common.cloud.ConnectionManager@682c3a97 name:ZooKeeperConnection Watcher:127.0.0.1:63525/solr got event WatchedEvent state:SyncConnected type:None path:null path:null type:None
   [junit4]   2> 40888 T91 oascc.ConnectionManager.waitForConnected Client is connected to ZooKeeper
   [junit4]   2> 40890 T91 oascc.ZkStateReader.createClusterStateWatchersAndUpdate Updating cluster state from ZooKeeper... 
   [junit4]   2> 40896 T91 oasc.ChaosMonkey.monkeyLog monkey: init - expire sessions:true cause connection loss:true
   [junit4]   2> 41140 T91 oejs.Server.doStart jetty-8.1.10.v20130312
   [junit4]   2> 41143 T91 oejs.AbstractConnector.doStart Started SocketConnector@127.0.0.1:50640
   [junit4]   2> 41144 T91 oass.SolrDispatchFilter.init SolrDispatchFilter.init()
   [junit4]   2> 41144 T91 oasc.SolrResourceLoader.locateSolrHome JNDI not configured for solr (NoInitialContextEx)
   [junit4]   2> 41144 T91 oasc.SolrResourceLoader.locateSolrHome using system property solr.solr.home: /usr/home/hudson/hudson-slave/workspace/Lucene-Solr-Tests-4.x-Java7/solr/build/solr-core/test/J1/./org.apache.solr.cloud.CollectionsAPIDistributedZkTest-jetty1-1375343620156
   [junit4]   2> 41145 T91 oasc.SolrResourceLoader.<init> new SolrResourceLoader for directory: '/usr/home/hudson/hudson-slave/workspace/Lucene-Solr-Tests-4.x-Java7/solr/build/solr-core/test/J1/./org.apache.solr.cloud.CollectionsAPIDistributedZkTest-jetty1-1375343620156/'
   [junit4]   2> 41176 T91 oasc.ConfigSolr.fromFile Loading container configuration from /usr/home/hudson/hudson-slave/workspace/Lucene-Solr-Tests-4.x-Java7/solr/build/solr-core/test/J1/./org.apache.solr.cloud.CollectionsAPIDistributedZkTest-jetty1-1375343620156/solr.xml
   [junit4]   2> 41255 T91 oasc.ConfigSolrXml.<init> Config-defined core root directory: 
   [junit4]   2> 41256 T91 oasc.CoreContainer.<init> New CoreContainer 345528214
   [junit4]   2> 41256 T91 oasc.CoreContainer.load Loading cores into CoreContainer [instanceDir=/usr/home/hudson/hudson-slave/workspace/Lucene-Solr-Tests-4.x-Java7/solr/build/solr-core/test/J1/./org.apache.solr.cloud.CollectionsAPIDistributedZkTest-jetty1-1375343620156/]
   [junit4]   2> 41258 T91 oashc.HttpShardHandlerFactory.getParameter Setting socketTimeout to: 120000
   [junit4]   2> 41258 T91 oashc.HttpShardHandlerFactory.getParameter Setting urlScheme to: http://
   [junit4]   2> 41259 T91 oashc.HttpShardHandlerFactory.getParameter Setting connTimeout to: 15000
   [junit4]   2> 41259 T91 oashc.HttpShardHandlerFactory.getParameter Setting maxConnectionsPerHost to: 20
   [junit4]   2> 41259 T91 oashc.HttpShardHandlerFactory.getParameter Setting corePoolSize to: 0
   [junit4]   2> 41260 T91 oashc.HttpShardHandlerFactory.getParameter Setting maximumPoolSize to: 2147483647
   [junit4]   2> 41260 T91 oashc.HttpShardHandlerFactory.getParameter Setting maxThreadIdleTime to: 5
   [junit4]   2> 41261 T91 oashc.HttpShardHandlerFactory.getParameter Setting sizeOfQueue to: -1
   [junit4]   2> 41261 T91 oashc.HttpShardHandlerFactory.getParameter Setting fairnessPolicy to: false
   [junit4]   2> 41261 T91 oascsi.HttpClientUtil.createClient Creating new http client, config:maxConnectionsPerHost=20&maxConnections=10000&socketTimeout=120000&connTimeout=15000&retry=false
   [junit4]   2> 41276 T91 oasc.ZkContainer.initZooKeeper Zookeeper client=127.0.0.1:63525/solr
   [junit4]   2> 41277 T91 oasc.ZkController.checkChrootPath zkHost includes chroot
   [junit4]   2> 41278 T91 oascc.ConnectionManager.waitForConnected Waiting for client to connect to ZooKeeper
   [junit4]   2> 41285 T129 oascc.ConnectionManager.process Watcher org.apache.solr.common.cloud.ConnectionManager@2a7a28c name:ZooKeeperConnection Watcher:127.0.0.1:63525 got event WatchedEvent state:SyncConnected type:None path:null path:null type:None
   [junit4]   2> 41285 T91 oascc.ConnectionManager.waitForConnected Client is connected to ZooKeeper
   [junit4]   2> 41302 T91 oascsi.HttpClientUtil.createClient Creating new http client, config:maxConnections=500&maxConnectionsPerHost=16&socketTimeout=120000&connTimeout=15000
   [junit4]   2> 41314 T91 oascc.ConnectionManager.waitForConnected Waiting for client to connect to ZooKeeper
   [junit4]   2> 41317 T131 oascc.ConnectionManager.process Watcher org.apache.solr.common.cloud.ConnectionManager@21c1bc4a name:ZooKeeperConnection Watcher:127.0.0.1:63525/solr got event WatchedEvent state:SyncConnected type:None path:null path:null type:None
   [junit4]   2> 41317 T91 oascc.ConnectionManager.waitForConnected Client is connected to ZooKeeper
   [junit4]   2> 41323 T91 oascc.ZkStateReader.createClusterStateWatchersAndUpdate Updating cluster state from ZooKeeper... 
   [junit4]   2> 42329 T91 oasc.ZkController.createEphemeralLiveNode Register node as live in ZooKeeper:/live_nodes/127.0.0.1:50640_gf%2Fjn
   [junit4]   2> 42356 T91 oascc.SolrZkClient.makePath makePath: /live_nodes/127.0.0.1:50640_gf%2Fjn
   [junit4]   2> 42370 T113 oascc.ZkStateReader$3.process Updating live nodes... (2)
   [junit4]   2> 42370 T131 oascc.ZkStateReader$3.process Updating live nodes... (2)
   [junit4]   2> 42370 T118 oascc.ZkStateReader$3.process Updating live nodes... (2)
   [junit4]   2> 42389 T91 oasc.CorePropertiesLocator.discover Looking for core definitions underneath /usr/home/hudson/hudson-slave/workspace/Lucene-Solr-Tests-4.x-Java7/solr/build/solr-core/test/J1/./org.apache.solr.cloud.CollectionsAPIDistributedZkTest-jetty1-1375343620156
   [junit4]   2> 42391 T91 oasc.CorePropertiesLocator.discoverUnder Found core conf in /usr/home/hudson/hudson-slave/workspace/Lucene-Solr-Tests-4.x-Java7/solr/build/solr-core/test/J1/./org.apache.solr.cloud.CollectionsAPIDistributedZkTest-jetty1-1375343620156/conf/
   [junit4]   2> 42571 T91 oasc.CorePropertiesLocator.discover Found 1 core definitions
   [junit4]   2> 42572 T91 oass.SolrDispatchFilter.init user.dir=/usr/home/hudson/hudson-slave/workspace/Lucene-Solr-Tests-4.x-Java7/solr/build/solr-core/test/J1
   [junit4]   2> 42572 T91 oass.SolrDispatchFilter.init SolrDispatchFilter.init() done
   [junit4]   2> 42573 T91 oascsi.HttpClientUtil.createClient Creating new http client, config:maxConnections=128&maxConnectionsPerHost=32&followRedirects=false
   [junit4]   2> 42857 T91 oejs.Server.doStart jetty-8.1.10.v20130312
   [junit4]   2> 42860 T91 oejs.AbstractConnector.doStart Started SocketConnector@127.0.0.1:32493
   [junit4]   2> 42860 T91 oass.SolrDispatchFilter.init SolrDispatchFilter.init()
   [junit4]   2> 42861 T91 oasc.SolrResourceLoader.locateSolrHome JNDI not configured for solr (NoInitialContextEx)
   [junit4]   2> 42862 T91 oasc.SolrResourceLoader.locateSolrHome using system property solr.solr.home: /usr/home/hudson/hudson-slave/workspace/Lucene-Solr-Tests-4.x-Java7/solr/build/solr-core/test/J1/./org.apache.solr.cloud.CollectionsAPIDistributedZkTest-jetty2-1375343621850
   [junit4]   2> 42862 T91 oasc.SolrResourceLoader.<init> new SolrResourceLoader for directory: '/usr/home/hudson/hudson-slave/workspace/Lucene-Solr-Tests-4.x-Java7/solr/build/solr-core/test/J1/./org.apache.solr.cloud.CollectionsAPIDistributedZkTest-jetty2-1375343621850/'
   [junit4]   2> 42900 T91 oasc.ConfigSolr.fromFile Loading container configuration from /usr/home/hudson/hudson-slave/workspace/Lucene-Solr-Tests-4.x-Java7/solr/build/solr-core/test/J1/./org.apache.solr.cloud.CollectionsAPIDistributedZkTest-jetty2-1375343621850/solr.xml
   [junit4]   2> 42995 T91 oasc.ConfigSolrXml.<init> Config-defined core root directory: 
   [junit4]   2> 42996 T91 oasc.CoreContainer.<init> New CoreContainer 531551041
   [junit4]   2> 42996 T91 oasc.CoreContainer.load Loading cores into CoreContainer [instanceDir=/usr/home/hudson/hudson-slave/workspace/Lucene-Solr-Tests-4.x-Java7/solr/build/solr-core/test/J1/./org.apache.solr.cloud.CollectionsAPIDistributedZkTest-jetty2-1375343621850/]
   [junit4]   2> 42998 T91 oashc.HttpShardHandlerFactory.getParameter Setting socketTimeout to: 120000
   [junit4]   2> 42999 T91 oashc.HttpShardHandlerFactory.getParameter Setting urlScheme to: http://
   [junit4]   2> 42999 T91 oashc.HttpShardHandlerFactory.getParameter Setting connTimeout to: 15000
   [junit4]   2> 43000 T91 oashc.HttpShardHandlerFactory.getParameter Setting maxConnectionsPerHost to: 20
   [junit4]   2> 43000 T91 oashc.HttpShardHandlerFactory.getParameter Setting corePoolSize to: 0
   [junit4]   2> 43001 T91 oashc.HttpShardHandlerFactory.getParameter Setting maximumPoolSize to: 2147483647
   [junit4]   2> 43001 T91 oashc.HttpShardHandlerFactory.getParameter Setting maxThreadIdleTime to: 5
   [junit4]   2> 43002 T91 oashc.HttpShardHandlerFactory.getParameter Setting sizeOfQueue to: -1
   [junit4]   2> 43002 T91 oashc.HttpShardHandlerFactory.getParameter Setting fairnessPolicy to: false
   [junit4]   2> 43003 T91 oascsi.HttpClientUtil.createClient Creating new http client, config:maxConnectionsPerHost=20&maxConnections=10000&socketTimeout=120000&connTimeout=15000&retry=false
   [junit4]   2> 43020 T91 oasc.ZkContainer.initZooKeeper Zookeeper client=127.0.0.1:63525/solr
   [junit4]   2> 43021 T91 oasc.ZkController.checkChrootPath zkHost includes chroot
   [junit4]   2> 43022 T91 oascc.ConnectionManager.waitForConnected Waiting for client to connect to ZooKeeper
   [junit4]   2> 43043 T143 oascc.ConnectionManager.process Watcher org.apache.solr.common.cloud.ConnectionManager@4c885344 name:ZooKeeperConnection Watcher:127.0.0.1:63525 got event WatchedEvent state:SyncConnected type:None path:null path:null type:None
   [junit4]   2> 43043 T91 oascc.ConnectionManager.waitForConnected Client is connected to ZooKeeper
   [junit4]   2> 43046 T91 oascsi.HttpClientUtil.createClient Creating new http client, config:maxConnections=500&maxConnectionsPerHost=16&socketTimeout=120000&connTimeout=15000
   [junit4]   2> 43060 T91 oascc.ConnectionManager.waitForConnected Waiting for client to connect to ZooKeeper
   [junit4]   2> 43063 T145 oascc.ConnectionManager.process Watcher org.apache.solr.common.cloud.ConnectionManager@17b4dc48 name:ZooKeeperConnection Watcher:127.0.0.1:63525/solr got event WatchedEvent state:SyncConnected type:None path:null path:null type:None
   [junit4]   2> 43063 T91 oascc.ConnectionManager.waitForConnected Client is connected to ZooKeeper
   [junit4]   2> 43076 T91 oascc.ZkStateReader.createClusterStateWatchersAndUpdate Updating cluster state from ZooKeeper... 
   [junit4]   2> 44082 T91 oasc.ZkController.createEphemeralLiveNode Register node as live in ZooKeeper:/live_nodes/127.0.0.1:32493_gf%2Fjn
   [junit4]   2> 44090 T91 oascc.SolrZkClient.makePath makePath: /live_nodes/127.0.0.1:32493_gf%2Fjn
   [junit4]   2> 44095 T131 oascc.ZkStateReader$3.process Updating live nodes... (3)
   [junit4]   2> 44095 T145 oascc.ZkStateReader$3.process Updating live nodes... (3)
   [junit4]   2> 44095 T113 oascc.ZkStateReader$3.process Updating live nodes... (3)
   [junit4]   2> 44095 T118 oascc.ZkStateReader$3.process Updating live nodes... (3)
   [junit4]   2> 44111 T91 oasc.CorePropertiesLocator.discover Looking for core definitions underneath /usr/home/hudson/hudson-slave/workspace/Lucene-Solr-Tests-4.x-Java7/solr/build/solr-core/test/J1/./org.apache.solr.cloud.CollectionsAPIDistributedZkTest-jetty2-1375343621850
   [junit4]   2> 44238 T91 oasc.CorePropertiesLocator.discoverUnder Found core conf in /usr/home/hudson/hudson-slave/workspace/Lucene-Solr-Tests-4.x-Java7/solr/build/solr-core/test/J1/./org.apache.solr.cloud.CollectionsAPIDistributedZkTest-jetty2-1375343621850/conf/
   [junit4]   2> 44239 T91 oasc.CorePropertiesLocator.discover Found 1 core definitions
   [junit4]   2> 44239 T91 oass.SolrDispatchFilter.init user.dir=/usr/home/hudson/hudson-slave/workspace/Lucene-Solr-Tests-4.x-Java7/solr/build/solr-core/test/J1
   [junit4]   2> 44240 T91 oass.SolrDispatchFilter.init SolrDispatchFilter.init() done
   [junit4]   2> 44240 T91 oascsi.HttpClientUtil.createClient Creating new http client, config:maxConnections=128&maxConnectionsPerHost=32&followRedirects=false
   [junit4]   2> 44454 T91 oejs.Server.doStart jetty-8.1.10.v20130312
   [junit4]   2> 44457 T91 oejs.AbstractConnector.doStart Started SocketConnector@127.0.0.1:35063
   [junit4]   2> 44458 T91 oass.SolrDispatchFilter.init SolrDispatchFilter.init()
   [junit4]   2> 44458 T91 oasc.SolrResourceLoader.locateSolrHome JNDI not configured for solr (NoInitialContextEx)
   [junit4]   2> 44459 T91 oasc.SolrResourceLoader.locateSolrHome using system property solr.solr.home: /usr/home/hudson/hudson-slave/workspace/Lucene-Solr-Tests-4.x-Java7/solr/build/solr-core/test/J1/./org.apache.solr.cloud.CollectionsAPIDistributedZkTest-jetty3-1375343623513
   [junit4]   2> 44459 T91 oasc.SolrResourceLoader.<init> new SolrResourceLoader for directory: '/usr/home/hudson/hudson-slave/workspace/Lucene-Solr-Tests-4.x-Java7/solr/build/solr-core/test/J1/./org.apache.solr.cloud.CollectionsAPIDistributedZkTest-jetty3-1375343623513/'
   [junit4]   2> 44486 T91 oasc.ConfigSolr.fromFile Loading container configuration from /usr/home/hudson/hudson-slave/workspace/Lucene-Solr-Tests-4.x-Java7/solr/build/solr-core/test/J1/./org.apache.solr.cloud.CollectionsAPIDistributedZkTest-jetty3-1375343623513/solr.xml
   [junit4]   2> 44553 T91 oasc.ConfigSolrXml.<init> Config-defined core root directory: 
   [junit4]   2> 44554 T91 oasc.CoreContainer.<init> New CoreContainer 29409719
   [junit4]   2> 44554 T91 oasc.CoreContainer.load Loading cores into CoreContainer [instanceDir=/usr/home/hudson/hudson-slave/workspace/Lucene-Solr-Tests-4.x-Java7/solr/build/solr-core/test/J1/./org.apache.solr.cloud.CollectionsAPIDistributedZkTest-jetty3-1375343623513/]
   [junit4]   2> 44555 T91 oashc.HttpShardHandlerFactory.getParameter Setting socketTimeout to: 120000
   [junit4]   2> 44556 T91 oashc.HttpShardHandlerFactory.getParameter Setting urlScheme to: http://
   [junit4]   2> 44556 T91 oashc.HttpShardHandlerFactory.getParameter Setting connTimeout to: 15000
   [junit4]   2> 44557 T91 oashc.HttpShardHandlerFactory.getParameter Setting maxConnectionsPerHost to: 20
   [junit4]   2> 44557 T91 oashc.HttpShardHandlerFactory.getParameter Setting corePoolSize to: 0
   [junit4]   2> 44557 T91 oashc.HttpShardHandlerFactory.getParameter Setting maximumPoolSize to: 2147483647
   [junit4]   2> 44558 T91 oashc.HttpShardHandlerFactory.getParameter Setting maxThreadIdleTime to: 5
   [junit4]   2> 44558 T91 oashc.HttpShardHandlerFactory.getParameter Setting sizeOfQueue to: -1
   [junit4]   2> 44558 T91 oashc.HttpShardHandlerFactory.getParameter Setting fairnessPolicy to: false
   [junit4]   2> 44559 T91 oascsi.HttpClientUtil.createClient Creating new http client, config:maxConnectionsPerHost=20&maxConnections=10000&socketTimeout=120000&connTimeout=15000&retry=false
   [junit4]   2> 44572 T91 oasc.ZkContainer.initZooKeeper Zookeeper client=127.0.0.1:63525/solr
   [junit4]   2> 44573 T91 oasc.ZkController.checkChrootPath zkHost includes chroot
   [junit4]   2> 44574 T91 oascc.ConnectionManager.waitForConnected Waiting for client to connect to ZooKeeper
   [junit4]   2> 44577 T157 oascc.ConnectionManager.process Watcher org.apache.solr.common.cloud.ConnectionManager@19af3d5b name:ZooKeeperConnection Watcher:127.0.0.1:63525 got event WatchedEvent state:SyncConnected type:None path:null path:null type:None
   [junit4]   2> 44577 T91 oascc.ConnectionManager.waitForConnected Client is connected to ZooKeeper
   [junit4]   2> 44581 T91 oascsi.HttpClientUtil.createClient Creating new http client, config:maxConnections=500&maxConnectionsPerHost=16&socketTimeout=120000&connTimeout=15000
   [junit4]   2> 44596 T91 oascc.ConnectionManager.waitForConnected Waiting for client to connect to ZooKeeper
   [junit4]   2> 44603 T159 oascc.ConnectionManager.process Watcher org.apache.solr.common.cloud.ConnectionManager@6578553b name:ZooKeeperConnection Watcher:127.0.0.1:63525/solr got event WatchedEvent state:SyncConnected type:None path:null path:null type:None
   [junit4]   2> 44603 T91 oascc.ConnectionManager.waitForConnected Client is connected to ZooKeeper
   [junit4]   2> 44610 T91 oascc.ZkStateReader.createClusterStateWatchersAndUpdate Updating cluster state from ZooKeeper... 
   [junit4]   2> 45616 T91 oasc.ZkController.createEphemeralLiveNode Register node as live in ZooKeeper:/live_nodes/127.0.0.1:35063_gf%2Fjn
   [junit4]   2> 45618 T91 oascc.SolrZkClient.makePath makePath: /live_nodes/127.0.0.1:35063_gf%2Fjn
   [junit4]   2> 45624 T131 oascc.ZkStateReader$3.process Updating live nodes... (4)
   [junit4]   2> 45624 T113 oascc.ZkStateReader$3.process Updating live nodes... (4)
   [junit4]   2> 45624 T145 oascc.ZkStateReader$3.process Updating live nodes... (4)
   [junit4]   2> 45624 T118 oascc.ZkStateReader$3.process Updating live nodes... (4)
   [junit4]   2> 45624 T159 oascc.ZkStateReader$3.process Updating live nodes... (4)
   [junit4]   2> 45639 T91 oasc.CorePropertiesLocator.discover Looking for core definitions underneath /usr/home/hudson/hudson-slave/workspace/Lucene-Solr-Tests-4.x-Java7/solr/build/solr-core/test/J1/./org.apache.solr.cloud.CollectionsAPIDistributedZkTest-jetty3-1375343623513
   [junit4]   2> 45641 T91 oasc.CorePropertiesLocator.discoverUnder Found core conf in /usr/home/hudson/hudson-slave/workspace/Lucene-Solr-Tests-4.x-Java7/solr/build/solr-core/test/J1/./org.apache.solr.cloud.CollectionsAPIDistributedZkTest-jetty3-1375343623513/conf/
   [junit4]   2> 45876 T91 oasc.CorePropertiesLocator.discover Found 1 core definitions
   [junit4]   2> 45877 T91 oass.SolrDispatchFilter.init user.dir=/usr/home/hudson/hudson-slave/workspace/Lucene-Solr-Tests-4.x-Java7/solr/build/solr-core/test/J1
   [junit4]   2> 45878 T91 oass.SolrDispatchFilter.init SolrDispatchFilter.init() done
   [junit4]   2> 45879 T91 oascsi.HttpClientUtil.createClient Creating new http client, config:maxConnections=128&maxConnectionsPerHost=32&followRedirects=false
   [junit4]   2> 46237 T91 oejs.Server.doStart jetty-8.1.10.v20130312
   [junit4]   2> 46240 T91 oejs.AbstractConnector.doStart Started SocketConnector@127.0.0.1:26234
   [junit4]   2> 46241 T91 oass.SolrDispatchFilter.init SolrDispatchFilter.init()
   [junit4]   2> 46242 T91 oasc.SolrResourceLoader.locateSolrHome JNDI not configured for solr (NoInitialContextEx)
   [junit4]   2> 46242 T91 oasc.SolrResourceLoader.locateSolrHome using system property solr.solr.home: /usr/home/hudson/hudson-slave/workspace/Lucene-Solr-Tests-4.x-Java7/solr/build/solr-core/test/J1/./org.apache.solr.cloud.CollectionsAPIDistributedZkTest-jetty4-1375343625159
   [junit4]   2> 46243 T91 oasc.SolrResourceLoader.<init> new SolrResourceLoader for directory: '/usr/home/hudson/hudson-slave/workspace/Lucene-Solr-Tests-4.x-Java7/solr/build/solr-core/test/J1/./org.apache.solr.cloud.CollectionsAPIDistributedZkTest-jetty4-1375343625159/'
   [junit4]   2> 46287 T91 oasc.ConfigSolr.fromFile Loading container configuration from /usr/home/hudson/hudson-slave/workspace/Lucene-Solr-Tests-4.x-Java7/solr/build/solr-core/test/J1/./org.apache.solr.cloud.CollectionsAPIDistributedZkTest-jetty4-1375343625159/solr.xml
   [junit4]   2> 46395 T91 oasc.ConfigSolrXml.<init> Config-defined core root directory: 
   [junit4]   2> 46396 T91 oasc.CoreContainer.<init> New CoreContainer 246454889
   [junit4]   2> 46397 T91 oasc.CoreContainer.load Loading cores into CoreContainer [instanceDir=/usr/home/hudson/hudson-slave/workspace/Lucene-Solr-Tests-4.x-Java7/solr/build/solr-core/test/J1/./org.apache.solr.cloud.CollectionsAPIDistributedZkTest-jetty4-1375343625159/]
   [junit4]   2> 46399 T91 oashc.HttpShardHandlerFactory.getParameter Setting socketTimeout to: 120000
   [junit4]   2> 46399 T91 oashc.HttpShardHandlerFactory.getParameter Setting urlScheme to: http://
   [junit4]   2> 46400 T91 oashc.HttpShardHandlerFactory.getParameter Setting connTimeout to: 15000
   [junit4]   2> 46400 T91 oashc.HttpShardHandlerFactory.getParameter Setting maxConnectionsPerHost to: 20
   [junit4]   2> 46401 T91 oashc.HttpShardHandlerFactory.getParameter Setting corePoolSize to: 0
   [junit4]   2> 46402 T91 oashc.HttpShardHandlerFactory.getParameter Setting maximumPoolSize to: 2147483647
   [junit4]   2> 46402 T91 oashc.HttpShardHandlerFactory.getParameter Setting maxThreadIdleTime to: 5
   [junit4]   2> 46403 T91 oashc.HttpShardHandlerFactory.getParameter Setting sizeOfQueue to: -1
   [junit4]   2> 46403 T91 oashc.HttpShardHandlerFactory.getParameter Setting fairnessPolicy to: false
   [junit4]   2> 46404 T91 oascsi.HttpClientUtil.createClient Creating new http client, config:maxConnectionsPerHost=20&maxConnections=10000&socketTimeout=120000&connTimeout=15000&retry=false
   [junit4]   2> 46423 T91 oasc.ZkContainer.initZooKeeper Zookeeper client=127.0.0.1:63525/solr
   [junit4]   2> 46423 T91 oasc.ZkController.checkChrootPath zkHost includes chroot
   [junit4]   2> 46425 T91 oascc.ConnectionManager.waitForConnected Waiting for client to connect to ZooKeeper
   [junit4]   2> 46433 T171 oascc.ConnectionManager.process Watcher org.apache.solr.common.cloud.ConnectionManager@6799f722 name:ZooKeeperConnection Watcher:127.0.0.1:63525 got event WatchedEvent state:SyncConnected type:None path:null path:null type:None
   [junit4]   2> 46433 T91 oascc.ConnectionManager.waitForConnected Client is connected to ZooKeeper
   [junit4]   2> 46437 T91 oascsi.HttpClientUtil.createClient Creating new http client, config:maxConnections=500&maxConnectionsPerHost=16&socketTimeout=120000&connTimeout=15000
   [junit4]   2> 46449 T91 oascc.ConnectionManager.waitForConnected Waiting for client to connect to ZooKeeper
   [junit4]   2> 46452 T173 oascc.ConnectionManager.process Watcher org.apache.solr.common.cloud.ConnectionManager@2d046021 name:ZooKeeperConnection Watcher:127.0.0.1:63525/solr got event WatchedEvent state:SyncConnected type:None path:null path:null type:None
   [junit4]   2> 46453 T91 oascc.ConnectionManager.waitForConnected Client is connected to ZooKeeper
   [junit4]   2> 46460 T91 oascc.ZkStateReader.createClusterStateWatchersAndUpdate Updating cluster state from ZooKeeper... 
   [junit4]   2> 47466 T91 oasc.ZkController.createEphemeralLiveNode Register node as live in ZooKeeper:/live_nodes/127.0.0.1:26234_gf%2Fjn
   [junit4]   2> 47477 T91 oascc.SolrZkClient.makePath makePath: /live_nodes/127.0.0.1:26234_gf%2Fjn
   [junit4]   2> 47482 T159 oascc.ZkStateReader$3.process Updating live nodes... (5)
   [junit4]   2> 47482 T145 oascc.ZkStateReader$3.process Updating live nodes... (5)
   [junit4]   2> 47483 T118 oascc.ZkStateReader$3.process Updating live nodes... (5)
   [junit4]   2> 47482 T131 oascc.ZkStateReader$3.process Updating live nodes... (5)
   [junit4]   2> 47482 T173 oascc.ZkStateReader$3.process Updating live nodes... (5)
   [junit4]   2> 47482 T113 oascc.ZkStateReader$3.process Updating live nodes... (5)
   [junit4]   2> 47491 T91 oasc.CorePropertiesLocator.discover Looking for core definitions underneath /usr/home/hudson/hudson-slave/workspace/Lucene-Solr-Tests-4.x-Java7/solr/build/solr-core/test/J1/./org.apache.solr.cloud.CollectionsAPIDistributedZkTest-jetty4-1375343625159
   [junit4]   2> 47496 T91 oasc.CorePropertiesLocator.discoverUnder Found core conf in /usr/home/hudson/hudson-slave/workspace/Lucene-Solr-Tests-4.x-Java7/solr/build/solr-core/test/J1/./org.apache.solr.cloud.CollectionsAPIDistributedZkTest-jetty4-1375343625159/conf/
   [junit4]   2> 47705 T91 oasc.CorePropertiesLocator.discover Found 1 core definitions
   [junit4]   2> 47706 T91 oass.SolrDispatchFilter.init user.dir=/usr/home/hudson/hudson-slave/workspace/Lucene-Solr-Tests-4.x-Java7/solr/build/solr-core/test/J1
   [junit4]   2> 47707 T91 oass.SolrDispatchFilter.init SolrDispatchFilter.init() done
   [junit4]   2> 47707 T91 oascsi.HttpClientUtil.createClient Creating new http client, config:maxConnections=128&maxConnectionsPerHost=32&followRedirects=false
   [junit4]   2> 47734 T91 oascsi.HttpClientUtil.createClient Creating new http client, config:maxConnections=128&maxConnectionsPerHost=32&followRedirects=false
   [junit4]   2> 47757 T121 oasha.CollectionsHandler.handleCreateAction Creating Collection : numShards=2&name=nodes_used_collection&replicationFactor=2&action=CREATE&wt=javabin&version=2
   [junit4]   2> 47760 T113 oasc.DistributedQueue$LatchChildWatcher.process Watcher fired on path: /overseer/collection-queue-work state: SyncConnected type NodeChildrenChanged
   [junit4]   2> 47769 T115 oasc.OverseerCollectionProcessor.run Overseer Collection Processor: Get the message id:/overseer/collection-queue-work/qn-0000000000 message:{
   [junit4]   2> 	  "operation":"createcollection",
   [junit4]   2> 	  "numShards":"2",
   [junit4]   2> 	  "name":"nodes_used_collection",
   [junit4]   2> 	  "replicationFactor":"2"}
   [junit4]   2> 47770 T115 oasc.OverseerCollectionProcessor.processMessage WARN OverseerCollectionProcessor.processMessage : createcollection , {
   [junit4]   2> 	  "operation":"createcollection",
   [junit4]   2> 	  "numShards":"2",
   [junit4]   2> 	  "name":"nodes_used_collection",
   [junit4]   2> 	  "replicationFactor":"2"}
   [junit4]   2> 48233 T114 oascc.ZkStateReader.updateClusterState Updating cloud state from ZooKeeper... 
   [junit4]   2> 48234 T114 oasc.Overseer$ClusterStateUpdater.buildCollection building a new collection: nodes_used_collection
   [junit4]   2> 48234 T114 oasc.Overseer$ClusterStateUpdater.createCollection Create collection nodes_used_collection with shards [shard1, shard2]
   [junit4]   2> 48291 T113 oascc.ZkStateReader$2.process A cluster state change: WatchedEvent state:SyncConnected type:NodeDataChanged path:/clusterstate.json, has occurred - updating... (live nodes size: 5)
   [junit4]   2> 48291 T118 oascc.ZkStateReader$2.process A cluster state change: WatchedEvent state:SyncConnected type:NodeDataChanged path:/clusterstate.json, has occurred - updating... (live nodes size: 5)
   [junit4]   2> 48291 T145 oascc.ZkStateReader$2.process A cluster state change: WatchedEvent state:SyncConnected type:NodeDataChanged path:/clusterstate.json, has occurred - updating... (live nodes size: 5)
   [junit4]   2> 48291 T159 oascc.ZkStateReader$2.process A cluster state change: WatchedEvent state:SyncConnected type:NodeDataChanged path:/clusterstate.json, has occurred - updating... (live nodes size: 5)
   [junit4]   2> 48291 T131 oascc.ZkStateReader$2.process A cluster state change: WatchedEvent state:SyncConnected type:NodeDataChanged path:/clusterstate.json, has occurred - updating... (live nodes size: 5)
   [junit4]   2> 48291 T173 oascc.ZkStateReader$2.process A cluster state change: WatchedEvent state:SyncConnected type:NodeDataChanged path:/clusterstate.json, has occurred - updating... (live nodes size: 5)
   [junit4]   2> 48381 T115 oasc.OverseerCollectionProcessor.createCollection going to create cores replicas shardNames [shard1, shard2] , repFactor : 2
   [junit4]   2> 48381 T115 oasc.OverseerCollectionProcessor.createCollection Creating shard nodes_used_collection_shard1_replica1 as part of slice shard1 of collection nodes_used_collection on 127.0.0.1:50640_gf%2Fjn
   [junit4]   2> 48387 T115 oasc.OverseerCollectionProcessor.createCollection Creating shard nodes_used_collection_shard1_replica2 as part of slice shard1 of collection nodes_used_collection on 127.0.0.1:26234_gf%2Fjn
   [junit4]   2> 48387 T115 oasc.OverseerCollectionProcessor.createCollection Creating shard nodes_used_collection_shard2_replica1 as part of slice shard2 of collection nodes_used_collection on 127.0.0.1:40981_gf%2Fjn
   [junit4]   2> 48388 T115 oasc.OverseerCollectionProcessor.createCollection Creating shard nodes_used_collection_shard2_replica2 as part of slice shard2 of collection nodes_used_collection on 127.0.0.1:35063_gf%2Fjn
   [junit4]   2> 48404 T149 oasc.ZkController.publish publishing core=nodes_used_collection_shard2_replica2 state=down
   [junit4]   2> 48403 T122 oasc.ZkController.publish publishing core=nodes_used_collection_shard1_replica1 state=down
   [junit4]   2> 48403 T163 oasc.ZkController.publish publishing core=nodes_used_collection_shard1_replica2 state=down
   [junit4]   2> 48403 T103 oasc.ZkController.publish publishing core=nodes_used_collection_shard2_replica1 state=down
   [junit4]   2> 48407 T149 oasc.ZkController.waitForCoreNodeName look for our core node name
   [junit4]   2> 48407 T122 oasc.ZkController.waitForCoreNodeName look for our core node name
   [junit4]   2> 48408 T103 oasc.ZkController.waitForCoreNodeName look for our core node name
   [junit4]   2> 48408 T163 oasc.ZkController.waitForCoreNodeName look for our core node name
   [junit4]   2> 49807 T114 oascc.ZkStateReader.updateClusterState Updating cloud state from ZooKeeper... 
   [junit4]   2> 49809 T114 oasc.Overseer$ClusterStateUpdater.updateState WARN Could not find collection node for nodes_used_collection, skipping publish state
   [junit4]   2> 49814 T114 oasc.Overseer$ClusterStateUpdater.updateState Update state numShards=2 message={
   [junit4]   2> 	  "operation":"state",
   [junit4]   2> 	  "core_node_name":"core_node1",
   [junit4]   2> 	  "numShards":"2",
   [junit4]   2> 	  "shard":"shard2",
   [junit4]   2> 	  "roles":null,
   [junit4]   2> 	  "state":"down",
   [junit4]   2> 	  "shard_state":"active",
   [junit4]   2> 	  "core":"nodes_used_collection_shard2_replica2",
   [junit4]   2> 	  "collection":"nodes_used_collection",
   [junit4]   2> 	  "shard_range":null,
   [junit4]   2> 	  "node_name":"127.0.0.1:35063_gf%2Fjn",
   [junit4]   2> 	  "base_url":"http://127.0.0.1:35063/gf/jn"}
   [junit4]   2> 49821 T114 oasc.Overseer$ClusterStateUpdater.updateState WARN Could not find collection node for nodes_used_collection, skipping publish state
   [junit4]   2> 49821 T114 oasc.Overseer$ClusterStateUpdater.updateState Update state numShards=2 message={
   [junit4]   2> 	  "operation":"state",
   [junit4]   2> 	  "core_node_name":"core_node2",
   [junit4]   2> 	  "numShards":"2",
   [junit4]   2> 	  "shard":"shard1",
   [junit4]   2> 	  "roles":null,
   [junit4]   2> 	  "state":"down",
   [junit4]   2> 	  "shard_state":"active",
   [junit4]   2> 	  "core":"nodes_used_collection_shard1_replica1",
   [junit4]   2> 	  "collection":"nodes_used_collection",
   [junit4]   2> 	  "shard_range":null,
   [junit4]   2> 	  "node_name":"127.0.0.1:50640_gf%2Fjn",
   [junit4]   2> 	  "base_url":"http://127.0.0.1:50640/gf/jn"}
   [junit4]   2> 49834 T114 oasc.Overseer$ClusterStateUpdater.updateState WARN Could not find collection node for nodes_used_collection, skipping publish state
   [junit4]   2> 49834 T114 oasc.Overseer$ClusterStateUpdater.updateState Update state numShards=2 message={
   [junit4]   2> 	  "operation":"state",
   [junit4]   2> 	  "core_node_name":"core_node3",
   [junit4]   2> 	  "numShards":"2",
   [junit4]   2> 	  "shard":"shard1",
   [junit4]   2> 	  "roles":null,
   [junit4]   2> 	  "state":"down",
   [junit4]   2> 	  "shard_state":"active",
   [junit4]   2> 	  "core":"nodes_used_collection_shard1_replica2",
   [junit4]   2> 	  "collection":"nodes_used_collection",
   [junit4]   2> 	  "shard_range":null,
   [junit4]   2> 	  "node_name":"127.0.0.1:26234_gf%2Fjn",
   [junit4]   2> 	  "base_url":"http://127.0.0.1:26234/gf/jn"}
   [junit4]   2> 49841 T114 oasc.Overseer$ClusterStateUpdater.updateState WARN Could not find collection node for nodes_used_collection, skipping publish state
   [junit4]   2> 49842 T114 oasc.Overseer$ClusterStateUpdater.updateState Update state numShards=2 message={
   [junit4]   2> 	  "operation":"state",
   [junit4]   2> 	  "core_node_name":"core_node4",
   [junit4]   2> 	  "numShards":"2",
   [junit4]   2> 	  "shard":"shard2",
   [junit4]   2> 	  "roles":null,
   [junit4]   2> 	  "state":"down",
   [junit4]   2> 	  "shard_state":"active",
   [junit4]   2> 	  "core":"nodes_used_collection_shard2_replica1",
   [junit4]   2> 	  "collection":"nodes_used_collection",
   [junit4]   2> 	  "shard_range":null,
   [junit4]   2> 	  "node_name":"127.0.0.1:40981_gf%2Fjn",
   [junit4]   2> 	  "base_url":"http://127.0.0.1:40981/gf/jn"}
   [junit4]   2> 49854 T159 oascc.ZkStateReader$2.process A cluster state change: WatchedEvent state:SyncConnected type:NodeDataChanged path:/clusterstate.json, has occurred - updating... (live nodes size: 5)
   [junit4]   2> 49854 T145 oascc.ZkStateReader$2.process A cluster state change: WatchedEvent state:SyncConnected type:NodeDataChanged path:/clusterstate.json, has occurred - updating... (live nodes size: 5)
   [junit4]   2> 49854 T173 oascc.ZkStateReader$2.process A cluster state change: WatchedEvent state:SyncConnected type:NodeDataChanged path:/clusterstate.json, has occurred - updating... (live nodes size: 5)
   [junit4]   2> 49854 T131 oascc.ZkStateReader$2.process A cluster state change: WatchedEvent state:SyncConnected type:NodeDataChanged path:/clusterstate.json, has occurred - updating... (live nodes size: 5)
   [junit4]   2> 49854 T118 oascc.ZkStateReader$2.process A cluster state change: WatchedEvent state:SyncConnected type:NodeDataChanged path:/clusterstate.json, has occurred - updating... (live nodes size: 5)
   [junit4]   2> 49854 T113 oascc.ZkStateReader$2.process A cluster state change: WatchedEvent state:SyncConnected type:NodeDataChanged path:/clusterstate.json, has occurred - updating... (live nodes size: 5)
   [junit4]   2> 50409 T149 oasc.ZkController.waitForShardId waiting to find shard id in clusterstate for nodes_used_collection_shard2_replica2
   [junit4]   2> 50410 T149 oasc.CorePropertiesLocator.writePropertiesFile ERROR Couldn't persist core properties to /usr/home/hudson/hudson-slave/workspace/Lucene-Solr-Tests-4.x-Java7/solr/build/solr-core/test/J1/./org.apache.solr.cloud.CollectionsAPIDistributedZkTest-jetty3-1375343623513/nodes_used_collection_shard2_replica2/core.properties: java.io.FileNotFoundException: /usr/home/hudson/hudson-slave/workspace/Lucene-Solr-Tests-4.x-Java7/solr/build/solr-core/test/J1/./org.apache.solr.cloud.CollectionsAPIDistributedZkTest-jetty3-1375343623513/nodes_used_collection_shard2_replica2/core.properties (No such file or directory)
   [junit4]   2> 50411 T122 oasc.ZkController.waitForShardId waiting to find shard id in clusterstate for nodes_used_collection_shard1_replica1
   [junit4]   2> 50411 T103 oasc.ZkController.waitForShardId waiting to find shard id in clusterstate for nodes_used_collection_shard2_replica1
   [junit4]   2> 50411 T149 oasc.CoreContainer.create Creating SolrCore 'nodes_used_collection_shard2_replica2' using instanceDir: /usr/home/hudson/hudson-slave/workspace/Lucene-Solr-Tests-4.x-Java7/solr/build/solr-core/test/J1/./org.apache.solr.cloud.CollectionsAPIDistributedZkTest-jetty3-1375343623513/nodes_used_collection_shard2_replica2
   [junit4]   2> 50412 T149 oasc.ZkController.createCollectionZkNode Check for collection zkNode:nodes_used_collection
   [junit4]   2> 50413 T122 oasc.CorePropertiesLocator.writePropertiesFile ERROR Couldn't persist core properties to /usr/home/hudson/hudson-slave/workspace/Lucene-Solr-Tests-4.x-Java7/solr/build/solr-core/test/J1/./org.apache.solr.cloud.CollectionsAPIDistributedZkTest-jetty1-1375343620156/nodes_used_collection_shard1_replica1/core.properties: java.io.FileNotFoundException: /usr/home/hudson/hudson-slave/workspace/Lucene-Solr-Tests-4.x-Java7/solr/build/solr-core/test/J1/./org.apache.solr.cloud.CollectionsAPIDistributedZkTest-jetty1-1375343620156/nodes_used_collection_shard1_replica1/core.properties (No such file or directory)
   [junit4]   2> 50413 T103 oasc.CorePropertiesLocator.writePropertiesFile ERROR Couldn't persist core properties to /usr/home/hudson/hudson-slave/workspace/Lucene-Solr-Tests-4.x-Java7/solr/build/solr-core/test/J1/./org.apache.solr.cloud.CollectionsAPIDistributedZkTest-controljetty-1375343619377/nodes_used_collection_shard2_replica1/core.properties: java.io.FileNotFoundException: /usr/home/hudson/hudson-slave/workspace/Lucene-Solr-Tests-4.x-Java7/solr/build/solr-core/test/J1/./org.apache.solr.cloud.CollectionsAPIDistributedZkTest-controljetty-1375343619377/nodes_used_collection_shard2_replica1/core.properties (No such file or directory)
   [junit4]   2> 50413 T163 oasc.ZkController.waitForShardId waiting to find shard id in clusterstate for nodes_used_collection_shard1_replica2
   [junit4]   2> 50414 T103 oasc.CoreContainer.create Creating SolrCore 'nodes_used_collection_shard2_replica1' using instanceDir: /usr/home/hudson/hudson-slave/workspace/Lucene-Solr-Tests-4.x-Java7/solr/build/solr-core/test/J1/./org.apache.solr.cloud.CollectionsAPIDistributedZkTest-controljetty-1375343619377/nodes_used_collection_shard2_replica1
   [junit4]   2> 50414 T149 oasc.ZkController.createCollectionZkNode Creating collection in ZooKeeper:nodes_used_collection
   [junit4]   2> 50413 T122 oasc.CoreContainer.create Creating SolrCore 'nodes_used_collection_shard1_replica1' using instanceDir: /usr/home/hudson/hudson-slave/workspace/Lucene-Solr-Tests-4.x-Java7/solr/build/solr-core/test/J1/./org.apache.solr.cloud.CollectionsAPIDistributedZkTest-jetty1-1375343620156/nodes_used_collection_shard1_replica1
   [junit4]   2> 50415 T163 oasc.CorePropertiesLocator.writePropertiesFile ERROR Couldn't persist core properties to /usr/home/hudson/hudson-slave/workspace/Lucene-Solr-Tests-4.x-Java7/solr/build/solr-core/test/J1/./org.apache.solr.cloud.CollectionsAPIDistributedZkTest-jetty4-1375343625159/nodes_used_collection_shard1_replica2/core.properties: java.io.FileNotFoundException: /usr/home/hudson/hudson-slave/workspace/Lucene-Solr-Tests-4.x-Java7/solr/build/solr-core/test/J1/./org.apache.solr.cloud.CollectionsAPIDistributedZkTest-jetty4-1375343625159/nodes_used_collection_shard1_replica2/core.properties (No such file or directory)
   [junit4]   2> 50415 T149 oasc.ZkController.getConfName Looking for collection configName
   [junit4]   2> 50415 T103 oasc.ZkController.createCollectionZkNode Check for collection zkNode:nodes_used_collection
   [junit4]   2> 50416 T163 oasc.CoreContainer.create Creating SolrCore 'nodes_used_collection_shard1_replica2' using instanceDir: /usr/home/hudson/hudson-slave/workspace/Lucene-Solr-Tests-4.x-Java7/solr/build/solr-core/test/J1/./org.apache.solr.cloud.CollectionsAPIDistributedZkTest-jetty4-1375343625159/nodes_used_collection_shard1_replica2
   [junit4]   2> 50415 T122 oasc.ZkController.createCollectionZkNode Check for collection zkNode:nodes_used_collection
   [junit4]   2> 50417 T103 oasc.ZkController.createCollectionZkNode Creating collection in ZooKeeper:nodes_used_collection
   [junit4]   2> 50417 T163 oasc.ZkController.createCollectionZkNode Check for collection zkNode:nodes_used_collection
   [junit4]   2> 50418 T122 oasc.ZkController.createCollectionZkNode Creating collection in ZooKeeper:nodes_used_collection
   [junit4]   2> 50418 T103 oasc.ZkController.getConfName Looking for collection configName
   [junit4]   2> 50418 T149 oasc.ZkController.getConfName Only one config set found in zk - using it:conf1
   [junit4]   2> 50419 T163 oasc.ZkController.createCollectionZkNode Creating collection in ZooKeeper:nodes_used_collection
   [junit4]   2> 50419 T122 oasc.ZkController.getConfName Looking for collection configName
   [junit4]   2> 50420 T163 oasc.ZkController.getConfName Looking for collection configName
   [junit4]   2> 50420 T149 oascc.SolrZkClient.makePath makePath: /collections/nodes_used_collection
   [junit4]   2> 50421 T103 oasc.ZkController.getConfName Only one config set found in zk - using it:conf1
   [junit4]   2> 50422 T122 oasc.ZkController.getConfName Only one config set found in zk - using it:conf1
   [junit4]   2> 50422 T103 oascc.SolrZkClient.makePath makePath: /collections/nodes_used_collection
   [junit4]   2> 50422 T122 oascc.SolrZkClient.makePath makePath: /collections/nodes_used_collection
   [junit4]   2> 50422 T163 oasc.ZkController.getConfName Only one config set found in zk - using it:conf1
   [junit4]   2> 50424 T163 oascc.SolrZkClient.makePath makePath: /collections/nodes_used_collection
   [junit4]   2> 50435 T149 oasc.ZkController.readConfigName Load collection config from:/collections/nodes_used_collection
   [junit4]   2> 50436 T103 oasc.ZkController.readConfigName Load collection config from:/collections/nodes_used_collection
   [junit4]   2> 50450 T122 oasc.ZkController.readConfigName Load collection config from:/collections/nodes_used_collection
   [junit4]   2> 50450 T163 oasc.ZkController.readConfigName Load collection config from:/collections/nodes_used_collection
   [junit4]   2> 50486 T103 oasc.SolrResourceLoader.<init> new SolrResourceLoader for directory: '/usr/home/hudson/hudson-slave/workspace/Lucene-Solr-Tests-4.x-Java7/solr/build/solr-core/test/J1/./org.apache.solr.cloud.CollectionsAPIDistributedZkTest-controljetty-1375343619377/nodes_used_collection_shard2_replica1/'
   [junit4]   2> 50487 T122 oasc.SolrResourceLoader.<init> new SolrResourceLoader for directory: '/usr/home/hudson/hudson-slave/workspace/Lucene-Solr-Tests-4.x-Java7/solr/build/solr-core/test/J1/./org.apache.solr.cloud.CollectionsAPIDistributedZkTest-jetty1-1375343620156/nodes_used_collection_shard1_replica1/'
   [junit4]   2> 50486 T149 oasc.SolrResourceLoader.<init> new SolrResourceLoader for directory: '/usr/home/hudson/hudson-slave/workspace/Lucene-Solr-Tests-4.x-Java7/solr/build/solr-core/test/J1/./org.apache.solr.cloud.CollectionsAPIDistributedZkTest-jetty3-1375343623513/nodes_used_collection_shard2_replica2/'
   [junit4]   2> 50487 T163 oasc.SolrResourceLoader.<init> new SolrResourceLoader for directory: '/usr/home/hudson/hudson-slave/workspace/Lucene-Solr-Tests-4.x-Java7/solr/build/solr-core/test/J1/./org.apache.solr.cloud.CollectionsAPIDistributedZkTest-jetty4-1375343625159/nodes_used_collection_shard1_replica2/'
   [junit4]   2> 50612 T163 oasc.SolrConfig.<init> Using Lucene MatchVersion: LUCENE_45
   [junit4]   2> 50612 T149 oasc.SolrConfig.<init> Using Lucene MatchVersion: LUCENE_45
   [junit4]   2> 50617 T103 oasc.SolrConfig.<init> Using Lucene MatchVersion: LUCENE_45
   [junit4]   2> 50628 T122 oasc.SolrConfig.<init> Using Lucene MatchVersion: LUCENE_45
   [junit4]   2> 50709 T163 oasc.SolrConfig.<init> Loaded SolrConfig: solrconfig.xml
   [junit4]   2> 50716 T149 oasc.SolrConfig.<init> Loaded SolrConfig: solrconfig.xml
   [junit4]   2> 50722 T103 oasc.SolrConfig.<init> Loaded SolrConfig: solrconfig.xml
   [junit4]   2> 50731 T122 oasc.SolrConfig.<init> Loaded SolrConfig: solrconfig.xml
   [junit4]   2> 50812 T163 oass.IndexSchema.readSchema Reading Solr Schema from schema.xml
   [junit4]   2> 50818 T149 oass.IndexSchema.readSchema Reading Solr Schema from schema.xml
   [junit4]   2> 50824 T103 oass.IndexSchema.readSchema Reading Solr Schema from schema.xml
   [junit4]   2> 50834 T122 oass.IndexSchema.readSchema Reading Solr Schema from schema.xml
   [junit4]   2> 50854 T163 oass.IndexSchema.readSchema [nodes_used_collection_shard1_replica2] Schema name=test
   [junit4]   2> 50868 T149 oass.IndexSchema.readSchema [nodes_used_collection_shard2_replica2] Schema name=test
   [junit4]   2> 50872 T103 oass.IndexSchema.readSchema [nodes_used_collection_shard2_replica1] Schema name=test
   [junit4]   2> 50882 T122 oass.IndexSchema.readSchema [nodes_used_collection_shard1_replica1] Schema name=test
   [junit4]   2> 51993 T122 oass.ByteField.init WARN ByteField is deprecated and will be removed in 5.0. You should use TrieIntField instead.
   [junit4]   2> 51993 T149 oass.ByteField.init WARN ByteField is deprecated and will be removed in 5.0. You should use TrieIntField instead.
   [junit4]   2> 51993 T122 oass.ShortField.init WARN ShortField is deprecated and will be removed in 5.0. You should use TrieIntField instead.
   [junit4]   2> 51994 T103 oass.ByteField.init WARN ByteField is deprecated and will be removed in 5.0. You should use TrieIntField instead.
   [junit4]   2> 51994 T149 oass.ShortField.init WARN ShortField is deprecated and will be removed in 5.0. You should use TrieIntField instead.
   [junit4]   2> 51995 T103 oass.ShortField.init WARN ShortField is deprecated and will be removed in 5.0. You should use TrieIntField instead.
   [junit4]   2> 51995 T122 oass.OpenExchangeRatesOrgProvider.init Initialized with rates=open-exchange-rates.json, refreshInterval=1440.
   [junit4]   2> 51996 T149 oass.OpenExchangeRatesOrgProvider.init Initialized with rates=open-exchange-rates.json, refreshInterval=1440.
   [junit4]   2> 51996 T103 oass.OpenExchangeRatesOrgProvider.init Initialized with rates=open-exchange-rates.json, refreshInterval=1440.
   [junit4]   2> 52000 T163 oass.ByteField.init WARN ByteField is deprecated and will be removed in 5.0. You should use TrieIntField instead.
   [junit4]   2> 52000 T163 oass.ShortField.init WARN ShortField is deprecated and will be removed in 5.0. You should use TrieIntField instead.
   [junit4]   2> 52001 T163 oass.OpenExchangeRatesOrgProvider.init Initialized with rates=open-exchange-rates.json, refreshInterval=1440.
   [junit4]   2> 52009 T149 oass.IndexSchema.readSchema default search field in schema is text
   [junit4]   2> 52009 T122 oass.IndexSchema.readSchema default search field in schema is text
   [junit4]   2> 52010 T103 oass.IndexSchema.readSchema default search field in schema is text
   [junit4]   2> 52010 T163 oass.IndexSchema.readSchema default search field in schema is text
   [junit4]   2> 52012 T149 oass.IndexSchema.readSchema unique key field: id
   [junit4]   2> 52013 T122 oass.IndexSchema.readSchema unique key field: id
   [junit4]   2> 52013 T103 oass.IndexSchema.readSchema unique key field: id
   [junit4]   2> 52014 T163 oass.IndexSchema.readSchema unique key field: id
   [junit4]   2> 52042 T149 oass.FileExchangeRateProvider.reload Reloading exchange rates from file currency.xml
   [junit4]   2> 52042 T103 oass.FileExchangeRateProvider.reload Reloading exchange rates from file currency.xml
   [junit4]   2> 52043 T122 oass.FileExchangeRateProvider.reload Reloading exchange rates from file currency.xml
   [junit4]   2> 52043 T163 oass.FileExchangeRateProvider.reload Reloading exchange rates from file currency.xml
   [junit4]   2> 52047 T103 oass.FileExchangeRateProvider.reload Reloading exchange rates from file currency.xml
   [junit4]   2> 52047 T149 oass.FileExchangeRateProvider.reload Reloading exchange rates from file currency.xml
   [junit4]   2> 52048 T163 oass.FileExchangeRateProvider.reload Reloading exchange rates from file currency.xml
   [junit4]   2> 52048 T122 oass.FileExchangeRateProvider.reload Reloading exchange rates from file currency.xml
   [junit4]   2> 52052 T103 oass.OpenExchangeRatesOrgProvider.reload Reloading exchange rates from open-exchange-rates.json
   [junit4]   2> 52052 T149 oass.OpenExchangeRatesOrgProvider.reload Reloading exchange rates from open-exchange-rates.json
   [junit4]   2> 52054 T163 oass.OpenExchangeRatesOrgProvider.reload Reloading exchange rates from open-exchange-rates.json
   [junit4]   2> 52054 T122 oass.OpenExchangeRatesOrgProvider.reload Reloading exchange rates from open-exchange-rates.json
   [junit4]   2> 52054 T103 oass.OpenExchangeRatesOrgProvider$OpenExchangeRates.<init> WARN Unknown key IMPORTANT NOTE
   [junit4]   2> 52054 T149 oass.OpenExchangeRatesOrgProvider$OpenExchangeRates.<init> WARN Unknown key IMPORTANT NOTE
   [junit4]   2> 52055 T149 oass.OpenExchangeRatesOrgProvider$OpenExchangeRates.<init> WARN Expected key, got STRING
   [junit4]   2> 52056 T122 oass.OpenExchangeRatesOrgProvider$OpenExchangeRates.<init> WARN Unknown key IMPORTANT NOTE
   [junit4]   2> 52055 T103 oass.OpenExchangeRatesOrgProvider$OpenExchangeRates.<init> WARN Expected key, got STRING
   [junit4]   2> 52056 T122 oass.OpenExchangeRatesOrgProvider$OpenExchangeRates.<init> WARN Expected key, got STRING
   [junit4]   2> 52056 T149 oass.OpenExchangeRatesOrgProvider.reload Reloading exchange rates from open-exchange-rates.json
   [junit4]   2> 52056 T163 oass.OpenExchangeRatesOrgProvider$OpenExchangeRates.<init> WARN Unknown key IMPORTANT NOTE
   [junit4]   2> 52057 T122 oass.OpenExchangeRatesOrgProvider.reload Reloading exchange rates from open-exchange-rates.json
   [junit4]   2> 52057 T103 oass.OpenExchangeRatesOrgProvider.reload Reloading exchange rates from open-exchange-rates.json
   [junit4]   2> 52058 T163 oass.OpenExchangeRatesOrgProvider$OpenExchangeRates.<init> WARN Expected key, got STRING
   [junit4]   2> 52059 T149 oass.OpenExchangeRatesOrgProvider$OpenExchangeRates.<init> WARN Unknown key IMPORTANT NOTE
   [junit4]   2> 52059 T163 oass.OpenExchangeRatesOrgProvider.reload Reloading exchange rates from open-exchange-rates.json
   [junit4]   2> 52059 T122 oass.OpenExchangeRatesOrgProvider$OpenExchangeRates.<init> WARN Unknown key IMPORTANT NOTE
   [junit4]   2> 52060 T103 oass.OpenExchangeRatesOrgProvider$OpenExchangeRates.<init> WARN Unknown key IMPORTANT NOTE
   [junit4]   2> 52059 T149 oass.OpenExchangeRatesOrgProvider$OpenExchangeRates.<init> WARN Expected key, got STRING
   [junit4]   2> 52061 T163 oass.OpenExchangeRatesOrgProvider$OpenExchangeRates.<init> WARN Unknown key IMPORTANT NOTE
   [junit4]   2> 52061 T149 oasc.SolrCore.initDirectoryFactory org.apache.solr.core.MockDirectoryFactory
   [junit4]   2> 52060 T103 oass.OpenExchangeRatesOrgProvider$OpenExchangeRates.<init> WARN Expected key, got STRING
   [junit4]   2> 52060 T122 oass.OpenExchangeRatesOrgProvider$OpenExchangeRates.<init> WARN Expected key, got STRING
   [junit4]   2> 52062 T103 oasc.SolrCore.initDirectoryFactory org.apache.solr.core.MockDirectoryFactory
   [junit4]   2> 52061 T149 oasc.SolrCore.<init> [nodes_used_collection_shard2_replica2] Opening new SolrCore at /usr/home/hudson/hudson-slave/workspace/Lucene-Solr-Tests-4.x-Java7/solr/build/solr-core/test/J1/./org.apache.solr.cloud.CollectionsAPIDistributedZkTest-jetty3-1375343623513/nodes_used_collection_shard2_replica2/, dataDir=/usr/home/hudson/hudson-slave/workspace/Lucene-Solr-Tests-4.x-Java7/solr/build/solr-core/test/J1/./org.apache.solr.cloud.CollectionsAPIDistributedZkTest-jetty3-1375343623513//nodes_used_collection_shard2_replica2/data/
   [junit4]   2> 52061 T163 oass.OpenExchangeRatesOrgProvider$OpenExchangeRates.<init> WARN Expected key, got STRING
   [junit4]   2> 52063 T149 oasc.JmxMonitoredMap.<init> JMX monitoring is enabled. Adding Solr mbeans to JMX Server: com.sun.jmx.mbeanserver.JmxMBeanServer@fe33c37
   [junit4]   2> 52062 T103 oasc.SolrCore.<init> [nodes_used_collection_shard2_replica1] Opening new SolrCore at /usr/home/hudson/hudson-slave/workspace/Lucene-Solr-Tests-4.x-Java7/solr/build/solr-core/test/J1/./org.apache.solr.cloud.CollectionsAPIDistributedZkTest-controljetty-1375343619377/nodes_used_collection_shard2_replica1/, dataDir=/usr/home/hudson/hudson-slave/workspace/Lucene-Solr-Tests-4.x-Java7/solr/build/solr-core/test/J1/./org.apache.solr.cloud.CollectionsAPIDistributedZkTest-controljetty-1375343619377//nodes_used_collection_shard2_replica1/data/
   [junit4]   2> 52062 T122 oasc.SolrCore.initDirectoryFactory org.apache.solr.core.MockDirectoryFactory
   [junit4]   2> 52065 T103 oasc.JmxMonitoredMap.<init> JMX monitoring is enabled. Adding Solr mbeans to JMX Server: com.sun.jmx.mbeanserver.JmxMBeanServer@fe33c37
   [junit4]   2> 52064 T163 oasc.SolrCore.initDirectoryFactory org.apache.solr.core.MockDirectoryFactory
   [junit4]   2> 52065 T122 oasc.SolrCore.<init> [nodes_used_collection_shard1_replica1] Opening new SolrCore at /usr/home/hudson/hudson-slave/workspace/Lucene-Solr-Tests-4.x-Java7/solr/build/solr-core/test/J1/./org.apache.solr.cloud.CollectionsAPIDistributedZkTest-jetty1-1375343620156/nodes_used_collection_shard1_replica1/, dataDir=/usr/home/hudson/hudson-slave/workspace/Lucene-Solr-Tests-4.x-Java7/solr/build/solr-core/test/J1/./org.apache.solr.cloud.CollectionsAPIDistributedZkTest-jetty1-1375343620156//nodes_used_collection_shard1_replica1/data/
   [junit4]   2> 52065 T149 oasc.CachingDirectoryFactory.get return new directory for /usr/home/hudson/hudson-slave/workspace/Lucene-Solr-Tests-4.x-Java7/solr/build/solr-core/test/J1/./org.apache.solr.cloud.CollectionsAPIDistributedZkTest-jetty3-1375343623513//nodes_used_collection_shard2_replica2/data
   [junit4]   2> 52066 T103 oasc.CachingDirectoryFactory.get return new directory for /usr/home/hudson/hudson-slave/workspace/Lucene-Solr-Tests-4.x-Java7/solr/build/solr-core/test/J1/./org.apache.solr.cloud.CollectionsAPIDistributedZkTest-controljetty-1375343619377//nodes_used_collection_shard2_replica1/data
   [junit4]   2> 52066 T122 oasc.JmxMonitoredMap.<init> JMX monitoring is enabled. Adding Solr mbeans to JMX Server: com.sun.jmx.mbeanserver.JmxMBeanServer@fe33c37
   [junit4]   2> 52066 T163 oasc.SolrCore.<init> [nodes_used_collection_shard1_replica2] Opening new SolrCore at /usr/home/hudson/hudson-slave/workspace/Lucene-Solr-Tests-4.x-Java7/solr/build/solr-core/test/J1/./org.apache.solr.cloud.CollectionsAPIDistributedZkTest-jetty4-1375343625159/nodes_used_collection_shard1_replica2/, dataDir=/usr/home/hudson/hudson-slave/workspace/Lucene-Solr-Tests-4.x-Java7/solr/build/solr-core/test/J1/./org.apache.solr.cloud.CollectionsAPIDistributedZkTest-jetty4-1375343625159//nodes_used_collection_shard1_replica2/data/
   [junit4]   2> 52067 T103 oasc.SolrCore.getNewIndexDir New index directory detected: old=null new=/usr/home/hudson/hudson-slave/workspace/Lucene-Solr-Tests-4.x-Java7/solr/build/solr-core/test/J1/./org.apache.solr.cloud.CollectionsAPIDistributedZkTest-controljetty-1375343619377//nodes_used_collection_shard2_replica1/data/index/
   [junit4]   2> 52066 T149 oasc.SolrCore.getNewIndexDir New index directory detected: old=null new=/usr/home/hudson/hudson-slave/workspace/Lucene-Solr-Tests-4.x-Java7/solr/build/solr-core/test/J1/./org.apache.solr.cloud.CollectionsAPIDistributedZkTest-jetty3-1375343623513//nodes_used_collection_shard2_replica2/data/index/
   [junit4]   2> 52068 T122 oasc.CachingDirectoryFactory.get return new directory for /usr/home/hudson/hudson-slave/workspace/Lucene-Solr-Tests-4.x-Java7/solr/build/solr-core/test/J1/./org.apache.solr.cloud.CollectionsAPIDistributedZkTest-jetty1-1375343620156//nodes_used_collection_shard1_replica1/data
   [junit4]   2> 52068 T103 oasc.SolrCore.initIndex WARN [nodes_used_collection_shard2_replica1] Solr index directory '/usr/home/hudson/hudson-slave/workspace/Lucene-Solr-Tests-4.x-Java7/solr/build/solr-core/test/J1/./org.apache.solr.cloud.CollectionsAPIDistributedZkTest-controljetty-1375343619377/nodes_used_collection_shard2_replica1/data/index' doesn't exist. Creating new index...
   [junit4]   2> 52067 T163 oasc.JmxMonitoredMap.<init> JMX monitoring is enabled. Adding Solr mbeans to JMX Server: com.sun.jmx.mbeanserver.JmxMBeanServer@fe33c37
   [junit4]   2> 52069 T103 oasc.CachingDirectoryFactory.get return new directory for /usr/home/hudson/hudson-slave/workspace/Lucene-Solr-Tests-4.x-Java7/solr/build/solr-core/test/J1/./org.apache.solr.cloud.CollectionsAPIDistributedZkTest-controljetty-1375343619377//nodes_used_collection_shard2_replica1/data/index
   [junit4]   2> 52068 T122 oasc.SolrCore.getNewIndexDir New index directory detected: old=null new=/usr/home/hudson/hudson-slave/workspace/Lucene-Solr-Tests-4.x-Java7/solr/build/solr-core/test/J1/./org.apache.solr.cloud.CollectionsAPIDistributedZkTest-jetty1-1375343620156//nodes_used_collection_shard1_replica1/data/index/
   [junit4]   2> 52070 T163 oasc.CachingDirectoryFactory.get return new directory for /usr/home/hudson/hudson-slave/workspace/Lucene-Solr-Tests-4.x-Java7/solr/build/solr-core/test/J1/./org.apache.solr.cloud.CollectionsAPIDistributedZkTest-jetty4-1375343625159//nodes_used_collection_shard1_replica2/data
   [junit4]   2> 52068 T149 oasc.SolrCore.initIndex WARN [nodes_used_collection_shard2_replica2] Solr index directory '/usr/home/hudson/hudson-slave/workspace/Lucene-Solr-Tests-4.x-Java7/solr/build/solr-core/test/J1/./org.apache.solr.cloud.CollectionsAPIDistributedZkTest-jetty3-1375343623513/nodes_used_collection_shard2_replica2/data/index' doesn't exist. Creating new index...
   [junit4]   2> 52070 T163 oasc.SolrCore.getNewIndexDir New index directory detected: old=null new=/usr/home/hudson/hudson-slave/workspace/Lucene-Solr-Tests-4.x-Java7/solr/build/solr-core/test/J1/./org.apache.solr.cloud.CollectionsAPIDistributedZkTest-jetty4-1375343625159//nodes_used_collection_shard1_replica2/data/index/
   [junit4]   2> 52070 T122 oasc.SolrCore.initIndex WARN [nodes_used_collection_shard1_replica1] Solr index directory '/usr/home/hudson/hudson-slave/workspace/Lucene-Solr-Tests-4.x-Java7/solr/build/solr-core/test/J1/./org.apache.solr.cloud.CollectionsAPIDistributedZkTest-jetty1-1375343620156/nodes_used_collection_shard1_replica1/data/index' doesn't exist. Creating new index...
   [junit4]   2> 52071 T163 oasc.SolrCore.initIndex WARN [nodes_used_collection_shard1_replica2] Solr index directory '/usr/home/hudson/hudson-slave/workspace/Lucene-Solr-Tests-4.x-Java7/solr/build/solr-core/test/J1/./org.apache.solr.cloud.CollectionsAPIDistributedZkTest-jetty4-1375343625159/nodes_used_collection_shard1_replica2/data/index' doesn't exist. Creating new index...
   [junit4]   2> 52071 T149 oasc.CachingDirectoryFactory.get return new directory for /usr/home/hudson/hudson-slave/workspace/Lucene-Solr-Tests-4.x-Java7/solr/build/solr-core/test/J1/./org.apache.solr.cloud.CollectionsAPIDistributedZkTest-jetty3-1375343623513//nodes_used_collection_shard2_replica2/data/index
   [junit4]   2> 52072 T163 oasc.CachingDirectoryFactory.get return new directory for /usr/home/hudson/hudson-slave/workspace/Lucene-Solr-Tests-4.x-Java7/solr/build/solr-core/test/J1/./org.apache.solr.cloud.CollectionsAPIDistributedZkTest-jetty4-1375343625159//nodes_used_collection_shard1_replica2/data/index
   [junit4]   2> 52072 T122 oasc.CachingDirectoryFactory.get return new directory for /usr/home/hudson/hudson-slave/workspace/Lucene-Solr-Tests-4.x-Java7/solr/build/solr-core/test/J1/./org.apache.solr.cloud.CollectionsAPIDistributedZkTest-jetty1-1375343620156//nodes_used_collection_shard1_replica1/data/index
   [junit4]   2> 52076 T103 oasc.SolrDeletionPolicy.onCommit SolrDeletionPolicy.onCommit: commits: num=1
   [junit4]   2> 		commit{dir=MockDirWrapper(org.apache.lucene.store.RAMDirectory@6f8288d2 lockFactory=org.apache.lucene.store.NativeFSLockFactory@1bf2fbd4),segFN=segments_1,generation=1}
   [junit4]   2> 52076 T103 oasc.SolrDeletionPolicy.updateCommits newest commit generation = 1
   [junit4]   2> 52078 T149 oasc.SolrDeletionPolicy.onCommit SolrDeletionPolicy.onCommit: commits: num=1
   [junit4]   2> 		commit{dir=MockDirWrapper(org.apache.lucene.store.RAMDirectory@420c2f4a lockFactory=org.apache.lucene.store.NativeFSLockFactory@6be7b7cd),segFN=segments_1,generation=1}
   [junit4]   2> 52079 T149 oasc.SolrDeletionPolicy.updateCommits newest commit generation = 1
   [junit4]   2> 52079 T163 oasc.SolrDeletionPolicy.onCommit SolrDeletionPolicy.onCommit: commits: num=1
   [junit4]   2> 		commit{dir=MockDirWrapper(org.apache.lucene.store.RAMDirectory@470056df lockFactory=org.apache.lucene.store.NativeFSLockFactory@58b69a8b),segFN=segments_1,generation=1}
   [junit4]   2> 52079 T122 oasc.SolrDeletionPolicy.onCommit SolrDeletionPolicy.onCommit: commits: num=1
   [junit4]   2> 		commit{dir=MockDirWrapper(org.apache.lucene.store.RAMDirectory@3bfc299e lockFactory=org.apache.lucene.store.NativeFSLockFactory@71faa1a8),segFN=segments_1,generation=1}
   [junit4]   2> 52079 T163 oasc.SolrDeletionPolicy.updateCommits newest commit generation = 1
   [junit4]   2> 52080 T122 oasc.SolrDeletionPolicy.updateCommits newest commit generation = 1
   [junit4]   2> 52135 T122 oasup.UpdateRequestProcessorChain.init inserting DistributedUpdateProcessorFactory into updateRequestProcessorChain "dedupe"
   [junit4]   2> 52135 T163 oasup.UpdateRequestProcessorChain.init inserting DistributedUpdateProcessorFactory into updateRequestProcessorChain "dedupe"
   [junit4]   2> 52135 T149 oasup.UpdateRequestProcessorChain.init inserting DistributedUpdateProcessorFactory into updateRequestProcessorChain "dedupe"
   [junit4]   2> 52135 T103 oasup.UpdateRequestProcessorChain.init inserting DistributedUpdateProcessorFactory into updateRequestProcessorChain "dedupe"
   [junit4]   2> 52136 T149 oasup.UpdateRequestProcessorChain.init inserting DistributedUpdateProcessorFactory into updateRequestProcessorChain "stored_sig"
   [junit4]   2> 52136 T163 oasup.UpdateRequestProcessorChain.init inserting DistributedUpdateProcessorFactory into updateRequestProcessorChain "stored_sig"
   [junit4]   2> 52136 T122 oasup.UpdateRequestProcessorChain.init inserting DistributedUpdateProcessorFactory into updateRequestProcessorChain "stored_sig"
   [junit4]   2> 52137 T149 oasup.UpdateRequestProcessorChain.init inserting DistributedUpdateProcessorFactory into updateRequestProcessorChain "distrib-dup-test-chain-implicit"
   [junit4]   2> 52137 T103 oasup.UpdateRequestProcessorChain.init inserting DistributedUpdateProcessorFactory into updateRequestProcessorChain "stored_sig"
   [junit4]   2> 52138 T163 oasup.UpdateRequestProcessorChain.init inserting DistributedUpdateProcessorFactory into updateRequestProcessorChain "distrib-dup-test-chain-implicit"
   [junit4]   2> 52139 T149 oasc.RequestHandlers.initHandlersFromConfig created standard: solr.StandardRequestHandler
   [junit4]   2> 52138 T122 oasup.UpdateRequestProcessorChain.init inserting DistributedUpdateProcessorFactory into updateRequestProcessorChain "distrib-dup-test-chain-implicit"
   [junit4]   2> 52139 T163 oasc.RequestHandlers.initHandlersFromConfig created standard: solr.StandardRequestHandler
   [junit4]   2> 52139 T103 oasup.UpdateRequestProcessorChain.init inserting DistributedUpdateProcessorFactory into updateRequestProcessorChain "distrib-dup-test-chain-implicit"
   [junit4]   2> 52140 T122 oasc.RequestHandlers.initHandlersFromConfig created standard: solr.StandardRequestHandler
   [junit4]   2> 52139 T149 oasc.RequestHandlers.initHandlersFromConfig created /get: solr.RealTimeGetHandler
   [junit4]   2> 52141 T103 oasc.RequestHandlers.initHandlersFromConfig created standard: solr.StandardRequestHandler
   [junit4]   2> 52140 T163 oasc.RequestHandlers.initHandlersFromConfig created /get: solr.RealTimeGetHandler
   [junit4]   2> 52141 T103 oasc.RequestHandlers.initHandlersFromConfig created /get: solr.RealTimeGetHandler
   [junit4]   2> 52141 T122 oasc.RequestHandlers.initHandlersFromConfig created /get: solr.RealTimeGetHandler
   [junit4]   2> 52141 T149 oasc.RequestHandlers.initHandlersFromConfig adding lazy requestHandler: solr.ReplicationHandler
   [junit4]   2> 52142 T122 oasc.RequestHandlers.initHandlersFromConfig adding lazy requestHandler: solr.ReplicationHandler
   [junit4]   2> 52142 T103 oasc.RequestHandlers.initHandlersFromConfig adding lazy requestHandler: solr.ReplicationHandler
   [junit4]   2> 52141 T163 oasc.RequestHandlers.initHandlersFromConfig adding lazy requestHandler: solr.ReplicationHandler
   [junit4]   2> 52143 T103 oasc.RequestHandlers.initHandlersFromConfig created /replication: solr.ReplicationHandler
   [junit4]   2> 52143 T122 oasc.RequestHandlers.initHandlersFromConfig created /replication: solr.ReplicationHandler
   [junit4]   2> 52143 T149 oasc.RequestHandlers.initHandlersFromConfig created /replication: solr.ReplicationHandler
   [junit4]   2> 52146 T103 oasc.RequestHandlers.initHandlersFromConfig created /update: solr.UpdateRequestHandler
   [junit4]   2> 52146 T149 oasc.RequestHandlers.initHandlersFromConfig created /update: solr.UpdateRequestHandler
   [junit4]   2> 52145 T163 oasc.RequestHandlers.initHandlersFromConfig created /replication: solr.ReplicationHandler
   [junit4]   2> 52147 T149 oasc.RequestHandlers.initHandlersFromConfig created /admin/: org.apache.solr.handler.admin.AdminHandlers
   [junit4]   2> 52147 T103 oasc.RequestHandlers.initHandlersFromConfig created /admin/: org.apache.solr.handler.admin.AdminHandlers
   [junit4]   2> 52146 T122 oasc.RequestHandlers.initHandlersFromConfig created /update: solr.UpdateRequestHandler
   [junit4]   2> 52148 T163 oasc.RequestHandlers.initHandlersFromConfig created /update: solr.UpdateRequestHandler
   [junit4]   2> 52148 T122 oasc.RequestHandlers.initHandlersFromConfig created /admin/: org.apache.solr.handler.admin.AdminHandlers
   [junit4]   2> 52149 T163 oasc.RequestHandlers.initHandlersFromConfig created /admin/: org.apache.solr.handler.admin.AdminHandlers
   [junit4]   2> 52174 T122 oashl.XMLLoader.init xsltCacheLifetimeSeconds=60
   [junit4]   2> 52174 T149 oashl.XMLLoader.init xsltCacheLifetimeSeconds=60
   [junit4]   2> 52174 T103 oashl.XMLLoader.init xsltCacheLifetimeSeconds=60
   [junit4]   2> 52174 T163 oashl.XMLLoader.init xsltCacheLifetimeSeconds=60
   [junit4]   2> 52185 T103 oass.SolrIndexSearcher.<init> Opening Searcher@2cff8421 main
   [junit4]   2> 52185 T149 oass.SolrIndexSearcher.<init> Opening Searcher@2d1e77a8 main
   [junit4]   2> 52185 T122 oass.SolrIndexSearcher.<init> Opening Searcher@fa4b83c main
   [junit4]   2> 52185 T163 oass.SolrIndexSearcher.<init> Opening Searcher@13152127 main
   [junit4]   2> 52186 T103 oasu.CommitTracker.<init> Hard AutoCommit: disabled
   [junit4]   2> 52187 T103 oasu.CommitTracker.<init> Soft AutoCommit: disabled
   [junit4]   2> 52187 T122 oasu.CommitTracker.<init> Hard AutoCommit: disabled
   [junit4]   2> 52187 T149 oasu.CommitTracker.<init> Hard AutoCommit: disabled
   [junit4]   2> 52187 T163 oasu.CommitTracker.<init> Hard AutoCommit: disabled
   [junit4]   2> 52188 T149 oasu.CommitTracker.<init> Soft AutoCommit: disabled
   [junit4]   2> 52188 T122 oasu.CommitTracker.<init> Soft AutoCommit: disabled
   [junit4]   2> 52188 T163 oasu.CommitTracker.<init> Soft AutoCommit: disabled
   [junit4]   2> 52192 T179 oasc.SolrCore.registerSearcher [nodes_used_collection_shard2_replica1] Registered new searcher Searcher@2cff8421 main{StandardDirectoryReader(segments_1:1)}
   [junit4]   2> 52192 T181 oasc.SolrCore.registerSearcher [nodes_used_collection_shard2_replica2] Registered new searcher Searcher@2d1e77a8 main{StandardDirectoryReader(segments_1:1)}
   [junit4]   2> 52193 T180 oasc.SolrCore.registerSearcher [nodes_used_collection_shard1_replica1] Registered new searcher Searcher@fa4b83c main{StandardDirectoryReader(segments_1:1)}
   [junit4]   2> 52193 T182 oasc.SolrCore.registerSearcher [nodes_used_collection_shard1_replica2] Registered new searcher Searcher@13152127 main{StandardDirectoryReader(segments_1:1)}
   [junit4]   2> 52194 T103 oasc.CoreContainer.registerCore registering core: nodes_used_collection_shard2_replica1
   [junit4]   2> 52195 T103 oasc.ZkController.register Register replica - core:nodes_used_collection_shard2_replica1 address:http://127.0.0.1:40981/gf/jn collection:nodes_used_collection shard:shard2
   [junit4]   2> 52195 T149 oasc.CoreContainer.registerCore registering core: nodes_used_collection_shard2_replica2
   [junit4]   2> 52195 T149 oasc.ZkController.register Register replica - core:nodes_used_collection_shard2_replica2 address:http://127.0.0.1:35063/gf/jn collection:nodes_used_collection shard:shard2
   [junit4]   2> 52196 T122 oasc.CoreContainer.registerCore registering core: nodes_used_collection_shard1_replica1
   [junit4]   2> 52196 T122 oasc.ZkController.register Register replica - core:nodes_used_collection_shard1_replica1 address:http://127.0.0.1:50640/gf/jn collection:nodes_used_collection shard:shard1
   [junit4]   2> 52196 T163 oasc.CoreContainer.registerCore registering core: nodes_used_collection_shard1_replica2
   [junit4]   2> 52197 T163 oasc.ZkController.register Register replica - core:nodes_used_collection_shard1_replica2 address:http://127.0.0.1:26234/gf/jn collection:nodes_used_collection shard:shard1
   [junit4]   2> 52205 T149 oascsi.HttpClientUtil.createClient Creating new http client, config:maxConnections=10000&maxConnectionsPerHost=20&connTimeout=15000&socketTimeout=30000&retry=false
   [junit4]   2> 52205 T103 oascsi.HttpClientUtil.createClient Creating new http client, config:maxConnections=10000&maxConnectionsPerHost=20&connTimeout=15000&socketTimeout=30000&retry=false
   [junit4]   2> 52205 T122 oascsi.HttpClientUtil.createClient Creating new http client, config:maxConnections=10000&maxConnectionsPerHost=20&connTimeout=15000&socketTimeout=30000&retry=false
   [junit4]   2> 52205 T163 oascsi.HttpClientUtil.createClient Creating new http client, config:maxConnections=10000&maxConnectionsPerHost=20&connTimeout=15000&socketTimeout=30000&retry=false
   [junit4]   2> 52229 T103 oascc.SolrZkClient.makePath makePath: /collections/nodes_used_collection/leader_elect/shard2/election
   [junit4]   2> 52229 T149 oascc.SolrZkClient.makePath makePath: /collections/nodes_used_collection/leader_elect/shard2/election
   [junit4]   2> 52229 T163 oascc.SolrZkClient.makePath makePath: /collections/nodes_used_collection/leader_elect/shard1/election
   [junit4]   2> 52229 T122 oascc.SolrZkClient.makePath makePath: /collections/nodes_used_collection/leader_elect/shard1/election
   [junit4]   2> 52286 T149 oasc.ShardLeaderElectionContext.runLeaderProcess Running the leader process for shard shard2
   [junit4]   2> 52287 T163 oasc.ShardLeaderElectionContext.runLeaderProcess Running the leader process for shard shard1
   [junit4]   2> 52291 T149 oasc.ShardLeaderElectionContext.waitForReplicasToComeUp Enough replicas found to continue.
   [junit4]   2> 52291 T149 oasc.ShardLeaderElectionContext.runLeaderProcess I may be the new leader - try and sync
   [junit4]   2> 52291 T163 oasc.ShardLeaderElectionContext.waitForReplicasToComeUp Enough replicas found to continue.
   [junit4]   2> 52292 T163 oasc.ShardLeaderElectionContext.runLeaderProcess I may be the new leader - try and sync
   [junit4]   2> 52297 T149 oasc.SyncStrategy.sync Sync replicas to http://127.0.0.1:35063/gf/jn/nodes_used_collection_shard2_replica2/
   [junit4]   2> 52297 T163 oasc.SyncStrategy.sync Sync replicas to http://127.0.0.1:26234/gf/jn/nodes_used_collection_shard1_replica2/
   [junit4]   2> 52307 T149 oascsi.HttpClientUtil.createClient Creating new http client, config:maxConnectionsPerHost=20&maxConnections=10000&connTimeout=30000&socketTimeout=30000&retry=false
   [junit4]   2> 52324 T149 oasu.PeerSync.sync PeerSync: core=nodes_used_collection_shard2_replica2 url=http://127.0.0.1:35063/gf/jn START replicas=[http://127.0.0.1:40981/gf/jn/nodes_used_collection_shard2_replica1/] nUpdates=100
   [junit4]   2> 52324 T163 oasu.PeerSync.sync PeerSync: core=nodes_used_collection_shard1_replica2 url=http://127.0.0.1:26234/gf/jn START replicas=[http://127.0.0.1:50640/gf/jn/nodes_used_collection_shard1_replica1/] nUpdates=100
   [junit4]   2> 52325 T149 oasu.PeerSync.sync PeerSync: core=nodes_used_collection_shard2_replica2 url=http://127.0.0.1:35063/gf/jn DONE.  We have no versions.  sync failed.
   [junit4]   2> 52326 T163 oasu.PeerSync.sync PeerSync: core=nodes_used_collection_shard1_replica2 url=http://127.0.0.1:26234/gf/jn DONE.  We have no versions.  sync failed.
   [junit4]   2> 52326 T163 oasc.SyncStrategy.syncReplicas Leader's attempt to sync with shard failed, moving to the next candidate
   [junit4]   2> 52326 T149 oasc.SyncStrategy.syncReplicas Leader's attempt to sync with shard failed, moving to the next candidate
   [junit4]   2> 52327 T163 oasc.ShardLeaderElectionContext.runLeaderProcess We failed sync, but we have no versions - we can't sync in that case - we were active before, so become leader anyway
   [junit4]   2> 52328 T149 oasc.ShardLeaderElectionContext.runLeaderProcess We failed sync, but we have no versions - we can't sync in that case - we were active before, so become leader anyway
   [junit4]   2> 52329 T163 oasc.ShardLeaderElectionContext.runLeaderProcess I am the new leader: http://127.0.0.1:26234/gf/jn/nodes_used_collection_shard1_replica2/ shard1
   [junit4]   2> 52329 T149 oasc.ShardLeaderElectionContext.runLeaderProcess I am the new leader: http://127.0.0.1:35063/gf/jn/nodes_used_collection_shard2_replica2/ shard2
   [junit4]   2> 52330 T163 oascc.SolrZkClient.makePath makePath: /collections/nodes_used_collection/

[...truncated too long message...]

7/solr/build/solr-core/test/J1/./org.apache.solr.cloud.CollectionsAPIDistributedZkTest-jetty4-1375343625159//new_implicit_coll_1_d_replica2/data/index
   [junit4]   2> 183507 T91 oasc.CachingDirectoryFactory.closeCacheValue looking to close /usr/home/hudson/hudson-slave/workspace/Lucene-Solr-Tests-4.x-Java7/solr/build/solr-core/test/J1/./org.apache.solr.cloud.CollectionsAPIDistributedZkTest-jetty4-1375343625159//new_implicit_coll_1_d_replica2/data [CachedDir<<refCount=0;path=/usr/home/hudson/hudson-slave/workspace/Lucene-Solr-Tests-4.x-Java7/solr/build/solr-core/test/J1/./org.apache.solr.cloud.CollectionsAPIDistributedZkTest-jetty4-1375343625159//new_implicit_coll_1_d_replica2/data;done=false>>]
   [junit4]   2> 183508 T91 oasc.CachingDirectoryFactory.close Closing directory: /usr/home/hudson/hudson-slave/workspace/Lucene-Solr-Tests-4.x-Java7/solr/build/solr-core/test/J1/./org.apache.solr.cloud.CollectionsAPIDistributedZkTest-jetty4-1375343625159//new_implicit_coll_1_d_replica2/data
   [junit4]   2> 183508 T91 oasc.SolrCore.close [new_implicit_coll_1_a_replica2]  CLOSING SolrCore org.apache.solr.core.SolrCore@18c775bd
   [junit4]   2> 183517 T91 oasu.DirectUpdateHandler2.close closing DirectUpdateHandler2{commits=0,autocommits=0,soft autocommits=0,optimizes=0,rollbacks=0,expungeDeletes=0,docsPending=0,adds=0,deletesById=0,deletesByQuery=0,errors=0,cumulative_adds=0,cumulative_deletesById=0,cumulative_deletesByQuery=0,cumulative_errors=0}
   [junit4]   2> 183517 T91 oasu.SolrCoreState.decrefSolrCoreState Closing SolrCoreState
   [junit4]   2> 183518 T91 oasu.DefaultSolrCoreState.closeIndexWriter SolrCoreState ref count has reached 0 - closing IndexWriter
   [junit4]   2> 183518 T91 oasu.DefaultSolrCoreState.closeIndexWriter closing IndexWriter with IndexWriterCloser
   [junit4]   2> 183518 T91 oasc.SolrCore.closeSearcher [new_implicit_coll_1_a_replica2] Closing main searcher on request.
   [junit4]   2> 183519 T91 oasc.CachingDirectoryFactory.close Closing MockDirectoryFactory - 2 directories currently being tracked
   [junit4]   2> 183519 T91 oasc.CachingDirectoryFactory.closeCacheValue looking to close /usr/home/hudson/hudson-slave/workspace/Lucene-Solr-Tests-4.x-Java7/solr/build/solr-core/test/J1/./org.apache.solr.cloud.CollectionsAPIDistributedZkTest-jetty4-1375343625159//new_implicit_coll_1_a_replica2/data/index [CachedDir<<refCount=0;path=/usr/home/hudson/hudson-slave/workspace/Lucene-Solr-Tests-4.x-Java7/solr/build/solr-core/test/J1/./org.apache.solr.cloud.CollectionsAPIDistributedZkTest-jetty4-1375343625159//new_implicit_coll_1_a_replica2/data/index;done=false>>]
   [junit4]   2> 183520 T91 oasc.CachingDirectoryFactory.close Closing directory: /usr/home/hudson/hudson-slave/workspace/Lucene-Solr-Tests-4.x-Java7/solr/build/solr-core/test/J1/./org.apache.solr.cloud.CollectionsAPIDistributedZkTest-jetty4-1375343625159//new_implicit_coll_1_a_replica2/data/index
   [junit4]   2> 183520 T91 oasc.CachingDirectoryFactory.closeCacheValue looking to close /usr/home/hudson/hudson-slave/workspace/Lucene-Solr-Tests-4.x-Java7/solr/build/solr-core/test/J1/./org.apache.solr.cloud.CollectionsAPIDistributedZkTest-jetty4-1375343625159//new_implicit_coll_1_a_replica2/data [CachedDir<<refCount=0;path=/usr/home/hudson/hudson-slave/workspace/Lucene-Solr-Tests-4.x-Java7/solr/build/solr-core/test/J1/./org.apache.solr.cloud.CollectionsAPIDistributedZkTest-jetty4-1375343625159//new_implicit_coll_1_a_replica2/data;done=false>>]
   [junit4]   2> 183521 T91 oasc.CachingDirectoryFactory.close Closing directory: /usr/home/hudson/hudson-slave/workspace/Lucene-Solr-Tests-4.x-Java7/solr/build/solr-core/test/J1/./org.apache.solr.cloud.CollectionsAPIDistributedZkTest-jetty4-1375343625159//new_implicit_coll_1_a_replica2/data
   [junit4]   2> 183522 T644 oasc.Overseer$ClusterStateUpdater.amILeader According to ZK I (id=90134519388110860-127.0.0.1:26234_gf%2Fjn-n_0000000004) am no longer a leader.
   [junit4]   2> 183526 T91 oejsh.ContextHandler.doStop stopped o.e.j.s.ServletContextHandler{/gf/jn,null}
   [junit4]   2> 183582 T91 oas.SolrTestCaseJ4.tearDown ###Ending testDistribSearch
   [junit4]   2> 183588 T91 oasc.ZkTestServer.send4LetterWord connecting to 127.0.0.1:63525 63525
   [junit4]   1> client port:0.0.0.0/0.0.0.0:0
   [junit4]   2> NOTE: reproduce with: ant test  -Dtestcase=CollectionsAPIDistributedZkTest -Dtests.method=testDistribSearch -Dtests.seed=5651F12EA4745678 -Dtests.multiplier=3 -Dtests.slow=true -Dtests.locale=es_PR -Dtests.timezone=Etc/GMT+10 -Dtests.file.encoding=US-ASCII
   [junit4] ERROR    145s J1 | CollectionsAPIDistributedZkTest.testDistribSearch <<<
   [junit4]    > Throwable #1: org.apache.solr.client.solrj.SolrServerException: IOException occured when talking to server at: http://127.0.0.1:32493/gf/jn
   [junit4]    > 	at __randomizedtesting.SeedInfo.seed([5651F12EA4745678:D7B77F36D32B3644]:0)
   [junit4]    > 	at org.apache.solr.client.solrj.impl.HttpSolrServer.request(HttpSolrServer.java:435)
   [junit4]    > 	at org.apache.solr.client.solrj.impl.HttpSolrServer.request(HttpSolrServer.java:180)
   [junit4]    > 	at org.apache.solr.cloud.AbstractFullDistribZkTestBase.createCollection(AbstractFullDistribZkTestBase.java:1535)
   [junit4]    > 	at org.apache.solr.cloud.CollectionsAPIDistributedZkTest.testCustomCollectionsAPI(CollectionsAPIDistributedZkTest.java:677)
   [junit4]    > 	at org.apache.solr.cloud.CollectionsAPIDistributedZkTest.doTest(CollectionsAPIDistributedZkTest.java:159)
   [junit4]    > 	at org.apache.solr.BaseDistributedSearchTestCase.testDistribSearch(BaseDistributedSearchTestCase.java:835)
   [junit4]    > 	at java.lang.Thread.run(Thread.java:724)
   [junit4]    > Caused by: org.apache.http.conn.ConnectTimeoutException: Connect to 127.0.0.1:32493 timed out
   [junit4]    > 	at org.apache.http.conn.scheme.PlainSocketFactory.connectSocket(PlainSocketFactory.java:129)
   [junit4]    > 	at org.apache.http.impl.conn.DefaultClientConnectionOperator.openConnection(DefaultClientConnectionOperator.java:180)
   [junit4]    > 	at org.apache.http.impl.conn.ManagedClientConnectionImpl.open(ManagedClientConnectionImpl.java:294)
   [junit4]    > 	at org.apache.http.impl.client.DefaultRequestDirector.tryConnect(DefaultRequestDirector.java:645)
   [junit4]    > 	at org.apache.http.impl.client.DefaultRequestDirector.execute(DefaultRequestDirector.java:480)
   [junit4]    > 	at org.apache.http.impl.client.AbstractHttpClient.execute(AbstractHttpClient.java:906)
   [junit4]    > 	at org.apache.http.impl.client.AbstractHttpClient.execute(AbstractHttpClient.java:805)
   [junit4]    > 	at org.apache.http.impl.client.AbstractHttpClient.execute(AbstractHttpClient.java:784)
   [junit4]    > 	at org.apache.solr.client.solrj.impl.HttpSolrServer.request(HttpSolrServer.java:365)
   [junit4]    > 	... 45 more
   [junit4]   2> 184004 T91 oas.SolrTestCaseJ4.deleteCore ###deleteCore
   [junit4]   2> 145124 T90 ccr.ThreadLeakControl.checkThreadLeaks WARNING Will linger awaiting termination of 1 leaked thread(s).
   [junit4]   2> 184825 T173 oascc.ZkStateReader$3.process WARN ZooKeeper watch triggered, but Solr cannot talk to ZK
   [junit4]   2> 184825 T173 oascc.ZkStateReader$2.process A cluster state change: WatchedEvent state:SyncConnected type:NodeChildrenChanged path:/live_nodes, has occurred - updating... (live nodes size: 1)
   [junit4]   2> 184825 T173 oascc.ZkStateReader$2.process WARN ZooKeeper watch triggered, but Solr cannot talk to ZK
   [junit4]   2> NOTE: test params are: codec=Lucene42: {timestamp=Pulsing41(freqCutoff=14 minBlockSize=98 maxBlockSize=262), range_facet_l=Pulsing41(freqCutoff=14 minBlockSize=98 maxBlockSize=262), id=Lucene41(blocksize=128), range_facet_sl=Lucene41(blocksize=128), a_t=PostingsFormat(name=SimpleText), text=PostingsFormat(name=Memory doPackFST= true), range_facet_si=PostingsFormat(name=SimpleText), _version_=Pulsing41(freqCutoff=14 minBlockSize=98 maxBlockSize=262), other_tl1=Pulsing41(freqCutoff=14 minBlockSize=98 maxBlockSize=262), multiDefault=Pulsing41(freqCutoff=14 minBlockSize=98 maxBlockSize=262), a_si=Pulsing41(freqCutoff=14 minBlockSize=98 maxBlockSize=262), intDefault=Pulsing41(freqCutoff=14 minBlockSize=98 maxBlockSize=262)}, docValues:{}, sim=RandomSimilarityProvider(queryNorm=false,coord=crazy): {}, locale=es_PR, timezone=Etc/GMT+10
   [junit4]   2> NOTE: FreeBSD 9.1-RELEASE-p3 amd64/Oracle Corporation 1.7.0_25 (64-bit)/cpus=16,threads=3,free=106853600,total=498073600
   [junit4]   2> NOTE: All tests run in this JVM: [TestWriterPerf, JsonLoaderTest, DistributedQueryElevationComponentTest, BasicFunctionalityTest, CollectionsAPIDistributedZkTest]
   [junit4] Completed on J1 in 146.18s, 1 test, 1 error <<< FAILURES!

[...truncated 966 lines...]
BUILD FAILED
/usr/home/hudson/hudson-slave/workspace/Lucene-Solr-Tests-4.x-Java7/build.xml:395: The following error occurred while executing this line:
/usr/home/hudson/hudson-slave/workspace/Lucene-Solr-Tests-4.x-Java7/build.xml:375: The following error occurred while executing this line:
/usr/home/hudson/hudson-slave/workspace/Lucene-Solr-Tests-4.x-Java7/build.xml:39: The following error occurred while executing this line:
/usr/home/hudson/hudson-slave/workspace/Lucene-Solr-Tests-4.x-Java7/solr/build.xml:181: The following error occurred while executing this line:
/usr/home/hudson/hudson-slave/workspace/Lucene-Solr-Tests-4.x-Java7/solr/common-build.xml:449: The following error occurred while executing this line:
/usr/home/hudson/hudson-slave/workspace/Lucene-Solr-Tests-4.x-Java7/lucene/common-build.xml:1233: The following error occurred while executing this line:
/usr/home/hudson/hudson-slave/workspace/Lucene-Solr-Tests-4.x-Java7/lucene/common-build.xml:876: There were test failures: 321 suites, 1350 tests, 1 error, 34 ignored (6 assumptions)

Total time: 70 minutes 20 seconds
Build step 'Invoke Ant' marked build as failure
Archiving artifacts
Recording test results
Email was triggered for: Failure
Sending email for trigger: Failure



Mime
View raw message