lucene-dev mailing list archives

Site index · List index
Message view « Date » · « Thread »
Top « Date » · « Thread »
From Policeman Jenkins Server <jenk...@thetaphi.de>
Subject [JENKINS] Lucene-Solr-trunk-MacOSX (64bit/jdk1.7.0) - Build # 698 - Still Failing!
Date Fri, 02 Aug 2013 01:02:41 GMT
Build: http://jenkins.thetaphi.de/job/Lucene-Solr-trunk-MacOSX/698/
Java: 64bit/jdk1.7.0 -XX:-UseCompressedOops -XX:+UseConcMarkSweepGC

1 tests failed.
FAILED:  org.apache.solr.cloud.CollectionsAPIDistributedZkTest.testDistribSearch

Error Message:
Server refused connection at: http://127.0.0.1:50910

Stack Trace:
org.apache.solr.client.solrj.SolrServerException: Server refused connection at: http://127.0.0.1:50910
	at __randomizedtesting.SeedInfo.seed([8069EA96999D7486:18F648EEEC214BA]:0)
	at org.apache.solr.client.solrj.impl.HttpSolrServer.request(HttpSolrServer.java:428)
	at org.apache.solr.client.solrj.impl.HttpSolrServer.request(HttpSolrServer.java:180)
	at org.apache.solr.cloud.AbstractFullDistribZkTestBase.createCollection(AbstractFullDistribZkTestBase.java:1535)
	at org.apache.solr.cloud.CollectionsAPIDistributedZkTest.testCustomCollectionsAPI(CollectionsAPIDistributedZkTest.java:677)
	at org.apache.solr.cloud.CollectionsAPIDistributedZkTest.doTest(CollectionsAPIDistributedZkTest.java:159)
	at org.apache.solr.BaseDistributedSearchTestCase.testDistribSearch(BaseDistributedSearchTestCase.java:835)
	at sun.reflect.NativeMethodAccessorImpl.invoke0(Native Method)
	at sun.reflect.NativeMethodAccessorImpl.invoke(NativeMethodAccessorImpl.java:57)
	at sun.reflect.DelegatingMethodAccessorImpl.invoke(DelegatingMethodAccessorImpl.java:43)
	at java.lang.reflect.Method.invoke(Method.java:606)
	at com.carrotsearch.randomizedtesting.RandomizedRunner.invoke(RandomizedRunner.java:1559)
	at com.carrotsearch.randomizedtesting.RandomizedRunner.access$600(RandomizedRunner.java:79)
	at com.carrotsearch.randomizedtesting.RandomizedRunner$6.evaluate(RandomizedRunner.java:737)
	at com.carrotsearch.randomizedtesting.RandomizedRunner$7.evaluate(RandomizedRunner.java:773)
	at com.carrotsearch.randomizedtesting.RandomizedRunner$8.evaluate(RandomizedRunner.java:787)
	at com.carrotsearch.randomizedtesting.rules.SystemPropertiesRestoreRule$1.evaluate(SystemPropertiesRestoreRule.java:53)
	at org.apache.lucene.util.TestRuleSetupTeardownChained$1.evaluate(TestRuleSetupTeardownChained.java:50)
	at org.apache.lucene.util.TestRuleFieldCacheSanity$1.evaluate(TestRuleFieldCacheSanity.java:51)
	at org.apache.lucene.util.AbstractBeforeAfterRule$1.evaluate(AbstractBeforeAfterRule.java:46)
	at com.carrotsearch.randomizedtesting.rules.SystemPropertiesInvariantRule$1.evaluate(SystemPropertiesInvariantRule.java:55)
	at org.apache.lucene.util.TestRuleThreadAndTestName$1.evaluate(TestRuleThreadAndTestName.java:49)
	at org.apache.lucene.util.TestRuleIgnoreAfterMaxFailures$1.evaluate(TestRuleIgnoreAfterMaxFailures.java:70)
	at org.apache.lucene.util.TestRuleMarkFailure$1.evaluate(TestRuleMarkFailure.java:48)
	at com.carrotsearch.randomizedtesting.rules.StatementAdapter.evaluate(StatementAdapter.java:36)
	at com.carrotsearch.randomizedtesting.ThreadLeakControl$StatementRunner.run(ThreadLeakControl.java:358)
	at com.carrotsearch.randomizedtesting.ThreadLeakControl.forkTimeoutingTask(ThreadLeakControl.java:782)
	at com.carrotsearch.randomizedtesting.ThreadLeakControl$3.evaluate(ThreadLeakControl.java:442)
	at com.carrotsearch.randomizedtesting.RandomizedRunner.runSingleTest(RandomizedRunner.java:746)
	at com.carrotsearch.randomizedtesting.RandomizedRunner$3.evaluate(RandomizedRunner.java:648)
	at com.carrotsearch.randomizedtesting.RandomizedRunner$4.evaluate(RandomizedRunner.java:682)
	at com.carrotsearch.randomizedtesting.RandomizedRunner$5.evaluate(RandomizedRunner.java:693)
	at com.carrotsearch.randomizedtesting.rules.StatementAdapter.evaluate(StatementAdapter.java:36)
	at com.carrotsearch.randomizedtesting.rules.SystemPropertiesRestoreRule$1.evaluate(SystemPropertiesRestoreRule.java:53)
	at org.apache.lucene.util.AbstractBeforeAfterRule$1.evaluate(AbstractBeforeAfterRule.java:46)
	at org.apache.lucene.util.TestRuleStoreClassName$1.evaluate(TestRuleStoreClassName.java:42)
	at com.carrotsearch.randomizedtesting.rules.SystemPropertiesInvariantRule$1.evaluate(SystemPropertiesInvariantRule.java:55)
	at com.carrotsearch.randomizedtesting.rules.NoShadowingOrOverridesOnMethodsRule$1.evaluate(NoShadowingOrOverridesOnMethodsRule.java:39)
	at com.carrotsearch.randomizedtesting.rules.NoShadowingOrOverridesOnMethodsRule$1.evaluate(NoShadowingOrOverridesOnMethodsRule.java:39)
	at com.carrotsearch.randomizedtesting.rules.StatementAdapter.evaluate(StatementAdapter.java:36)
	at org.apache.lucene.util.TestRuleAssertionsRequired$1.evaluate(TestRuleAssertionsRequired.java:43)
	at org.apache.lucene.util.TestRuleMarkFailure$1.evaluate(TestRuleMarkFailure.java:48)
	at org.apache.lucene.util.TestRuleIgnoreAfterMaxFailures$1.evaluate(TestRuleIgnoreAfterMaxFailures.java:70)
	at org.apache.lucene.util.TestRuleIgnoreTestSuites$1.evaluate(TestRuleIgnoreTestSuites.java:55)
	at com.carrotsearch.randomizedtesting.rules.StatementAdapter.evaluate(StatementAdapter.java:36)
	at com.carrotsearch.randomizedtesting.ThreadLeakControl$StatementRunner.run(ThreadLeakControl.java:358)
	at java.lang.Thread.run(Thread.java:724)
Caused by: org.apache.http.conn.HttpHostConnectException: Connection to http://127.0.0.1:50910 refused
	at org.apache.http.impl.conn.DefaultClientConnectionOperator.openConnection(DefaultClientConnectionOperator.java:190)
	at org.apache.http.impl.conn.ManagedClientConnectionImpl.open(ManagedClientConnectionImpl.java:294)
	at org.apache.http.impl.client.DefaultRequestDirector.tryConnect(DefaultRequestDirector.java:645)
	at org.apache.http.impl.client.DefaultRequestDirector.execute(DefaultRequestDirector.java:480)
	at org.apache.http.impl.client.AbstractHttpClient.execute(AbstractHttpClient.java:906)
	at org.apache.http.impl.client.AbstractHttpClient.execute(AbstractHttpClient.java:805)
	at org.apache.http.impl.client.AbstractHttpClient.execute(AbstractHttpClient.java:784)
	at org.apache.solr.client.solrj.impl.HttpSolrServer.request(HttpSolrServer.java:365)
	... 45 more
Caused by: java.net.ConnectException: Connection refused
	at java.net.PlainSocketImpl.socketConnect(Native Method)
	at java.net.AbstractPlainSocketImpl.doConnect(AbstractPlainSocketImpl.java:339)
	at java.net.AbstractPlainSocketImpl.connectToAddress(AbstractPlainSocketImpl.java:200)
	at java.net.AbstractPlainSocketImpl.connect(AbstractPlainSocketImpl.java:182)
	at java.net.SocksSocketImpl.connect(SocksSocketImpl.java:392)
	at java.net.Socket.connect(Socket.java:579)
	at org.apache.http.conn.scheme.PlainSocketFactory.connectSocket(PlainSocketFactory.java:127)
	at org.apache.http.impl.conn.DefaultClientConnectionOperator.openConnection(DefaultClientConnectionOperator.java:180)
	... 52 more




Build Log:
[...truncated 9812 lines...]
   [junit4] Suite: org.apache.solr.cloud.CollectionsAPIDistributedZkTest
   [junit4]   2> 2765962 T5141 oas.BaseDistributedSearchTestCase.initHostContext Setting hostContext system property: /
   [junit4]   2> 2765977 T5141 oas.SolrTestCaseJ4.setUp ###Starting testDistribSearch
   [junit4]   2> Creating dataDir: /Users/jenkins/jenkins-slave/workspace/Lucene-Solr-trunk-MacOSX/solr/build/solr-core/test/J0/./solrtest-CollectionsAPIDistributedZkTest-1375403940287
   [junit4]   2> 2765979 T5141 oasc.ZkTestServer.run STARTING ZK TEST SERVER
   [junit4]   2> 2765980 T5142 oasc.ZkTestServer$ZKServerMain.runFromConfig Starting server
   [junit4]   2> 2766081 T5141 oasc.ZkTestServer.run start zk server on port:50900
   [junit4]   2> 2766083 T5141 oascc.ConnectionManager.waitForConnected Waiting for client to connect to ZooKeeper
   [junit4]   2> 2766092 T5148 oascc.ConnectionManager.process Watcher org.apache.solr.common.cloud.ConnectionManager@1ad0837e name:ZooKeeperConnection Watcher:127.0.0.1:50900 got event WatchedEvent state:SyncConnected type:None path:null path:null type:None
   [junit4]   2> 2766093 T5141 oascc.ConnectionManager.waitForConnected Client is connected to ZooKeeper
   [junit4]   2> 2766093 T5141 oascc.SolrZkClient.makePath makePath: /solr
   [junit4]   2> 2766104 T5141 oascc.ConnectionManager.waitForConnected Waiting for client to connect to ZooKeeper
   [junit4]   2> 2766109 T5150 oascc.ConnectionManager.process Watcher org.apache.solr.common.cloud.ConnectionManager@6831fb87 name:ZooKeeperConnection Watcher:127.0.0.1:50900/solr got event WatchedEvent state:SyncConnected type:None path:null path:null type:None
   [junit4]   2> 2766109 T5141 oascc.ConnectionManager.waitForConnected Client is connected to ZooKeeper
   [junit4]   2> 2766110 T5141 oascc.SolrZkClient.makePath makePath: /collections/collection1
   [junit4]   2> 2766117 T5141 oascc.SolrZkClient.makePath makePath: /collections/collection1/shards
   [junit4]   2> 2766123 T5141 oascc.SolrZkClient.makePath makePath: /collections/control_collection
   [junit4]   2> 2766128 T5141 oascc.SolrZkClient.makePath makePath: /collections/control_collection/shards
   [junit4]   2> 2766134 T5141 oasc.AbstractZkTestCase.putConfig put /Users/jenkins/jenkins-slave/workspace/Lucene-Solr-trunk-MacOSX/solr/build/solr-core/test-files/solr/collection1/conf/solrconfig-tlog.xml to /configs/conf1/solrconfig.xml
   [junit4]   2> 2766135 T5141 oascc.SolrZkClient.makePath makePath: /configs/conf1/solrconfig.xml
   [junit4]   2> 2766144 T5141 oasc.AbstractZkTestCase.putConfig put /Users/jenkins/jenkins-slave/workspace/Lucene-Solr-trunk-MacOSX/solr/build/solr-core/test-files/solr/collection1/conf/schema.xml to /configs/conf1/schema.xml
   [junit4]   2> 2766146 T5141 oascc.SolrZkClient.makePath makePath: /configs/conf1/schema.xml
   [junit4]   2> 2766159 T5141 oasc.AbstractZkTestCase.putConfig put /Users/jenkins/jenkins-slave/workspace/Lucene-Solr-trunk-MacOSX/solr/build/solr-core/test-files/solr/collection1/conf/stopwords.txt to /configs/conf1/stopwords.txt
   [junit4]   2> 2766161 T5141 oascc.SolrZkClient.makePath makePath: /configs/conf1/stopwords.txt
   [junit4]   2> 2766167 T5141 oasc.AbstractZkTestCase.putConfig put /Users/jenkins/jenkins-slave/workspace/Lucene-Solr-trunk-MacOSX/solr/build/solr-core/test-files/solr/collection1/conf/protwords.txt to /configs/conf1/protwords.txt
   [junit4]   2> 2766168 T5141 oascc.SolrZkClient.makePath makePath: /configs/conf1/protwords.txt
   [junit4]   2> 2766177 T5141 oasc.AbstractZkTestCase.putConfig put /Users/jenkins/jenkins-slave/workspace/Lucene-Solr-trunk-MacOSX/solr/build/solr-core/test-files/solr/collection1/conf/currency.xml to /configs/conf1/currency.xml
   [junit4]   2> 2766178 T5141 oascc.SolrZkClient.makePath makePath: /configs/conf1/currency.xml
   [junit4]   2> 2766185 T5141 oasc.AbstractZkTestCase.putConfig put /Users/jenkins/jenkins-slave/workspace/Lucene-Solr-trunk-MacOSX/solr/build/solr-core/test-files/solr/collection1/conf/open-exchange-rates.json to /configs/conf1/open-exchange-rates.json
   [junit4]   2> 2766185 T5141 oascc.SolrZkClient.makePath makePath: /configs/conf1/open-exchange-rates.json
   [junit4]   2> 2766192 T5141 oasc.AbstractZkTestCase.putConfig put /Users/jenkins/jenkins-slave/workspace/Lucene-Solr-trunk-MacOSX/solr/build/solr-core/test-files/solr/collection1/conf/mapping-ISOLatin1Accent.txt to /configs/conf1/mapping-ISOLatin1Accent.txt
   [junit4]   2> 2766193 T5141 oascc.SolrZkClient.makePath makePath: /configs/conf1/mapping-ISOLatin1Accent.txt
   [junit4]   2> 2766199 T5141 oasc.AbstractZkTestCase.putConfig put /Users/jenkins/jenkins-slave/workspace/Lucene-Solr-trunk-MacOSX/solr/build/solr-core/test-files/solr/collection1/conf/old_synonyms.txt to /configs/conf1/old_synonyms.txt
   [junit4]   2> 2766200 T5141 oascc.SolrZkClient.makePath makePath: /configs/conf1/old_synonyms.txt
   [junit4]   2> 2766206 T5141 oasc.AbstractZkTestCase.putConfig put /Users/jenkins/jenkins-slave/workspace/Lucene-Solr-trunk-MacOSX/solr/build/solr-core/test-files/solr/collection1/conf/synonyms.txt to /configs/conf1/synonyms.txt
   [junit4]   2> 2766207 T5141 oascc.SolrZkClient.makePath makePath: /configs/conf1/synonyms.txt
   [junit4]   2> 2766709 T5141 oejs.Server.doStart jetty-8.1.10.v20130312
   [junit4]   2> 2766722 T5141 oejs.AbstractConnector.doStart Started SelectChannelConnector@127.0.0.1:50903
   [junit4]   2> 2766723 T5141 oass.SolrDispatchFilter.init SolrDispatchFilter.init()
   [junit4]   2> 2766724 T5141 oasc.SolrResourceLoader.locateSolrHome JNDI not configured for solr (NoInitialContextEx)
   [junit4]   2> 2766725 T5141 oasc.SolrResourceLoader.locateSolrHome using system property solr.solr.home: /Users/jenkins/jenkins-slave/workspace/Lucene-Solr-trunk-MacOSX/solr/build/solr-core/test/J0/./org.apache.solr.cloud.CollectionsAPIDistributedZkTest-controljetty-1375403940531
   [junit4]   2> 2766726 T5141 oasc.SolrResourceLoader.<init> new SolrResourceLoader for directory: '/Users/jenkins/jenkins-slave/workspace/Lucene-Solr-trunk-MacOSX/solr/build/solr-core/test/J0/./org.apache.solr.cloud.CollectionsAPIDistributedZkTest-controljetty-1375403940531/'
   [junit4]   2> 2766780 T5141 oasc.ConfigSolr.fromFile Loading container configuration from /Users/jenkins/jenkins-slave/workspace/Lucene-Solr-trunk-MacOSX/solr/build/solr-core/test/J0/./org.apache.solr.cloud.CollectionsAPIDistributedZkTest-controljetty-1375403940531/solr.xml
   [junit4]   2> 2766911 T5141 oasc.ConfigSolrXml.<init> Config-defined core root directory: 
   [junit4]   2> 2766911 T5141 oasc.CoreContainer.<init> New CoreContainer 830863602
   [junit4]   2> 2766912 T5141 oasc.CoreContainer.load Loading cores into CoreContainer [instanceDir=/Users/jenkins/jenkins-slave/workspace/Lucene-Solr-trunk-MacOSX/solr/build/solr-core/test/J0/./org.apache.solr.cloud.CollectionsAPIDistributedZkTest-controljetty-1375403940531/]
   [junit4]   2> 2766915 T5141 oashc.HttpShardHandlerFactory.getParameter Setting socketTimeout to: 120000
   [junit4]   2> 2766915 T5141 oashc.HttpShardHandlerFactory.getParameter Setting urlScheme to: http://
   [junit4]   2> 2766920 T5141 oashc.HttpShardHandlerFactory.getParameter Setting connTimeout to: 15000
   [junit4]   2> 2766920 T5141 oashc.HttpShardHandlerFactory.getParameter Setting maxConnectionsPerHost to: 20
   [junit4]   2> 2766921 T5141 oashc.HttpShardHandlerFactory.getParameter Setting corePoolSize to: 0
   [junit4]   2> 2766921 T5141 oashc.HttpShardHandlerFactory.getParameter Setting maximumPoolSize to: 2147483647
   [junit4]   2> 2766922 T5141 oashc.HttpShardHandlerFactory.getParameter Setting maxThreadIdleTime to: 5
   [junit4]   2> 2766923 T5141 oashc.HttpShardHandlerFactory.getParameter Setting sizeOfQueue to: -1
   [junit4]   2> 2766924 T5141 oashc.HttpShardHandlerFactory.getParameter Setting fairnessPolicy to: false
   [junit4]   2> 2766925 T5141 oascsi.HttpClientUtil.createClient Creating new http client, config:maxConnectionsPerHost=20&maxConnections=10000&socketTimeout=120000&connTimeout=15000&retry=false
   [junit4]   2> 2766947 T5141 oasc.ZkContainer.initZooKeeper Zookeeper client=127.0.0.1:50900/solr
   [junit4]   2> 2766948 T5141 oasc.ZkController.checkChrootPath zkHost includes chroot
   [junit4]   2> 2766956 T5141 oascc.ConnectionManager.waitForConnected Waiting for client to connect to ZooKeeper
   [junit4]   2> 2766963 T5161 oascc.ConnectionManager.process Watcher org.apache.solr.common.cloud.ConnectionManager@583c2841 name:ZooKeeperConnection Watcher:127.0.0.1:50900 got event WatchedEvent state:SyncConnected type:None path:null path:null type:None
   [junit4]   2> 2766964 T5141 oascc.ConnectionManager.waitForConnected Client is connected to ZooKeeper
   [junit4]   2> 2766968 T5141 oascsi.HttpClientUtil.createClient Creating new http client, config:maxConnections=500&maxConnectionsPerHost=16&socketTimeout=120000&connTimeout=15000
   [junit4]   2> 2766985 T5141 oascc.ConnectionManager.waitForConnected Waiting for client to connect to ZooKeeper
   [junit4]   2> 2766990 T5163 oascc.ConnectionManager.process Watcher org.apache.solr.common.cloud.ConnectionManager@4dd61d04 name:ZooKeeperConnection Watcher:127.0.0.1:50900/solr got event WatchedEvent state:SyncConnected type:None path:null path:null type:None
   [junit4]   2> 2766991 T5141 oascc.ConnectionManager.waitForConnected Client is connected to ZooKeeper
   [junit4]   2> 2766995 T5141 oascc.SolrZkClient.makePath makePath: /overseer/queue
   [junit4]   2> 2767004 T5141 oascc.SolrZkClient.makePath makePath: /overseer/collection-queue-work
   [junit4]   2> 2767017 T5141 oascc.SolrZkClient.makePath makePath: /live_nodes
   [junit4]   2> 2767025 T5141 oasc.ZkController.createEphemeralLiveNode Register node as live in ZooKeeper:/live_nodes/127.0.0.1:50903_
   [junit4]   2> 2767028 T5141 oascc.SolrZkClient.makePath makePath: /live_nodes/127.0.0.1:50903_
   [junit4]   2> 2767037 T5141 oascc.SolrZkClient.makePath makePath: /overseer_elect/election
   [junit4]   2> 2767049 T5141 oascc.SolrZkClient.makePath makePath: /overseer_elect/leader
   [junit4]   2> 2767054 T5141 oasc.Overseer.start Overseer (id=90138472631304195-127.0.0.1:50903_-n_0000000000) starting
   [junit4]   2> 2767062 T5141 oascc.SolrZkClient.makePath makePath: /overseer/queue-work
   [junit4]   2> 2767074 T5164 oasc.Overseer$ClusterStateUpdater.run Starting to work on the main queue
   [junit4]   2> 2767075 T5165 oasc.OverseerCollectionProcessor.run Process current queue of collection creations
   [junit4]   2> 2767081 T5141 oascc.SolrZkClient.makePath makePath: /clusterstate.json
   [junit4]   2> 2767092 T5141 oascc.SolrZkClient.makePath makePath: /aliases.json
   [junit4]   2> 2767098 T5141 oascc.ZkStateReader.createClusterStateWatchersAndUpdate Updating cluster state from ZooKeeper... 
   [junit4]   2> 2767111 T5141 oasc.CorePropertiesLocator.discover Looking for core definitions underneath /Users/jenkins/jenkins-slave/workspace/Lucene-Solr-trunk-MacOSX/solr/build/solr-core/test/J0/./org.apache.solr.cloud.CollectionsAPIDistributedZkTest-controljetty-1375403940531
   [junit4]   2> 2767285 T5141 oasc.CorePropertiesLocator.discoverUnder Found core conf in /Users/jenkins/jenkins-slave/workspace/Lucene-Solr-trunk-MacOSX/solr/build/solr-core/test/J0/./org.apache.solr.cloud.CollectionsAPIDistributedZkTest-controljetty-1375403940531/conf/
   [junit4]   2> 2767298 T5141 oasc.CorePropertiesLocator.discover Found 1 core definitions
   [junit4]   2> 2767299 T5141 oass.SolrDispatchFilter.init user.dir=/Users/jenkins/jenkins-slave/workspace/Lucene-Solr-trunk-MacOSX/solr/build/solr-core/test/J0
   [junit4]   2> 2767299 T5141 oass.SolrDispatchFilter.init SolrDispatchFilter.init() done
   [junit4]   2> 2767300 T5141 oascsi.HttpClientUtil.createClient Creating new http client, config:maxConnections=128&maxConnectionsPerHost=32&followRedirects=false
   [junit4]   2> 2767319 T5141 oascsi.HttpClientUtil.createClient Creating new http client, config:
   [junit4]   2> 2767346 T5141 oascc.ConnectionManager.waitForConnected Waiting for client to connect to ZooKeeper
   [junit4]   2> 2767351 T5168 oascc.ConnectionManager.process Watcher org.apache.solr.common.cloud.ConnectionManager@585f4234 name:ZooKeeperConnection Watcher:127.0.0.1:50900/solr got event WatchedEvent state:SyncConnected type:None path:null path:null type:None
   [junit4]   2> 2767352 T5141 oascc.ConnectionManager.waitForConnected Client is connected to ZooKeeper
   [junit4]   2> 2767357 T5141 oascc.ZkStateReader.createClusterStateWatchersAndUpdate Updating cluster state from ZooKeeper... 
   [junit4]   2> 2767364 T5141 oasc.ChaosMonkey.monkeyLog monkey: init - expire sessions:true cause connection loss:true
   [junit4]   2> 2768025 T5141 oejs.Server.doStart jetty-8.1.10.v20130312
   [junit4]   2> 2768031 T5141 oejs.AbstractConnector.doStart Started SelectChannelConnector@127.0.0.1:50907
   [junit4]   2> 2768032 T5141 oass.SolrDispatchFilter.init SolrDispatchFilter.init()
   [junit4]   2> 2768033 T5141 oasc.SolrResourceLoader.locateSolrHome JNDI not configured for solr (NoInitialContextEx)
   [junit4]   2> 2768033 T5141 oasc.SolrResourceLoader.locateSolrHome using system property solr.solr.home: /Users/jenkins/jenkins-slave/workspace/Lucene-Solr-trunk-MacOSX/solr/build/solr-core/test/J0/./org.apache.solr.cloud.CollectionsAPIDistributedZkTest-jetty1-1375403941674
   [junit4]   2> 2768034 T5141 oasc.SolrResourceLoader.<init> new SolrResourceLoader for directory: '/Users/jenkins/jenkins-slave/workspace/Lucene-Solr-trunk-MacOSX/solr/build/solr-core/test/J0/./org.apache.solr.cloud.CollectionsAPIDistributedZkTest-jetty1-1375403941674/'
   [junit4]   2> 2768084 T5141 oasc.ConfigSolr.fromFile Loading container configuration from /Users/jenkins/jenkins-slave/workspace/Lucene-Solr-trunk-MacOSX/solr/build/solr-core/test/J0/./org.apache.solr.cloud.CollectionsAPIDistributedZkTest-jetty1-1375403941674/solr.xml
   [junit4]   2> 2768228 T5141 oasc.ConfigSolrXml.<init> Config-defined core root directory: 
   [junit4]   2> 2768229 T5141 oasc.CoreContainer.<init> New CoreContainer 680111701
   [junit4]   2> 2768230 T5141 oasc.CoreContainer.load Loading cores into CoreContainer [instanceDir=/Users/jenkins/jenkins-slave/workspace/Lucene-Solr-trunk-MacOSX/solr/build/solr-core/test/J0/./org.apache.solr.cloud.CollectionsAPIDistributedZkTest-jetty1-1375403941674/]
   [junit4]   2> 2768242 T5141 oashc.HttpShardHandlerFactory.getParameter Setting socketTimeout to: 120000
   [junit4]   2> 2768242 T5141 oashc.HttpShardHandlerFactory.getParameter Setting urlScheme to: http://
   [junit4]   2> 2768242 T5141 oashc.HttpShardHandlerFactory.getParameter Setting connTimeout to: 15000
   [junit4]   2> 2768242 T5141 oashc.HttpShardHandlerFactory.getParameter Setting maxConnectionsPerHost to: 20
   [junit4]   2> 2768243 T5141 oashc.HttpShardHandlerFactory.getParameter Setting corePoolSize to: 0
   [junit4]   2> 2768243 T5141 oashc.HttpShardHandlerFactory.getParameter Setting maximumPoolSize to: 2147483647
   [junit4]   2> 2768243 T5141 oashc.HttpShardHandlerFactory.getParameter Setting maxThreadIdleTime to: 5
   [junit4]   2> 2768243 T5141 oashc.HttpShardHandlerFactory.getParameter Setting sizeOfQueue to: -1
   [junit4]   2> 2768243 T5141 oashc.HttpShardHandlerFactory.getParameter Setting fairnessPolicy to: false
   [junit4]   2> 2768243 T5141 oascsi.HttpClientUtil.createClient Creating new http client, config:maxConnectionsPerHost=20&maxConnections=10000&socketTimeout=120000&connTimeout=15000&retry=false
   [junit4]   2> 2768268 T5141 oasc.ZkContainer.initZooKeeper Zookeeper client=127.0.0.1:50900/solr
   [junit4]   2> 2768269 T5141 oasc.ZkController.checkChrootPath zkHost includes chroot
   [junit4]   2> 2768270 T5141 oascc.ConnectionManager.waitForConnected Waiting for client to connect to ZooKeeper
   [junit4]   2> 2768275 T5179 oascc.ConnectionManager.process Watcher org.apache.solr.common.cloud.ConnectionManager@7b3a5061 name:ZooKeeperConnection Watcher:127.0.0.1:50900 got event WatchedEvent state:SyncConnected type:None path:null path:null type:None
   [junit4]   2> 2768275 T5141 oascc.ConnectionManager.waitForConnected Client is connected to ZooKeeper
   [junit4]   2> 2768278 T5141 oascsi.HttpClientUtil.createClient Creating new http client, config:maxConnections=500&maxConnectionsPerHost=16&socketTimeout=120000&connTimeout=15000
   [junit4]   2> 2768295 T5141 oascc.ConnectionManager.waitForConnected Waiting for client to connect to ZooKeeper
   [junit4]   2> 2768298 T5181 oascc.ConnectionManager.process Watcher org.apache.solr.common.cloud.ConnectionManager@21dcec3 name:ZooKeeperConnection Watcher:127.0.0.1:50900/solr got event WatchedEvent state:SyncConnected type:None path:null path:null type:None
   [junit4]   2> 2768298 T5141 oascc.ConnectionManager.waitForConnected Client is connected to ZooKeeper
   [junit4]   2> 2768307 T5141 oascc.ZkStateReader.createClusterStateWatchersAndUpdate Updating cluster state from ZooKeeper... 
   [junit4]   2> 2769315 T5141 oasc.ZkController.createEphemeralLiveNode Register node as live in ZooKeeper:/live_nodes/127.0.0.1:50907_
   [junit4]   2> 2769317 T5141 oascc.SolrZkClient.makePath makePath: /live_nodes/127.0.0.1:50907_
   [junit4]   2> 2769324 T5168 oascc.ZkStateReader$3.process Updating live nodes... (2)
   [junit4]   2> 2769324 T5181 oascc.ZkStateReader$3.process Updating live nodes... (2)
   [junit4]   2> 2769327 T5163 oascc.ZkStateReader$3.process Updating live nodes... (2)
   [junit4]   2> 2769332 T5141 oasc.CorePropertiesLocator.discover Looking for core definitions underneath /Users/jenkins/jenkins-slave/workspace/Lucene-Solr-trunk-MacOSX/solr/build/solr-core/test/J0/./org.apache.solr.cloud.CollectionsAPIDistributedZkTest-jetty1-1375403941674
   [junit4]   2> 2769493 T5141 oasc.CorePropertiesLocator.discoverUnder Found core conf in /Users/jenkins/jenkins-slave/workspace/Lucene-Solr-trunk-MacOSX/solr/build/solr-core/test/J0/./org.apache.solr.cloud.CollectionsAPIDistributedZkTest-jetty1-1375403941674/conf/
   [junit4]   2> 2769501 T5141 oasc.CorePropertiesLocator.discover Found 1 core definitions
   [junit4]   2> 2769502 T5141 oass.SolrDispatchFilter.init user.dir=/Users/jenkins/jenkins-slave/workspace/Lucene-Solr-trunk-MacOSX/solr/build/solr-core/test/J0
   [junit4]   2> 2769502 T5141 oass.SolrDispatchFilter.init SolrDispatchFilter.init() done
   [junit4]   2> 2769503 T5141 oascsi.HttpClientUtil.createClient Creating new http client, config:maxConnections=128&maxConnectionsPerHost=32&followRedirects=false
   [junit4]   2> 2770013 T5141 oejs.Server.doStart jetty-8.1.10.v20130312
   [junit4]   2> 2770022 T5141 oejs.AbstractConnector.doStart Started SelectChannelConnector@127.0.0.1:50910
   [junit4]   2> 2770023 T5141 oass.SolrDispatchFilter.init SolrDispatchFilter.init()
   [junit4]   2> 2770023 T5141 oasc.SolrResourceLoader.locateSolrHome JNDI not configured for solr (NoInitialContextEx)
   [junit4]   2> 2770030 T5141 oasc.SolrResourceLoader.locateSolrHome using system property solr.solr.home: /Users/jenkins/jenkins-slave/workspace/Lucene-Solr-trunk-MacOSX/solr/build/solr-core/test/J0/./org.apache.solr.cloud.CollectionsAPIDistributedZkTest-jetty2-1375403943833
   [junit4]   2> 2770030 T5141 oasc.SolrResourceLoader.<init> new SolrResourceLoader for directory: '/Users/jenkins/jenkins-slave/workspace/Lucene-Solr-trunk-MacOSX/solr/build/solr-core/test/J0/./org.apache.solr.cloud.CollectionsAPIDistributedZkTest-jetty2-1375403943833/'
   [junit4]   2> 2770065 T5141 oasc.ConfigSolr.fromFile Loading container configuration from /Users/jenkins/jenkins-slave/workspace/Lucene-Solr-trunk-MacOSX/solr/build/solr-core/test/J0/./org.apache.solr.cloud.CollectionsAPIDistributedZkTest-jetty2-1375403943833/solr.xml
   [junit4]   2> 2770180 T5141 oasc.ConfigSolrXml.<init> Config-defined core root directory: 
   [junit4]   2> 2770181 T5141 oasc.CoreContainer.<init> New CoreContainer 620221532
   [junit4]   2> 2770182 T5141 oasc.CoreContainer.load Loading cores into CoreContainer [instanceDir=/Users/jenkins/jenkins-slave/workspace/Lucene-Solr-trunk-MacOSX/solr/build/solr-core/test/J0/./org.apache.solr.cloud.CollectionsAPIDistributedZkTest-jetty2-1375403943833/]
   [junit4]   2> 2770183 T5141 oashc.HttpShardHandlerFactory.getParameter Setting socketTimeout to: 120000
   [junit4]   2> 2770184 T5141 oashc.HttpShardHandlerFactory.getParameter Setting urlScheme to: http://
   [junit4]   2> 2770184 T5141 oashc.HttpShardHandlerFactory.getParameter Setting connTimeout to: 15000
   [junit4]   2> 2770185 T5141 oashc.HttpShardHandlerFactory.getParameter Setting maxConnectionsPerHost to: 20
   [junit4]   2> 2770185 T5141 oashc.HttpShardHandlerFactory.getParameter Setting corePoolSize to: 0
   [junit4]   2> 2770186 T5141 oashc.HttpShardHandlerFactory.getParameter Setting maximumPoolSize to: 2147483647
   [junit4]   2> 2770186 T5141 oashc.HttpShardHandlerFactory.getParameter Setting maxThreadIdleTime to: 5
   [junit4]   2> 2770187 T5141 oashc.HttpShardHandlerFactory.getParameter Setting sizeOfQueue to: -1
   [junit4]   2> 2770187 T5141 oashc.HttpShardHandlerFactory.getParameter Setting fairnessPolicy to: false
   [junit4]   2> 2770188 T5141 oascsi.HttpClientUtil.createClient Creating new http client, config:maxConnectionsPerHost=20&maxConnections=10000&socketTimeout=120000&connTimeout=15000&retry=false
   [junit4]   2> 2770207 T5141 oasc.ZkContainer.initZooKeeper Zookeeper client=127.0.0.1:50900/solr
   [junit4]   2> 2770211 T5141 oasc.ZkController.checkChrootPath zkHost includes chroot
   [junit4]   2> 2770213 T5141 oascc.ConnectionManager.waitForConnected Waiting for client to connect to ZooKeeper
   [junit4]   2> 2770220 T5193 oascc.ConnectionManager.process Watcher org.apache.solr.common.cloud.ConnectionManager@4273bd7e name:ZooKeeperConnection Watcher:127.0.0.1:50900 got event WatchedEvent state:SyncConnected type:None path:null path:null type:None
   [junit4]   2> 2770223 T5141 oascc.ConnectionManager.waitForConnected Client is connected to ZooKeeper
   [junit4]   2> 2770229 T5141 oascsi.HttpClientUtil.createClient Creating new http client, config:maxConnections=500&maxConnectionsPerHost=16&socketTimeout=120000&connTimeout=15000
   [junit4]   2> 2770245 T5141 oascc.ConnectionManager.waitForConnected Waiting for client to connect to ZooKeeper
   [junit4]   2> 2770250 T5195 oascc.ConnectionManager.process Watcher org.apache.solr.common.cloud.ConnectionManager@9ab798 name:ZooKeeperConnection Watcher:127.0.0.1:50900/solr got event WatchedEvent state:SyncConnected type:None path:null path:null type:None
   [junit4]   2> 2770251 T5141 oascc.ConnectionManager.waitForConnected Client is connected to ZooKeeper
   [junit4]   2> 2770265 T5141 oascc.ZkStateReader.createClusterStateWatchersAndUpdate Updating cluster state from ZooKeeper... 
   [junit4]   2> 2771274 T5141 oasc.ZkController.createEphemeralLiveNode Register node as live in ZooKeeper:/live_nodes/127.0.0.1:50910_
   [junit4]   2> 2771277 T5141 oascc.SolrZkClient.makePath makePath: /live_nodes/127.0.0.1:50910_
   [junit4]   2> 2771293 T5163 oascc.ZkStateReader$3.process Updating live nodes... (3)
   [junit4]   2> 2771294 T5195 oascc.ZkStateReader$3.process Updating live nodes... (3)
   [junit4]   2> 2771294 T5181 oascc.ZkStateReader$3.process Updating live nodes... (3)
   [junit4]   2> 2771294 T5168 oascc.ZkStateReader$3.process Updating live nodes... (3)
   [junit4]   2> 2771319 T5141 oasc.CorePropertiesLocator.discover Looking for core definitions underneath /Users/jenkins/jenkins-slave/workspace/Lucene-Solr-trunk-MacOSX/solr/build/solr-core/test/J0/./org.apache.solr.cloud.CollectionsAPIDistributedZkTest-jetty2-1375403943833
   [junit4]   2> 2771509 T5141 oasc.CorePropertiesLocator.discoverUnder Found core conf in /Users/jenkins/jenkins-slave/workspace/Lucene-Solr-trunk-MacOSX/solr/build/solr-core/test/J0/./org.apache.solr.cloud.CollectionsAPIDistributedZkTest-jetty2-1375403943833/conf/
   [junit4]   2> 2771518 T5141 oasc.CorePropertiesLocator.discover Found 1 core definitions
   [junit4]   2> 2771520 T5141 oass.SolrDispatchFilter.init user.dir=/Users/jenkins/jenkins-slave/workspace/Lucene-Solr-trunk-MacOSX/solr/build/solr-core/test/J0
   [junit4]   2> 2771521 T5141 oass.SolrDispatchFilter.init SolrDispatchFilter.init() done
   [junit4]   2> 2771521 T5141 oascsi.HttpClientUtil.createClient Creating new http client, config:maxConnections=128&maxConnectionsPerHost=32&followRedirects=false
   [junit4]   2> 2772051 T5141 oejs.Server.doStart jetty-8.1.10.v20130312
   [junit4]   2> 2772057 T5141 oejs.AbstractConnector.doStart Started SelectChannelConnector@127.0.0.1:50913
   [junit4]   2> 2772060 T5141 oass.SolrDispatchFilter.init SolrDispatchFilter.init()
   [junit4]   2> 2772061 T5141 oasc.SolrResourceLoader.locateSolrHome JNDI not configured for solr (NoInitialContextEx)
   [junit4]   2> 2772062 T5141 oasc.SolrResourceLoader.locateSolrHome using system property solr.solr.home: /Users/jenkins/jenkins-slave/workspace/Lucene-Solr-trunk-MacOSX/solr/build/solr-core/test/J0/./org.apache.solr.cloud.CollectionsAPIDistributedZkTest-jetty3-1375403945848
   [junit4]   2> 2772062 T5141 oasc.SolrResourceLoader.<init> new SolrResourceLoader for directory: '/Users/jenkins/jenkins-slave/workspace/Lucene-Solr-trunk-MacOSX/solr/build/solr-core/test/J0/./org.apache.solr.cloud.CollectionsAPIDistributedZkTest-jetty3-1375403945848/'
   [junit4]   2> 2772112 T5141 oasc.ConfigSolr.fromFile Loading container configuration from /Users/jenkins/jenkins-slave/workspace/Lucene-Solr-trunk-MacOSX/solr/build/solr-core/test/J0/./org.apache.solr.cloud.CollectionsAPIDistributedZkTest-jetty3-1375403945848/solr.xml
   [junit4]   2> 2772258 T5141 oasc.ConfigSolrXml.<init> Config-defined core root directory: 
   [junit4]   2> 2772259 T5141 oasc.CoreContainer.<init> New CoreContainer 1395222444
   [junit4]   2> 2772259 T5141 oasc.CoreContainer.load Loading cores into CoreContainer [instanceDir=/Users/jenkins/jenkins-slave/workspace/Lucene-Solr-trunk-MacOSX/solr/build/solr-core/test/J0/./org.apache.solr.cloud.CollectionsAPIDistributedZkTest-jetty3-1375403945848/]
   [junit4]   2> 2772261 T5141 oashc.HttpShardHandlerFactory.getParameter Setting socketTimeout to: 120000
   [junit4]   2> 2772262 T5141 oashc.HttpShardHandlerFactory.getParameter Setting urlScheme to: http://
   [junit4]   2> 2772262 T5141 oashc.HttpShardHandlerFactory.getParameter Setting connTimeout to: 15000
   [junit4]   2> 2772263 T5141 oashc.HttpShardHandlerFactory.getParameter Setting maxConnectionsPerHost to: 20
   [junit4]   2> 2772264 T5141 oashc.HttpShardHandlerFactory.getParameter Setting corePoolSize to: 0
   [junit4]   2> 2772264 T5141 oashc.HttpShardHandlerFactory.getParameter Setting maximumPoolSize to: 2147483647
   [junit4]   2> 2772265 T5141 oashc.HttpShardHandlerFactory.getParameter Setting maxThreadIdleTime to: 5
   [junit4]   2> 2772265 T5141 oashc.HttpShardHandlerFactory.getParameter Setting sizeOfQueue to: -1
   [junit4]   2> 2772266 T5141 oashc.HttpShardHandlerFactory.getParameter Setting fairnessPolicy to: false
   [junit4]   2> 2772267 T5141 oascsi.HttpClientUtil.createClient Creating new http client, config:maxConnectionsPerHost=20&maxConnections=10000&socketTimeout=120000&connTimeout=15000&retry=false
   [junit4]   2> 2772294 T5141 oasc.ZkContainer.initZooKeeper Zookeeper client=127.0.0.1:50900/solr
   [junit4]   2> 2772295 T5141 oasc.ZkController.checkChrootPath zkHost includes chroot
   [junit4]   2> 2772299 T5141 oascc.ConnectionManager.waitForConnected Waiting for client to connect to ZooKeeper
   [junit4]   2> 2772304 T5207 oascc.ConnectionManager.process Watcher org.apache.solr.common.cloud.ConnectionManager@2a8ad40c name:ZooKeeperConnection Watcher:127.0.0.1:50900 got event WatchedEvent state:SyncConnected type:None path:null path:null type:None
   [junit4]   2> 2772305 T5141 oascc.ConnectionManager.waitForConnected Client is connected to ZooKeeper
   [junit4]   2> 2772309 T5141 oascsi.HttpClientUtil.createClient Creating new http client, config:maxConnections=500&maxConnectionsPerHost=16&socketTimeout=120000&connTimeout=15000
   [junit4]   2> 2772333 T5141 oascc.ConnectionManager.waitForConnected Waiting for client to connect to ZooKeeper
   [junit4]   2> 2772339 T5209 oascc.ConnectionManager.process Watcher org.apache.solr.common.cloud.ConnectionManager@a858c0d name:ZooKeeperConnection Watcher:127.0.0.1:50900/solr got event WatchedEvent state:SyncConnected type:None path:null path:null type:None
   [junit4]   2> 2772339 T5141 oascc.ConnectionManager.waitForConnected Client is connected to ZooKeeper
   [junit4]   2> 2772359 T5141 oascc.ZkStateReader.createClusterStateWatchersAndUpdate Updating cluster state from ZooKeeper... 
   [junit4]   2> 2773375 T5141 oasc.ZkController.createEphemeralLiveNode Register node as live in ZooKeeper:/live_nodes/127.0.0.1:50913_
   [junit4]   2> 2773377 T5141 oascc.SolrZkClient.makePath makePath: /live_nodes/127.0.0.1:50913_
   [junit4]   2> 2773386 T5195 oascc.ZkStateReader$3.process Updating live nodes... (4)
   [junit4]   2> 2773386 T5209 oascc.ZkStateReader$3.process Updating live nodes... (4)
   [junit4]   2> 2773386 T5168 oascc.ZkStateReader$3.process Updating live nodes... (4)
   [junit4]   2> 2773386 T5181 oascc.ZkStateReader$3.process Updating live nodes... (4)
   [junit4]   2> 2773387 T5163 oascc.ZkStateReader$3.process Updating live nodes... (4)
   [junit4]   2> 2773397 T5141 oasc.CorePropertiesLocator.discover Looking for core definitions underneath /Users/jenkins/jenkins-slave/workspace/Lucene-Solr-trunk-MacOSX/solr/build/solr-core/test/J0/./org.apache.solr.cloud.CollectionsAPIDistributedZkTest-jetty3-1375403945848
   [junit4]   2> 2773561 T5141 oasc.CorePropertiesLocator.discoverUnder Found core conf in /Users/jenkins/jenkins-slave/workspace/Lucene-Solr-trunk-MacOSX/solr/build/solr-core/test/J0/./org.apache.solr.cloud.CollectionsAPIDistributedZkTest-jetty3-1375403945848/conf/
   [junit4]   2> 2773568 T5141 oasc.CorePropertiesLocator.discover Found 1 core definitions
   [junit4]   2> 2773569 T5141 oass.SolrDispatchFilter.init user.dir=/Users/jenkins/jenkins-slave/workspace/Lucene-Solr-trunk-MacOSX/solr/build/solr-core/test/J0
   [junit4]   2> 2773570 T5141 oass.SolrDispatchFilter.init SolrDispatchFilter.init() done
   [junit4]   2> 2773570 T5141 oascsi.HttpClientUtil.createClient Creating new http client, config:maxConnections=128&maxConnectionsPerHost=32&followRedirects=false
   [junit4]   2> 2774054 T5141 oejs.Server.doStart jetty-8.1.10.v20130312
   [junit4]   2> 2774060 T5141 oejs.AbstractConnector.doStart Started SelectChannelConnector@127.0.0.1:50916
   [junit4]   2> 2774064 T5141 oass.SolrDispatchFilter.init SolrDispatchFilter.init()
   [junit4]   2> 2774065 T5141 oasc.SolrResourceLoader.locateSolrHome JNDI not configured for solr (NoInitialContextEx)
   [junit4]   2> 2774065 T5141 oasc.SolrResourceLoader.locateSolrHome using system property solr.solr.home: /Users/jenkins/jenkins-slave/workspace/Lucene-Solr-trunk-MacOSX/solr/build/solr-core/test/J0/./org.apache.solr.cloud.CollectionsAPIDistributedZkTest-jetty4-1375403947904
   [junit4]   2> 2774066 T5141 oasc.SolrResourceLoader.<init> new SolrResourceLoader for directory: '/Users/jenkins/jenkins-slave/workspace/Lucene-Solr-trunk-MacOSX/solr/build/solr-core/test/J0/./org.apache.solr.cloud.CollectionsAPIDistributedZkTest-jetty4-1375403947904/'
   [junit4]   2> 2774105 T5141 oasc.ConfigSolr.fromFile Loading container configuration from /Users/jenkins/jenkins-slave/workspace/Lucene-Solr-trunk-MacOSX/solr/build/solr-core/test/J0/./org.apache.solr.cloud.CollectionsAPIDistributedZkTest-jetty4-1375403947904/solr.xml
   [junit4]   2> 2774218 T5141 oasc.ConfigSolrXml.<init> Config-defined core root directory: 
   [junit4]   2> 2774219 T5141 oasc.CoreContainer.<init> New CoreContainer 710787411
   [junit4]   2> 2774219 T5141 oasc.CoreContainer.load Loading cores into CoreContainer [instanceDir=/Users/jenkins/jenkins-slave/workspace/Lucene-Solr-trunk-MacOSX/solr/build/solr-core/test/J0/./org.apache.solr.cloud.CollectionsAPIDistributedZkTest-jetty4-1375403947904/]
   [junit4]   2> 2774221 T5141 oashc.HttpShardHandlerFactory.getParameter Setting socketTimeout to: 120000
   [junit4]   2> 2774222 T5141 oashc.HttpShardHandlerFactory.getParameter Setting urlScheme to: http://
   [junit4]   2> 2774222 T5141 oashc.HttpShardHandlerFactory.getParameter Setting connTimeout to: 15000
   [junit4]   2> 2774222 T5141 oashc.HttpShardHandlerFactory.getParameter Setting maxConnectionsPerHost to: 20
   [junit4]   2> 2774223 T5141 oashc.HttpShardHandlerFactory.getParameter Setting corePoolSize to: 0
   [junit4]   2> 2774223 T5141 oashc.HttpShardHandlerFactory.getParameter Setting maximumPoolSize to: 2147483647
   [junit4]   2> 2774224 T5141 oashc.HttpShardHandlerFactory.getParameter Setting maxThreadIdleTime to: 5
   [junit4]   2> 2774224 T5141 oashc.HttpShardHandlerFactory.getParameter Setting sizeOfQueue to: -1
   [junit4]   2> 2774225 T5141 oashc.HttpShardHandlerFactory.getParameter Setting fairnessPolicy to: false
   [junit4]   2> 2774225 T5141 oascsi.HttpClientUtil.createClient Creating new http client, config:maxConnectionsPerHost=20&maxConnections=10000&socketTimeout=120000&connTimeout=15000&retry=false
   [junit4]   2> 2774249 T5141 oasc.ZkContainer.initZooKeeper Zookeeper client=127.0.0.1:50900/solr
   [junit4]   2> 2774253 T5141 oasc.ZkController.checkChrootPath zkHost includes chroot
   [junit4]   2> 2774255 T5141 oascc.ConnectionManager.waitForConnected Waiting for client to connect to ZooKeeper
   [junit4]   2> 2774259 T5221 oascc.ConnectionManager.process Watcher org.apache.solr.common.cloud.ConnectionManager@59b4bf99 name:ZooKeeperConnection Watcher:127.0.0.1:50900 got event WatchedEvent state:SyncConnected type:None path:null path:null type:None
   [junit4]   2> 2774259 T5141 oascc.ConnectionManager.waitForConnected Client is connected to ZooKeeper
   [junit4]   2> 2774263 T5141 oascsi.HttpClientUtil.createClient Creating new http client, config:maxConnections=500&maxConnectionsPerHost=16&socketTimeout=120000&connTimeout=15000
   [junit4]   2> 2774281 T5141 oascc.ConnectionManager.waitForConnected Waiting for client to connect to ZooKeeper
   [junit4]   2> 2774285 T5223 oascc.ConnectionManager.process Watcher org.apache.solr.common.cloud.ConnectionManager@7f3901be name:ZooKeeperConnection Watcher:127.0.0.1:50900/solr got event WatchedEvent state:SyncConnected type:None path:null path:null type:None
   [junit4]   2> 2774285 T5141 oascc.ConnectionManager.waitForConnected Client is connected to ZooKeeper
   [junit4]   2> 2774312 T5141 oascc.ZkStateReader.createClusterStateWatchersAndUpdate Updating cluster state from ZooKeeper... 
   [junit4]   2> 2775321 T5141 oasc.ZkController.createEphemeralLiveNode Register node as live in ZooKeeper:/live_nodes/127.0.0.1:50916_
   [junit4]   2> 2775323 T5141 oascc.SolrZkClient.makePath makePath: /live_nodes/127.0.0.1:50916_
   [junit4]   2> 2775331 T5163 oascc.ZkStateReader$3.process Updating live nodes... (5)
   [junit4]   2> 2775331 T5223 oascc.ZkStateReader$3.process Updating live nodes... (5)
   [junit4]   2> 2775332 T5168 oascc.ZkStateReader$3.process Updating live nodes... (5)
   [junit4]   2> 2775332 T5195 oascc.ZkStateReader$3.process Updating live nodes... (5)
   [junit4]   2> 2775331 T5209 oascc.ZkStateReader$3.process Updating live nodes... (5)
   [junit4]   2> 2775331 T5181 oascc.ZkStateReader$3.process Updating live nodes... (5)
   [junit4]   2> 2775342 T5141 oasc.CorePropertiesLocator.discover Looking for core definitions underneath /Users/jenkins/jenkins-slave/workspace/Lucene-Solr-trunk-MacOSX/solr/build/solr-core/test/J0/./org.apache.solr.cloud.CollectionsAPIDistributedZkTest-jetty4-1375403947904
   [junit4]   2> 2775490 T5141 oasc.CorePropertiesLocator.discoverUnder Found core conf in /Users/jenkins/jenkins-slave/workspace/Lucene-Solr-trunk-MacOSX/solr/build/solr-core/test/J0/./org.apache.solr.cloud.CollectionsAPIDistributedZkTest-jetty4-1375403947904/conf/
   [junit4]   2> 2775497 T5141 oasc.CorePropertiesLocator.discover Found 1 core definitions
   [junit4]   2> 2775498 T5141 oass.SolrDispatchFilter.init user.dir=/Users/jenkins/jenkins-slave/workspace/Lucene-Solr-trunk-MacOSX/solr/build/solr-core/test/J0
   [junit4]   2> 2775499 T5141 oass.SolrDispatchFilter.init SolrDispatchFilter.init() done
   [junit4]   2> 2775499 T5141 oascsi.HttpClientUtil.createClient Creating new http client, config:maxConnections=128&maxConnectionsPerHost=32&followRedirects=false
   [junit4]   2> 2775525 T5141 oascsi.HttpClientUtil.createClient Creating new http client, config:maxConnections=128&maxConnectionsPerHost=32&followRedirects=false
   [junit4]   2> 2775542 T5173 oasha.CollectionsHandler.handleCreateAction Creating Collection : numShards=2&name=nodes_used_collection&replicationFactor=2&action=CREATE&wt=javabin&version=2
   [junit4]   2> 2775547 T5163 oasc.DistributedQueue$LatchChildWatcher.process Watcher fired on path: /overseer/collection-queue-work state: SyncConnected type NodeChildrenChanged
   [junit4]   2> 2775550 T5165 oasc.OverseerCollectionProcessor.run Overseer Collection Processor: Get the message id:/overseer/collection-queue-work/qn-0000000000 message:{
   [junit4]   2> 	  "operation":"createcollection",
   [junit4]   2> 	  "numShards":"2",
   [junit4]   2> 	  "name":"nodes_used_collection",
   [junit4]   2> 	  "replicationFactor":"2"}
   [junit4]   2> 2775550 T5165 oasc.OverseerCollectionProcessor.processMessage WARN OverseerCollectionProcessor.processMessage : createcollection , {
   [junit4]   2> 	  "operation":"createcollection",
   [junit4]   2> 	  "numShards":"2",
   [junit4]   2> 	  "name":"nodes_used_collection",
   [junit4]   2> 	  "replicationFactor":"2"}
   [junit4]   2> 2776108 T5164 oascc.ZkStateReader.updateClusterState Updating cloud state from ZooKeeper... 
   [junit4]   2> 2776109 T5164 oasc.Overseer$ClusterStateUpdater.buildCollection building a new collection: nodes_used_collection
   [junit4]   2> 2776110 T5164 oasc.Overseer$ClusterStateUpdater.createCollection Create collection nodes_used_collection with shards [shard1, shard2]
   [junit4]   2> 2776124 T5223 oascc.ZkStateReader$2.process A cluster state change: WatchedEvent state:SyncConnected type:NodeDataChanged path:/clusterstate.json, has occurred - updating... (live nodes size: 5)
   [junit4]   2> 2776124 T5168 oascc.ZkStateReader$2.process A cluster state change: WatchedEvent state:SyncConnected type:NodeDataChanged path:/clusterstate.json, has occurred - updating... (live nodes size: 5)
   [junit4]   2> 2776125 T5181 oascc.ZkStateReader$2.process A cluster state change: WatchedEvent state:SyncConnected type:NodeDataChanged path:/clusterstate.json, has occurred - updating... (live nodes size: 5)
   [junit4]   2> 2776124 T5163 oascc.ZkStateReader$2.process A cluster state change: WatchedEvent state:SyncConnected type:NodeDataChanged path:/clusterstate.json, has occurred - updating... (live nodes size: 5)
   [junit4]   2> 2776125 T5209 oascc.ZkStateReader$2.process A cluster state change: WatchedEvent state:SyncConnected type:NodeDataChanged path:/clusterstate.json, has occurred - updating... (live nodes size: 5)
   [junit4]   2> 2776124 T5195 oascc.ZkStateReader$2.process A cluster state change: WatchedEvent state:SyncConnected type:NodeDataChanged path:/clusterstate.json, has occurred - updating... (live nodes size: 5)
   [junit4]   2> 2776164 T5165 oasc.OverseerCollectionProcessor.createCollection going to create cores replicas shardNames [shard1, shard2] , repFactor : 2
   [junit4]   2> 2776164 T5165 oasc.OverseerCollectionProcessor.createCollection Creating shard nodes_used_collection_shard1_replica1 as part of slice shard1 of collection nodes_used_collection on 127.0.0.1:50907_
   [junit4]   2> 2776165 T5165 oasc.OverseerCollectionProcessor.createCollection Creating shard nodes_used_collection_shard1_replica2 as part of slice shard1 of collection nodes_used_collection on 127.0.0.1:50910_
   [junit4]   2> 2776165 T5165 oasc.OverseerCollectionProcessor.createCollection Creating shard nodes_used_collection_shard2_replica1 as part of slice shard2 of collection nodes_used_collection on 127.0.0.1:50916_
   [junit4]   2> 2776167 T5165 oasc.OverseerCollectionProcessor.createCollection Creating shard nodes_used_collection_shard2_replica2 as part of slice shard2 of collection nodes_used_collection on 127.0.0.1:50903_
   [junit4]   2> 2776179 T5189 oasc.ZkController.publish publishing core=nodes_used_collection_shard1_replica2 state=down
   [junit4]   2> 2776179 T5175 oasc.ZkController.publish publishing core=nodes_used_collection_shard1_replica1 state=down
   [junit4]   2> 2776180 T5219 oasc.ZkController.publish publishing core=nodes_used_collection_shard2_replica1 state=down
   [junit4]   2> 2776180 T5159 oasc.ZkController.publish publishing core=nodes_used_collection_shard2_replica2 state=down
   [junit4]   2> 2776184 T5189 oasc.ZkController.waitForCoreNodeName look for our core node name
   [junit4]   2> 2776184 T5159 oasc.ZkController.waitForCoreNodeName look for our core node name
   [junit4]   2> 2776185 T5175 oasc.ZkController.waitForCoreNodeName look for our core node name
   [junit4]   2> 2776185 T5219 oasc.ZkController.waitForCoreNodeName look for our core node name
   [junit4]   2> 2777639 T5164 oascc.ZkStateReader.updateClusterState Updating cloud state from ZooKeeper... 
   [junit4]   2> 2777642 T5164 oasc.Overseer$ClusterStateUpdater.updateState WARN Could not find collection node for nodes_used_collection, skipping publish state
   [junit4]   2> 2777642 T5164 oasc.Overseer$ClusterStateUpdater.updateState Update state numShards=2 message={
   [junit4]   2> 	  "operation":"state",
   [junit4]   2> 	  "core_node_name":"core_node1",
   [junit4]   2> 	  "numShards":"2",
   [junit4]   2> 	  "shard":"shard1",
   [junit4]   2> 	  "roles":null,
   [junit4]   2> 	  "state":"down",
   [junit4]   2> 	  "shard_state":"active",
   [junit4]   2> 	  "core":"nodes_used_collection_shard1_replica2",
   [junit4]   2> 	  "collection":"nodes_used_collection",
   [junit4]   2> 	  "shard_range":null,
   [junit4]   2> 	  "node_name":"127.0.0.1:50910_",
   [junit4]   2> 	  "base_url":"http://127.0.0.1:50910"}
   [junit4]   2> 2777656 T5164 oasc.Overseer$ClusterStateUpdater.updateState WARN Could not find collection node for nodes_used_collection, skipping publish state
   [junit4]   2> 2777657 T5164 oasc.Overseer$ClusterStateUpdater.updateState Update state numShards=2 message={
   [junit4]   2> 	  "operation":"state",
   [junit4]   2> 	  "core_node_name":"core_node2",
   [junit4]   2> 	  "numShards":"2",
   [junit4]   2> 	  "shard":"shard2",
   [junit4]   2> 	  "roles":null,
   [junit4]   2> 	  "state":"down",
   [junit4]   2> 	  "shard_state":"active",
   [junit4]   2> 	  "core":"nodes_used_collection_shard2_replica1",
   [junit4]   2> 	  "collection":"nodes_used_collection",
   [junit4]   2> 	  "shard_range":null,
   [junit4]   2> 	  "node_name":"127.0.0.1:50916_",
   [junit4]   2> 	  "base_url":"http://127.0.0.1:50916"}
   [junit4]   2> 2777668 T5164 oasc.Overseer$ClusterStateUpdater.updateState WARN Could not find collection node for nodes_used_collection, skipping publish state
   [junit4]   2> 2777669 T5164 oasc.Overseer$ClusterStateUpdater.updateState Update state numShards=2 message={
   [junit4]   2> 	  "operation":"state",
   [junit4]   2> 	  "core_node_name":"core_node3",
   [junit4]   2> 	  "numShards":"2",
   [junit4]   2> 	  "shard":"shard1",
   [junit4]   2> 	  "roles":null,
   [junit4]   2> 	  "state":"down",
   [junit4]   2> 	  "shard_state":"active",
   [junit4]   2> 	  "core":"nodes_used_collection_shard1_replica1",
   [junit4]   2> 	  "collection":"nodes_used_collection",
   [junit4]   2> 	  "shard_range":null,
   [junit4]   2> 	  "node_name":"127.0.0.1:50907_",
   [junit4]   2> 	  "base_url":"http://127.0.0.1:50907"}
   [junit4]   2> 2777678 T5164 oasc.Overseer$ClusterStateUpdater.updateState WARN Could not find collection node for nodes_used_collection, skipping publish state
   [junit4]   2> 2777679 T5164 oasc.Overseer$ClusterStateUpdater.updateState Update state numShards=2 message={
   [junit4]   2> 	  "operation":"state",
   [junit4]   2> 	  "core_node_name":"core_node4",
   [junit4]   2> 	  "numShards":"2",
   [junit4]   2> 	  "shard":"shard2",
   [junit4]   2> 	  "roles":null,
   [junit4]   2> 	  "state":"down",
   [junit4]   2> 	  "shard_state":"active",
   [junit4]   2> 	  "core":"nodes_used_collection_shard2_replica2",
   [junit4]   2> 	  "collection":"nodes_used_collection",
   [junit4]   2> 	  "shard_range":null,
   [junit4]   2> 	  "node_name":"127.0.0.1:50903_",
   [junit4]   2> 	  "base_url":"http://127.0.0.1:50903"}
   [junit4]   2> 2777688 T5163 oascc.ZkStateReader$2.process A cluster state change: WatchedEvent state:SyncConnected type:NodeDataChanged path:/clusterstate.json, has occurred - updating... (live nodes size: 5)
   [junit4]   2> 2777689 T5209 oascc.ZkStateReader$2.process A cluster state change: WatchedEvent state:SyncConnected type:NodeDataChanged path:/clusterstate.json, has occurred - updating... (live nodes size: 5)
   [junit4]   2> 2777689 T5181 oascc.ZkStateReader$2.process A cluster state change: WatchedEvent state:SyncConnected type:NodeDataChanged path:/clusterstate.json, has occurred - updating... (live nodes size: 5)
   [junit4]   2> 2777696 T5223 oascc.ZkStateReader$2.process A cluster state change: WatchedEvent state:SyncConnected type:NodeDataChanged path:/clusterstate.json, has occurred - updating... (live nodes size: 5)
   [junit4]   2> 2777697 T5168 oascc.ZkStateReader$2.process A cluster state change: WatchedEvent state:SyncConnected type:NodeDataChanged path:/clusterstate.json, has occurred - updating... (live nodes size: 5)
   [junit4]   2> 2777697 T5195 oascc.ZkStateReader$2.process A cluster state change: WatchedEvent state:SyncConnected type:NodeDataChanged path:/clusterstate.json, has occurred - updating... (live nodes size: 5)
   [junit4]   2> 2778187 T5189 oasc.ZkController.waitForShardId waiting to find shard id in clusterstate for nodes_used_collection_shard1_replica2
   [junit4]   2> 2778187 T5175 oasc.ZkController.waitForShardId waiting to find shard id in clusterstate for nodes_used_collection_shard1_replica1
   [junit4]   2> 2778189 T5189 oasc.CorePropertiesLocator.writePropertiesFile ERROR Couldn't persist core properties to /Users/jenkins/jenkins-slave/workspace/Lucene-Solr-trunk-MacOSX/solr/build/solr-core/test/J0/./org.apache.solr.cloud.CollectionsAPIDistributedZkTest-jetty2-1375403943833/nodes_used_collection_shard1_replica2/core.properties: java.io.FileNotFoundException: /Users/jenkins/jenkins-slave/workspace/Lucene-Solr-trunk-MacOSX/solr/build/solr-core/test/J0/./org.apache.solr.cloud.CollectionsAPIDistributedZkTest-jetty2-1375403943833/nodes_used_collection_shard1_replica2/core.properties (No such file or directory)
   [junit4]   2> 2778189 T5175 oasc.CorePropertiesLocator.writePropertiesFile ERROR Couldn't persist core properties to /Users/jenkins/jenkins-slave/workspace/Lucene-Solr-trunk-MacOSX/solr/build/solr-core/test/J0/./org.apache.solr.cloud.CollectionsAPIDistributedZkTest-jetty1-1375403941674/nodes_used_collection_shard1_replica1/core.properties: java.io.FileNotFoundException: /Users/jenkins/jenkins-slave/workspace/Lucene-Solr-trunk-MacOSX/solr/build/solr-core/test/J0/./org.apache.solr.cloud.CollectionsAPIDistributedZkTest-jetty1-1375403941674/nodes_used_collection_shard1_replica1/core.properties (No such file or directory)
   [junit4]   2> 2778190 T5175 oasc.CoreContainer.create Creating SolrCore 'nodes_used_collection_shard1_replica1' using instanceDir: /Users/jenkins/jenkins-slave/workspace/Lucene-Solr-trunk-MacOSX/solr/build/solr-core/test/J0/./org.apache.solr.cloud.CollectionsAPIDistributedZkTest-jetty1-1375403941674/nodes_used_collection_shard1_replica1
   [junit4]   2> 2778191 T5175 oasc.ZkController.createCollectionZkNode Check for collection zkNode:nodes_used_collection
   [junit4]   2> 2778187 T5159 oasc.ZkController.waitForShardId waiting to find shard id in clusterstate for nodes_used_collection_shard2_replica2
   [junit4]   2> 2778191 T5219 oasc.ZkController.waitForShardId waiting to find shard id in clusterstate for nodes_used_collection_shard2_replica1
   [junit4]   2> 2778192 T5159 oasc.CorePropertiesLocator.writePropertiesFile ERROR Couldn't persist core properties to /Users/jenkins/jenkins-slave/workspace/Lucene-Solr-trunk-MacOSX/solr/build/solr-core/test/J0/./org.apache.solr.cloud.CollectionsAPIDistributedZkTest-controljetty-1375403940531/nodes_used_collection_shard2_replica2/core.properties: java.io.FileNotFoundException: /Users/jenkins/jenkins-slave/workspace/Lucene-Solr-trunk-MacOSX/solr/build/solr-core/test/J0/./org.apache.solr.cloud.CollectionsAPIDistributedZkTest-controljetty-1375403940531/nodes_used_collection_shard2_replica2/core.properties (No such file or directory)
   [junit4]   2> 2778193 T5219 oasc.CorePropertiesLocator.writePropertiesFile ERROR Couldn't persist core properties to /Users/jenkins/jenkins-slave/workspace/Lucene-Solr-trunk-MacOSX/solr/build/solr-core/test/J0/./org.apache.solr.cloud.CollectionsAPIDistributedZkTest-jetty4-1375403947904/nodes_used_collection_shard2_replica1/core.properties: java.io.FileNotFoundException: /Users/jenkins/jenkins-slave/workspace/Lucene-Solr-trunk-MacOSX/solr/build/solr-core/test/J0/./org.apache.solr.cloud.CollectionsAPIDistributedZkTest-jetty4-1375403947904/nodes_used_collection_shard2_replica1/core.properties (No such file or directory)
   [junit4]   2> 2778193 T5219 oasc.CoreContainer.create Creating SolrCore 'nodes_used_collection_shard2_replica1' using instanceDir: /Users/jenkins/jenkins-slave/workspace/Lucene-Solr-trunk-MacOSX/solr/build/solr-core/test/J0/./org.apache.solr.cloud.CollectionsAPIDistributedZkTest-jetty4-1375403947904/nodes_used_collection_shard2_replica1
   [junit4]   2> 2778194 T5219 oasc.ZkController.createCollectionZkNode Check for collection zkNode:nodes_used_collection
   [junit4]   2> 2778189 T5189 oasc.CoreContainer.create Creating SolrCore 'nodes_used_collection_shard1_replica2' using instanceDir: /Users/jenkins/jenkins-slave/workspace/Lucene-Solr-trunk-MacOSX/solr/build/solr-core/test/J0/./org.apache.solr.cloud.CollectionsAPIDistributedZkTest-jetty2-1375403943833/nodes_used_collection_shard1_replica2
   [junit4]   2> 2778195 T5189 oasc.ZkController.createCollectionZkNode Check for collection zkNode:nodes_used_collection
   [junit4]   2> 2778193 T5175 oasc.ZkController.createCollectionZkNode Creating collection in ZooKeeper:nodes_used_collection
   [junit4]   2> 2778196 T5175 oasc.ZkController.getConfName Looking for collection configName
   [junit4]   2> 2778196 T5189 oasc.ZkController.createCollectionZkNode Creating collection in ZooKeeper:nodes_used_collection
   [junit4]   2> 2778197 T5189 oasc.ZkController.getConfName Looking for collection configName
   [junit4]   2> 2778193 T5159 oasc.CoreContainer.create Creating SolrCore 'nodes_used_collection_shard2_replica2' using instanceDir: /Users/jenkins/jenkins-slave/workspace/Lucene-Solr-trunk-MacOSX/solr/build/solr-core/test/J0/./org.apache.solr.cloud.CollectionsAPIDistributedZkTest-controljetty-1375403940531/nodes_used_collection_shard2_replica2
   [junit4]   2> 2778198 T5159 oasc.ZkController.createCollectionZkNode Check for collection zkNode:nodes_used_collection
   [junit4]   2> 2778195 T5219 oasc.ZkController.createCollectionZkNode Creating collection in ZooKeeper:nodes_used_collection
   [junit4]   2> 2778199 T5219 oasc.ZkController.getConfName Looking for collection configName
   [junit4]   2> 2778199 T5175 oasc.ZkController.getConfName Only one config set found in zk - using it:conf1
   [junit4]   2> 2778200 T5175 oascc.SolrZkClient.makePath makePath: /collections/nodes_used_collection
   [junit4]   2> 2778201 T5159 oasc.ZkController.createCollectionZkNode Creating collection in ZooKeeper:nodes_used_collection
   [junit4]   2> 2778202 T5159 oasc.ZkController.getConfName Looking for collection configName
   [junit4]   2> 2778202 T5189 oasc.ZkController.getConfName Only one config set found in zk - using it:conf1
   [junit4]   2> 2778203 T5189 oascc.SolrZkClient.makePath makePath: /collections/nodes_used_collection
   [junit4]   2> 2778205 T5219 oasc.ZkController.getConfName Only one config set found in zk - using it:conf1
   [junit4]   2> 2778206 T5219 oascc.SolrZkClient.makePath makePath: /collections/nodes_used_collection
   [junit4]   2> 2778210 T5159 oasc.ZkController.getConfName Only one config set found in zk - using it:conf1
   [junit4]   2> 2778210 T5159 oascc.SolrZkClient.makePath makePath: /collections/nodes_used_collection
   [junit4]   2> 2778212 T5219 oasc.ZkController.readConfigName Load collection config from:/collections/nodes_used_collection
   [junit4]   2> 2778216 T5219 oasc.SolrResourceLoader.<init> new SolrResourceLoader for directory: '/Users/jenkins/jenkins-slave/workspace/Lucene-Solr-trunk-MacOSX/solr/build/solr-core/test/J0/./org.apache.solr.cloud.CollectionsAPIDistributedZkTest-jetty4-1375403947904/nodes_used_collection_shard2_replica1/'
   [junit4]   2> 2778239 T5159 oasc.ZkController.readConfigName Load collection config from:/collections/nodes_used_collection
   [junit4]   2> 2778243 T5175 oasc.ZkController.readConfigName Load collection config from:/collections/nodes_used_collection
   [junit4]   2> 2778253 T5159 oasc.SolrResourceLoader.<init> new SolrResourceLoader for directory: '/Users/jenkins/jenkins-slave/workspace/Lucene-Solr-trunk-MacOSX/solr/build/solr-core/test/J0/./org.apache.solr.cloud.CollectionsAPIDistributedZkTest-controljetty-1375403940531/nodes_used_collection_shard2_replica2/'
   [junit4]   2> 2778256 T5189 oasc.ZkController.readConfigName Load collection config from:/collections/nodes_used_collection
   [junit4]   2> 2778261 T5175 oasc.SolrResourceLoader.<init> new SolrResourceLoader for directory: '/Users/jenkins/jenkins-slave/workspace/Lucene-Solr-trunk-MacOSX/solr/build/solr-core/test/J0/./org.apache.solr.cloud.CollectionsAPIDistributedZkTest-jetty1-1375403941674/nodes_used_collection_shard1_replica1/'
   [junit4]   2> 2778265 T5189 oasc.SolrResourceLoader.<init> new SolrResourceLoader for directory: '/Users/jenkins/jenkins-slave/workspace/Lucene-Solr-trunk-MacOSX/solr/build/solr-core/test/J0/./org.apache.solr.cloud.CollectionsAPIDistributedZkTest-jetty2-1375403943833/nodes_used_collection_shard1_replica2/'
   [junit4]   2> 2778462 T5219 oasc.SolrConfig.<init> Using Lucene MatchVersion: LUCENE_50
   [junit4]   2> 2778473 T5175 oasc.SolrConfig.<init> Using Lucene MatchVersion: LUCENE_50
   [junit4]   2> 2778473 T5159 oasc.SolrConfig.<init> Using Lucene MatchVersion: LUCENE_50
   [junit4]   2> 2778504 T5189 oasc.SolrConfig.<init> Using Lucene MatchVersion: LUCENE_50
   [junit4]   2> 2778708 T5175 oasc.SolrConfig.<init> Loaded SolrConfig: solrconfig.xml
   [junit4]   2> 2778732 T5175 oass.IndexSchema.readSchema Reading Solr Schema from schema.xml
   [junit4]   2> 2778734 T5189 oasc.SolrConfig.<init> Loaded SolrConfig: solrconfig.xml
   [junit4]   2> 2778748 T5219 oasc.SolrConfig.<init> Loaded SolrConfig: solrconfig.xml
   [junit4]   2> 2778749 T5159 oasc.SolrConfig.<init> Loaded SolrConfig: solrconfig.xml
   [junit4]   2> 2778751 T5189 oass.IndexSchema.readSchema Reading Solr Schema from schema.xml
   [junit4]   2> 2778760 T5175 oass.IndexSchema.readSchema [nodes_used_collection_shard1_replica1] Schema name=test
   [junit4]   2> 2778761 T5219 oass.IndexSchema.readSchema Reading Solr Schema from schema.xml
   [junit4]   2> 2778765 T5159 oass.IndexSchema.readSchema Reading Solr Schema from schema.xml
   [junit4]   2> 2778780 T5159 oass.IndexSchema.readSchema [nodes_used_collection_shard2_replica2] Schema name=test
   [junit4]   2> 2778789 T5219 oass.IndexSchema.readSchema [nodes_used_collection_shard2_replica1] Schema name=test
   [junit4]   2> 2778794 T5189 oass.IndexSchema.readSchema [nodes_used_collection_shard1_replica2] Schema name=test
   [junit4]   2> 2781293 T5219 oass.OpenExchangeRatesOrgProvider.init Initialized with rates=open-exchange-rates.json, refreshInterval=1440.
   [junit4]   2> 2781306 T5189 oass.OpenExchangeRatesOrgProvider.init Initialized with rates=open-exchange-rates.json, refreshInterval=1440.
   [junit4]   2> 2781332 T5159 oass.OpenExchangeRatesOrgProvider.init Initialized with rates=open-exchange-rates.json, refreshInterval=1440.
   [junit4]   2> 2781332 T5219 oass.IndexSchema.readSchema default search field in schema is text
   [junit4]   2> 2781342 T5219 oass.IndexSchema.readSchema unique key field: id
   [junit4]   2> 2781345 T5159 oass.IndexSchema.readSchema default search field in schema is text
   [junit4]   2> 2781335 T5189 oass.IndexSchema.readSchema default search field in schema is text
   [junit4]   2> 2781351 T5159 oass.IndexSchema.readSchema unique key field: id
   [junit4]   2> 2781358 T5189 oass.IndexSchema.readSchema unique key field: id
   [junit4]   2> 2781361 T5175 oass.OpenExchangeRatesOrgProvider.init Initialized with rates=open-exchange-rates.json, refreshInterval=1440.
   [junit4]   2> 2781375 T5175 oass.IndexSchema.readSchema default search field in schema is text
   [junit4]   2> 2781385 T5175 oass.IndexSchema.readSchema unique key field: id
   [junit4]   2> 2781425 T5219 oass.FileExchangeRateProvider.reload Reloading exchange rates from file currency.xml
   [junit4]   2> 2781428 T5189 oass.FileExchangeRateProvider.reload Reloading exchange rates from file currency.xml
   [junit4]   2> 2781443 T5219 oass.FileExchangeRateProvider.reload Reloading exchange rates from file currency.xml
   [junit4]   2> 2781447 T5189 oass.FileExchangeRateProvider.reload Reloading exchange rates from file currency.xml
   [junit4]   2> 2781452 T5159 oass.FileExchangeRateProvider.reload Reloading exchange rates from file currency.xml
   [junit4]   2> 2781458 T5219 oass.OpenExchangeRatesOrgProvider.reload Reloading exchange rates from open-exchange-rates.json
   [junit4]   2> 2781459 T5189 oass.OpenExchangeRatesOrgProvider.reload Reloading exchange rates from open-exchange-rates.json
   [junit4]   2> 2781463 T5219 oass.OpenExchangeRatesOrgProvider$OpenExchangeRates.<init> WARN Unknown key IMPORTANT NOTE
   [junit4]   2> 2781463 T5219 oass.OpenExchangeRatesOrgProvider$OpenExchangeRates.<init> WARN Expected key, got STRING
   [junit4]   2> 2781464 T5219 oass.OpenExchangeRatesOrgProvider.reload Reloading exchange rates from open-exchange-rates.json
   [junit4]   2> 2781464 T5189 oass.OpenExchangeRatesOrgProvider$OpenExchangeRates.<init> WARN Unknown key IMPORTANT NOTE
   [junit4]   2> 2781465 T5189 oass.OpenExchangeRatesOrgProvider$OpenExchangeRates.<init> WARN Expected key, got STRING
   [junit4]   2> 2781466 T5189 oass.OpenExchangeRatesOrgProvider.reload Reloading exchange rates from open-exchange-rates.json
   [junit4]   2> 2781466 T5159 oass.FileExchangeRateProvider.reload Reloading exchange rates from file currency.xml
   [junit4]   2> 2781472 T5219 oass.OpenExchangeRatesOrgProvider$OpenExchangeRates.<init> WARN Unknown key IMPORTANT NOTE
   [junit4]   2> 2781474 T5219 oass.OpenExchangeRatesOrgProvider$OpenExchangeRates.<init> WARN Expected key, got STRING
   [junit4]   2> 2781474 T5219 oasc.SolrCore.initDirectoryFactory org.apache.solr.core.MockDirectoryFactory
   [junit4]   2> 2781479 T5219 oasc.SolrCore.<init> [nodes_used_collection_shard2_replica1] Opening new SolrCore at /Users/jenkins/jenkins-slave/workspace/Lucene-Solr-trunk-MacOSX/solr/build/solr-core/test/J0/./org.apache.solr.cloud.CollectionsAPIDistributedZkTest-jetty4-1375403947904/nodes_used_collection_shard2_replica1/, dataDir=/Users/jenkins/jenkins-slave/workspace/Lucene-Solr-trunk-MacOSX/solr/build/solr-core/test/J0/./org.apache.solr.cloud.CollectionsAPIDistributedZkTest-jetty4-1375403947904//nodes_used_collection_shard2_replica1/data/
   [junit4]   2> 2781479 T5219 oasc.JmxMonitoredMap.<init> JMX monitoring is enabled. Adding Solr mbeans to JMX Server: com.sun.jmx.mbeanserver.JmxMBeanServer@71268a13
   [junit4]   2> 2781474 T5189 oass.OpenExchangeRatesOrgProvider$OpenExchangeRates.<init> WARN Unknown key IMPORTANT NOTE
   [junit4]   2> 2781481 T5189 oass.OpenExchangeRatesOrgProvider$OpenExchangeRates.<init> WARN Expected key, got STRING
   [junit4]   2> 2781482 T5189 oasc.SolrCore.initDirectoryFactory org.apache.solr.core.MockDirectoryFactory
   [junit4]   2> 2781482 T5189 oasc.SolrCore.<init> [nodes_used_collection_shard1_replica2] Opening new SolrCore at /Users/jenkins/jenkins-slave/workspace/Lucene-Solr-trunk-MacOSX/solr/build/solr-core/test/J0/./org.apache.solr.cloud.CollectionsAPIDistributedZkTest-jetty2-1375403943833/nodes_used_collection_shard1_replica2/, dataDir=/Users/jenkins/jenkins-slave/workspace/Lucene-Solr-trunk-MacOSX/solr/build/solr-core/test/J0/./org.apache.solr.cloud.CollectionsAPIDistributedZkTest-jetty2-1375403943833//nodes_used_collection_shard1_replica2/data/
   [junit4]   2> 2781483 T5189 oasc.JmxMonitoredMap.<init> JMX monitoring is enabled. Adding Solr mbeans to JMX Server: com.sun.jmx.mbeanserver.JmxMBeanServer@71268a13
   [junit4]   2> 2781478 T5159 oass.OpenExchangeRatesOrgProvider.reload Reloading exchange rates from open-exchange-rates.json
   [junit4]   2> 2781485 T5189 oasc.CachingDirectoryFactory.get return new directory for /Users/jenkins/jenkins-slave/workspace/Lucene-Solr-trunk-MacOSX/solr/build/solr-core/test/J0/./org.apache.solr.cloud.CollectionsAPIDistributedZkTest-jetty2-1375403943833//nodes_used_collection_shard1_replica2/data
   [junit4]   2> 2781487 T5189 oasc.SolrCore.getNewIndexDir New index directory detected: old=null new=/Users/jenkins/jenkins-slave/workspace/Lucene-Solr-trunk-MacOSX/solr/build/solr-core/test/J0/./org.apache.solr.cloud.CollectionsAPIDistributedZkTest-jetty2-1375403943833//nodes_used_collection_shard1_replica2/data/index/
   [junit4]   2> 2781488 T5189 oasc.SolrCore.initIndex WARN [nodes_used_collection_shard1_replica2] Solr index directory '/Users/jenkins/jenkins-slave/workspace/Lucene-Solr-trunk-MacOSX/solr/build/solr-core/test/J0/./org.apache.solr.cloud.CollectionsAPIDistributedZkTest-jetty2-1375403943833/nodes_used_collection_shard1_replica2/data/index' doesn't exist. Creating new index...
   [junit4]   2> 2781488 T5189 oasc.CachingDirectoryFactory.get return new directory for /Users/jenkins/jenkins-slave/workspace/Lucene-Solr-trunk-MacOSX/solr/build/solr-core/test/J0/./org.apache.solr.cloud.CollectionsAPIDistributedZkTest-jetty2-1375403943833//nodes_used_collection_shard1_replica2/data/index
   [junit4]   2> 2781485 T5219 oasc.CachingDirectoryFactory.get return new directory for /Users/jenkins/jenkins-slave/workspace/Lucene-Solr-trunk-MacOSX/solr/build/solr-core/test/J0/./org.apache.solr.cloud.CollectionsAPIDistributedZkTest-jetty4-1375403947904//nodes_used_collection_shard2_replica1/data
   [junit4]   2> 2781490 T5219 oasc.SolrCore.getNewIndexDir New index directory detected: old=null new=/Users/jenkins/jenkins-slave/workspace/Lucene-Solr-trunk-MacOSX/solr/build/solr-core/test/J0/./org.apache.solr.cloud.CollectionsAPIDistributedZkTest-jetty4-1375403947904//nodes_used_collection_shard2_replica1/data/index/
   [junit4]   2> 2781490 T5219 oasc.SolrCore.initIndex WARN [nodes_used_collection_shard2_replica1] Solr index directory '/Users/jenkins/jenkins-slave/workspace/Lucene-Solr-trunk-MacOSX/solr/build/solr-core/test/J0/./org.apache.solr.cloud.CollectionsAPIDistributedZkTest-jetty4-1375403947904/nodes_used_collection_shard2_replica1/data/index' doesn't exist. Creating new index...
   [junit4]   2> 2781491 T5219 oasc.CachingDirectoryFactory.get return new directory for /Users/jenkins/jenkins-slave/workspace/Lucene-Solr-trunk-MacOSX/solr/build/solr-core/test/J0/./org.apache.solr.cloud.CollectionsAPIDistributedZkTest-jetty4-1375403947904//nodes_used_collection_shard2_replica1/data/index
   [junit4]   2> 2781495 T5159 oass.OpenExchangeRatesOrgProvider$OpenExchangeRates.<init> WARN Unknown key IMPORTANT NOTE
   [junit4]   2> 2781496 T5159 oass.OpenExchangeRatesOrgProvider$OpenExchangeRates.<init> WARN Expected key, got STRING
   [junit4]   2> 2781497 T5159 oass.OpenExchangeRatesOrgProvider.reload Reloading exchange rates from open-exchange-rates.json
   [junit4]   2> 2781498 T5189 oasc.SolrDeletionPolicy.onCommit SolrDeletionPolicy.onCommit: commits: num=1
   [junit4]   2> 		commit{dir=MockDirWrapper(org.apache.lucene.store.RAMDirectory@3aa804d3 lockFactory=org.apache.lucene.store.NativeFSLockFactory@5ad109e5),segFN=segments_1,generation=1}
   [junit4]   2> 2781498 T5189 oasc.SolrDeletionPolicy.updateCommits newest commit generation = 1
   [junit4]   2> 2781502 T5219 oasc.SolrDeletionPolicy.onCommit SolrDeletionPolicy.onCommit: commits: num=1
   [junit4]   2> 		commit{dir=MockDirWrapper(org.apache.lucene.store.RAMDirectory@7c68531f lockFactory=org.apache.lucene.store.NativeFSLockFactory@75710cc4),segFN=segments_1,generation=1}
   [junit4]   2> 2781502 T5219 oasc.SolrDeletionPolicy.updateCommits newest commit generation = 1
   [junit4]   2> 2781504 T5159 oass.OpenExchangeRatesOrgProvider$OpenExchangeRates.<init> WARN Unknown key IMPORTANT NOTE
   [junit4]   2> 2781504 T5159 oass.OpenExchangeRatesOrgProvider$OpenExchangeRates.<init> WARN Expected key, got STRING
   [junit4]   2> 2781505 T5159 oasc.SolrCore.initDirectoryFactory org.apache.solr.core.MockDirectoryFactory
   [junit4]   2> 2781505 T5159 oasc.SolrCore.<init> [nodes_used_collection_shard2_replica2] Opening new SolrCore at /Users/jenkins/jenkins-slave/workspace/Lucene-Solr-trunk-MacOSX/solr/build/solr-core/test/J0/./org.apache.solr.cloud.CollectionsAPIDistributedZkTest-controljetty-1375403940531/nodes_used_collection_shard2_replica2/, dataDir=/Users/jenkins/jenkins-slave/workspace/Lucene-Solr-trunk-MacOSX/solr/build/solr-core/test/J0/./org.apache.solr.cloud.CollectionsAPIDistributedZkTest-controljetty-1375403940531//nodes_used_collection_shard2_replica2/data/
   [junit4]   2> 2781506 T5159 oasc.JmxMonitoredMap.<init> JMX monitoring is enabled. Adding Solr mbeans to JMX Server: com.sun.jmx.mbeanserver.JmxMBeanServer@71268a13
   [junit4]   2> 2781511 T5189 oasup.UpdateRequestProcessorChain.init inserting DistributedUpdateProcessorFactory into updateRequestProcessorChain "dedupe"
   [junit4]   2> 2781511 T5189 oasup.UpdateRequestProcessorChain.init inserting DistributedUpdateProcessorFactory into updateRequestProcessorChain "stored_sig"
   [junit4]   2> 2781512 T5189 oasup.UpdateRequestProcessorChain.init inserting DistributedUpdateProcessorFactory into updateRequestProcessorChain "distrib-dup-test-chain-implicit"
   [junit4]   2> 2781513 T5189 oasc.RequestHandlers.initHandlersFromConfig created standard: solr.StandardRequestHandler
   [junit4]   2> 2781515 T5159 oasc.CachingDirectoryFactory.get return new directory for /Users/jenkins/jenkins-slave/workspace/Lucene-Solr-trunk-MacOSX/solr/build/solr-core/test/J0/./org.apache.solr.cloud.CollectionsAPIDistributedZkTest-controljetty-1375403940531//nodes_used_collection_shard2_replica2/data
   [junit4]   2> 2781515 T5159 oasc.SolrCore.getNewIndexDir New index directory detected: old=null new=/Users/jenkins/jenkins-slave/workspace/Lucene-Solr-trunk-MacOSX/solr/build/solr-core/test/J0/./org.apache.solr.cloud.CollectionsAPIDistributedZkTest-controljetty-1375403940531//nodes_used_collection_shard2_replica2/data/index/
   [junit4]   2> 2781515 T5159 oasc.SolrCore.initIndex WARN [nodes_used_collection_shard2_replica2] Solr index directory '/Users/jenkins/jenkins-slave/workspace/Lucene-Solr-trunk-MacOSX/solr/build/solr-core/test/J0/./org.apache.solr.cloud.CollectionsAPIDistributedZkTest-controljetty-1375403940531/nodes_used_collection_shard2_replica2/data/index' doesn't exist. Creating new index...
   [junit4]   2> 2781516 T5159 oasc.CachingDirectoryFactory.get return new directory for /Users/jenkins/jenkins-slave/workspace/Lucene-Solr-trunk-MacOSX/solr/build/solr-core/test/J0/./org.apache.solr.cloud.CollectionsAPIDistributedZkTest-controljetty-1375403940531//nodes_used_collection_shard2_replica2/data/index
   [junit4]   2> 2781523 T5219 oasup.UpdateRequestProcessorChain.init inserting DistributedUpdateProcessorFactory into updateRequestProcessorChain "dedupe"
   [junit4]   2> 2781524 T5219 oasup.UpdateRequestProcessorChain.init inserting DistributedUpdateProcessorFactory into updateRequestProcessorChain "stored_sig"
   [junit4]   2> 2781525 T5219 oasup.UpdateRequestProcessorChain.init inserting DistributedUpdateProcessorFactory into updateRequestProcessorChain "distrib-dup-test-chain-implicit"
   [junit4]   2> 2781526 T5219 oasc.RequestHandlers.initHandlersFromConfig created standard: solr.StandardRequestHandler
   [junit4]   2> 2781530 T5219 oasc.RequestHandlers.initHandlersFromConfig created /get: solr.RealTimeGetHandler
   [junit4]   2> 2781530 T5219 oasc.RequestHandlers.initHandlersFromConfig adding lazy requestHandler: solr.ReplicationHandler
   [junit4]   2> 2781531 T5219 oasc.RequestHandlers.initHandlersFromConfig created /replication: solr.ReplicationHandler
   [junit4]   2> 2781527 T5189 oasc.RequestHandlers.initHandlersFromConfig created /get: solr.RealTimeGetHandler
   [junit4]   2> 2781532 T5189 oasc.RequestHandlers.initHandlersFromConfig adding lazy requestHandler: solr.ReplicationHandler
   [junit4]   2> 2781533 T5189 oasc.RequestHandlers.initHandlersFromConfig created /replication: solr.ReplicationHandler
   [junit4]   2> 2781534 T5189 oasc.RequestHandlers.initHandlersFromConfig created /update: solr.UpdateRequestHandler
   [junit4]   2> 2781532 T5219 oasc.RequestHandlers.initHandlersFromConfig created /update: solr.UpdateRequestHandler
   [junit4]   2> 2781536 T5219 oasc.RequestHandlers.initHandlersFromConfig created /admin/: org.apache.solr.handler.admin.AdminHandlers
   [junit4]   2> 2781535 T5189 oasc.RequestHandlers.initHandlersFromConfig created /admin/: org.apache.solr.handler.admin.AdminHandlers
   [junit4]   2> 2781548 T5175 oass.FileExchangeRateProvider.reload Reloading exchange rates from file currency.xml
   [junit4]   2> 2781555 T5159 oasc.SolrDeletionPolicy.onCommit SolrDeletionPolicy.onCommit: commits: num=1
   [junit4]   2> 		commit{dir=MockDirWrapper(org.apache.lucene.store.RAMDirectory@5983c6ea lockFactory=org.apache.lucene.store.NativeFSLockFactory@1f421cd1),segFN=segments_1,generation=1}
   [junit4]   2> 2781557 T5159 oasc.SolrDeletionPolicy.updateCommits newest commit generation = 1
   [junit4]   2> 2781561 T5189 oashl.XMLLoader.init xsltCacheLifetimeSeconds=60
   [junit4]   2> 2781561 T5219 oashl.XMLLoader.init xsltCacheLifetimeSeconds=60
   [junit4]   2> 2781576 T5159 oasup.UpdateRequestProcessorChain.init inserting DistributedUpdateProcessorFactory into updateRequestProcessorChain "dedupe"
   [junit4]   2> 2781577 T5159 oasup.UpdateRequestProcessorChain.init inserting DistributedUpdateProcessorFactory into updateRequestProcessorChain "stored_sig"
   [junit4]   2> 2781578 T5159 oasup.UpdateRequestProcessorChain.init inserting DistributedUpdateProcessorFactory into updateRequestProcessorChain "distrib-dup-test-chain-implicit"
   [junit4]   2> 2781579 T5159 oasc.RequestHandlers.initHandlersFromConfig created standard: solr.StandardRequestHandler
   [junit4]   2> 2781588 T5175 oass.FileExchangeRateProvider.reload Reloading exchange rates from file currency.xml
   [junit4]   2> 2781590 T5159 oasc.RequestHandlers.initHandlersFromConfig created /get: solr.RealTimeGetHandler
   [junit4]   2> 2781590 T5159 oasc.RequestHandlers.initHandlersFromConfig adding lazy requestHandler: solr.ReplicationHandler
   [junit4]   2> 2781592 T5159 oasc.RequestHandlers.initHandlersFromConfig created /replication: solr.ReplicationHandler
   [junit4]   2> 2781593 T5159 oasc.RequestHandlers.initHandlersFromConfig created /update: solr.UpdateRequestHandler
   [junit4]   2> 2781593 T5159 oasc.RequestHandlers.initHandlersFromConfig created /admin/: org.apache.solr.handler.admin.AdminHandlers
   [junit4]   2> 2781599 T5219 oass.SolrIndexSearcher.<init> Opening Searcher@3048afa1 main
   [junit4]   2> 2781601 T5219 oasu.CommitTracker.<init> Hard AutoCommit: disabled
   [junit4]   2> 2781602 T5219 oasu.CommitTracker.<init> Soft AutoCommit: disabled
   [junit4]   2> 2781612 T5229 oasc.SolrCore.registerSearcher [nodes_used_collection_shard2_replica1] Registered new searcher Searcher@3048afa1 main{StandardDirectoryReader(segments_1:1)}
   [junit4]   2> 2781613 T5159 oashl.XMLLoader.init xsltCacheLifetimeSeconds=60
   [junit4]   2> 2781615 T5219 oasc.CoreContainer.registerCore registering core: nodes_used_collection_shard2_replica1
   [junit4]   2> 2781616 T5219 oasc.ZkController.register Register replica - core:nodes_used_collection_shard2_replica1 address:http://127.0.0.1:50916 collection:nodes_used_collection shard:shard2
   [junit4]   2> 2781616 T5219 oascsi.HttpClientUtil.createClient Creating new http client, config:maxConnections=10000&maxConnectionsPerHost=20&connTimeout=15000&socketTimeout=30000&retry=false
   [junit4]   2> 2781617 T5175 oass.OpenExchangeRatesOrgProvider.reload Reloading exchange rates from open-exchange-rates.json
   [junit4]   2> 2781631 T5159 oass.SolrIndexSearcher.<init> Opening Searcher@6c011ce4 main
   [junit4]   2> 2781633 T5159 oasu.CommitTracker.<init> Hard AutoCommit: disabled
   [junit4]   2> 2781633 T5159 oasu.CommitTracker.<init> Soft AutoCommit: disabled
   [junit4]   2> 2781641 T5189 oass.SolrIndexSearcher.<init> Opening Searcher@63ccae7e main
   [junit4]   2> 2781643 T5189 oasu.CommitTracker.<init> Hard AutoCommit: disabled
   [junit4]   2> 2781644 T5189 oasu.CommitTracker.<init> Soft AutoCommit: disabled
   [junit4]   2> 2781648 T5230 oasc.SolrCore.registerSearcher [nodes_used_collection_shard1_replica2] Registered new searcher Searcher@63ccae7e main{StandardDirectoryReader(segments_1:1)}
   [junit4]   2> 2781643 T5175 oass.OpenExchangeRatesOrgProvider$OpenExchangeRates.<init> WARN Unknown key IMPORTANT NOTE
   [junit4]   2> 2781651 T5175 oass.OpenExchangeRatesOrgProvider$OpenExchangeRates.<init> WARN Expected key, got STRING
   [junit4]   2> 2781651 T5231 oasc.SolrCore.registerSearcher [nodes_used_collection_shard2_replica2] Registered new searcher Searcher@6c011ce4 main{StandardDirectoryReader(segments_1:1)}
   [junit4]   2> 2781653 T5175 oass.OpenExchangeRatesOrgProvider.reload Reloading exchange rates from open-exchange-rates.json
   [junit4]   2> 2781653 T5189 oasc.CoreContainer.registerCore registering core: nodes_used_collection_shard1_replica2
   [junit4]   2> 2781654 T5189 oasc.ZkController.register Register replica - core:nodes_used_collection_shard1_replica2 address:http://127.0.0.1:50910 collection:nodes_used_collection shard:shard1
   [junit4]   2> 2781654 T5189 oascsi.HttpClientUtil.createClient Creating new http client, config:maxConnections=10000&maxConnectionsPerHost=20&connTimeout=15000&socketTimeout=30000&retry=false
   [junit4]   2> 2781664 T5159 oasc.CoreContainer.registerCore registering core: nodes_used_collection_shard2_replica2
   [junit4]   2> 2781665 T5159 oasc.ZkController.register Register replica - core:nodes_used_collection_shard2_replica2 address:http://127.0.0.1:50903 collection:nodes_used_collection shard:shard2
   [junit4]   2> 2781665 T5159 oascsi.HttpClientUtil.createClient Creating new http client, config:maxConnections=10000&maxConnectionsPerHost=20&connTimeout=15000&socketTimeout=30000&retry=false
   [junit4]   2> 2781681 T5189 oascc.SolrZkClient.makePath makePath: /collections/nodes_used_collection/leader_elect/shard1/election
   [junit4]   2> 2781683 T5175 oass.OpenExchangeRatesOrgProvider$OpenExchangeRates.<init> WARN Unknown key IMPORTANT NOTE
   [junit4]   2> 2781683 T5175 oass.OpenExchangeRatesOrgProvider$OpenExchangeRates.<init> WARN Expected key, got STRING
   [junit4]   2> 2781684 T5175 oasc.SolrCore.initDirectoryFactory org.apache.solr.core.MockDirectoryFactory
   [junit4]   2> 2781684 T5175 oasc.SolrCore.<init> [nodes_used_collection_shard1_replica1] Opening new SolrCore at /Users/jenkins/jenkins-slave/workspace/Lucene-Solr-trunk-MacOSX/solr/build/solr-core/test/J0/./org.apache.solr.cloud.CollectionsAPIDistributedZkTest-jetty1-1375403941674/nodes_used_collection_shard1_replica1/, dataDir=/Users/jenkins/jenkins-slave/workspace/Lucene-Solr-trunk-MacOSX/solr/build/solr-core/test/J0/./org.apache.solr.cloud.CollectionsAPIDistributedZkTest-jetty1-1375403941674//nodes_used_collection_shard1_replica1/data/
   [junit4]   2> 2781685 T5175 oasc.JmxMonitoredMap.<init> JMX monitoring is enabled. Adding Solr mbeans to JMX Server: com.sun.jmx.mbeanserver.JmxMBeanServer@71268a13
   [junit4]   2> 2781686 T5219 oascc.SolrZkClient.makePath makePath: /collections/nodes_used_collection/leader_elect/shard2/election
   [junit4]   2> 2781688 T5175 oasc.CachingDirectoryFactory.get return new directory for /Users/jenkins/jenkins-slave/workspace/Lucene-Solr-trunk-MacOSX/solr/build/solr-core/test/J0/./org.apache.solr.cloud.CollectionsAPIDistributedZkTest-jetty1-1375403941674//nodes_used_collection_shard1_replica1/data
   [junit4]   2> 2781695 T5175 oasc.SolrCore.getNewIndexDir New index directory detected: old=null new=/Users/jenkins/jenkins-slave/workspace/Lucene-Solr-trunk-MacOSX/solr/build/solr-core/test/J0/./org.apache.solr.cloud.CollectionsAPIDistributedZkTest-jetty1-1375403941674//nodes_used_collection_shard1_replica1/data/index/
   [junit4]   2> 2781695 T5175 oasc.SolrCore.initIndex WARN [nodes_used_collection_shard1_replica1] Solr index directory '/Users/jenkins/jenkins-slave/workspace/Lucene-Solr-trunk-MacOSX/solr/build/solr-core/test/J0/./org.apache.solr.cloud.CollectionsAPIDistributedZkTest-jetty1-1375403941674/nodes_used_collection_shard1_replica1/data/index' doesn't exist. Creating new index...
   [junit4]   2> 2781696 T5175 oasc.CachingDirectoryFactory.get return new directory for /Users/jenkins/jenkins-slave/workspace/Lucene-Solr-trunk-MacOSX/solr/build/solr-core/test/J0/./org.apache.solr.cloud.CollectionsAPIDistributedZkTest-jetty1-1375403941674//nodes_used_collection_shard1_replica1/data/index
   [junit4]   2> 2781690 T5159 oascc.SolrZkClient.makePath makePath: /collections/nodes_used_collection/leader_elect/shard2/election
   [junit4]   2> 2781715 T5175 oasc.SolrDeletionPolicy.onCommit SolrDeletionPolicy.onCommit: commits: num=1
   [junit4]   2> 		commit{dir=MockDirWrapper(org.apache.lucene.store.RAMDirectory@5d7aea7d lockFactory=org.apache.lucene.store.NativeFSLockFactory@18ba13ca),segFN=segments_1,generation=1}
   [junit4]   2> 2781716 T5175 oasc.SolrDeletionPolicy.updateCommits newest commit generation = 1
   [junit4]   2> 2781724 T5175 oasup.UpdateRequestProcessorChain.init inserting DistributedUpdateProcessorFactory into updateRequestProcessorChain "dedupe"
   [junit4]   2> 2781725 T5175 oasup.UpdateRequestProcessorChain.init inserting DistributedUpdateProcessorFactory into updateRequestProcessorChain "stored_sig"
   [junit4]   2> 2781727 T5175 oasup.UpdateRequestProcessorChain.init inserting DistributedUpdateProcessorFactory into updateRequestProcessorChain "distrib-dup-test-chain-implicit"
   [junit4]   2> 2781729 T5175 oasc.RequestHandlers.initHandlersFromConfig created standard: solr.StandardRequestHandler
   [junit4]   2> 2781730 T5175 oasc.RequestHandlers.initHandlersFromConfig created /get: solr.RealTimeGetHandler
   [junit4]   2> 2781730 T5175 oasc.RequestHandlers.initHandlersFromConfig adding lazy requestHandler: solr.ReplicationHandler
   [junit4]   2> 2781732 T5175 oasc.RequestHandlers.initHandlersFromConfig created /replication: solr.ReplicationHandler
   [junit4]   2> 2781733 T5175 oasc.RequestHandlers.initHandlersFromConfig created /update: solr.UpdateRequestHandler
   [junit4]   2> 2781737 T5175 oasc.RequestHandlers.initHandlersFromConfig created /admin/: org.apache.solr.handler.admin.AdminHandlers
   [junit4]   2> 2781742 T5219 oasc.ShardLeaderElectionContext.runLeaderProcess Running the leader process for shard shard2
   [junit4]   2> 2781759 T5189 oasc.ShardLeaderElectionContext.runLeaderProcess Running the leader process for shard shard1
   [junit4]   2> 2781761 T5175 oashl.XMLLoader.init xsltCacheLifetimeSeconds=60
   [junit4]   2> 2781763 T5219 oasc.ShardLeaderElectionContext.waitForReplicasToComeUp Enough replicas found to continue.
   [junit4]   2> 2781764 T5219 oasc.ShardLeaderElectionContext.runLeaderProcess I may be the new leader - try and sync
   [junit4]   2> 2781764 T5219 oasc.SyncStrategy.sync Sync replicas to http://127.0.0.1:50916/nodes_used_collection_shard2_replica1/
   [junit4]   2> 2781764 T5219 oasu.PeerSync.sync PeerSync: core=nodes_used_collection_shard2_replica1 url=http://127.0.0.1:50916 START replicas=[http://127.0.0.1:50903/nodes_used_collection_shard2_replica2/] nUpdates=100
   [junit4]   2> 2781774 T5219 oasu.PeerSync.sync PeerSync: core=nodes_used_collection_shard2_replica1 url=http://127.0.0.1:50916 DONE.  We have no versions.  sync failed.
   [junit4]   2> 2781784 T5219 oasc.SyncStrategy.syncReplicas Leader's attempt to sync with shard failed, moving to the next candidate
   [junit4]   2> 2781785 T5219 oasc.ShardLeaderElectionContext.runLeaderProcess We failed sync, but we have no versions - we can't sync in that case - we were active before, so become leader anyway
   [junit4]   2> 2781785 T5219 oasc.ShardLeaderElectionContext.runLeaderProcess I am the new leader: http://127.0.0.1:50916/nodes_used_collection_shard2_replica1/ shard2
   [junit4]   2> 2781786 T5219 oascc.SolrZkClient.makePath makePath: /collections/nodes_used_collection/leaders/shard2
   [junit4]   2> 2781786 T5175 oass.SolrIndexSearcher.<init> Opening Searcher@40168eb4 main
   [junit4]   2> 2781788 T5175 oasu.CommitTracker.<init> Hard AutoCommit: disabled
   [junit4]   2> 2781789 T5175 oasu.CommitTracker.<init> Soft AutoCommit: disabled
   [junit4]   2> 2781793 T5233 oasc.SolrCore.registerSearcher [nodes_used_collection_shard1_replica1] Registered new searcher Searcher@40168eb4 main{StandardDirectoryReader(segments_1:1)}
   [junit4]   2> 2781783 T5189 oasc.ShardLeaderElectionContext.waitForReplicasToComeUp Waiting until we see more replicas up for shard shard1: total=2 found=1 timeoutin=179999
   [junit4]   2> ASYNC  NEW_CORE C6500 name=nodes_used_collection_shard2_replica2 org.apache.solr.core.SolrCore@5b7fe5f3 url=http://127.0.0.1:50903/nodes_used_collection_shard2_replica2 node=127.0.0.1:50903_ C6500_STATE=coll:nodes_used_collection core:nodes_used_collection_shard2_replica2 props:{state=down, core=nodes_used_collection_shard2_replica2, node_name=127.0.0.1:50903_, base_url=http://127.0.0.1:50903}
   [junit4]   2> 2781797 T5157 C6500 P50903 oasc.SolrCore.execute [nodes_used_collection_shard2_replica2] webapp= path=/get params={getVersions=100&distrib=false&wt=javabin&qt=/get&version=2} status=0 QTime=4 
   [junit4]   2> 2781797 T5175 oasc.CoreContainer.registerCore registering core: nodes_used_collection_shard1_replica1
   [junit4]   2> 2781798 T5175 oasc.ZkController.register Register replica - core:nodes_used_collection_shard1_replica1 address:http://127.0.0.1:50907 collection:nodes_used_collection shard:shard1
   [junit4]   2> 2781800 T5175 oascsi.HttpClientUtil.createClient Creating new http client, config:maxConnections=10000&maxConnectionsPerHost=20&connTimeout=15000&socketTimeout=30000&retry=false
   [junit4]   2> 27822

[...truncated too long message...]

-MacOSX/solr/build/solr-core/test/J0/./org.apache.solr.cloud.CollectionsAPIDistributedZkTest-jetty4-1375403947904//new_implicit_coll_1_c_replica2/data/index;done=false>>]
   [junit4]   2> 3022898 T5141 oasc.CachingDirectoryFactory.close Closing directory: /Users/jenkins/jenkins-slave/workspace/Lucene-Solr-trunk-MacOSX/solr/build/solr-core/test/J0/./org.apache.solr.cloud.CollectionsAPIDistributedZkTest-jetty4-1375403947904//new_implicit_coll_1_c_replica2/data/index
   [junit4]   2> 3022914 T5223 oascc.ZkStateReader$2.process A cluster state change: WatchedEvent state:SyncConnected type:NodeChildrenChanged path:/live_nodes, has occurred - updating... (live nodes size: 1)
   [junit4]   2> 3022915 T5223 oascc.ZkStateReader$2.process WARN ZooKeeper watch triggered, but Solr cannot talk to ZK
   [junit4]   2> 3022915 T5223 oascc.ZkStateReader$3.process WARN ZooKeeper watch triggered, but Solr cannot talk to ZK
   [junit4]   2> 3022932 T5141 oejsh.ContextHandler.doStop stopped o.e.j.s.ServletContextHandler{/,null}
   [junit4]   2> 3022991 T5141 oas.SolrTestCaseJ4.tearDown ###Ending testDistribSearch
   [junit4]   2> 3022996 T5141 oasc.ZkTestServer.send4LetterWord connecting to 127.0.0.1:50900 50900
   [junit4]   1> client port:0.0.0.0/0.0.0.0:0
   [junit4]   2> NOTE: reproduce with: ant test  -Dtestcase=CollectionsAPIDistributedZkTest -Dtests.method=testDistribSearch -Dtests.seed=8069EA96999D7486 -Dtests.slow=true -Dtests.locale=it_CH -Dtests.timezone=Africa/Brazzaville -Dtests.file.encoding=US-ASCII
   [junit4] ERROR    257s | CollectionsAPIDistributedZkTest.testDistribSearch <<<
   [junit4]    > Throwable #1: org.apache.solr.client.solrj.SolrServerException: Server refused connection at: http://127.0.0.1:50910
   [junit4]    > 	at __randomizedtesting.SeedInfo.seed([8069EA96999D7486:18F648EEEC214BA]:0)
   [junit4]    > 	at org.apache.solr.client.solrj.impl.HttpSolrServer.request(HttpSolrServer.java:428)
   [junit4]    > 	at org.apache.solr.client.solrj.impl.HttpSolrServer.request(HttpSolrServer.java:180)
   [junit4]    > 	at org.apache.solr.cloud.AbstractFullDistribZkTestBase.createCollection(AbstractFullDistribZkTestBase.java:1535)
   [junit4]    > 	at org.apache.solr.cloud.CollectionsAPIDistributedZkTest.testCustomCollectionsAPI(CollectionsAPIDistributedZkTest.java:677)
   [junit4]    > 	at org.apache.solr.cloud.CollectionsAPIDistributedZkTest.doTest(CollectionsAPIDistributedZkTest.java:159)
   [junit4]    > 	at org.apache.solr.BaseDistributedSearchTestCase.testDistribSearch(BaseDistributedSearchTestCase.java:835)
   [junit4]    > 	at java.lang.Thread.run(Thread.java:724)
   [junit4]    > Caused by: org.apache.http.conn.HttpHostConnectException: Connection to http://127.0.0.1:50910 refused
   [junit4]    > 	at org.apache.http.impl.conn.DefaultClientConnectionOperator.openConnection(DefaultClientConnectionOperator.java:190)
   [junit4]    > 	at org.apache.http.impl.conn.ManagedClientConnectionImpl.open(ManagedClientConnectionImpl.java:294)
   [junit4]    > 	at org.apache.http.impl.client.DefaultRequestDirector.tryConnect(DefaultRequestDirector.java:645)
   [junit4]    > 	at org.apache.http.impl.client.DefaultRequestDirector.execute(DefaultRequestDirector.java:480)
   [junit4]    > 	at org.apache.http.impl.client.AbstractHttpClient.execute(AbstractHttpClient.java:906)
   [junit4]    > 	at org.apache.http.impl.client.AbstractHttpClient.execute(AbstractHttpClient.java:805)
   [junit4]    > 	at org.apache.http.impl.client.AbstractHttpClient.execute(AbstractHttpClient.java:784)
   [junit4]    > 	at org.apache.solr.client.solrj.impl.HttpSolrServer.request(HttpSolrServer.java:365)
   [junit4]    > 	... 45 more
   [junit4]    > Caused by: java.net.ConnectException: Connection refused
   [junit4]    > 	at java.net.PlainSocketImpl.socketConnect(Native Method)
   [junit4]    > 	at java.net.AbstractPlainSocketImpl.doConnect(AbstractPlainSocketImpl.java:339)
   [junit4]    > 	at java.net.AbstractPlainSocketImpl.connectToAddress(AbstractPlainSocketImpl.java:200)
   [junit4]    > 	at java.net.AbstractPlainSocketImpl.connect(AbstractPlainSocketImpl.java:182)
   [junit4]    > 	at java.net.SocksSocketImpl.connect(SocksSocketImpl.java:392)
   [junit4]    > 	at java.net.Socket.connect(Socket.java:579)
   [junit4]    > 	at org.apache.http.conn.scheme.PlainSocketFactory.connectSocket(PlainSocketFactory.java:127)
   [junit4]    > 	at org.apache.http.impl.conn.DefaultClientConnectionOperator.openConnection(DefaultClientConnectionOperator.java:180)
   [junit4]    > 	... 52 more
   [junit4]   2> 3023156 T5141 oas.SolrTestCaseJ4.deleteCore ###deleteCore
   [junit4]   2> 257219 T5140 ccr.ThreadLeakControl.checkThreadLeaks WARNING Will linger awaiting termination of 1 leaked thread(s).
   [junit4]   2> NOTE: test params are: codec=CheapBastard, sim=RandomSimilarityProvider(queryNorm=true,coord=no): {}, locale=it_CH, timezone=Africa/Brazzaville
   [junit4]   2> NOTE: Mac OS X 10.8.4 x86_64/Oracle Corporation 1.7.0_25 (64-bit)/cpus=2,threads=3,free=181856832,total=519438336
   [junit4]   2> NOTE: All tests run in this JVM: [StatsComponentTest, CircularListTest, TestBinaryField, TestDefaultSearchFieldResource, JsonLoaderTest, ZkSolrClientTest, TestSolrIndexConfig, PreAnalyzedFieldTest, HdfsBasicDistributedZkTest, LeaderElectionTest, DocValuesMultiTest, SolrIndexSplitterTest, NoCacheHeaderTest, TermVectorComponentTest, SimpleFacetsTest, TestMaxScoreQueryParser, StatelessScriptUpdateProcessorFactoryTest, MultiTermTest, RecoveryZkTest, TestLazyCores, SignatureUpdateProcessorFactoryTest, TestManagedSchemaFieldResource, TestBM25SimilarityFactory, TestShardHandlerFactory, URLClassifyProcessorTest, PreAnalyzedUpdateProcessorTest, TestFieldTypeCollectionResource, TestSystemIdResolver, NotRequiredUniqueKeyTest, HardAutoCommitTest, FullSolrCloudDistribCmdsTest, SortByFunctionTest, TestManagedSchema, BlockCacheTest, TestIndexSearcher, HdfsLockFactoryTest, PrimitiveFieldTypeTest, PingRequestHandlerTest, ExternalFileFieldSortTest, UniqFieldsUpdateProcessorFactoryTest, FieldAnalysisRequestHandlerTest, CurrencyFieldXmlFileTest, TestPerFieldSimilarity, ChaosMonkeyNothingIsSafeTest, TestSearchPerf, UUIDFieldTest, TestSolrQueryParserResource, BinaryUpdateRequestHandlerTest, TestPHPSerializedResponseWriter, ShardSplitTest, DistanceFunctionTest, SolrInfoMBeanTest, XsltUpdateRequestHandlerTest, TestLFUCache, TestUtils, SuggesterWFSTTest, TestLRUCache, ClusterStateTest, HighlighterConfigTest, TestReload, SolrCmdDistributorTest, ZkCLITest, ReturnFieldsTest, TestDynamicFieldResource, DocValuesTest, TestPseudoReturnFields, HdfsRecoveryZkTest, AddSchemaFieldsUpdateProcessorFactoryTest, TestJmxIntegration, ShowFileRequestHandlerTest, IndexReaderFactoryTest, SolrRequestParserTest, StandardRequestHandlerTest, BadComponentTest, IndexSchemaRuntimeFieldTest, CoreAdminCreateDiscoverTest, DirectUpdateHandlerOptimizeTest, BadCopyFieldTest, HighlighterTest, SyncSliceTest, CSVRequestHandlerTest, TestSolrQueryParserDefaultOperatorResource, FileBasedSpellCheckerTest, TestStressRecovery, TestSolrQueryParser, DebugComponentTest, TestAtomicUpdateErrorCases, TestJoin, TestDFRSimilarityFactory, SuggesterTest, TermVectorComponentDistributedTest, CoreMergeIndexesAdminHandlerTest, TestCopyFieldCollectionResource, TestQueryUtils, TestFunctionQuery, TestRecovery, ShardRoutingCustomTest, TestDynamicFieldCollectionResource, TestGroupingSearch, RegexBoostProcessorTest, TestSurroundQueryParser, NumericFieldsTest, TestRangeQuery, DeleteShardTest, DirectSolrConnectionTest, WordBreakSolrSpellCheckerTest, FieldMutatingUpdateProcessorTest, AliasIntegrationTest, TestRTGBase, TestStressReorder, TestStressVersions, DateMathParserTest, SolrCoreTest, TestFastOutputStream, UpdateParamsTest, AnalysisAfterCoreReloadTest, TestElisionMultitermQuery, BlockDirectoryTest, BasicZkTest, TestRemoteStreaming, TestWordDelimiterFilterFactory, AlternateDirectoryTest, TermsComponentTest, TestPhraseSuggestions, LukeRequestHandlerTest, PolyFieldTest, SolrTestCaseJ4Test, ShardRoutingTest, FastVectorHighlighterTest, ConvertedLegacyTest, TestFastWriter, TestRandomFaceting, SampleTest, TestStressLucene, TestSolrJ, DOMUtilTest, SolrPluginUtilsTest, TestCharFilters, OpenCloseCoreStressTest, ResponseLogComponentTest, DirectUpdateHandlerTest, TestDocSet, TestFiltering, OverseerTest, DateFieldTest, ScriptEngineTest, IndexBasedSpellCheckerTest, TestCoreContainer, HdfsBasicDistributedZk2Test, TestPropInject, SliceStateTest, BasicDistributedZkTest, ChaosMonkeySafeLeaderTest, BasicDistributedZk2Test, UnloadDistributedZkTest, CollectionsAPIDistributedZkTest]
   [junit4] Completed in 258.06s, 1 test, 1 error <<< FAILURES!

[...truncated 477 lines...]
BUILD FAILED
/Users/jenkins/jenkins-slave/workspace/Lucene-Solr-trunk-MacOSX/build.xml:389: The following error occurred while executing this line:
/Users/jenkins/jenkins-slave/workspace/Lucene-Solr-trunk-MacOSX/build.xml:369: The following error occurred while executing this line:
/Users/jenkins/jenkins-slave/workspace/Lucene-Solr-trunk-MacOSX/build.xml:39: The following error occurred while executing this line:
/Users/jenkins/jenkins-slave/workspace/Lucene-Solr-trunk-MacOSX/solr/build.xml:181: The following error occurred while executing this line:
/Users/jenkins/jenkins-slave/workspace/Lucene-Solr-trunk-MacOSX/solr/common-build.xml:449: The following error occurred while executing this line:
/Users/jenkins/jenkins-slave/workspace/Lucene-Solr-trunk-MacOSX/lucene/common-build.xml:1230: The following error occurred while executing this line:
/Users/jenkins/jenkins-slave/workspace/Lucene-Solr-trunk-MacOSX/lucene/common-build.xml:873: There were test failures: 320 suites, 1347 tests, 1 error, 39 ignored (5 assumptions)

Total time: 109 minutes 48 seconds
Build step 'Invoke Ant' marked build as failure
Description set: Java: 64bit/jdk1.7.0 -XX:-UseCompressedOops -XX:+UseConcMarkSweepGC
Archiving artifacts
Recording test results
Email was triggered for: Failure
Sending email for trigger: Failure



Mime
View raw message