lucene-dev mailing list archives

Site index · List index
Message view « Date » · « Thread »
Top « Date » · « Thread »
From Policeman Jenkins Server <jenk...@thetaphi.de>
Subject [JENKINS] Lucene-Solr-trunk-MacOSX (64bit/jdk1.7.0) - Build # 702 - Still Failing!
Date Sat, 03 Aug 2013 14:55:20 GMT
Build: http://jenkins.thetaphi.de/job/Lucene-Solr-trunk-MacOSX/702/
Java: 64bit/jdk1.7.0 -XX:-UseCompressedOops -XX:+UseParallelGC

1 tests failed.
FAILED:  org.apache.solr.cloud.CollectionsAPIDistributedZkTest.testDistribSearch

Error Message:
Server refused connection at: http://127.0.0.1:49811

Stack Trace:
org.apache.solr.client.solrj.SolrServerException: Server refused connection at: http://127.0.0.1:49811
	at __randomizedtesting.SeedInfo.seed([D249A40DB536FF7B:53AF2A15C2699F47]:0)
	at org.apache.solr.client.solrj.impl.HttpSolrServer.request(HttpSolrServer.java:428)
	at org.apache.solr.client.solrj.impl.HttpSolrServer.request(HttpSolrServer.java:180)
	at org.apache.solr.cloud.CollectionsAPIDistributedZkTest.testCustomCollectionsAPI(CollectionsAPIDistributedZkTest.java:764)
	at org.apache.solr.cloud.CollectionsAPIDistributedZkTest.doTest(CollectionsAPIDistributedZkTest.java:159)
	at org.apache.solr.BaseDistributedSearchTestCase.testDistribSearch(BaseDistributedSearchTestCase.java:835)
	at sun.reflect.NativeMethodAccessorImpl.invoke0(Native Method)
	at sun.reflect.NativeMethodAccessorImpl.invoke(NativeMethodAccessorImpl.java:57)
	at sun.reflect.DelegatingMethodAccessorImpl.invoke(DelegatingMethodAccessorImpl.java:43)
	at java.lang.reflect.Method.invoke(Method.java:606)
	at com.carrotsearch.randomizedtesting.RandomizedRunner.invoke(RandomizedRunner.java:1559)
	at com.carrotsearch.randomizedtesting.RandomizedRunner.access$600(RandomizedRunner.java:79)
	at com.carrotsearch.randomizedtesting.RandomizedRunner$6.evaluate(RandomizedRunner.java:737)
	at com.carrotsearch.randomizedtesting.RandomizedRunner$7.evaluate(RandomizedRunner.java:773)
	at com.carrotsearch.randomizedtesting.RandomizedRunner$8.evaluate(RandomizedRunner.java:787)
	at com.carrotsearch.randomizedtesting.rules.SystemPropertiesRestoreRule$1.evaluate(SystemPropertiesRestoreRule.java:53)
	at org.apache.lucene.util.TestRuleSetupTeardownChained$1.evaluate(TestRuleSetupTeardownChained.java:50)
	at org.apache.lucene.util.TestRuleFieldCacheSanity$1.evaluate(TestRuleFieldCacheSanity.java:51)
	at org.apache.lucene.util.AbstractBeforeAfterRule$1.evaluate(AbstractBeforeAfterRule.java:46)
	at com.carrotsearch.randomizedtesting.rules.SystemPropertiesInvariantRule$1.evaluate(SystemPropertiesInvariantRule.java:55)
	at org.apache.lucene.util.TestRuleThreadAndTestName$1.evaluate(TestRuleThreadAndTestName.java:49)
	at org.apache.lucene.util.TestRuleIgnoreAfterMaxFailures$1.evaluate(TestRuleIgnoreAfterMaxFailures.java:70)
	at org.apache.lucene.util.TestRuleMarkFailure$1.evaluate(TestRuleMarkFailure.java:48)
	at com.carrotsearch.randomizedtesting.rules.StatementAdapter.evaluate(StatementAdapter.java:36)
	at com.carrotsearch.randomizedtesting.ThreadLeakControl$StatementRunner.run(ThreadLeakControl.java:358)
	at com.carrotsearch.randomizedtesting.ThreadLeakControl.forkTimeoutingTask(ThreadLeakControl.java:782)
	at com.carrotsearch.randomizedtesting.ThreadLeakControl$3.evaluate(ThreadLeakControl.java:442)
	at com.carrotsearch.randomizedtesting.RandomizedRunner.runSingleTest(RandomizedRunner.java:746)
	at com.carrotsearch.randomizedtesting.RandomizedRunner$3.evaluate(RandomizedRunner.java:648)
	at com.carrotsearch.randomizedtesting.RandomizedRunner$4.evaluate(RandomizedRunner.java:682)
	at com.carrotsearch.randomizedtesting.RandomizedRunner$5.evaluate(RandomizedRunner.java:693)
	at com.carrotsearch.randomizedtesting.rules.StatementAdapter.evaluate(StatementAdapter.java:36)
	at com.carrotsearch.randomizedtesting.rules.SystemPropertiesRestoreRule$1.evaluate(SystemPropertiesRestoreRule.java:53)
	at org.apache.lucene.util.AbstractBeforeAfterRule$1.evaluate(AbstractBeforeAfterRule.java:46)
	at org.apache.lucene.util.TestRuleStoreClassName$1.evaluate(TestRuleStoreClassName.java:42)
	at com.carrotsearch.randomizedtesting.rules.SystemPropertiesInvariantRule$1.evaluate(SystemPropertiesInvariantRule.java:55)
	at com.carrotsearch.randomizedtesting.rules.NoShadowingOrOverridesOnMethodsRule$1.evaluate(NoShadowingOrOverridesOnMethodsRule.java:39)
	at com.carrotsearch.randomizedtesting.rules.NoShadowingOrOverridesOnMethodsRule$1.evaluate(NoShadowingOrOverridesOnMethodsRule.java:39)
	at com.carrotsearch.randomizedtesting.rules.StatementAdapter.evaluate(StatementAdapter.java:36)
	at org.apache.lucene.util.TestRuleAssertionsRequired$1.evaluate(TestRuleAssertionsRequired.java:43)
	at org.apache.lucene.util.TestRuleMarkFailure$1.evaluate(TestRuleMarkFailure.java:48)
	at org.apache.lucene.util.TestRuleIgnoreAfterMaxFailures$1.evaluate(TestRuleIgnoreAfterMaxFailures.java:70)
	at org.apache.lucene.util.TestRuleIgnoreTestSuites$1.evaluate(TestRuleIgnoreTestSuites.java:55)
	at com.carrotsearch.randomizedtesting.rules.StatementAdapter.evaluate(StatementAdapter.java:36)
	at com.carrotsearch.randomizedtesting.ThreadLeakControl$StatementRunner.run(ThreadLeakControl.java:358)
	at java.lang.Thread.run(Thread.java:724)
Caused by: org.apache.http.conn.HttpHostConnectException: Connection to http://127.0.0.1:49811 refused
	at org.apache.http.impl.conn.DefaultClientConnectionOperator.openConnection(DefaultClientConnectionOperator.java:190)
	at org.apache.http.impl.conn.ManagedClientConnectionImpl.open(ManagedClientConnectionImpl.java:294)
	at org.apache.http.impl.client.DefaultRequestDirector.tryConnect(DefaultRequestDirector.java:645)
	at org.apache.http.impl.client.DefaultRequestDirector.execute(DefaultRequestDirector.java:480)
	at org.apache.http.impl.client.AbstractHttpClient.execute(AbstractHttpClient.java:906)
	at org.apache.http.impl.client.AbstractHttpClient.execute(AbstractHttpClient.java:805)
	at org.apache.http.impl.client.AbstractHttpClient.execute(AbstractHttpClient.java:784)
	at org.apache.solr.client.solrj.impl.HttpSolrServer.request(HttpSolrServer.java:365)
	... 44 more
Caused by: java.net.ConnectException: Connection refused
	at java.net.PlainSocketImpl.socketConnect(Native Method)
	at java.net.AbstractPlainSocketImpl.doConnect(AbstractPlainSocketImpl.java:339)
	at java.net.AbstractPlainSocketImpl.connectToAddress(AbstractPlainSocketImpl.java:200)
	at java.net.AbstractPlainSocketImpl.connect(AbstractPlainSocketImpl.java:182)
	at java.net.SocksSocketImpl.connect(SocksSocketImpl.java:392)
	at java.net.Socket.connect(Socket.java:579)
	at org.apache.http.conn.scheme.PlainSocketFactory.connectSocket(PlainSocketFactory.java:127)
	at org.apache.http.impl.conn.DefaultClientConnectionOperator.openConnection(DefaultClientConnectionOperator.java:180)
	... 51 more




Build Log:
[...truncated 9488 lines...]
   [junit4] Suite: org.apache.solr.cloud.CollectionsAPIDistributedZkTest
   [junit4]   2> 852718 T2499 oas.BaseDistributedSearchTestCase.initHostContext Setting hostContext system property: /
   [junit4]   2> 852726 T2499 oas.SolrTestCaseJ4.setUp ###Starting testDistribSearch
   [junit4]   2> Creating dataDir: /Users/jenkins/jenkins-slave/workspace/Lucene-Solr-trunk-MacOSX/solr/build/solr-core/test/J0/./solrtest-CollectionsAPIDistributedZkTest-1375538431589
   [junit4]   2> 852728 T2499 oasc.ZkTestServer.run STARTING ZK TEST SERVER
   [junit4]   2> 852730 T2500 oasc.ZkTestServer$ZKServerMain.runFromConfig Starting server
   [junit4]   2> 852834 T2499 oasc.ZkTestServer.run start zk server on port:49804
   [junit4]   2> 852840 T2499 oascc.ConnectionManager.waitForConnected Waiting for client to connect to ZooKeeper
   [junit4]   2> 852851 T2506 oascc.ConnectionManager.process Watcher org.apache.solr.common.cloud.ConnectionManager@10d7e94a name:ZooKeeperConnection Watcher:127.0.0.1:49804 got event WatchedEvent state:SyncConnected type:None path:null path:null type:None
   [junit4]   2> 852851 T2499 oascc.ConnectionManager.waitForConnected Client is connected to ZooKeeper
   [junit4]   2> 852852 T2499 oascc.SolrZkClient.makePath makePath: /solr
   [junit4]   2> 852866 T2499 oascc.ConnectionManager.waitForConnected Waiting for client to connect to ZooKeeper
   [junit4]   2> 852870 T2508 oascc.ConnectionManager.process Watcher org.apache.solr.common.cloud.ConnectionManager@4ef57af6 name:ZooKeeperConnection Watcher:127.0.0.1:49804/solr got event WatchedEvent state:SyncConnected type:None path:null path:null type:None
   [junit4]   2> 852870 T2499 oascc.ConnectionManager.waitForConnected Client is connected to ZooKeeper
   [junit4]   2> 852871 T2499 oascc.SolrZkClient.makePath makePath: /collections/collection1
   [junit4]   2> 852878 T2499 oascc.SolrZkClient.makePath makePath: /collections/collection1/shards
   [junit4]   2> 852887 T2499 oascc.SolrZkClient.makePath makePath: /collections/control_collection
   [junit4]   2> 852897 T2499 oascc.SolrZkClient.makePath makePath: /collections/control_collection/shards
   [junit4]   2> 852913 T2499 oasc.AbstractZkTestCase.putConfig put /Users/jenkins/jenkins-slave/workspace/Lucene-Solr-trunk-MacOSX/solr/build/solr-core/test-files/solr/collection1/conf/solrconfig-tlog.xml to /configs/conf1/solrconfig.xml
   [junit4]   2> 852914 T2499 oascc.SolrZkClient.makePath makePath: /configs/conf1/solrconfig.xml
   [junit4]   2> 852926 T2499 oasc.AbstractZkTestCase.putConfig put /Users/jenkins/jenkins-slave/workspace/Lucene-Solr-trunk-MacOSX/solr/build/solr-core/test-files/solr/collection1/conf/schema.xml to /configs/conf1/schema.xml
   [junit4]   2> 852927 T2499 oascc.SolrZkClient.makePath makePath: /configs/conf1/schema.xml
   [junit4]   2> 852940 T2499 oasc.AbstractZkTestCase.putConfig put /Users/jenkins/jenkins-slave/workspace/Lucene-Solr-trunk-MacOSX/solr/build/solr-core/test-files/solr/collection1/conf/stopwords.txt to /configs/conf1/stopwords.txt
   [junit4]   2> 852942 T2499 oascc.SolrZkClient.makePath makePath: /configs/conf1/stopwords.txt
   [junit4]   2> 852952 T2499 oasc.AbstractZkTestCase.putConfig put /Users/jenkins/jenkins-slave/workspace/Lucene-Solr-trunk-MacOSX/solr/build/solr-core/test-files/solr/collection1/conf/protwords.txt to /configs/conf1/protwords.txt
   [junit4]   2> 852953 T2499 oascc.SolrZkClient.makePath makePath: /configs/conf1/protwords.txt
   [junit4]   2> 852971 T2499 oasc.AbstractZkTestCase.putConfig put /Users/jenkins/jenkins-slave/workspace/Lucene-Solr-trunk-MacOSX/solr/build/solr-core/test-files/solr/collection1/conf/currency.xml to /configs/conf1/currency.xml
   [junit4]   2> 852972 T2499 oascc.SolrZkClient.makePath makePath: /configs/conf1/currency.xml
   [junit4]   2> 852980 T2499 oasc.AbstractZkTestCase.putConfig put /Users/jenkins/jenkins-slave/workspace/Lucene-Solr-trunk-MacOSX/solr/build/solr-core/test-files/solr/collection1/conf/open-exchange-rates.json to /configs/conf1/open-exchange-rates.json
   [junit4]   2> 852981 T2499 oascc.SolrZkClient.makePath makePath: /configs/conf1/open-exchange-rates.json
   [junit4]   2> 852987 T2499 oasc.AbstractZkTestCase.putConfig put /Users/jenkins/jenkins-slave/workspace/Lucene-Solr-trunk-MacOSX/solr/build/solr-core/test-files/solr/collection1/conf/mapping-ISOLatin1Accent.txt to /configs/conf1/mapping-ISOLatin1Accent.txt
   [junit4]   2> 852987 T2499 oascc.SolrZkClient.makePath makePath: /configs/conf1/mapping-ISOLatin1Accent.txt
   [junit4]   2> 852995 T2499 oasc.AbstractZkTestCase.putConfig put /Users/jenkins/jenkins-slave/workspace/Lucene-Solr-trunk-MacOSX/solr/build/solr-core/test-files/solr/collection1/conf/old_synonyms.txt to /configs/conf1/old_synonyms.txt
   [junit4]   2> 852996 T2499 oascc.SolrZkClient.makePath makePath: /configs/conf1/old_synonyms.txt
   [junit4]   2> 853001 T2499 oasc.AbstractZkTestCase.putConfig put /Users/jenkins/jenkins-slave/workspace/Lucene-Solr-trunk-MacOSX/solr/build/solr-core/test-files/solr/collection1/conf/synonyms.txt to /configs/conf1/synonyms.txt
   [junit4]   2> 853002 T2499 oascc.SolrZkClient.makePath makePath: /configs/conf1/synonyms.txt
   [junit4]   2> 853750 T2499 oejs.Server.doStart jetty-8.1.10.v20130312
   [junit4]   2> 853759 T2499 oejs.AbstractConnector.doStart Started SelectChannelConnector@127.0.0.1:49807
   [junit4]   2> 853760 T2499 oass.SolrDispatchFilter.init SolrDispatchFilter.init()
   [junit4]   2> 853761 T2499 oasc.SolrResourceLoader.locateSolrHome JNDI not configured for solr (NoInitialContextEx)
   [junit4]   2> 853761 T2499 oasc.SolrResourceLoader.locateSolrHome using system property solr.solr.home: /Users/jenkins/jenkins-slave/workspace/Lucene-Solr-trunk-MacOSX/solr/build/solr-core/test/J0/./org.apache.solr.cloud.CollectionsAPIDistributedZkTest-controljetty-1375538431871
   [junit4]   2> 853762 T2499 oasc.SolrResourceLoader.<init> new SolrResourceLoader for directory: '/Users/jenkins/jenkins-slave/workspace/Lucene-Solr-trunk-MacOSX/solr/build/solr-core/test/J0/./org.apache.solr.cloud.CollectionsAPIDistributedZkTest-controljetty-1375538431871/'
   [junit4]   2> 853838 T2499 oasc.ConfigSolr.fromFile Loading container configuration from /Users/jenkins/jenkins-slave/workspace/Lucene-Solr-trunk-MacOSX/solr/build/solr-core/test/J0/./org.apache.solr.cloud.CollectionsAPIDistributedZkTest-controljetty-1375538431871/solr.xml
   [junit4]   2> 853982 T2499 oasc.ConfigSolrXml.<init> Config-defined core root directory: 
   [junit4]   2> 853983 T2499 oasc.CoreContainer.<init> New CoreContainer 358410571
   [junit4]   2> 853984 T2499 oasc.CoreContainer.load Loading cores into CoreContainer [instanceDir=/Users/jenkins/jenkins-slave/workspace/Lucene-Solr-trunk-MacOSX/solr/build/solr-core/test/J0/./org.apache.solr.cloud.CollectionsAPIDistributedZkTest-controljetty-1375538431871/]
   [junit4]   2> 853986 T2499 oashc.HttpShardHandlerFactory.getParameter Setting socketTimeout to: 120000
   [junit4]   2> 853990 T2499 oashc.HttpShardHandlerFactory.getParameter Setting urlScheme to: http://
   [junit4]   2> 853993 T2499 oashc.HttpShardHandlerFactory.getParameter Setting connTimeout to: 15000
   [junit4]   2> 853994 T2499 oashc.HttpShardHandlerFactory.getParameter Setting maxConnectionsPerHost to: 20
   [junit4]   2> 853995 T2499 oashc.HttpShardHandlerFactory.getParameter Setting corePoolSize to: 0
   [junit4]   2> 853995 T2499 oashc.HttpShardHandlerFactory.getParameter Setting maximumPoolSize to: 2147483647
   [junit4]   2> 853996 T2499 oashc.HttpShardHandlerFactory.getParameter Setting maxThreadIdleTime to: 5
   [junit4]   2> 853996 T2499 oashc.HttpShardHandlerFactory.getParameter Setting sizeOfQueue to: -1
   [junit4]   2> 853997 T2499 oashc.HttpShardHandlerFactory.getParameter Setting fairnessPolicy to: false
   [junit4]   2> 853997 T2499 oascsi.HttpClientUtil.createClient Creating new http client, config:maxConnectionsPerHost=20&maxConnections=10000&socketTimeout=120000&connTimeout=15000&retry=false
   [junit4]   2> 854021 T2499 oasc.ZkContainer.initZooKeeper Zookeeper client=127.0.0.1:49804/solr
   [junit4]   2> 854021 T2499 oasc.ZkController.checkChrootPath zkHost includes chroot
   [junit4]   2> 854024 T2499 oascc.ConnectionManager.waitForConnected Waiting for client to connect to ZooKeeper
   [junit4]   2> 854036 T2519 oascc.ConnectionManager.process Watcher org.apache.solr.common.cloud.ConnectionManager@7d417b39 name:ZooKeeperConnection Watcher:127.0.0.1:49804 got event WatchedEvent state:SyncConnected type:None path:null path:null type:None
   [junit4]   2> 854036 T2499 oascc.ConnectionManager.waitForConnected Client is connected to ZooKeeper
   [junit4]   2> 854040 T2499 oascsi.HttpClientUtil.createClient Creating new http client, config:maxConnections=500&maxConnectionsPerHost=16&socketTimeout=120000&connTimeout=15000
   [junit4]   2> 854057 T2499 oascc.ConnectionManager.waitForConnected Waiting for client to connect to ZooKeeper
   [junit4]   2> 854115 T2521 oascc.ConnectionManager.process Watcher org.apache.solr.common.cloud.ConnectionManager@173654d0 name:ZooKeeperConnection Watcher:127.0.0.1:49804/solr got event WatchedEvent state:SyncConnected type:None path:null path:null type:None
   [junit4]   2> 854115 T2499 oascc.ConnectionManager.waitForConnected Client is connected to ZooKeeper
   [junit4]   2> 854119 T2499 oascc.SolrZkClient.makePath makePath: /overseer/queue
   [junit4]   2> 854128 T2499 oascc.SolrZkClient.makePath makePath: /overseer/collection-queue-work
   [junit4]   2> 854135 T2499 oascc.SolrZkClient.makePath makePath: /live_nodes
   [junit4]   2> 854140 T2499 oasc.ZkController.createEphemeralLiveNode Register node as live in ZooKeeper:/live_nodes/127.0.0.1:49807_
   [junit4]   2> 854142 T2499 oascc.SolrZkClient.makePath makePath: /live_nodes/127.0.0.1:49807_
   [junit4]   2> 854163 T2499 oascc.SolrZkClient.makePath makePath: /overseer_elect/election
   [junit4]   2> 854177 T2499 oascc.SolrZkClient.makePath makePath: /overseer_elect/leader
   [junit4]   2> 854184 T2499 oasc.Overseer.start Overseer (id=90147286653468675-127.0.0.1:49807_-n_0000000000) starting
   [junit4]   2> 854192 T2499 oascc.SolrZkClient.makePath makePath: /overseer/queue-work
   [junit4]   2> 854206 T2523 oasc.OverseerCollectionProcessor.run Process current queue of collection creations
   [junit4]   2> 854209 T2499 oascc.SolrZkClient.makePath makePath: /clusterstate.json
   [junit4]   2> 854216 T2499 oascc.SolrZkClient.makePath makePath: /aliases.json
   [junit4]   2> 854222 T2499 oascc.ZkStateReader.createClusterStateWatchersAndUpdate Updating cluster state from ZooKeeper... 
   [junit4]   2> 854231 T2522 oasc.Overseer$ClusterStateUpdater.run Starting to work on the main queue
   [junit4]   2> 854237 T2499 oasc.CorePropertiesLocator.discover Looking for core definitions underneath /Users/jenkins/jenkins-slave/workspace/Lucene-Solr-trunk-MacOSX/solr/build/solr-core/test/J0/./org.apache.solr.cloud.CollectionsAPIDistributedZkTest-controljetty-1375538431871
   [junit4]   2> 854454 T2499 oasc.CorePropertiesLocator.discoverUnder Found core conf in /Users/jenkins/jenkins-slave/workspace/Lucene-Solr-trunk-MacOSX/solr/build/solr-core/test/J0/./org.apache.solr.cloud.CollectionsAPIDistributedZkTest-controljetty-1375538431871/conf/
   [junit4]   2> 854462 T2499 oasc.CorePropertiesLocator.discover Found 1 core definitions
   [junit4]   2> 854463 T2499 oass.SolrDispatchFilter.init user.dir=/Users/jenkins/jenkins-slave/workspace/Lucene-Solr-trunk-MacOSX/solr/build/solr-core/test/J0
   [junit4]   2> 854463 T2499 oass.SolrDispatchFilter.init SolrDispatchFilter.init() done
   [junit4]   2> 854464 T2499 oascsi.HttpClientUtil.createClient Creating new http client, config:maxConnections=128&maxConnectionsPerHost=32&followRedirects=false
   [junit4]   2> 854486 T2499 oascsi.HttpClientUtil.createClient Creating new http client, config:
   [junit4]   2> 854497 T2499 oascc.ConnectionManager.waitForConnected Waiting for client to connect to ZooKeeper
   [junit4]   2> 854504 T2526 oascc.ConnectionManager.process Watcher org.apache.solr.common.cloud.ConnectionManager@4f332d80 name:ZooKeeperConnection Watcher:127.0.0.1:49804/solr got event WatchedEvent state:SyncConnected type:None path:null path:null type:None
   [junit4]   2> 854504 T2499 oascc.ConnectionManager.waitForConnected Client is connected to ZooKeeper
   [junit4]   2> 854507 T2499 oascc.ZkStateReader.createClusterStateWatchersAndUpdate Updating cluster state from ZooKeeper... 
   [junit4]   2> 854512 T2499 oasc.ChaosMonkey.monkeyLog monkey: init - expire sessions:true cause connection loss:true
   [junit4]   2> 855327 T2499 oejs.Server.doStart jetty-8.1.10.v20130312
   [junit4]   2> 855339 T2499 oejs.AbstractConnector.doStart Started SelectChannelConnector@127.0.0.1:49811
   [junit4]   2> 855340 T2499 oass.SolrDispatchFilter.init SolrDispatchFilter.init()
   [junit4]   2> 855340 T2499 oasc.SolrResourceLoader.locateSolrHome JNDI not configured for solr (NoInitialContextEx)
   [junit4]   2> 855341 T2499 oasc.SolrResourceLoader.locateSolrHome using system property solr.solr.home: /Users/jenkins/jenkins-slave/workspace/Lucene-Solr-trunk-MacOSX/solr/build/solr-core/test/J0/./org.apache.solr.cloud.CollectionsAPIDistributedZkTest-jetty1-1375538433375
   [junit4]   2> 855341 T2499 oasc.SolrResourceLoader.<init> new SolrResourceLoader for directory: '/Users/jenkins/jenkins-slave/workspace/Lucene-Solr-trunk-MacOSX/solr/build/solr-core/test/J0/./org.apache.solr.cloud.CollectionsAPIDistributedZkTest-jetty1-1375538433375/'
   [junit4]   2> 855381 T2499 oasc.ConfigSolr.fromFile Loading container configuration from /Users/jenkins/jenkins-slave/workspace/Lucene-Solr-trunk-MacOSX/solr/build/solr-core/test/J0/./org.apache.solr.cloud.CollectionsAPIDistributedZkTest-jetty1-1375538433375/solr.xml
   [junit4]   2> 855497 T2499 oasc.ConfigSolrXml.<init> Config-defined core root directory: 
   [junit4]   2> 855497 T2499 oasc.CoreContainer.<init> New CoreContainer 430536093
   [junit4]   2> 855498 T2499 oasc.CoreContainer.load Loading cores into CoreContainer [instanceDir=/Users/jenkins/jenkins-slave/workspace/Lucene-Solr-trunk-MacOSX/solr/build/solr-core/test/J0/./org.apache.solr.cloud.CollectionsAPIDistributedZkTest-jetty1-1375538433375/]
   [junit4]   2> 855501 T2499 oashc.HttpShardHandlerFactory.getParameter Setting socketTimeout to: 120000
   [junit4]   2> 855501 T2499 oashc.HttpShardHandlerFactory.getParameter Setting urlScheme to: http://
   [junit4]   2> 855502 T2499 oashc.HttpShardHandlerFactory.getParameter Setting connTimeout to: 15000
   [junit4]   2> 855502 T2499 oashc.HttpShardHandlerFactory.getParameter Setting maxConnectionsPerHost to: 20
   [junit4]   2> 855503 T2499 oashc.HttpShardHandlerFactory.getParameter Setting corePoolSize to: 0
   [junit4]   2> 855503 T2499 oashc.HttpShardHandlerFactory.getParameter Setting maximumPoolSize to: 2147483647
   [junit4]   2> 855504 T2499 oashc.HttpShardHandlerFactory.getParameter Setting maxThreadIdleTime to: 5
   [junit4]   2> 855504 T2499 oashc.HttpShardHandlerFactory.getParameter Setting sizeOfQueue to: -1
   [junit4]   2> 855505 T2499 oashc.HttpShardHandlerFactory.getParameter Setting fairnessPolicy to: false
   [junit4]   2> 855505 T2499 oascsi.HttpClientUtil.createClient Creating new http client, config:maxConnectionsPerHost=20&maxConnections=10000&socketTimeout=120000&connTimeout=15000&retry=false
   [junit4]   2> 855527 T2499 oasc.ZkContainer.initZooKeeper Zookeeper client=127.0.0.1:49804/solr
   [junit4]   2> 855531 T2499 oasc.ZkController.checkChrootPath zkHost includes chroot
   [junit4]   2> 855536 T2499 oascc.ConnectionManager.waitForConnected Waiting for client to connect to ZooKeeper
   [junit4]   2> 855565 T1937 oasc.OverseerCollectionProcessor.run WARN Overseer cannot talk to ZK
   [junit4]   2> 856844 T2503 oazsp.FileTxnLog.commit WARN fsync-ing the write ahead log in SyncThread:0 took 1304ms which will adversely effect operation latency. See the ZooKeeper troubleshooting guide
   [junit4]   2> 856846 T2537 oascc.ConnectionManager.process Watcher org.apache.solr.common.cloud.ConnectionManager@22491938 name:ZooKeeperConnection Watcher:127.0.0.1:49804 got event WatchedEvent state:SyncConnected type:None path:null path:null type:None
   [junit4]   2> 856846 T2499 oascc.ConnectionManager.waitForConnected Client is connected to ZooKeeper
   [junit4]   2> 856851 T2499 oascsi.HttpClientUtil.createClient Creating new http client, config:maxConnections=500&maxConnectionsPerHost=16&socketTimeout=120000&connTimeout=15000
   [junit4]   2> 856878 T2499 oascc.ConnectionManager.waitForConnected Waiting for client to connect to ZooKeeper
   [junit4]   2> 856882 T2539 oascc.ConnectionManager.process Watcher org.apache.solr.common.cloud.ConnectionManager@444d5a19 name:ZooKeeperConnection Watcher:127.0.0.1:49804/solr got event WatchedEvent state:SyncConnected type:None path:null path:null type:None
   [junit4]   2> 856883 T2499 oascc.ConnectionManager.waitForConnected Client is connected to ZooKeeper
   [junit4]   2> 856895 T2499 oascc.ZkStateReader.createClusterStateWatchersAndUpdate Updating cluster state from ZooKeeper... 
   [junit4]   2> 857910 T2499 oasc.ZkController.createEphemeralLiveNode Register node as live in ZooKeeper:/live_nodes/127.0.0.1:49811_
   [junit4]   2> 857914 T2499 oascc.SolrZkClient.makePath makePath: /live_nodes/127.0.0.1:49811_
   [junit4]   2> 857920 T2539 oascc.ZkStateReader$3.process Updating live nodes... (2)
   [junit4]   2> 857924 T2526 oascc.ZkStateReader$3.process Updating live nodes... (2)
   [junit4]   2> 857926 T2521 oascc.ZkStateReader$3.process Updating live nodes... (2)
   [junit4]   2> 857932 T2499 oasc.CorePropertiesLocator.discover Looking for core definitions underneath /Users/jenkins/jenkins-slave/workspace/Lucene-Solr-trunk-MacOSX/solr/build/solr-core/test/J0/./org.apache.solr.cloud.CollectionsAPIDistributedZkTest-jetty1-1375538433375
   [junit4]   2> 858112 T2499 oasc.CorePropertiesLocator.discoverUnder Found core conf in /Users/jenkins/jenkins-slave/workspace/Lucene-Solr-trunk-MacOSX/solr/build/solr-core/test/J0/./org.apache.solr.cloud.CollectionsAPIDistributedZkTest-jetty1-1375538433375/conf/
   [junit4]   2> 858119 T2499 oasc.CorePropertiesLocator.discover Found 1 core definitions
   [junit4]   2> 858120 T2499 oass.SolrDispatchFilter.init user.dir=/Users/jenkins/jenkins-slave/workspace/Lucene-Solr-trunk-MacOSX/solr/build/solr-core/test/J0
   [junit4]   2> 858121 T2499 oass.SolrDispatchFilter.init SolrDispatchFilter.init() done
   [junit4]   2> 858121 T2499 oascsi.HttpClientUtil.createClient Creating new http client, config:maxConnections=128&maxConnectionsPerHost=32&followRedirects=false
   [junit4]   2> 859014 T2499 oejs.Server.doStart jetty-8.1.10.v20130312
   [junit4]   2> 859021 T2499 oejs.AbstractConnector.doStart Started SelectChannelConnector@127.0.0.1:49814
   [junit4]   2> 859023 T2499 oass.SolrDispatchFilter.init SolrDispatchFilter.init()
   [junit4]   2> 859023 T2499 oasc.SolrResourceLoader.locateSolrHome JNDI not configured for solr (NoInitialContextEx)
   [junit4]   2> 859024 T2499 oasc.SolrResourceLoader.locateSolrHome using system property solr.solr.home: /Users/jenkins/jenkins-slave/workspace/Lucene-Solr-trunk-MacOSX/solr/build/solr-core/test/J0/./org.apache.solr.cloud.CollectionsAPIDistributedZkTest-jetty2-1375538437004
   [junit4]   2> 859024 T2499 oasc.SolrResourceLoader.<init> new SolrResourceLoader for directory: '/Users/jenkins/jenkins-slave/workspace/Lucene-Solr-trunk-MacOSX/solr/build/solr-core/test/J0/./org.apache.solr.cloud.CollectionsAPIDistributedZkTest-jetty2-1375538437004/'
   [junit4]   2> 859080 T2499 oasc.ConfigSolr.fromFile Loading container configuration from /Users/jenkins/jenkins-slave/workspace/Lucene-Solr-trunk-MacOSX/solr/build/solr-core/test/J0/./org.apache.solr.cloud.CollectionsAPIDistributedZkTest-jetty2-1375538437004/solr.xml
   [junit4]   2> 859212 T2499 oasc.ConfigSolrXml.<init> Config-defined core root directory: 
   [junit4]   2> 859213 T2499 oasc.CoreContainer.<init> New CoreContainer 56360420
   [junit4]   2> 859213 T2499 oasc.CoreContainer.load Loading cores into CoreContainer [instanceDir=/Users/jenkins/jenkins-slave/workspace/Lucene-Solr-trunk-MacOSX/solr/build/solr-core/test/J0/./org.apache.solr.cloud.CollectionsAPIDistributedZkTest-jetty2-1375538437004/]
   [junit4]   2> 859216 T2499 oashc.HttpShardHandlerFactory.getParameter Setting socketTimeout to: 120000
   [junit4]   2> 859216 T2499 oashc.HttpShardHandlerFactory.getParameter Setting urlScheme to: http://
   [junit4]   2> 859216 T2499 oashc.HttpShardHandlerFactory.getParameter Setting connTimeout to: 15000
   [junit4]   2> 859217 T2499 oashc.HttpShardHandlerFactory.getParameter Setting maxConnectionsPerHost to: 20
   [junit4]   2> 859217 T2499 oashc.HttpShardHandlerFactory.getParameter Setting corePoolSize to: 0
   [junit4]   2> 859218 T2499 oashc.HttpShardHandlerFactory.getParameter Setting maximumPoolSize to: 2147483647
   [junit4]   2> 859218 T2499 oashc.HttpShardHandlerFactory.getParameter Setting maxThreadIdleTime to: 5
   [junit4]   2> 859218 T2499 oashc.HttpShardHandlerFactory.getParameter Setting sizeOfQueue to: -1
   [junit4]   2> 859219 T2499 oashc.HttpShardHandlerFactory.getParameter Setting fairnessPolicy to: false
   [junit4]   2> 859220 T2499 oascsi.HttpClientUtil.createClient Creating new http client, config:maxConnectionsPerHost=20&maxConnections=10000&socketTimeout=120000&connTimeout=15000&retry=false
   [junit4]   2> 859240 T2499 oasc.ZkContainer.initZooKeeper Zookeeper client=127.0.0.1:49804/solr
   [junit4]   2> 859241 T2499 oasc.ZkController.checkChrootPath zkHost includes chroot
   [junit4]   2> 859243 T2499 oascc.ConnectionManager.waitForConnected Waiting for client to connect to ZooKeeper
   [junit4]   2> 859248 T2551 oascc.ConnectionManager.process Watcher org.apache.solr.common.cloud.ConnectionManager@281536bd name:ZooKeeperConnection Watcher:127.0.0.1:49804 got event WatchedEvent state:SyncConnected type:None path:null path:null type:None
   [junit4]   2> 859248 T2499 oascc.ConnectionManager.waitForConnected Client is connected to ZooKeeper
   [junit4]   2> 859253 T2499 oascsi.HttpClientUtil.createClient Creating new http client, config:maxConnections=500&maxConnectionsPerHost=16&socketTimeout=120000&connTimeout=15000
   [junit4]   2> 859275 T2499 oascc.ConnectionManager.waitForConnected Waiting for client to connect to ZooKeeper
   [junit4]   2> 859279 T2553 oascc.ConnectionManager.process Watcher org.apache.solr.common.cloud.ConnectionManager@74c78043 name:ZooKeeperConnection Watcher:127.0.0.1:49804/solr got event WatchedEvent state:SyncConnected type:None path:null path:null type:None
   [junit4]   2> 859280 T2499 oascc.ConnectionManager.waitForConnected Client is connected to ZooKeeper
   [junit4]   2> 859289 T2499 oascc.ZkStateReader.createClusterStateWatchersAndUpdate Updating cluster state from ZooKeeper... 
   [junit4]   2> 860298 T2499 oasc.ZkController.createEphemeralLiveNode Register node as live in ZooKeeper:/live_nodes/127.0.0.1:49814_
   [junit4]   2> 860303 T2499 oascc.SolrZkClient.makePath makePath: /live_nodes/127.0.0.1:49814_
   [junit4]   2> 860317 T2521 oascc.ZkStateReader$3.process Updating live nodes... (3)
   [junit4]   2> 860317 T2553 oascc.ZkStateReader$3.process Updating live nodes... (3)
   [junit4]   2> 860317 T2539 oascc.ZkStateReader$3.process Updating live nodes... (3)
   [junit4]   2> 860317 T2526 oascc.ZkStateReader$3.process Updating live nodes... (3)
   [junit4]   2> 860444 T2499 oasc.CorePropertiesLocator.discover Looking for core definitions underneath /Users/jenkins/jenkins-slave/workspace/Lucene-Solr-trunk-MacOSX/solr/build/solr-core/test/J0/./org.apache.solr.cloud.CollectionsAPIDistributedZkTest-jetty2-1375538437004
   [junit4]   2> 860819 T2499 oasc.CorePropertiesLocator.discoverUnder Found core conf in /Users/jenkins/jenkins-slave/workspace/Lucene-Solr-trunk-MacOSX/solr/build/solr-core/test/J0/./org.apache.solr.cloud.CollectionsAPIDistributedZkTest-jetty2-1375538437004/conf/
   [junit4]   2> 860824 T2499 oasc.CorePropertiesLocator.discover Found 1 core definitions
   [junit4]   2> 860825 T2499 oass.SolrDispatchFilter.init user.dir=/Users/jenkins/jenkins-slave/workspace/Lucene-Solr-trunk-MacOSX/solr/build/solr-core/test/J0
   [junit4]   2> 860825 T2499 oass.SolrDispatchFilter.init SolrDispatchFilter.init() done
   [junit4]   2> 860825 T2499 oascsi.HttpClientUtil.createClient Creating new http client, config:maxConnections=128&maxConnectionsPerHost=32&followRedirects=false
   [junit4]   2> 863958 T2499 oejs.Server.doStart jetty-8.1.10.v20130312
   [junit4]   2> 863965 T2499 oejs.AbstractConnector.doStart Started SelectChannelConnector@127.0.0.1:49817
   [junit4]   2> 863966 T2499 oass.SolrDispatchFilter.init SolrDispatchFilter.init()
   [junit4]   2> 863967 T2499 oasc.SolrResourceLoader.locateSolrHome JNDI not configured for solr (NoInitialContextEx)
   [junit4]   2> 863967 T2499 oasc.SolrResourceLoader.locateSolrHome using system property solr.solr.home: /Users/jenkins/jenkins-slave/workspace/Lucene-Solr-trunk-MacOSX/solr/build/solr-core/test/J0/./org.apache.solr.cloud.CollectionsAPIDistributedZkTest-jetty3-1375538439703
   [junit4]   2> 863968 T2499 oasc.SolrResourceLoader.<init> new SolrResourceLoader for directory: '/Users/jenkins/jenkins-slave/workspace/Lucene-Solr-trunk-MacOSX/solr/build/solr-core/test/J0/./org.apache.solr.cloud.CollectionsAPIDistributedZkTest-jetty3-1375538439703/'
   [junit4]   2> 864021 T2499 oasc.ConfigSolr.fromFile Loading container configuration from /Users/jenkins/jenkins-slave/workspace/Lucene-Solr-trunk-MacOSX/solr/build/solr-core/test/J0/./org.apache.solr.cloud.CollectionsAPIDistributedZkTest-jetty3-1375538439703/solr.xml
   [junit4]   2> 864148 T2499 oasc.ConfigSolrXml.<init> Config-defined core root directory: 
   [junit4]   2> 864149 T2499 oasc.CoreContainer.<init> New CoreContainer 1961772723
   [junit4]   2> 864153 T2499 oasc.CoreContainer.load Loading cores into CoreContainer [instanceDir=/Users/jenkins/jenkins-slave/workspace/Lucene-Solr-trunk-MacOSX/solr/build/solr-core/test/J0/./org.apache.solr.cloud.CollectionsAPIDistributedZkTest-jetty3-1375538439703/]
   [junit4]   2> 864158 T2499 oashc.HttpShardHandlerFactory.getParameter Setting socketTimeout to: 120000
   [junit4]   2> 864160 T2499 oashc.HttpShardHandlerFactory.getParameter Setting urlScheme to: http://
   [junit4]   2> 864161 T2499 oashc.HttpShardHandlerFactory.getParameter Setting connTimeout to: 15000
   [junit4]   2> 864161 T2499 oashc.HttpShardHandlerFactory.getParameter Setting maxConnectionsPerHost to: 20
   [junit4]   2> 864161 T2499 oashc.HttpShardHandlerFactory.getParameter Setting corePoolSize to: 0
   [junit4]   2> 864162 T2499 oashc.HttpShardHandlerFactory.getParameter Setting maximumPoolSize to: 2147483647
   [junit4]   2> 864162 T2499 oashc.HttpShardHandlerFactory.getParameter Setting maxThreadIdleTime to: 5
   [junit4]   2> 864163 T2499 oashc.HttpShardHandlerFactory.getParameter Setting sizeOfQueue to: -1
   [junit4]   2> 864163 T2499 oashc.HttpShardHandlerFactory.getParameter Setting fairnessPolicy to: false
   [junit4]   2> 864164 T2499 oascsi.HttpClientUtil.createClient Creating new http client, config:maxConnectionsPerHost=20&maxConnections=10000&socketTimeout=120000&connTimeout=15000&retry=false
   [junit4]   2> 864190 T2499 oasc.ZkContainer.initZooKeeper Zookeeper client=127.0.0.1:49804/solr
   [junit4]   2> 864191 T2499 oasc.ZkController.checkChrootPath zkHost includes chroot
   [junit4]   2> 864192 T2499 oascc.ConnectionManager.waitForConnected Waiting for client to connect to ZooKeeper
   [junit4]   2> 864685 T2565 oascc.ConnectionManager.process Watcher org.apache.solr.common.cloud.ConnectionManager@37c9b151 name:ZooKeeperConnection Watcher:127.0.0.1:49804 got event WatchedEvent state:SyncConnected type:None path:null path:null type:None
   [junit4]   2> 864685 T2499 oascc.ConnectionManager.waitForConnected Client is connected to ZooKeeper
   [junit4]   2> 864687 T2499 oascsi.HttpClientUtil.createClient Creating new http client, config:maxConnections=500&maxConnectionsPerHost=16&socketTimeout=120000&connTimeout=15000
   [junit4]   2> 864716 T2499 oascc.ConnectionManager.waitForConnected Waiting for client to connect to ZooKeeper
   [junit4]   2> 864722 T2567 oascc.ConnectionManager.process Watcher org.apache.solr.common.cloud.ConnectionManager@34646f25 name:ZooKeeperConnection Watcher:127.0.0.1:49804/solr got event WatchedEvent state:SyncConnected type:None path:null path:null type:None
   [junit4]   2> 864722 T2499 oascc.ConnectionManager.waitForConnected Client is connected to ZooKeeper
   [junit4]   2> 864732 T2499 oascc.ZkStateReader.createClusterStateWatchersAndUpdate Updating cluster state from ZooKeeper... 
   [junit4]   2> 865741 T2499 oasc.ZkController.createEphemeralLiveNode Register node as live in ZooKeeper:/live_nodes/127.0.0.1:49817_
   [junit4]   2> 865744 T2499 oascc.SolrZkClient.makePath makePath: /live_nodes/127.0.0.1:49817_
   [junit4]   2> 865753 T2521 oascc.ZkStateReader$3.process Updating live nodes... (4)
   [junit4]   2> 865753 T2526 oascc.ZkStateReader$3.process Updating live nodes... (4)
   [junit4]   2> 865758 T2553 oascc.ZkStateReader$3.process Updating live nodes... (4)
   [junit4]   2> 865764 T2539 oascc.ZkStateReader$3.process Updating live nodes... (4)
   [junit4]   2> 865765 T2567 oascc.ZkStateReader$3.process Updating live nodes... (4)
   [junit4]   2> 865779 T2499 oasc.CorePropertiesLocator.discover Looking for core definitions underneath /Users/jenkins/jenkins-slave/workspace/Lucene-Solr-trunk-MacOSX/solr/build/solr-core/test/J0/./org.apache.solr.cloud.CollectionsAPIDistributedZkTest-jetty3-1375538439703
   [junit4]   2> 865927 T2499 oasc.CorePropertiesLocator.discoverUnder Found core conf in /Users/jenkins/jenkins-slave/workspace/Lucene-Solr-trunk-MacOSX/solr/build/solr-core/test/J0/./org.apache.solr.cloud.CollectionsAPIDistributedZkTest-jetty3-1375538439703/conf/
   [junit4]   2> 865935 T2499 oasc.CorePropertiesLocator.discover Found 1 core definitions
   [junit4]   2> 865936 T2499 oass.SolrDispatchFilter.init user.dir=/Users/jenkins/jenkins-slave/workspace/Lucene-Solr-trunk-MacOSX/solr/build/solr-core/test/J0
   [junit4]   2> 865936 T2499 oass.SolrDispatchFilter.init SolrDispatchFilter.init() done
   [junit4]   2> 865937 T2499 oascsi.HttpClientUtil.createClient Creating new http client, config:maxConnections=128&maxConnectionsPerHost=32&followRedirects=false
   [junit4]   2> 866623 T2499 oejs.Server.doStart jetty-8.1.10.v20130312
   [junit4]   2> 866631 T2499 oejs.AbstractConnector.doStart Started SelectChannelConnector@127.0.0.1:49820
   [junit4]   2> 866632 T2499 oass.SolrDispatchFilter.init SolrDispatchFilter.init()
   [junit4]   2> 866633 T2499 oasc.SolrResourceLoader.locateSolrHome JNDI not configured for solr (NoInitialContextEx)
   [junit4]   2> 866633 T2499 oasc.SolrResourceLoader.locateSolrHome using system property solr.solr.home: /Users/jenkins/jenkins-slave/workspace/Lucene-Solr-trunk-MacOSX/solr/build/solr-core/test/J0/./org.apache.solr.cloud.CollectionsAPIDistributedZkTest-jetty4-1375538444825
   [junit4]   2> 866634 T2499 oasc.SolrResourceLoader.<init> new SolrResourceLoader for directory: '/Users/jenkins/jenkins-slave/workspace/Lucene-Solr-trunk-MacOSX/solr/build/solr-core/test/J0/./org.apache.solr.cloud.CollectionsAPIDistributedZkTest-jetty4-1375538444825/'
   [junit4]   2> 866690 T2499 oasc.ConfigSolr.fromFile Loading container configuration from /Users/jenkins/jenkins-slave/workspace/Lucene-Solr-trunk-MacOSX/solr/build/solr-core/test/J0/./org.apache.solr.cloud.CollectionsAPIDistributedZkTest-jetty4-1375538444825/solr.xml
   [junit4]   2> 866808 T2499 oasc.ConfigSolrXml.<init> Config-defined core root directory: 
   [junit4]   2> 866809 T2499 oasc.CoreContainer.<init> New CoreContainer 1525448065
   [junit4]   2> 866809 T2499 oasc.CoreContainer.load Loading cores into CoreContainer [instanceDir=/Users/jenkins/jenkins-slave/workspace/Lucene-Solr-trunk-MacOSX/solr/build/solr-core/test/J0/./org.apache.solr.cloud.CollectionsAPIDistributedZkTest-jetty4-1375538444825/]
   [junit4]   2> 866811 T2499 oashc.HttpShardHandlerFactory.getParameter Setting socketTimeout to: 120000
   [junit4]   2> 866812 T2499 oashc.HttpShardHandlerFactory.getParameter Setting urlScheme to: http://
   [junit4]   2> 866812 T2499 oashc.HttpShardHandlerFactory.getParameter Setting connTimeout to: 15000
   [junit4]   2> 866813 T2499 oashc.HttpShardHandlerFactory.getParameter Setting maxConnectionsPerHost to: 20
   [junit4]   2> 866813 T2499 oashc.HttpShardHandlerFactory.getParameter Setting corePoolSize to: 0
   [junit4]   2> 866813 T2499 oashc.HttpShardHandlerFactory.getParameter Setting maximumPoolSize to: 2147483647
   [junit4]   2> 866814 T2499 oashc.HttpShardHandlerFactory.getParameter Setting maxThreadIdleTime to: 5
   [junit4]   2> 866816 T2499 oashc.HttpShardHandlerFactory.getParameter Setting sizeOfQueue to: -1
   [junit4]   2> 866816 T2499 oashc.HttpShardHandlerFactory.getParameter Setting fairnessPolicy to: false
   [junit4]   2> 866817 T2499 oascsi.HttpClientUtil.createClient Creating new http client, config:maxConnectionsPerHost=20&maxConnections=10000&socketTimeout=120000&connTimeout=15000&retry=false
   [junit4]   2> 866844 T2499 oasc.ZkContainer.initZooKeeper Zookeeper client=127.0.0.1:49804/solr
   [junit4]   2> 866845 T2499 oasc.ZkController.checkChrootPath zkHost includes chroot
   [junit4]   2> 866848 T2499 oascc.ConnectionManager.waitForConnected Waiting for client to connect to ZooKeeper
   [junit4]   2> 866859 T2579 oascc.ConnectionManager.process Watcher org.apache.solr.common.cloud.ConnectionManager@52b3e55d name:ZooKeeperConnection Watcher:127.0.0.1:49804 got event WatchedEvent state:SyncConnected type:None path:null path:null type:None
   [junit4]   2> 866859 T2499 oascc.ConnectionManager.waitForConnected Client is connected to ZooKeeper
   [junit4]   2> 866867 T2499 oascsi.HttpClientUtil.createClient Creating new http client, config:maxConnections=500&maxConnectionsPerHost=16&socketTimeout=120000&connTimeout=15000
   [junit4]   2> 866888 T2499 oascc.ConnectionManager.waitForConnected Waiting for client to connect to ZooKeeper
   [junit4]   2> 866895 T2581 oascc.ConnectionManager.process Watcher org.apache.solr.common.cloud.ConnectionManager@2792a97b name:ZooKeeperConnection Watcher:127.0.0.1:49804/solr got event WatchedEvent state:SyncConnected type:None path:null path:null type:None
   [junit4]   2> 866896 T2499 oascc.ConnectionManager.waitForConnected Client is connected to ZooKeeper
   [junit4]   2> 866909 T2499 oascc.ZkStateReader.createClusterStateWatchersAndUpdate Updating cluster state from ZooKeeper... 
   [junit4]   2> 867920 T2499 oasc.ZkController.createEphemeralLiveNode Register node as live in ZooKeeper:/live_nodes/127.0.0.1:49820_
   [junit4]   2> 867923 T2499 oascc.SolrZkClient.makePath makePath: /live_nodes/127.0.0.1:49820_
   [junit4]   2> 867931 T2567 oascc.ZkStateReader$3.process Updating live nodes... (5)
   [junit4]   2> 867932 T2521 oascc.ZkStateReader$3.process Updating live nodes... (5)
   [junit4]   2> 867932 T2539 oascc.ZkStateReader$3.process Updating live nodes... (5)
   [junit4]   2> 867933 T2553 oascc.ZkStateReader$3.process Updating live nodes... (5)
   [junit4]   2> 867933 T2581 oascc.ZkStateReader$3.process Updating live nodes... (5)
   [junit4]   2> 867934 T2526 oascc.ZkStateReader$3.process Updating live nodes... (5)
   [junit4]   2> 867947 T2499 oasc.CorePropertiesLocator.discover Looking for core definitions underneath /Users/jenkins/jenkins-slave/workspace/Lucene-Solr-trunk-MacOSX/solr/build/solr-core/test/J0/./org.apache.solr.cloud.CollectionsAPIDistributedZkTest-jetty4-1375538444825
   [junit4]   2> 868129 T2499 oasc.CorePropertiesLocator.discoverUnder Found core conf in /Users/jenkins/jenkins-slave/workspace/Lucene-Solr-trunk-MacOSX/solr/build/solr-core/test/J0/./org.apache.solr.cloud.CollectionsAPIDistributedZkTest-jetty4-1375538444825/conf/
   [junit4]   2> 868136 T2499 oasc.CorePropertiesLocator.discover Found 1 core definitions
   [junit4]   2> 868138 T2499 oass.SolrDispatchFilter.init user.dir=/Users/jenkins/jenkins-slave/workspace/Lucene-Solr-trunk-MacOSX/solr/build/solr-core/test/J0
   [junit4]   2> 868138 T2499 oass.SolrDispatchFilter.init SolrDispatchFilter.init() done
   [junit4]   2> 868139 T2499 oascsi.HttpClientUtil.createClient Creating new http client, config:maxConnections=128&maxConnectionsPerHost=32&followRedirects=false
   [junit4]   2> 868159 T2499 oascsi.HttpClientUtil.createClient Creating new http client, config:maxConnections=128&maxConnectionsPerHost=32&followRedirects=false
   [junit4]   2> 868183 T2530 oasha.CollectionsHandler.handleCreateAction Creating Collection : numShards=2&name=nodes_used_collection&replicationFactor=2&action=CREATE&wt=javabin&version=2
   [junit4]   2> 868186 T2521 oasc.DistributedQueue$LatchChildWatcher.process Watcher fired on path: /overseer/collection-queue-work state: SyncConnected type NodeChildrenChanged
   [junit4]   2> 868192 T2523 oasc.OverseerCollectionProcessor.run Overseer Collection Processor: Get the message id:/overseer/collection-queue-work/qn-0000000000 message:{
   [junit4]   2> 	  "operation":"createcollection",
   [junit4]   2> 	  "numShards":"2",
   [junit4]   2> 	  "name":"nodes_used_collection",
   [junit4]   2> 	  "replicationFactor":"2"}
   [junit4]   2> 868193 T2523 oasc.OverseerCollectionProcessor.processMessage WARN OverseerCollectionProcessor.processMessage : createcollection , {
   [junit4]   2> 	  "operation":"createcollection",
   [junit4]   2> 	  "numShards":"2",
   [junit4]   2> 	  "name":"nodes_used_collection",
   [junit4]   2> 	  "replicationFactor":"2"}
   [junit4]   2> 869554 T2522 oascc.ZkStateReader.updateClusterState Updating cloud state from ZooKeeper... 
   [junit4]   2> 869556 T2522 oasc.Overseer$ClusterStateUpdater.buildCollection building a new collection: nodes_used_collection
   [junit4]   2> 869556 T2522 oasc.Overseer$ClusterStateUpdater.createCollection Create collection nodes_used_collection with shards [shard1, shard2]
   [junit4]   2> 869570 T2521 oascc.ZkStateReader$2.process A cluster state change: WatchedEvent state:SyncConnected type:NodeDataChanged path:/clusterstate.json, has occurred - updating... (live nodes size: 5)
   [junit4]   2> 869571 T2567 oascc.ZkStateReader$2.process A cluster state change: WatchedEvent state:SyncConnected type:NodeDataChanged path:/clusterstate.json, has occurred - updating... (live nodes size: 5)
   [junit4]   2> 869579 T2553 oascc.ZkStateReader$2.process A cluster state change: WatchedEvent state:SyncConnected type:NodeDataChanged path:/clusterstate.json, has occurred - updating... (live nodes size: 5)
   [junit4]   2> 869582 T2581 oascc.ZkStateReader$2.process A cluster state change: WatchedEvent state:SyncConnected type:NodeDataChanged path:/clusterstate.json, has occurred - updating... (live nodes size: 5)
   [junit4]   2> 869585 T2526 oascc.ZkStateReader$2.process A cluster state change: WatchedEvent state:SyncConnected type:NodeDataChanged path:/clusterstate.json, has occurred - updating... (live nodes size: 5)
   [junit4]   2> 869587 T2539 oascc.ZkStateReader$2.process A cluster state change: WatchedEvent state:SyncConnected type:NodeDataChanged path:/clusterstate.json, has occurred - updating... (live nodes size: 5)
   [junit4]   2> 869630 T2523 oasc.OverseerCollectionProcessor.createCollection going to create cores replicas shardNames [shard1, shard2] , repFactor : 2
   [junit4]   2> 869631 T2523 oasc.OverseerCollectionProcessor.createCollection Creating shard nodes_used_collection_shard1_replica1 as part of slice shard1 of collection nodes_used_collection on 127.0.0.1:49811_
   [junit4]   2> 869632 T2523 oasc.OverseerCollectionProcessor.createCollection Creating shard nodes_used_collection_shard1_replica2 as part of slice shard1 of collection nodes_used_collection on 127.0.0.1:49820_
   [junit4]   2> 869633 T2523 oasc.OverseerCollectionProcessor.createCollection Creating shard nodes_used_collection_shard2_replica1 as part of slice shard2 of collection nodes_used_collection on 127.0.0.1:49807_
   [junit4]   2> 869633 T2523 oasc.OverseerCollectionProcessor.createCollection Creating shard nodes_used_collection_shard2_replica2 as part of slice shard2 of collection nodes_used_collection on 127.0.0.1:49814_
   [junit4]   2> 869674 T2543 oasc.ZkController.publish publishing core=nodes_used_collection_shard2_replica2 state=down
   [junit4]   2> 869681 T2534 oasc.ZkController.publish publishing core=nodes_used_collection_shard1_replica1 state=down
   [junit4]   2> 869683 T2534 oasc.ZkController.waitForCoreNodeName look for our core node name
   [junit4]   2> 869684 T2543 oasc.ZkController.waitForCoreNodeName look for our core node name
   [junit4]   2> 869687 T2513 oasc.ZkController.publish publishing core=nodes_used_collection_shard2_replica1 state=down
   [junit4]   2> 869690 T2572 oasc.ZkController.publish publishing core=nodes_used_collection_shard1_replica2 state=down
   [junit4]   2> 869691 T2513 oasc.ZkController.waitForCoreNodeName look for our core node name
   [junit4]   2> 869693 T2572 oasc.ZkController.waitForCoreNodeName look for our core node name
   [junit4]   2> 871084 T2522 oascc.ZkStateReader.updateClusterState Updating cloud state from ZooKeeper... 
   [junit4]   2> 871088 T2522 oasc.Overseer$ClusterStateUpdater.updateState WARN Could not find collection node for nodes_used_collection, skipping publish state
   [junit4]   2> 871088 T2522 oasc.Overseer$ClusterStateUpdater.updateState Update state numShards=2 message={
   [junit4]   2> 	  "operation":"state",
   [junit4]   2> 	  "core_node_name":"core_node1",
   [junit4]   2> 	  "numShards":"2",
   [junit4]   2> 	  "shard":"shard2",
   [junit4]   2> 	  "roles":null,
   [junit4]   2> 	  "state":"down",
   [junit4]   2> 	  "shard_state":"active",
   [junit4]   2> 	  "core":"nodes_used_collection_shard2_replica2",
   [junit4]   2> 	  "collection":"nodes_used_collection",
   [junit4]   2> 	  "shard_range":null,
   [junit4]   2> 	  "node_name":"127.0.0.1:49814_",
   [junit4]   2> 	  "base_url":"http://127.0.0.1:49814"}
   [junit4]   2> 871102 T2522 oasc.Overseer$ClusterStateUpdater.updateState WARN Could not find collection node for nodes_used_collection, skipping publish state
   [junit4]   2> 871103 T2522 oasc.Overseer$ClusterStateUpdater.updateState Update state numShards=2 message={
   [junit4]   2> 	  "operation":"state",
   [junit4]   2> 	  "core_node_name":"core_node2",
   [junit4]   2> 	  "numShards":"2",
   [junit4]   2> 	  "shard":"shard1",
   [junit4]   2> 	  "roles":null,
   [junit4]   2> 	  "state":"down",
   [junit4]   2> 	  "shard_state":"active",
   [junit4]   2> 	  "core":"nodes_used_collection_shard1_replica1",
   [junit4]   2> 	  "collection":"nodes_used_collection",
   [junit4]   2> 	  "shard_range":null,
   [junit4]   2> 	  "node_name":"127.0.0.1:49811_",
   [junit4]   2> 	  "base_url":"http://127.0.0.1:49811"}
   [junit4]   2> 871124 T2522 oasc.Overseer$ClusterStateUpdater.updateState WARN Could not find collection node for nodes_used_collection, skipping publish state
   [junit4]   2> 871124 T2522 oasc.Overseer$ClusterStateUpdater.updateState Update state numShards=2 message={
   [junit4]   2> 	  "operation":"state",
   [junit4]   2> 	  "core_node_name":"core_node3",
   [junit4]   2> 	  "numShards":"2",
   [junit4]   2> 	  "shard":"shard2",
   [junit4]   2> 	  "roles":null,
   [junit4]   2> 	  "state":"down",
   [junit4]   2> 	  "shard_state":"active",
   [junit4]   2> 	  "core":"nodes_used_collection_shard2_replica1",
   [junit4]   2> 	  "collection":"nodes_used_collection",
   [junit4]   2> 	  "shard_range":null,
   [junit4]   2> 	  "node_name":"127.0.0.1:49807_",
   [junit4]   2> 	  "base_url":"http://127.0.0.1:49807"}
   [junit4]   2> 871136 T2522 oasc.Overseer$ClusterStateUpdater.updateState WARN Could not find collection node for nodes_used_collection, skipping publish state
   [junit4]   2> 871136 T2522 oasc.Overseer$ClusterStateUpdater.updateState Update state numShards=2 message={
   [junit4]   2> 	  "operation":"state",
   [junit4]   2> 	  "core_node_name":"core_node4",
   [junit4]   2> 	  "numShards":"2",
   [junit4]   2> 	  "shard":"shard1",
   [junit4]   2> 	  "roles":null,
   [junit4]   2> 	  "state":"down",
   [junit4]   2> 	  "shard_state":"active",
   [junit4]   2> 	  "core":"nodes_used_collection_shard1_replica2",
   [junit4]   2> 	  "collection":"nodes_used_collection",
   [junit4]   2> 	  "shard_range":null,
   [junit4]   2> 	  "node_name":"127.0.0.1:49820_",
   [junit4]   2> 	  "base_url":"http://127.0.0.1:49820"}
   [junit4]   2> 871144 T2553 oascc.ZkStateReader$2.process A cluster state change: WatchedEvent state:SyncConnected type:NodeDataChanged path:/clusterstate.json, has occurred - updating... (live nodes size: 5)
   [junit4]   2> 871144 T2567 oascc.ZkStateReader$2.process A cluster state change: WatchedEvent state:SyncConnected type:NodeDataChanged path:/clusterstate.json, has occurred - updating... (live nodes size: 5)
   [junit4]   2> 871144 T2526 oascc.ZkStateReader$2.process A cluster state change: WatchedEvent state:SyncConnected type:NodeDataChanged path:/clusterstate.json, has occurred - updating... (live nodes size: 5)
   [junit4]   2> 871149 T2581 oascc.ZkStateReader$2.process A cluster state change: WatchedEvent state:SyncConnected type:NodeDataChanged path:/clusterstate.json, has occurred - updating... (live nodes size: 5)
   [junit4]   2> 871149 T2539 oascc.ZkStateReader$2.process A cluster state change: WatchedEvent state:SyncConnected type:NodeDataChanged path:/clusterstate.json, has occurred - updating... (live nodes size: 5)
   [junit4]   2> 871165 T2521 oascc.ZkStateReader$2.process A cluster state change: WatchedEvent state:SyncConnected type:NodeDataChanged path:/clusterstate.json, has occurred - updating... (live nodes size: 5)
   [junit4]   2> 871686 T2534 oasc.ZkController.waitForShardId waiting to find shard id in clusterstate for nodes_used_collection_shard1_replica1
   [junit4]   2> 871688 T2543 oasc.ZkController.waitForShardId waiting to find shard id in clusterstate for nodes_used_collection_shard2_replica2
   [junit4]   2> 871688 T2534 oasc.CorePropertiesLocator.writePropertiesFile ERROR Couldn't persist core properties to /Users/jenkins/jenkins-slave/workspace/Lucene-Solr-trunk-MacOSX/solr/build/solr-core/test/J0/./org.apache.solr.cloud.CollectionsAPIDistributedZkTest-jetty1-1375538433375/nodes_used_collection_shard1_replica1/core.properties: java.io.FileNotFoundException: /Users/jenkins/jenkins-slave/workspace/Lucene-Solr-trunk-MacOSX/solr/build/solr-core/test/J0/./org.apache.solr.cloud.CollectionsAPIDistributedZkTest-jetty1-1375538433375/nodes_used_collection_shard1_replica1/core.properties (No such file or directory)
   [junit4]   2> 871690 T2534 oasc.CoreContainer.create Creating SolrCore 'nodes_used_collection_shard1_replica1' using instanceDir: /Users/jenkins/jenkins-slave/workspace/Lucene-Solr-trunk-MacOSX/solr/build/solr-core/test/J0/./org.apache.solr.cloud.CollectionsAPIDistributedZkTest-jetty1-1375538433375/nodes_used_collection_shard1_replica1
   [junit4]   2> 871690 T2534 oasc.ZkController.createCollectionZkNode Check for collection zkNode:nodes_used_collection
   [junit4]   2> 871689 T2543 oasc.CorePropertiesLocator.writePropertiesFile ERROR Couldn't persist core properties to /Users/jenkins/jenkins-slave/workspace/Lucene-Solr-trunk-MacOSX/solr/build/solr-core/test/J0/./org.apache.solr.cloud.CollectionsAPIDistributedZkTest-jetty2-1375538437004/nodes_used_collection_shard2_replica2/core.properties: java.io.FileNotFoundException: /Users/jenkins/jenkins-slave/workspace/Lucene-Solr-trunk-MacOSX/solr/build/solr-core/test/J0/./org.apache.solr.cloud.CollectionsAPIDistributedZkTest-jetty2-1375538437004/nodes_used_collection_shard2_replica2/core.properties (No such file or directory)
   [junit4]   2> 871691 T2543 oasc.CoreContainer.create Creating SolrCore 'nodes_used_collection_shard2_replica2' using instanceDir: /Users/jenkins/jenkins-slave/workspace/Lucene-Solr-trunk-MacOSX/solr/build/solr-core/test/J0/./org.apache.solr.cloud.CollectionsAPIDistributedZkTest-jetty2-1375538437004/nodes_used_collection_shard2_replica2
   [junit4]   2> 871692 T2543 oasc.ZkController.createCollectionZkNode Check for collection zkNode:nodes_used_collection
   [junit4]   2> 871694 T2543 oasc.ZkController.createCollectionZkNode Creating collection in ZooKeeper:nodes_used_collection
   [junit4]   2> 871694 T2543 oasc.ZkController.getConfName Looking for collection configName
   [junit4]   2> 871695 T2534 oasc.ZkController.createCollectionZkNode Creating collection in ZooKeeper:nodes_used_collection
   [junit4]   2> 871697 T2513 oasc.ZkController.waitForShardId waiting to find shard id in clusterstate for nodes_used_collection_shard2_replica1
   [junit4]   2> 871701 T2534 oasc.ZkController.getConfName Looking for collection configName
   [junit4]   2> 871702 T2513 oasc.CorePropertiesLocator.writePropertiesFile ERROR Couldn't persist core properties to /Users/jenkins/jenkins-slave/workspace/Lucene-Solr-trunk-MacOSX/solr/build/solr-core/test/J0/./org.apache.solr.cloud.CollectionsAPIDistributedZkTest-controljetty-1375538431871/nodes_used_collection_shard2_replica1/core.properties: java.io.FileNotFoundException: /Users/jenkins/jenkins-slave/workspace/Lucene-Solr-trunk-MacOSX/solr/build/solr-core/test/J0/./org.apache.solr.cloud.CollectionsAPIDistributedZkTest-controljetty-1375538431871/nodes_used_collection_shard2_replica1/core.properties (No such file or directory)
   [junit4]   2> 871707 T2513 oasc.CoreContainer.create Creating SolrCore 'nodes_used_collection_shard2_replica1' using instanceDir: /Users/jenkins/jenkins-slave/workspace/Lucene-Solr-trunk-MacOSX/solr/build/solr-core/test/J0/./org.apache.solr.cloud.CollectionsAPIDistributedZkTest-controljetty-1375538431871/nodes_used_collection_shard2_replica1
   [junit4]   2> 871707 T2513 oasc.ZkController.createCollectionZkNode Check for collection zkNode:nodes_used_collection
   [junit4]   2> 871706 T2572 oasc.ZkController.waitForShardId waiting to find shard id in clusterstate for nodes_used_collection_shard1_replica2
   [junit4]   2> 871710 T2572 oasc.CorePropertiesLocator.writePropertiesFile ERROR Couldn't persist core properties to /Users/jenkins/jenkins-slave/workspace/Lucene-Solr-trunk-MacOSX/solr/build/solr-core/test/J0/./org.apache.solr.cloud.CollectionsAPIDistributedZkTest-jetty4-1375538444825/nodes_used_collection_shard1_replica2/core.properties: java.io.FileNotFoundException: /Users/jenkins/jenkins-slave/workspace/Lucene-Solr-trunk-MacOSX/solr/build/solr-core/test/J0/./org.apache.solr.cloud.CollectionsAPIDistributedZkTest-jetty4-1375538444825/nodes_used_collection_shard1_replica2/core.properties (No such file or directory)
   [junit4]   2> 871710 T2572 oasc.CoreContainer.create Creating SolrCore 'nodes_used_collection_shard1_replica2' using instanceDir: /Users/jenkins/jenkins-slave/workspace/Lucene-Solr-trunk-MacOSX/solr/build/solr-core/test/J0/./org.apache.solr.cloud.CollectionsAPIDistributedZkTest-jetty4-1375538444825/nodes_used_collection_shard1_replica2
   [junit4]   2> 871710 T2572 oasc.ZkController.createCollectionZkNode Check for collection zkNode:nodes_used_collection
   [junit4]   2> 871710 T2543 oasc.ZkController.getConfName Only one config set found in zk - using it:conf1
   [junit4]   2> 871712 T2543 oascc.SolrZkClient.makePath makePath: /collections/nodes_used_collection
   [junit4]   2> 871711 T2534 oasc.ZkController.getConfName Only one config set found in zk - using it:conf1
   [junit4]   2> 871711 T2513 oasc.ZkController.createCollectionZkNode Creating collection in ZooKeeper:nodes_used_collection
   [junit4]   2> 871714 T2513 oasc.ZkController.getConfName Looking for collection configName
   [junit4]   2> 871713 T2534 oascc.SolrZkClient.makePath makePath: /collections/nodes_used_collection
   [junit4]   2> 871712 T2572 oasc.ZkController.createCollectionZkNode Creating collection in ZooKeeper:nodes_used_collection
   [junit4]   2> 871717 T2572 oasc.ZkController.getConfName Looking for collection configName
   [junit4]   2> 871720 T2513 oascc.SolrZkClient.makePath makePath: /collections/nodes_used_collection
   [junit4]   2> 871721 T2543 oasc.ZkController.readConfigName Load collection config from:/collections/nodes_used_collection
   [junit4]   2> 871724 T2572 oascc.SolrZkClient.makePath makePath: /collections/nodes_used_collection
   [junit4]   2> 871725 T2534 oasc.ZkController.readConfigName Load collection config from:/collections/nodes_used_collection
   [junit4]   2> 871729 T2513 oasc.ZkController.readConfigName Load collection config from:/collections/nodes_used_collection
   [junit4]   2> 871729 T2543 oasc.SolrResourceLoader.<init> new SolrResourceLoader for directory: '/Users/jenkins/jenkins-slave/workspace/Lucene-Solr-trunk-MacOSX/solr/build/solr-core/test/J0/./org.apache.solr.cloud.CollectionsAPIDistributedZkTest-jetty2-1375538437004/nodes_used_collection_shard2_replica2/'
   [junit4]   2> 871739 T2534 oasc.SolrResourceLoader.<init> new SolrResourceLoader for directory: '/Users/jenkins/jenkins-slave/workspace/Lucene-Solr-trunk-MacOSX/solr/build/solr-core/test/J0/./org.apache.solr.cloud.CollectionsAPIDistributedZkTest-jetty1-1375538433375/nodes_used_collection_shard1_replica1/'
   [junit4]   2> 871746 T2572 oasc.ZkController.readConfigName Load collection config from:/collections/nodes_used_collection
   [junit4]   2> 871750 T2572 oasc.SolrResourceLoader.<init> new SolrResourceLoader for directory: '/Users/jenkins/jenkins-slave/workspace/Lucene-Solr-trunk-MacOSX/solr/build/solr-core/test/J0/./org.apache.solr.cloud.CollectionsAPIDistributedZkTest-jetty4-1375538444825/nodes_used_collection_shard1_replica2/'
   [junit4]   2> 871800 T2513 oasc.SolrResourceLoader.<init> new SolrResourceLoader for directory: '/Users/jenkins/jenkins-slave/workspace/Lucene-Solr-trunk-MacOSX/solr/build/solr-core/test/J0/./org.apache.solr.cloud.CollectionsAPIDistributedZkTest-controljetty-1375538431871/nodes_used_collection_shard2_replica1/'
   [junit4]   2> 872093 T2513 oasc.SolrConfig.<init> Using Lucene MatchVersion: LUCENE_50
   [junit4]   2> 872101 T2543 oasc.SolrConfig.<init> Using Lucene MatchVersion: LUCENE_50
   [junit4]   2> 872126 T2572 oasc.SolrConfig.<init> Using Lucene MatchVersion: LUCENE_50
   [junit4]   2> 872189 T2534 oasc.SolrConfig.<init> Using Lucene MatchVersion: LUCENE_50
   [junit4]   2> 872325 T2513 oasc.SolrConfig.<init> Loaded SolrConfig: solrconfig.xml
   [junit4]   2> 872335 T2513 oass.IndexSchema.readSchema Reading Solr Schema from schema.xml
   [junit4]   2> 872371 T2513 oass.IndexSchema.readSchema [nodes_used_collection_shard2_replica1] Schema name=test
   [junit4]   2> 872486 T2543 oasc.SolrConfig.<init> Loaded SolrConfig: solrconfig.xml
   [junit4]   2> 872493 T2543 oass.IndexSchema.readSchema Reading Solr Schema from schema.xml
   [junit4]   2> 872499 T2572 oasc.SolrConfig.<init> Loaded SolrConfig: solrconfig.xml
   [junit4]   2> 872502 T2572 oass.IndexSchema.readSchema Reading Solr Schema from schema.xml
   [junit4]   2> 872531 T2572 oass.IndexSchema.readSchema [nodes_used_collection_shard1_replica2] Schema name=test
   [junit4]   2> 872547 T2543 oass.IndexSchema.readSchema [nodes_used_collection_shard2_replica2] Schema name=test
   [junit4]   2> 872565 T2534 oasc.SolrConfig.<init> Loaded SolrConfig: solrconfig.xml
   [junit4]   2> 872577 T2534 oass.IndexSchema.readSchema Reading Solr Schema from schema.xml
   [junit4]   2> 872613 T2534 oass.IndexSchema.readSchema [nodes_used_collection_shard1_replica1] Schema name=test
   [junit4]   2> 876144 T2534 oass.OpenExchangeRatesOrgProvider.init Initialized with rates=open-exchange-rates.json, refreshInterval=1440.
   [junit4]   2> 876187 T2534 oass.IndexSchema.readSchema default search field in schema is text
   [junit4]   2> 876192 T2534 oass.IndexSchema.readSchema unique key field: id
   [junit4]   2> 876326 T2534 oass.FileExchangeRateProvider.reload Reloading exchange rates from file currency.xml
   [junit4]   2> 876335 T2534 oass.FileExchangeRateProvider.reload Reloading exchange rates from file currency.xml
   [junit4]   2> 876355 T2534 oass.OpenExchangeRatesOrgProvider.reload Reloading exchange rates from open-exchange-rates.json
   [junit4]   2> 876370 T2534 oass.OpenExchangeRatesOrgProvider$OpenExchangeRates.<init> WARN Unknown key IMPORTANT NOTE
   [junit4]   2> 876370 T2534 oass.OpenExchangeRatesOrgProvider$OpenExchangeRates.<init> WARN Expected key, got STRING
   [junit4]   2> 876371 T2534 oass.OpenExchangeRatesOrgProvider.reload Reloading exchange rates from open-exchange-rates.json
   [junit4]   2> 876381 T2534 oass.OpenExchangeRatesOrgProvider$OpenExchangeRates.<init> WARN Unknown key IMPORTANT NOTE
   [junit4]   2> 876381 T2534 oass.OpenExchangeRatesOrgProvider$OpenExchangeRates.<init> WARN Expected key, got STRING
   [junit4]   2> 876382 T2534 oasc.SolrCore.initDirectoryFactory org.apache.solr.core.MockDirectoryFactory
   [junit4]   2> 876383 T2534 oasc.SolrCore.<init> [nodes_used_collection_shard1_replica1] Opening new SolrCore at /Users/jenkins/jenkins-slave/workspace/Lucene-Solr-trunk-MacOSX/solr/build/solr-core/test/J0/./org.apache.solr.cloud.CollectionsAPIDistributedZkTest-jetty1-1375538433375/nodes_used_collection_shard1_replica1/, dataDir=/Users/jenkins/jenkins-slave/workspace/Lucene-Solr-trunk-MacOSX/solr/build/solr-core/test/J0/./org.apache.solr.cloud.CollectionsAPIDistributedZkTest-jetty1-1375538433375//nodes_used_collection_shard1_replica1/data/
   [junit4]   2> 876393 T2534 oasc.JmxMonitoredMap.<init> JMX monitoring is enabled. Adding Solr mbeans to JMX Server: com.sun.jmx.mbeanserver.JmxMBeanServer@1354e4e
   [junit4]   2> 876409 T2534 oasc.CachingDirectoryFactory.get return new directory for /Users/jenkins/jenkins-slave/workspace/Lucene-Solr-trunk-MacOSX/solr/build/solr-core/test/J0/./org.apache.solr.cloud.CollectionsAPIDistributedZkTest-jetty1-1375538433375//nodes_used_collection_shard1_replica1/data
   [junit4]   2> 876420 T2572 oass.OpenExchangeRatesOrgProvider.init Initialized with rates=open-exchange-rates.json, refreshInterval=1440.
   [junit4]   2> 876426 T2534 oasc.SolrCore.getNewIndexDir New index directory detected: old=null new=/Users/jenkins/jenkins-slave/workspace/Lucene-Solr-trunk-MacOSX/solr/build/solr-core/test/J0/./org.apache.solr.cloud.CollectionsAPIDistributedZkTest-jetty1-1375538433375//nodes_used_collection_shard1_replica1/data/index/
   [junit4]   2> 876426 T2534 oasc.SolrCore.initIndex WARN [nodes_used_collection_shard1_replica1] Solr index directory '/Users/jenkins/jenkins-slave/workspace/Lucene-Solr-trunk-MacOSX/solr/build/solr-core/test/J0/./org.apache.solr.cloud.CollectionsAPIDistributedZkTest-jetty1-1375538433375/nodes_used_collection_shard1_replica1/data/index' doesn't exist. Creating new index...
   [junit4]   2> 876432 T2572 oass.IndexSchema.readSchema default search field in schema is text
   [junit4]   2> 876435 T2534 oasc.CachingDirectoryFactory.get return new directory for /Users/jenkins/jenkins-slave/workspace/Lucene-Solr-trunk-MacOSX/solr/build/solr-core/test/J0/./org.apache.solr.cloud.CollectionsAPIDistributedZkTest-jetty1-1375538433375//nodes_used_collection_shard1_replica1/data/index
   [junit4]   2> 876439 T2572 oass.IndexSchema.readSchema unique key field: id
   [junit4]   2> 876457 T2534 oasc.SolrDeletionPolicy.onCommit SolrDeletionPolicy.onCommit: commits: num=1
   [junit4]   2> 		commit{dir=MockDirWrapper(org.apache.lucene.store.RAMDirectory@789d315e lockFactory=org.apache.lucene.store.NativeFSLockFactory@3fbef951),segFN=segments_1,generation=1}
   [junit4]   2> 876458 T2534 oasc.SolrDeletionPolicy.updateCommits newest commit generation = 1
   [junit4]   2> 876465 T2534 oasup.UpdateRequestProcessorChain.init inserting DistributedUpdateProcessorFactory into updateRequestProcessorChain "dedupe"
   [junit4]   2> 876466 T2534 oasup.UpdateRequestProcessorChain.init inserting DistributedUpdateProcessorFactory into updateRequestProcessorChain "stored_sig"
   [junit4]   2> 876484 T2534 oasup.UpdateRequestProcessorChain.init inserting DistributedUpdateProcessorFactory into updateRequestProcessorChain "distrib-dup-test-chain-implicit"
   [junit4]   2> 876485 T2534 oasc.RequestHandlers.initHandlersFromConfig created standard: solr.StandardRequestHandler
   [junit4]   2> 876486 T2534 oasc.RequestHandlers.initHandlersFromConfig created /get: solr.RealTimeGetHandler
   [junit4]   2> 876486 T2534 oasc.RequestHandlers.initHandlersFromConfig adding lazy requestHandler: solr.ReplicationHandler
   [junit4]   2> 876487 T2534 oasc.RequestHandlers.initHandlersFromConfig created /replication: solr.ReplicationHandler
   [junit4]   2> 876488 T2534 oasc.RequestHandlers.initHandlersFromConfig created /update: solr.UpdateRequestHandler
   [junit4]   2> 876488 T2534 oasc.RequestHandlers.initHandlersFromConfig created /admin/: org.apache.solr.handler.admin.AdminHandlers
   [junit4]   2> 876504 T2513 oass.OpenExchangeRatesOrgProvider.init Initialized with rates=open-exchange-rates.json, refreshInterval=1440.
   [junit4]   2> 876539 T2543 oass.OpenExchangeRatesOrgProvider.init Initialized with rates=open-exchange-rates.json, refreshInterval=1440.
   [junit4]   2> 876545 T2513 oass.IndexSchema.readSchema default search field in schema is text
   [junit4]   2> 876543 T2534 oashl.XMLLoader.init xsltCacheLifetimeSeconds=60
   [junit4]   2> 876564 T2513 oass.IndexSchema.readSchema unique key field: id
   [junit4]   2> 876558 T2543 oass.IndexSchema.readSchema default search field in schema is text
   [junit4]   2> 876576 T2543 oass.IndexSchema.readSchema unique key field: id
   [junit4]   2> 876584 T2534 oass.SolrIndexSearcher.<init> Opening Searcher@2535bfc3 main
   [junit4]   2> 876586 T2534 oasu.CommitTracker.<init> Hard AutoCommit: disabled
   [junit4]   2> 876587 T2534 oasu.CommitTracker.<init> Soft AutoCommit: disabled
   [junit4]   2> 876592 T2587 oasc.SolrCore.registerSearcher [nodes_used_collection_shard1_replica1] Registered new searcher Searcher@2535bfc3 main{StandardDirectoryReader(segments_1:1)}
   [junit4]   2> 876594 T2534 oasc.CoreContainer.registerCore registering core: nodes_used_collection_shard1_replica1
   [junit4]   2> 876596 T2534 oasc.ZkController.register Register replica - core:nodes_used_collection_shard1_replica1 address:http://127.0.0.1:49811 collection:nodes_used_collection shard:shard1
   [junit4]   2> 876601 T2534 oascsi.HttpClientUtil.createClient Creating new http client, config:maxConnections=10000&maxConnectionsPerHost=20&connTimeout=15000&socketTimeout=30000&retry=false
   [junit4]   2> 876600 T2572 oass.FileExchangeRateProvider.reload Reloading exchange rates from file currency.xml
   [junit4]   2> 876635 T2572 oass.FileExchangeRateProvider.reload Reloading exchange rates from file currency.xml
   [junit4]   2> 876641 T2513 oass.FileExchangeRateProvider.reload Reloading exchange rates from file currency.xml
   [junit4]   2> 876651 T2513 oass.FileExchangeRateProvider.reload Reloading exchange rates from file currency.xml
   [junit4]   2> 876651 T2572 oass.OpenExchangeRatesOrgProvider.reload Reloading exchange rates from open-exchange-rates.json
   [junit4]   2> 876659 T2513 oass.OpenExchangeRatesOrgProvider.reload Reloading exchange rates from open-exchange-rates.json
   [junit4]   2> 876662 T2572 oass.OpenExchangeRatesOrgProvider$OpenExchangeRates.<init> WARN Unknown key IMPORTANT NOTE
   [junit4]   2> 876662 T2572 oass.OpenExchangeRatesOrgProvider$OpenExchangeRates.<init> WARN Expected key, got STRING
   [junit4]   2> 876662 T2572 oass.OpenExchangeRatesOrgProvider.reload Reloading exchange rates from open-exchange-rates.json
   [junit4]   2> 876666 T2572 oass.OpenExchangeRatesOrgProvider$OpenExchangeRates.<init> WARN Unknown key IMPORTANT NOTE
   [junit4]   2> 876666 T2572 oass.OpenExchangeRatesOrgProvider$OpenExchangeRates.<init> WARN Expected key, got STRING
   [junit4]   2> 876667 T2572 oasc.SolrCore.initDirectoryFactory org.apache.solr.core.MockDirectoryFactory
   [junit4]   2> 876667 T2572 oasc.SolrCore.<init> [nodes_used_collection_shard1_replica2] Opening new SolrCore at /Users/jenkins/jenkins-slave/workspace/Lucene-Solr-trunk-MacOSX/solr/build/solr-core/test/J0/./org.apache.solr.cloud.CollectionsAPIDistributedZkTest-jetty4-1375538444825/nodes_used_collection_shard1_replica2/, dataDir=/Users/jenkins/jenkins-slave/workspace/Lucene-Solr-trunk-MacOSX/solr/build/solr-core/test/J0/./org.apache.solr.cloud.CollectionsAPIDistributedZkTest-jetty4-1375538444825//nodes_used_collection_shard1_replica2/data/
   [junit4]   2> 876668 T2572 oasc.JmxMonitoredMap.<init> JMX monitoring is enabled. Adding Solr mbeans to JMX Server: com.sun.jmx.mbeanserver.JmxMBeanServer@1354e4e
   [junit4]   2> 876675 T2572 oasc.CachingDirectoryFactory.get return new directory for /Users/jenkins/jenkins-slave/workspace/Lucene-Solr-trunk-MacOSX/solr/build/solr-core/test/J0/./org.apache.solr.cloud.CollectionsAPIDistributedZkTest-jetty4-1375538444825//nodes_used_collection_shard1_replica2/data
   [junit4]   2> 876680 T2534 oascc.SolrZkClient.makePath makePath: /collections/nodes_used_collection/leader_elect/shard1/election
   [junit4]   2> 876681 T2572 oasc.SolrCore.getNewIndexDir New index directory detected: old=null new=/Users/jenkins/jenkins-slave/workspace/Lucene-Solr-trunk-MacOSX/solr/build/solr-core/test/J0/./org.apache.solr.cloud.CollectionsAPIDistributedZkTest-jetty4-1375538444825//nodes_used_collection_shard1_replica2/data/index/
   [junit4]   2> 876683 T2572 oasc.SolrCore.initIndex WARN [nodes_used_collection_shard1_replica2] Solr index directory '/Users/jenkins/jenkins-slave/workspace/Lucene-Solr-trunk-MacOSX/solr/build/solr-core/test/J0/./org.apache.solr.cloud.CollectionsAPIDistributedZkTest-jetty4-1375538444825/nodes_used_collection_shard1_replica2/data/index' doesn't exist. Creating new index...
   [junit4]   2> 876684 T2513 oass.OpenExchangeRatesOrgProvider$OpenExchangeRates.<init> WARN Unknown key IMPORTANT NOTE
   [junit4]   2> 876684 T2513 oass.OpenExchangeRatesOrgProvider$OpenExchangeRates.<init> WARN Expected key, got STRING
   [junit4]   2> 876684 T2513 oass.OpenExchangeRatesOrgProvider.reload Reloading exchange rates from open-exchange-rates.json
   [junit4]   2> 876686 T2572 oasc.CachingDirectoryFactory.get return new directory for /Users/jenkins/jenkins-slave/workspace/Lucene-Solr-trunk-MacOSX/solr/build/solr-core/test/J0/./org.apache.solr.cloud.CollectionsAPIDistributedZkTest-jetty4-1375538444825//nodes_used_collection_shard1_replica2/data/index
   [junit4]   2> 876694 T2513 oass.OpenExchangeRatesOrgProvider$OpenExchangeRates.<init> WARN Unknown key IMPORTANT NOTE
   [junit4]   2> 876695 T2513 oass.OpenExchangeRatesOrgProvider$OpenExchangeRates.<init> WARN Expected key, got STRING
   [junit4]   2> 876696 T2513 oasc.SolrCore.initDirectoryFactory org.apache.solr.core.MockDirectoryFactory
   [junit4]   2> 876696 T2513 oasc.SolrCore.<init> [nodes_used_collection_shard2_replica1] Opening new SolrCore at /Users/jenkins/jenkins-slave/workspace/Lucene-Solr-trunk-MacOSX/solr/build/solr-core/test/J0/./org.apache.solr.cloud.CollectionsAPIDistributedZkTest-controljetty-1375538431871/nodes_used_collection_shard2_replica1/, dataDir=/Users/jenkins/jenkins-slave/workspace/Lucene-Solr-trunk-MacOSX/solr/build/solr-core/test/J0/./org.apache.solr.cloud.CollectionsAPIDistributedZkTest-controljetty-1375538431871//nodes_used_collection_shard2_replica1/data/
   [junit4]   2> 876697 T2513 oasc.JmxMonitoredMap.<init> JMX monitoring is enabled. Adding Solr mbeans to JMX Server: com.sun.jmx.mbeanserver.JmxMBeanServer@1354e4e
   [junit4]   2> 876701 T2572 oasc.SolrDeletionPolicy.onCommit SolrDeletionPolicy.onCommit: commits: num=1
   [junit4]   2> 		commit{dir=MockDirWrapper(org.apache.lucene.store.RAMDirectory@627f93ae lockFactory=org.apache.lucene.store.NativeFSLockFactory@512c1ca8),segFN=segments_1,generation=1}
   [junit4]   2> 876702 T2572 oasc.SolrDeletionPolicy.updateCommits newest commit generation = 1
   [junit4]   2> 876705 T2513 oasc.CachingDirectoryFactory.get return new directory for /Users/jenkins/jenkins-slave/workspace/Lucene-Solr-trunk-MacOSX/solr/build/solr-core/test/J0/./org.apache.solr.cloud.CollectionsAPIDistributedZkTest-controljetty-1375538431871//nodes_used_collection_shard2_replica1/data
   [junit4]   2> 876707 T2513 oasc.SolrCore.getNewIndexDir New index directory detected: old=null new=/Users/jenkins/jenkins-slave/workspace/Lucene-Solr-trunk-MacOSX/solr/build/solr-core/test/J0/./org.apache.solr.cloud.CollectionsAPIDistributedZkTest-controljetty-1375538431871//nodes_used_collection_shard2_replica1/data/index/
   [junit4]   2> 876707 T2513 oasc.SolrCore.initIndex WARN [nodes_used_collection_shard2_replica1] Solr index directory '/Users/jenkins/jenkins-slave/workspace/Lucene-Solr-trunk-MacOSX/solr/build/solr-core/test/J0/./org.apache.solr.cloud.CollectionsAPIDistributedZkTest-controljetty-1375538431871/nodes_used_collection_shard2_replica1/data/index' doesn't exist. Creating new index...
   [junit4]   2> 876712 T2513 oasc.CachingDirectoryFactory.get return new directory for /Users/jenkins/jenkins-slave/workspace/Lucene-Solr-trunk-MacOSX/solr/build/solr-core/test/J0/./org.apache.solr.cloud.CollectionsAPIDistributedZkTest-controljetty-1375538431871//nodes_used_collection_shard2_replica1/data/index
   [junit4]   2> 876717 T2513 oasc.SolrDeletionPolicy.onCommit SolrDeletionPolicy.onCommit: commits: num=1
   [junit4]   2> 		commit{dir=MockDirWrapper(org.apache.lucene.store.RAMDirectory@5a36446b lockFactory=org.apache.lucene.store.NativeFSLockFactory@3a9f096b),segFN=segments_1,generation=1}
   [junit4]   2> 876718 T2513 oasc.SolrDeletionPolicy.updateCommits newest commit generation = 1
   [junit4]   2> 876723 T2572 oasup.UpdateRequestProcessorChain.init inserting DistributedUpdateProcessorFactory into updateRequestProcessorChain "dedupe"
   [junit4]   2> 876727 T2543 oass.FileExchangeRateProvider.reload Reloading exchange rates from file currency.xml
   [junit4]   2> 876731 T2513 oasup.UpdateRequestProcessorChain.init inserting DistributedUpdateProcessorFactory into updateRequestProcessorChain "dedupe"
   [junit4]   2> 876732 T2513 oasup.UpdateRequestProcessorChain.init inserting DistributedUpdateProcessorFactory into updateRequestProcessorChain "stored_sig"
   [junit4]   2> 876733 T2513 oasup.UpdateRequestProcessorChain.init inserting DistributedUpdateProcessorFactory into updateRequestProcessorChain "distrib-dup-test-chain-implicit"
   [junit4]   2> 876734 T2513 oasc.RequestHandlers.initHandlersFromConfig created standard: solr.StandardRequestHandler
   [junit4]   2> 876735 T2513 oasc.RequestHandlers.initHandlersFromConfig created /get: solr.RealTimeGetHandler
   [junit4]   2> 876735 T2513 oasc.RequestHandlers.initHandlersFromConfig adding lazy requestHandler: solr.ReplicationHandler
   [junit4]   2> 876736 T2513 oasc.RequestHandlers.initHandlersFromConfig created /replication: solr.ReplicationHandler
   [junit4]   2> 876737 T2513 oasc.RequestHandlers.initHandlersFromConfig created /update: solr.UpdateRequestHandler
   [junit4]   2> 876737 T2513 oasc.RequestHandlers.initHandlersFromConfig created /admin/: org.apache.solr.handler.admin.AdminHandlers
   [junit4]   2> 876759 T2534 oasc.ShardLeaderElectionContext.runLeaderProcess Running the leader process for shard shard1
   [junit4]   2> 876760 T2572 oasup.UpdateRequestProcessorChain.init inserting DistributedUpdateProcessorFactory into updateRequestProcessorChain "stored_sig"
   [junit4]   2> 876765 T2572 oasup.UpdateRequestProcessorChain.init inserting DistributedUpdateProcessorFactory into updateRequestProcessorChain "distrib-dup-test-chain-implicit"
   [junit4]   2> 876766 T2572 oasc.RequestHandlers.initHandlersFromConfig created standard: solr.StandardRequestHandler
   [junit4]   2> 876767 T2572 oasc.RequestHandlers.initHandlersFromConfig created /get: solr.RealTimeGetHandler
   [junit4]   2> 876768 T2572 oasc.RequestHandlers.initHandlersFromConfig adding lazy requestHandler: solr.ReplicationHandler
   [junit4]   2> 876768 T2572 oasc.RequestHandlers.initHandlersFromConfig created /replication: solr.ReplicationHandler
   [junit4]   2> 876769 T2572 oasc.RequestHandlers.initHandlersFromConfig created /update: solr.UpdateRequestHandler
   [junit4]   2> 876770 T2572 oasc.RequestHandlers.initHandlersFromConfig created /admin/: org.apache.solr.handler.admin.AdminHandlers
   [junit4]   2> 876787 T2543 oass.FileExchangeRateProvider.reload Reloading exchange rates from file currency.xml
   [junit4]   2> 876793 T2513 oashl.XMLLoader.init xsltCacheLifetimeSeconds=60
   [junit4]   2> 876793 T2572 oashl.XMLLoader.init xsltCacheLifetimeSeconds=60
   [junit4]   2> 876799 T2513 oass.SolrIndexSearcher.<init> Opening Searcher@76dee13d main
   [junit4]   2> 876801 T2513 oasu.CommitTracker.<init> Hard AutoCommit: disabled
   [junit4]   2> 876802 T2513 oasu.CommitTracker.<init> Soft AutoCommit: disabled
   [junit4]   2> 876808 T2588 oasc.SolrCore.registerSearcher [nodes_used_collection_shard2_replica1] Registered new searcher Searcher@76dee13d main{StandardDirectoryReader(segments_1:1)}
   [junit4]   2> 876810 T2572 oass.SolrIndexSearcher.<init> Opening Searcher@51be3a4f main
   [junit4]   2> 876818 T2572 oasu.CommitTracker.<init> Hard AutoCommit: disabled
   [junit4]   2> 876818 T2572 oasu.CommitTracker.<init> Soft AutoCommit: disabled
   [junit4]   2> 876830 T2589 oasc.SolrCore.registerSearcher [nodes_used_collection_shard1_replica2] Registered new searcher Searcher@51be3a4f main{StandardDirectoryReader(segments_1:1)}
   [junit4]   2> 876816 T2513 oasc.CoreContainer.registerCore registering core: nodes_used_collection_shard2_replica1
   [junit4]   2> 876832 T2513 oasc.ZkController.register Register replica - core:nodes_used_collection_shard2_replica1 address:http://127.0.0.1:49807 collection:nodes_used_collection shard:shard2
   [junit4]   2> 876832 T2513 oascsi.HttpClientUtil.createClient Creating new http client, config:maxConnections=10000&maxConnectionsPerHost=20&connTimeout=15000&socketTimeout=30000&retry=false
   [junit4]   2> 876834 T2572 oasc.CoreContainer.registerCore registering core: nodes_used_collection_shard1_replica2
   [junit4]   2> 876835 T2572 oasc.ZkController.register Register replica - core:nodes_used_collection_shard1_replica2 address:http://127.0.0.1:49820 collection:nodes_used_collection shard:shard1
   [junit4]   2> 876836 T2572 oascsi.HttpClientUtil.createClient Creating new http client, config:maxConnections=10000&maxConnectionsPerHost=20&connTimeout=15000&socketTimeout=30000&retry=false
   [junit4]   2> 876830 T2534 oasc.ShardLeaderElectionContext.waitForReplicasToComeUp Waiting until we see more replicas up for shard shard1: total=2 found=1 timeoutin=179972
   [junit4]   2> 876848 T2543 oass.OpenExchangeRatesOrgProvider.reload Reloading exchange rates from open-exchange-rates.json
   [junit4]   2> 876864 T2543 oass.OpenExchangeRatesOrgProvider$OpenExchangeRates.<init> WARN Unknown key IMPORTANT NOTE
   [junit4]   2> 876865 T2543 oass.OpenExchangeRatesOrgProvider$OpenExchangeRates.<init> WARN Expected key, got STRING
   [junit4]   2> 876865 T2543 oass.OpenExchangeRatesOrgProvider.reload Reloading exchange rates from open-exchange-rates.json
   [junit4]   2> 876866 T2513 oascc.SolrZkClient.makePath makePath: /collections/nodes_used_collection/leader_elect/shard2/election
   [junit4]   2> 876883 T2543 oass.OpenExchangeRatesOrgProvider$OpenExchangeRates.<init> WARN Unknown key IMPORTANT NOTE
   [junit4]   2> 876883 T2543 oass.OpenExchangeRatesOrgProvider$OpenExchangeRates.<init> WARN Expected key, got STRING
   [junit4]   2> 876884 T2543 oasc.SolrCore.initDirectoryFactory org.apache.solr.core.MockDirectoryFactory
   [junit4]   2> 876885 T2543 oasc.SolrCore.<init> [nodes_used_collection_shard2_replica2] Opening new SolrCore at /Users/jenkins/jenkins-slave/workspace/Lucene-Solr-trunk-MacOSX/solr/build/solr-core/test/J0/./org.apache.solr.cloud.CollectionsAPIDistributedZkTest-jetty2-1375538437004/nodes_used_collection_shard2_replica2/, dataDir=/Users/jenkins/jenkins-slave/workspace/Lucene-Solr-trunk-MacOSX/solr/build/solr-core/test/J0/./org.apache.solr.cloud.CollectionsAPIDistributedZkTest-jetty2-1375538437004//nodes_used_collection_shard2_replica2/data/
   [junit4]   2> 876885 T2543 oasc.JmxMonitoredMap.<init> JMX monitoring is enabled. Adding Solr mbeans to JMX Server: com.sun.jmx.mbeanserver.JmxMBeanServer@1354e4e
   [junit4]   2> 876886 T2543 oasc.CachingDirectoryFactory.get return new directory for /Users/jenkins/jenkins-slave/workspace/Lucene-Solr-trunk-MacOSX/solr/build/solr-core/test/J0/./org.apache.solr.cloud.CollectionsAPIDistributedZkTest-jetty2-1375538437004//nodes_used_collection_shard2_replica2/data
   [junit4]   2> 876887 T2543 oasc.SolrCore.getNewIndexDir New index directory detected: old=null new=/Users/jenkins/jenkins-slave/workspace/Lucene-Solr-trunk-MacOSX/solr/build/solr-core/test/J0/./org.apache.solr.cloud.CollectionsAPIDistributedZkTest-jetty2-1375538437004//nodes_used_collection_shard2_replica2/data/index/
   [junit4]   2> 876887 T2543 oasc.SolrCore.initIndex WARN [nodes_used_collection_shard2_replica2] Solr index directory '/Users/jenkins/jenkins-slave/workspace/Lucene-Solr-trunk-MacOSX/solr/build/solr-core/test/J0/./org.apache.solr.cloud.CollectionsAPIDistributedZkTest-jetty2-1375538437004/nodes_used_collection_shard2_replica2/data/index' doesn't exist. Creating new index...
   [junit4]   2> 876888 T2543 oasc.CachingDirectoryFactory.get return new directory for /Users/jenkins/jenkins-slave/workspace/Lucene-Solr-trunk-MacOSX/solr/build/solr-core/test/J0/./org.apache.solr.cloud.CollectionsAPIDistributedZkTest-jetty2-1375538437004//nodes_used_collection_shard2_replica2/data/index
   [junit4]   2> 876895 T2543 oasc.SolrDeletionPolicy.onCommit SolrDeletionPolicy.onCommit: commits: num=1
   [junit4]   2> 		commit{dir=MockDirWrapper(org.apache.lucene.store.RAMDirectory@1913d60 lockFactory=org.apache.lucene.store.NativeFSLockFactory@4a28b42b),segFN=segments_1,generation=1}
   [junit4]   2> 876895 T2543 oasc.SolrDeletionPolicy.updateCommits newest commit generation = 1
   [junit4]   2> 876902 T2543 oasup.UpdateRequestProcessorChain.init inserting DistributedUpdateProcessorFactory into updateRequestProcessorChain "dedupe"
   [junit4]   2> 876903 T2543 oasup.UpdateRequestProcessorChain.init inserting DistributedUpdateProcessorFactory into updateRequestProcessorChain "stored_sig"
   [junit4]   2> 876905 T2543 oasup.UpdateRequestProcessorChain.init inserting DistributedUpdateProcessorFactory into updateRequestProcessorChain "distrib-dup-test-chain-implicit"
   [junit4]   2> 876912 T2543 oasc.RequestHandlers.initHandlersFromConfig created standard: solr.StandardRequestHandler
   [junit4]   2> 876905 T2513 oasc.ShardLeaderElectionContext.runLeaderProcess Running the leader process for shard shard2
   [junit4]   2> 876913 T2543 oasc.RequestHandlers.initHandlersFromConfig created /get: solr.RealTimeGetHandler
   [junit4]   2> 876914 T2543 oasc.RequestHandlers.initHandlersFromConfig adding lazy requestHandler: solr.ReplicationHandler
   [junit4]   2> 876915 T2543 oasc.RequestHandlers.initHandlersFromConfig created /replication: solr.ReplicationHandler
   [junit4]   2> 876916 T2543 oasc.RequestHandlers.initHandlersFromConfig created /update: solr.UpdateRequestHandler
   [junit4]   2> 876917 T2543 oasc.RequestHandlers.initHandlersFromConfig created /admin/: org.apache.solr.handler.admin.AdminHandlers
   [junit4]   2> 876921 T2513 oasc.ShardLeaderElectionContext.waitForReplicasToComeUp Waiting until we see more replicas up for shard shard2: total=2 found=1 timeoutin=179998
   [junit4]   2> 876936 T2543 oashl.XMLLoader.init xsltCacheLifetimeSeconds=60
   [junit4]   2> 876946 T2543 oass.SolrIndexSearcher.<init> Opening Searcher@7983555b main
   [junit4]   2> 876948 T2543 oasu.CommitTracker.<init> Hard AutoCommit: disabled
   [junit4]   2> 876948 T2543 oasu.CommitTracker.<init> Soft AutoCommit: disabled
   [junit4]   2> 876953 T2590 oasc.SolrCore.registerSearcher [nodes_used_collection_shard2_replica2] Registered new searcher Searcher@7983555b main{StandardDirectoryReader(segments_1:1)}
   [junit4]   2> 876957 T2543 oasc.CoreContainer.registerCore registering core: nodes_used_collection_shard2_replica2
   [junit4]   2> 876957 T2543 oasc.ZkController.register Register replica - core:nodes_used_collection_shard2_replica2 address:http://127.0.0.1:49814 collection:nodes_used_collection shard:shard2
   [junit4]   2> 876958 T2543 oascsi.HttpClientUtil.createClient Creating new http client, config:maxConnections=10000&maxConnectionsPerHost=20&connTimeout=15000&socketTimeout=30000&retry=false
   [junit4]   2> 877222 T2522 oascc.ZkStateReader.updateClusterState Updating cloud state from ZooKeeper... 
   [junit4]   2> 877247 T2567 oascc.ZkStateReader$2.process A cluster state change: WatchedEvent state:SyncConnected type:NodeDataChanged path:/clusterstate.json, has occurred - updating... (live nodes size: 5)
   [junit4]   2> 877247 T2521 oascc.ZkStateReader$2.process A cluster state change: WatchedEvent state:SyncConnected type:NodeDataChanged path:/clusterstate.json, has occurred - updating... (live nodes size: 5)
   [junit4]   2> 877248 T2526 oascc.ZkStateReader$2.process A cluster state change: WatchedEvent state:SyncConnected type:NodeDataChanged path:/clusterstate.json, has occurred - updating... (live nodes size: 5)
   [junit4]   2> 877247 T2553 oascc.ZkStateReader$2.process A cluster state change: WatchedEvent state:SyncConnected type:NodeDataChanged path:/clusterstate.json, has occurred - updating... (live nodes size: 5)
   [junit4]   2> 877247 T2581 oascc.ZkStateReader$2.process A cluster state change: WatchedEvent state:SyncConnected type:NodeDataChanged path:/clusterstate.json, has occurred - updating... (live nodes size: 5)
   [junit4]   2> 877247 T2539 oascc.ZkStateReader$2.process A cluster state change: WatchedEvent state:SyncConnected type:NodeDataChanged path:/clusterstate.json, has occurred - updating... (live nodes size: 5)
   [junit4]   2> 877348 T2534 oasc.ShardLeaderElectionContext.waitForReplicasToComeUp Enough replicas found to continue.
   [junit4]   2> 877348 T2534 oasc.ShardLeaderElectionContext.runLeaderProcess I may be the new leader - try and sync
   [junit4]   2> 877349 T2534 oasc.SyncStrategy.sync Sync replicas to http://127.0.0.1:49811/nodes_used_collection_shard1_replica1/
   [junit4]   2> 877349 T2534 oasu.PeerSync.sync PeerSync: core=nodes_used_collection_shard1_replica1 url=http://127.0.0.1:49811 START replicas=[http://127.0.0.1:49820/nodes_used_collection_shard1_replica2/] nUpdates=100
   [junit4]   2> 877350 T2534 oasu.PeerSync.sync PeerSync: core=nodes_used_collection_shard1_replica1 url=http://127.0.0.1:49811 DONE.  We have no versions.  sync failed.
   [junit4]   2> 877351 T2534 oasc.SyncStrategy.syncReplicas Leader's attempt to sync with shard failed, moving to the next candidate
   [junit4]   2> 877363 T2534 oasc.ShardLeaderElectionContext.runLeaderProcess We failed sync, but we have no versions - we can't sync in that case - we were active before, so become leader anyway
   [junit4]   2> 877365 T2534 oasc.ShardLeaderElectionContext.runLead

[...truncated too long message...]

solr/build/solr-core/test/J0/./org.apache.solr.cloud.CollectionsAPIDistributedZkTest-jetty4-1375538444825//new_implicit_coll_0_a_replica2/data/index [CachedDir<<refCount=0;path=/Users/jenkins/jenkins-slave/workspace/Lucene-Solr-trunk-MacOSX/solr/build/solr-core/test/J0/./org.apache.solr.cloud.CollectionsAPIDistributedZkTest-jetty4-1375538444825//new_implicit_coll_0_a_replica2/data/index;done=false>>]
   [junit4]   2> 1118566 T2499 oasc.CachingDirectoryFactory.close Closing directory: /Users/jenkins/jenkins-slave/workspace/Lucene-Solr-trunk-MacOSX/solr/build/solr-core/test/J0/./org.apache.solr.cloud.CollectionsAPIDistributedZkTest-jetty4-1375538444825//new_implicit_coll_0_a_replica2/data/index
   [junit4]   2> 1118567 T2499 oasc.CachingDirectoryFactory.closeCacheValue looking to close /Users/jenkins/jenkins-slave/workspace/Lucene-Solr-trunk-MacOSX/solr/build/solr-core/test/J0/./org.apache.solr.cloud.CollectionsAPIDistributedZkTest-jetty4-1375538444825//new_implicit_coll_0_a_replica2/data [CachedDir<<refCount=0;path=/Users/jenkins/jenkins-slave/workspace/Lucene-Solr-trunk-MacOSX/solr/build/solr-core/test/J0/./org.apache.solr.cloud.CollectionsAPIDistributedZkTest-jetty4-1375538444825//new_implicit_coll_0_a_replica2/data;done=false>>]
   [junit4]   2> 1118567 T2499 oasc.CachingDirectoryFactory.close Closing directory: /Users/jenkins/jenkins-slave/workspace/Lucene-Solr-trunk-MacOSX/solr/build/solr-core/test/J0/./org.apache.solr.cloud.CollectionsAPIDistributedZkTest-jetty4-1375538444825//new_implicit_coll_0_a_replica2/data
   [junit4]   2> 1118599 T2499 oejsh.ContextHandler.doStop stopped o.e.j.s.ServletContextHandler{/,null}
   [junit4]   2> 1118657 T2499 oas.SolrTestCaseJ4.tearDown ###Ending testDistribSearch
   [junit4]   2> 1118668 T2499 oasc.ZkTestServer.send4LetterWord connecting to 127.0.0.1:49804 49804
   [junit4]   1> client port:0.0.0.0/0.0.0.0:0
   [junit4]   2> NOTE: reproduce with: ant test  -Dtestcase=CollectionsAPIDistributedZkTest -Dtests.method=testDistribSearch -Dtests.seed=D249A40DB536FF7B -Dtests.slow=true -Dtests.locale=ja -Dtests.timezone=Asia/Ulaanbaatar -Dtests.file.encoding=UTF-8
   [junit4] ERROR    266s | CollectionsAPIDistributedZkTest.testDistribSearch <<<
   [junit4]    > Throwable #1: org.apache.solr.client.solrj.SolrServerException: Server refused connection at: http://127.0.0.1:49811
   [junit4]    > 	at __randomizedtesting.SeedInfo.seed([D249A40DB536FF7B:53AF2A15C2699F47]:0)
   [junit4]    > 	at org.apache.solr.client.solrj.impl.HttpSolrServer.request(HttpSolrServer.java:428)
   [junit4]    > 	at org.apache.solr.client.solrj.impl.HttpSolrServer.request(HttpSolrServer.java:180)
   [junit4]    > 	at org.apache.solr.cloud.CollectionsAPIDistributedZkTest.testCustomCollectionsAPI(CollectionsAPIDistributedZkTest.java:764)
   [junit4]    > 	at org.apache.solr.cloud.CollectionsAPIDistributedZkTest.doTest(CollectionsAPIDistributedZkTest.java:159)
   [junit4]    > 	at org.apache.solr.BaseDistributedSearchTestCase.testDistribSearch(BaseDistributedSearchTestCase.java:835)
   [junit4]    > 	at java.lang.Thread.run(Thread.java:724)
   [junit4]    > Caused by: org.apache.http.conn.HttpHostConnectException: Connection to http://127.0.0.1:49811 refused
   [junit4]    > 	at org.apache.http.impl.conn.DefaultClientConnectionOperator.openConnection(DefaultClientConnectionOperator.java:190)
   [junit4]    > 	at org.apache.http.impl.conn.ManagedClientConnectionImpl.open(ManagedClientConnectionImpl.java:294)
   [junit4]    > 	at org.apache.http.impl.client.DefaultRequestDirector.tryConnect(DefaultRequestDirector.java:645)
   [junit4]    > 	at org.apache.http.impl.client.DefaultRequestDirector.execute(DefaultRequestDirector.java:480)
   [junit4]    > 	at org.apache.http.impl.client.AbstractHttpClient.execute(AbstractHttpClient.java:906)
   [junit4]    > 	at org.apache.http.impl.client.AbstractHttpClient.execute(AbstractHttpClient.java:805)
   [junit4]    > 	at org.apache.http.impl.client.AbstractHttpClient.execute(AbstractHttpClient.java:784)
   [junit4]    > 	at org.apache.solr.client.solrj.impl.HttpSolrServer.request(HttpSolrServer.java:365)
   [junit4]    > 	... 44 more
   [junit4]    > Caused by: java.net.ConnectException: Connection refused
   [junit4]    > 	at java.net.PlainSocketImpl.socketConnect(Native Method)
   [junit4]    > 	at java.net.AbstractPlainSocketImpl.doConnect(AbstractPlainSocketImpl.java:339)
   [junit4]    > 	at java.net.AbstractPlainSocketImpl.connectToAddress(AbstractPlainSocketImpl.java:200)
   [junit4]    > 	at java.net.AbstractPlainSocketImpl.connect(AbstractPlainSocketImpl.java:182)
   [junit4]    > 	at java.net.SocksSocketImpl.connect(SocksSocketImpl.java:392)
   [junit4]    > 	at java.net.Socket.connect(Socket.java:579)
   [junit4]    > 	at org.apache.http.conn.scheme.PlainSocketFactory.connectSocket(PlainSocketFactory.java:127)
   [junit4]    > 	at org.apache.http.impl.conn.DefaultClientConnectionOperator.openConnection(DefaultClientConnectionOperator.java:180)
   [junit4]    > 	... 51 more
   [junit4]   2> 1118877 T2499 oas.SolrTestCaseJ4.deleteCore ###deleteCore
   [junit4]   2> 266173 T2498 ccr.ThreadLeakControl.checkThreadLeaks WARNING Will linger awaiting termination of 2 leaked thread(s).
   [junit4]   2> 1119880 T2581 oascc.ZkStateReader$3.process WARN ZooKeeper watch triggered, but Solr cannot talk to ZK
   [junit4]   2> 1119881 T2581 oascc.ZkStateReader$2.process A cluster state change: WatchedEvent state:SyncConnected type:NodeChildrenChanged path:/live_nodes, has occurred - updating... (live nodes size: 1)
   [junit4]   2> 1119881 T2581 oascc.ZkStateReader$2.process WARN ZooKeeper watch triggered, but Solr cannot talk to ZK
   [junit4]   2> NOTE: test params are: codec=Lucene42: {_route_=PostingsFormat(name=Lucene41VarGapFixedInterval), range_facet_l=PostingsFormat(name=Memory doPackFST= true), text=PostingsFormat(name=Lucene41VarGapFixedInterval), _version_=Pulsing41(freqCutoff=15 minBlockSize=88 maxBlockSize=256), intDefault=Pulsing41(freqCutoff=15 minBlockSize=88 maxBlockSize=256), id=PostingsFormat(name=Asserting), timestamp=PostingsFormat(name=Memory doPackFST= true), a_t=PostingsFormat(name=Memory doPackFST= true), range_facet_sl=PostingsFormat(name=Asserting), range_facet_si=PostingsFormat(name=Memory doPackFST= true), other_tl1=Pulsing41(freqCutoff=15 minBlockSize=88 maxBlockSize=256), multiDefault=PostingsFormat(name=Memory doPackFST= true), a_si=Pulsing41(freqCutoff=15 minBlockSize=88 maxBlockSize=256)}, docValues:{timestamp=DocValuesFormat(name=CheapBastard)}, sim=RandomSimilarityProvider(queryNorm=false,coord=no): {}, locale=ja, timezone=Asia/Ulaanbaatar
   [junit4]   2> NOTE: Mac OS X 10.8.4 x86_64/Oracle Corporation 1.7.0_25 (64-bit)/cpus=2,threads=8,free=259059784,total=393019392
   [junit4]   2> NOTE: All tests run in this JVM: [TestDefaultSearchFieldResource, ShardRoutingTest, TestSystemIdResolver, TestSolrCoreProperties, TestReplicationHandler, WordBreakSolrSpellCheckerTest, HdfsChaosMonkeySafeLeaderTest, TestSolr4Spatial, RegexBoostProcessorTest, UUIDFieldTest, DefaultValueUpdateProcessorTest, TestStressReorder, TestCopyFieldCollectionResource, PrimitiveFieldTypeTest, SolrCoreTest, TestLazyCores, InfoHandlerTest, AlternateDirectoryTest, LukeRequestHandlerTest, TestQuerySenderNoQuery, HdfsLockFactoryTest, OutputWriterTest, LegacyHTMLStripCharFilterTest, TestRecovery, CacheHeaderTest, TestMultiCoreConfBootstrap, TestAnalyzedSuggestions, DistributedTermsComponentTest, TestPostingsSolrHighlighter, TestRandomMergePolicy, TestSolrQueryParserResource, TestPluginEnable, SystemInfoHandlerTest, SoftAutoCommitTest, BasicFunctionalityTest, TestIndexSearcher, TestInfoStreamLogging, TestFastWriter, DistanceFunctionTest, TestWordDelimiterFilterFactory, OverseerTest, TestSort, FileUtilsTest, TestIndexingPerformance, DisMaxRequestHandlerTest, TestSchemaNameResource, BasicZkTest, SpatialFilterTest, SpellCheckCollatorTest, HdfsRecoveryZkTest, OverseerCollectionProcessorTest, TestDocumentBuilder, TestSolrQueryParserDefaultOperatorResource, TestCSVResponseWriter, CoreContainerCoreInitFailuresTest, TestUtils, PreAnalyzedFieldTest, TestLFUCache, DocumentBuilderTest, TermVectorComponentDistributedTest, TestCharFilters, RequiredFieldsTest, TestFastOutputStream, SyncSliceTest, TestLRUCache, TermVectorComponentTest, QueryEqualityTest, TestMaxScoreQueryParser, TestShardHandlerFactory, CoreAdminHandlerTest, ScriptEngineTest, TestSolrJ, TestPhraseSuggestions, SuggesterWFSTTest, TestSchemaSimilarityResource, SolrIndexSplitterTest, FastVectorHighlighterTest, TestTrie, CollectionsAPIDistributedZkTest]
   [junit4] Completed in 267.27s, 1 test, 1 error <<< FAILURES!

[...truncated 757 lines...]
BUILD FAILED
/Users/jenkins/jenkins-slave/workspace/Lucene-Solr-trunk-MacOSX/build.xml:389: The following error occurred while executing this line:
/Users/jenkins/jenkins-slave/workspace/Lucene-Solr-trunk-MacOSX/build.xml:369: The following error occurred while executing this line:
/Users/jenkins/jenkins-slave/workspace/Lucene-Solr-trunk-MacOSX/build.xml:39: The following error occurred while executing this line:
/Users/jenkins/jenkins-slave/workspace/Lucene-Solr-trunk-MacOSX/solr/build.xml:181: The following error occurred while executing this line:
/Users/jenkins/jenkins-slave/workspace/Lucene-Solr-trunk-MacOSX/solr/common-build.xml:449: The following error occurred while executing this line:
/Users/jenkins/jenkins-slave/workspace/Lucene-Solr-trunk-MacOSX/lucene/common-build.xml:1230: The following error occurred while executing this line:
/Users/jenkins/jenkins-slave/workspace/Lucene-Solr-trunk-MacOSX/lucene/common-build.xml:873: There were test failures: 320 suites, 1347 tests, 1 error, 39 ignored (5 assumptions)

Total time: 109 minutes 57 seconds
Build step 'Invoke Ant' marked build as failure
Description set: Java: 64bit/jdk1.7.0 -XX:-UseCompressedOops -XX:+UseParallelGC
Archiving artifacts
Recording test results
Email was triggered for: Failure
Sending email for trigger: Failure



Mime
View raw message