lucene-dev mailing list archives

Site index · List index
Message view « Date » · « Thread »
Top « Date » · « Thread »
From Policeman Jenkins Server <jenk...@thetaphi.de>
Subject [JENKINS] Lucene-Solr-trunk-Linux (32bit/jdk1.7.0_25) - Build # 6821 - Failure!
Date Thu, 01 Aug 2013 01:14:21 GMT
Build: http://jenkins.thetaphi.de/job/Lucene-Solr-trunk-Linux/6821/
Java: 32bit/jdk1.7.0_25 -client -XX:+UseParallelGC

1 tests failed.
FAILED:  org.apache.solr.cloud.CollectionsAPIDistributedZkTest.testDistribSearch

Error Message:
Server refused connection at: http://127.0.0.1:56171

Stack Trace:
org.apache.solr.client.solrj.SolrServerException: Server refused connection at: http://127.0.0.1:56171
	at __randomizedtesting.SeedInfo.seed([737B4C9C32C05245:F29DC284459F3279]:0)
	at org.apache.solr.client.solrj.impl.HttpSolrServer.request(HttpSolrServer.java:428)
	at org.apache.solr.client.solrj.impl.HttpSolrServer.request(HttpSolrServer.java:180)
	at org.apache.solr.cloud.CollectionsAPIDistributedZkTest.testCustomCollectionsAPI(CollectionsAPIDistributedZkTest.java:764)
	at org.apache.solr.cloud.CollectionsAPIDistributedZkTest.doTest(CollectionsAPIDistributedZkTest.java:159)
	at org.apache.solr.BaseDistributedSearchTestCase.testDistribSearch(BaseDistributedSearchTestCase.java:835)
	at sun.reflect.NativeMethodAccessorImpl.invoke0(Native Method)
	at sun.reflect.NativeMethodAccessorImpl.invoke(NativeMethodAccessorImpl.java:57)
	at sun.reflect.DelegatingMethodAccessorImpl.invoke(DelegatingMethodAccessorImpl.java:43)
	at java.lang.reflect.Method.invoke(Method.java:606)
	at com.carrotsearch.randomizedtesting.RandomizedRunner.invoke(RandomizedRunner.java:1559)
	at com.carrotsearch.randomizedtesting.RandomizedRunner.access$600(RandomizedRunner.java:79)
	at com.carrotsearch.randomizedtesting.RandomizedRunner$6.evaluate(RandomizedRunner.java:737)
	at com.carrotsearch.randomizedtesting.RandomizedRunner$7.evaluate(RandomizedRunner.java:773)
	at com.carrotsearch.randomizedtesting.RandomizedRunner$8.evaluate(RandomizedRunner.java:787)
	at com.carrotsearch.randomizedtesting.rules.SystemPropertiesRestoreRule$1.evaluate(SystemPropertiesRestoreRule.java:53)
	at org.apache.lucene.util.TestRuleSetupTeardownChained$1.evaluate(TestRuleSetupTeardownChained.java:50)
	at org.apache.lucene.util.TestRuleFieldCacheSanity$1.evaluate(TestRuleFieldCacheSanity.java:51)
	at org.apache.lucene.util.AbstractBeforeAfterRule$1.evaluate(AbstractBeforeAfterRule.java:46)
	at com.carrotsearch.randomizedtesting.rules.SystemPropertiesInvariantRule$1.evaluate(SystemPropertiesInvariantRule.java:55)
	at org.apache.lucene.util.TestRuleThreadAndTestName$1.evaluate(TestRuleThreadAndTestName.java:49)
	at org.apache.lucene.util.TestRuleIgnoreAfterMaxFailures$1.evaluate(TestRuleIgnoreAfterMaxFailures.java:70)
	at org.apache.lucene.util.TestRuleMarkFailure$1.evaluate(TestRuleMarkFailure.java:48)
	at com.carrotsearch.randomizedtesting.rules.StatementAdapter.evaluate(StatementAdapter.java:36)
	at com.carrotsearch.randomizedtesting.ThreadLeakControl$StatementRunner.run(ThreadLeakControl.java:358)
	at com.carrotsearch.randomizedtesting.ThreadLeakControl.forkTimeoutingTask(ThreadLeakControl.java:782)
	at com.carrotsearch.randomizedtesting.ThreadLeakControl$3.evaluate(ThreadLeakControl.java:442)
	at com.carrotsearch.randomizedtesting.RandomizedRunner.runSingleTest(RandomizedRunner.java:746)
	at com.carrotsearch.randomizedtesting.RandomizedRunner$3.evaluate(RandomizedRunner.java:648)
	at com.carrotsearch.randomizedtesting.RandomizedRunner$4.evaluate(RandomizedRunner.java:682)
	at com.carrotsearch.randomizedtesting.RandomizedRunner$5.evaluate(RandomizedRunner.java:693)
	at com.carrotsearch.randomizedtesting.rules.StatementAdapter.evaluate(StatementAdapter.java:36)
	at com.carrotsearch.randomizedtesting.rules.SystemPropertiesRestoreRule$1.evaluate(SystemPropertiesRestoreRule.java:53)
	at org.apache.lucene.util.AbstractBeforeAfterRule$1.evaluate(AbstractBeforeAfterRule.java:46)
	at org.apache.lucene.util.TestRuleStoreClassName$1.evaluate(TestRuleStoreClassName.java:42)
	at com.carrotsearch.randomizedtesting.rules.SystemPropertiesInvariantRule$1.evaluate(SystemPropertiesInvariantRule.java:55)
	at com.carrotsearch.randomizedtesting.rules.NoShadowingOrOverridesOnMethodsRule$1.evaluate(NoShadowingOrOverridesOnMethodsRule.java:39)
	at com.carrotsearch.randomizedtesting.rules.NoShadowingOrOverridesOnMethodsRule$1.evaluate(NoShadowingOrOverridesOnMethodsRule.java:39)
	at com.carrotsearch.randomizedtesting.rules.StatementAdapter.evaluate(StatementAdapter.java:36)
	at org.apache.lucene.util.TestRuleAssertionsRequired$1.evaluate(TestRuleAssertionsRequired.java:43)
	at org.apache.lucene.util.TestRuleMarkFailure$1.evaluate(TestRuleMarkFailure.java:48)
	at org.apache.lucene.util.TestRuleIgnoreAfterMaxFailures$1.evaluate(TestRuleIgnoreAfterMaxFailures.java:70)
	at org.apache.lucene.util.TestRuleIgnoreTestSuites$1.evaluate(TestRuleIgnoreTestSuites.java:55)
	at com.carrotsearch.randomizedtesting.rules.StatementAdapter.evaluate(StatementAdapter.java:36)
	at com.carrotsearch.randomizedtesting.ThreadLeakControl$StatementRunner.run(ThreadLeakControl.java:358)
	at java.lang.Thread.run(Thread.java:724)
Caused by: org.apache.http.conn.HttpHostConnectException: Connection to http://127.0.0.1:56171 refused
	at org.apache.http.impl.conn.DefaultClientConnectionOperator.openConnection(DefaultClientConnectionOperator.java:190)
	at org.apache.http.impl.conn.ManagedClientConnectionImpl.open(ManagedClientConnectionImpl.java:294)
	at org.apache.http.impl.client.DefaultRequestDirector.tryConnect(DefaultRequestDirector.java:645)
	at org.apache.http.impl.client.DefaultRequestDirector.execute(DefaultRequestDirector.java:480)
	at org.apache.http.impl.client.AbstractHttpClient.execute(AbstractHttpClient.java:906)
	at org.apache.http.impl.client.AbstractHttpClient.execute(AbstractHttpClient.java:805)
	at org.apache.http.impl.client.AbstractHttpClient.execute(AbstractHttpClient.java:784)
	at org.apache.solr.client.solrj.impl.HttpSolrServer.request(HttpSolrServer.java:365)
	... 44 more
Caused by: java.net.ConnectException: Connection refused
	at java.net.PlainSocketImpl.socketConnect(Native Method)
	at java.net.AbstractPlainSocketImpl.doConnect(AbstractPlainSocketImpl.java:339)
	at java.net.AbstractPlainSocketImpl.connectToAddress(AbstractPlainSocketImpl.java:200)
	at java.net.AbstractPlainSocketImpl.connect(AbstractPlainSocketImpl.java:182)
	at java.net.SocksSocketImpl.connect(SocksSocketImpl.java:392)
	at java.net.Socket.connect(Socket.java:579)
	at org.apache.http.conn.scheme.PlainSocketFactory.connectSocket(PlainSocketFactory.java:127)
	at org.apache.http.impl.conn.DefaultClientConnectionOperator.openConnection(DefaultClientConnectionOperator.java:180)
	... 51 more




Build Log:
[...truncated 9793 lines...]
   [junit4] Suite: org.apache.solr.cloud.CollectionsAPIDistributedZkTest
   [junit4]   2> 644693 T1953 oas.BaseDistributedSearchTestCase.initHostContext Setting hostContext system property: /
   [junit4]   2> 644698 T1953 oas.SolrTestCaseJ4.setUp ###Starting testDistribSearch
   [junit4]   2> Creating dataDir: /mnt/ssd/jenkins/workspace/Lucene-Solr-trunk-Linux/solr/build/solr-core/test/J1/./solrtest-CollectionsAPIDistributedZkTest-1375318854392
   [junit4]   2> 644698 T1953 oasc.ZkTestServer.run STARTING ZK TEST SERVER
   [junit4]   2> 644699 T1954 oasc.ZkTestServer$ZKServerMain.runFromConfig Starting server
   [junit4]   2> 644799 T1953 oasc.ZkTestServer.run start zk server on port:57173
   [junit4]   2> 644800 T1953 oascc.ConnectionManager.waitForConnected Waiting for client to connect to ZooKeeper
   [junit4]   2> 645003 T1960 oascc.ConnectionManager.process Watcher org.apache.solr.common.cloud.ConnectionManager@c37ce2 name:ZooKeeperConnection Watcher:127.0.0.1:57173 got event WatchedEvent state:SyncConnected type:None path:null path:null type:None
   [junit4]   2> 645003 T1953 oascc.ConnectionManager.waitForConnected Client is connected to ZooKeeper
   [junit4]   2> 645003 T1953 oascc.SolrZkClient.makePath makePath: /solr
   [junit4]   2> 645007 T1953 oascc.ConnectionManager.waitForConnected Waiting for client to connect to ZooKeeper
   [junit4]   2> 645008 T1962 oascc.ConnectionManager.process Watcher org.apache.solr.common.cloud.ConnectionManager@278643 name:ZooKeeperConnection Watcher:127.0.0.1:57173/solr got event WatchedEvent state:SyncConnected type:None path:null path:null type:None
   [junit4]   2> 645009 T1953 oascc.ConnectionManager.waitForConnected Client is connected to ZooKeeper
   [junit4]   2> 645009 T1953 oascc.SolrZkClient.makePath makePath: /collections/collection1
   [junit4]   2> 645011 T1953 oascc.SolrZkClient.makePath makePath: /collections/collection1/shards
   [junit4]   2> 645013 T1953 oascc.SolrZkClient.makePath makePath: /collections/control_collection
   [junit4]   2> 645015 T1953 oascc.SolrZkClient.makePath makePath: /collections/control_collection/shards
   [junit4]   2> 645017 T1953 oasc.AbstractZkTestCase.putConfig put /mnt/ssd/jenkins/workspace/Lucene-Solr-trunk-Linux/solr/build/solr-core/test-files/solr/collection1/conf/solrconfig-tlog.xml to /configs/conf1/solrconfig.xml
   [junit4]   2> 645017 T1953 oascc.SolrZkClient.makePath makePath: /configs/conf1/solrconfig.xml
   [junit4]   2> 645020 T1953 oasc.AbstractZkTestCase.putConfig put /mnt/ssd/jenkins/workspace/Lucene-Solr-trunk-Linux/solr/build/solr-core/test-files/solr/collection1/conf/schema.xml to /configs/conf1/schema.xml
   [junit4]   2> 645021 T1953 oascc.SolrZkClient.makePath makePath: /configs/conf1/schema.xml
   [junit4]   2> 645024 T1953 oasc.AbstractZkTestCase.putConfig put /mnt/ssd/jenkins/workspace/Lucene-Solr-trunk-Linux/solr/build/solr-core/test-files/solr/collection1/conf/stopwords.txt to /configs/conf1/stopwords.txt
   [junit4]   2> 645024 T1953 oascc.SolrZkClient.makePath makePath: /configs/conf1/stopwords.txt
   [junit4]   2> 645027 T1953 oasc.AbstractZkTestCase.putConfig put /mnt/ssd/jenkins/workspace/Lucene-Solr-trunk-Linux/solr/build/solr-core/test-files/solr/collection1/conf/protwords.txt to /configs/conf1/protwords.txt
   [junit4]   2> 645027 T1953 oascc.SolrZkClient.makePath makePath: /configs/conf1/protwords.txt
   [junit4]   2> 645029 T1953 oasc.AbstractZkTestCase.putConfig put /mnt/ssd/jenkins/workspace/Lucene-Solr-trunk-Linux/solr/build/solr-core/test-files/solr/collection1/conf/currency.xml to /configs/conf1/currency.xml
   [junit4]   2> 645029 T1953 oascc.SolrZkClient.makePath makePath: /configs/conf1/currency.xml
   [junit4]   2> 645031 T1953 oasc.AbstractZkTestCase.putConfig put /mnt/ssd/jenkins/workspace/Lucene-Solr-trunk-Linux/solr/build/solr-core/test-files/solr/collection1/conf/open-exchange-rates.json to /configs/conf1/open-exchange-rates.json
   [junit4]   2> 645031 T1953 oascc.SolrZkClient.makePath makePath: /configs/conf1/open-exchange-rates.json
   [junit4]   2> 645033 T1953 oasc.AbstractZkTestCase.putConfig put /mnt/ssd/jenkins/workspace/Lucene-Solr-trunk-Linux/solr/build/solr-core/test-files/solr/collection1/conf/mapping-ISOLatin1Accent.txt to /configs/conf1/mapping-ISOLatin1Accent.txt
   [junit4]   2> 645034 T1953 oascc.SolrZkClient.makePath makePath: /configs/conf1/mapping-ISOLatin1Accent.txt
   [junit4]   2> 645036 T1953 oasc.AbstractZkTestCase.putConfig put /mnt/ssd/jenkins/workspace/Lucene-Solr-trunk-Linux/solr/build/solr-core/test-files/solr/collection1/conf/old_synonyms.txt to /configs/conf1/old_synonyms.txt
   [junit4]   2> 645036 T1953 oascc.SolrZkClient.makePath makePath: /configs/conf1/old_synonyms.txt
   [junit4]   2> 645038 T1953 oasc.AbstractZkTestCase.putConfig put /mnt/ssd/jenkins/workspace/Lucene-Solr-trunk-Linux/solr/build/solr-core/test-files/solr/collection1/conf/synonyms.txt to /configs/conf1/synonyms.txt
   [junit4]   2> 645039 T1953 oascc.SolrZkClient.makePath makePath: /configs/conf1/synonyms.txt
   [junit4]   2> 645104 T1953 oejs.Server.doStart jetty-8.1.10.v20130312
   [junit4]   2> 645155 T1953 oejs.AbstractConnector.doStart Started SelectChannelConnector@127.0.0.1:50200
   [junit4]   2> 645155 T1953 oass.SolrDispatchFilter.init SolrDispatchFilter.init()
   [junit4]   2> 645156 T1953 oasc.SolrResourceLoader.locateSolrHome JNDI not configured for solr (NoInitialContextEx)
   [junit4]   2> 645156 T1953 oasc.SolrResourceLoader.locateSolrHome using system property solr.solr.home: /mnt/ssd/jenkins/workspace/Lucene-Solr-trunk-Linux/solr/build/solr-core/test/J1/./org.apache.solr.cloud.CollectionsAPIDistributedZkTest-controljetty-1375318854735
   [junit4]   2> 645156 T1953 oasc.SolrResourceLoader.<init> new SolrResourceLoader for directory: '/mnt/ssd/jenkins/workspace/Lucene-Solr-trunk-Linux/solr/build/solr-core/test/J1/./org.apache.solr.cloud.CollectionsAPIDistributedZkTest-controljetty-1375318854735/'
   [junit4]   2> 645168 T1953 oasc.ConfigSolr.fromFile Loading container configuration from /mnt/ssd/jenkins/workspace/Lucene-Solr-trunk-Linux/solr/build/solr-core/test/J1/./org.apache.solr.cloud.CollectionsAPIDistributedZkTest-controljetty-1375318854735/solr.xml
   [junit4]   2> 645208 T1953 oasc.ConfigSolrXml.<init> Config-defined core root directory: 
   [junit4]   2> 645208 T1953 oasc.CoreContainer.<init> New CoreContainer 12621811
   [junit4]   2> 645209 T1953 oasc.CoreContainer.load Loading cores into CoreContainer [instanceDir=/mnt/ssd/jenkins/workspace/Lucene-Solr-trunk-Linux/solr/build/solr-core/test/J1/./org.apache.solr.cloud.CollectionsAPIDistributedZkTest-controljetty-1375318854735/]
   [junit4]   2> 645210 T1953 oashc.HttpShardHandlerFactory.getParameter Setting socketTimeout to: 120000
   [junit4]   2> 645210 T1953 oashc.HttpShardHandlerFactory.getParameter Setting urlScheme to: http://
   [junit4]   2> 645211 T1953 oashc.HttpShardHandlerFactory.getParameter Setting connTimeout to: 15000
   [junit4]   2> 645211 T1953 oashc.HttpShardHandlerFactory.getParameter Setting maxConnectionsPerHost to: 20
   [junit4]   2> 645211 T1953 oashc.HttpShardHandlerFactory.getParameter Setting corePoolSize to: 0
   [junit4]   2> 645211 T1953 oashc.HttpShardHandlerFactory.getParameter Setting maximumPoolSize to: 2147483647
   [junit4]   2> 645212 T1953 oashc.HttpShardHandlerFactory.getParameter Setting maxThreadIdleTime to: 5
   [junit4]   2> 645212 T1953 oashc.HttpShardHandlerFactory.getParameter Setting sizeOfQueue to: -1
   [junit4]   2> 645212 T1953 oashc.HttpShardHandlerFactory.getParameter Setting fairnessPolicy to: false
   [junit4]   2> 645213 T1953 oascsi.HttpClientUtil.createClient Creating new http client, config:maxConnectionsPerHost=20&maxConnections=10000&socketTimeout=120000&connTimeout=15000&retry=false
   [junit4]   2> 645216 T1953 oasc.ZkContainer.initZooKeeper Zookeeper client=127.0.0.1:57173/solr
   [junit4]   2> 645216 T1953 oasc.ZkController.checkChrootPath zkHost includes chroot
   [junit4]   2> 645217 T1953 oascc.ConnectionManager.waitForConnected Waiting for client to connect to ZooKeeper
   [junit4]   2> 645219 T1973 oascc.ConnectionManager.process Watcher org.apache.solr.common.cloud.ConnectionManager@1d23feb name:ZooKeeperConnection Watcher:127.0.0.1:57173 got event WatchedEvent state:SyncConnected type:None path:null path:null type:None
   [junit4]   2> 645219 T1953 oascc.ConnectionManager.waitForConnected Client is connected to ZooKeeper
   [junit4]   2> 645221 T1953 oascsi.HttpClientUtil.createClient Creating new http client, config:maxConnections=500&maxConnectionsPerHost=16&socketTimeout=120000&connTimeout=15000
   [junit4]   2> 645224 T1953 oascc.ConnectionManager.waitForConnected Waiting for client to connect to ZooKeeper
   [junit4]   2> 645225 T1975 oascc.ConnectionManager.process Watcher org.apache.solr.common.cloud.ConnectionManager@1e1540 name:ZooKeeperConnection Watcher:127.0.0.1:57173/solr got event WatchedEvent state:SyncConnected type:None path:null path:null type:None
   [junit4]   2> 645225 T1953 oascc.ConnectionManager.waitForConnected Client is connected to ZooKeeper
   [junit4]   2> 645226 T1953 oascc.SolrZkClient.makePath makePath: /overseer/queue
   [junit4]   2> 645228 T1953 oascc.SolrZkClient.makePath makePath: /overseer/collection-queue-work
   [junit4]   2> 645231 T1953 oascc.SolrZkClient.makePath makePath: /live_nodes
   [junit4]   2> 645232 T1953 oasc.ZkController.createEphemeralLiveNode Register node as live in ZooKeeper:/live_nodes/127.0.0.1:50200_
   [junit4]   2> 645233 T1953 oascc.SolrZkClient.makePath makePath: /live_nodes/127.0.0.1:50200_
   [junit4]   2> 645235 T1953 oascc.SolrZkClient.makePath makePath: /overseer_elect/election
   [junit4]   2> 645239 T1953 oascc.SolrZkClient.makePath makePath: /overseer_elect/leader
   [junit4]   2> 645241 T1953 oasc.Overseer.start Overseer (id=90132896441565187-127.0.0.1:50200_-n_0000000000) starting
   [junit4]   2> 645247 T1953 oascc.SolrZkClient.makePath makePath: /overseer/queue-work
   [junit4]   2> 645250 T1977 oasc.OverseerCollectionProcessor.run Process current queue of collection creations
   [junit4]   2> 645250 T1953 oascc.SolrZkClient.makePath makePath: /clusterstate.json
   [junit4]   2> 645252 T1953 oascc.SolrZkClient.makePath makePath: /aliases.json
   [junit4]   2> 645253 T1953 oascc.ZkStateReader.createClusterStateWatchersAndUpdate Updating cluster state from ZooKeeper... 
   [junit4]   2> 645255 T1976 oasc.Overseer$ClusterStateUpdater.run Starting to work on the main queue
   [junit4]   2> 645259 T1953 oasc.CorePropertiesLocator.discover Looking for core definitions underneath /mnt/ssd/jenkins/workspace/Lucene-Solr-trunk-Linux/solr/build/solr-core/test/J1/./org.apache.solr.cloud.CollectionsAPIDistributedZkTest-controljetty-1375318854735
   [junit4]   2> 645282 T1953 oasc.CorePropertiesLocator.discoverUnder Found core conf in /mnt/ssd/jenkins/workspace/Lucene-Solr-trunk-Linux/solr/build/solr-core/test/J1/./org.apache.solr.cloud.CollectionsAPIDistributedZkTest-controljetty-1375318854735/conf/
   [junit4]   2> 645283 T1953 oasc.CorePropertiesLocator.discover Found 1 core definitions
   [junit4]   2> 645283 T1953 oass.SolrDispatchFilter.init user.dir=/mnt/ssd/jenkins/workspace/Lucene-Solr-trunk-Linux/solr/build/solr-core/test/J1
   [junit4]   2> 645283 T1953 oass.SolrDispatchFilter.init SolrDispatchFilter.init() done
   [junit4]   2> 645284 T1953 oascsi.HttpClientUtil.createClient Creating new http client, config:maxConnections=128&maxConnectionsPerHost=32&followRedirects=false
   [junit4]   2> 645287 T1953 oascsi.HttpClientUtil.createClient Creating new http client, config:
   [junit4]   2> 645288 T1953 oascc.ConnectionManager.waitForConnected Waiting for client to connect to ZooKeeper
   [junit4]   2> 645289 T1980 oascc.ConnectionManager.process Watcher org.apache.solr.common.cloud.ConnectionManager@1d1b699 name:ZooKeeperConnection Watcher:127.0.0.1:57173/solr got event WatchedEvent state:SyncConnected type:None path:null path:null type:None
   [junit4]   2> 645289 T1953 oascc.ConnectionManager.waitForConnected Client is connected to ZooKeeper
   [junit4]   2> 645290 T1953 oascc.ZkStateReader.createClusterStateWatchersAndUpdate Updating cluster state from ZooKeeper... 
   [junit4]   2> 645291 T1953 oasc.ChaosMonkey.monkeyLog monkey: init - expire sessions:true cause connection loss:true
   [junit4]   2> 645354 T1953 oejs.Server.doStart jetty-8.1.10.v20130312
   [junit4]   2> 645356 T1953 oejs.AbstractConnector.doStart Started SelectChannelConnector@127.0.0.1:56171
   [junit4]   2> 645356 T1953 oass.SolrDispatchFilter.init SolrDispatchFilter.init()
   [junit4]   2> 645356 T1953 oasc.SolrResourceLoader.locateSolrHome JNDI not configured for solr (NoInitialContextEx)
   [junit4]   2> 645357 T1953 oasc.SolrResourceLoader.locateSolrHome using system property solr.solr.home: /mnt/ssd/jenkins/workspace/Lucene-Solr-trunk-Linux/solr/build/solr-core/test/J1/./org.apache.solr.cloud.CollectionsAPIDistributedZkTest-jetty1-1375318854985
   [junit4]   2> 645357 T1953 oasc.SolrResourceLoader.<init> new SolrResourceLoader for directory: '/mnt/ssd/jenkins/workspace/Lucene-Solr-trunk-Linux/solr/build/solr-core/test/J1/./org.apache.solr.cloud.CollectionsAPIDistributedZkTest-jetty1-1375318854985/'
   [junit4]   2> 645368 T1953 oasc.ConfigSolr.fromFile Loading container configuration from /mnt/ssd/jenkins/workspace/Lucene-Solr-trunk-Linux/solr/build/solr-core/test/J1/./org.apache.solr.cloud.CollectionsAPIDistributedZkTest-jetty1-1375318854985/solr.xml
   [junit4]   2> 645405 T1953 oasc.ConfigSolrXml.<init> Config-defined core root directory: 
   [junit4]   2> 645405 T1953 oasc.CoreContainer.<init> New CoreContainer 11260238
   [junit4]   2> 645406 T1953 oasc.CoreContainer.load Loading cores into CoreContainer [instanceDir=/mnt/ssd/jenkins/workspace/Lucene-Solr-trunk-Linux/solr/build/solr-core/test/J1/./org.apache.solr.cloud.CollectionsAPIDistributedZkTest-jetty1-1375318854985/]
   [junit4]   2> 645407 T1953 oashc.HttpShardHandlerFactory.getParameter Setting socketTimeout to: 120000
   [junit4]   2> 645407 T1953 oashc.HttpShardHandlerFactory.getParameter Setting urlScheme to: http://
   [junit4]   2> 645407 T1953 oashc.HttpShardHandlerFactory.getParameter Setting connTimeout to: 15000
   [junit4]   2> 645408 T1953 oashc.HttpShardHandlerFactory.getParameter Setting maxConnectionsPerHost to: 20
   [junit4]   2> 645408 T1953 oashc.HttpShardHandlerFactory.getParameter Setting corePoolSize to: 0
   [junit4]   2> 645408 T1953 oashc.HttpShardHandlerFactory.getParameter Setting maximumPoolSize to: 2147483647
   [junit4]   2> 645409 T1953 oashc.HttpShardHandlerFactory.getParameter Setting maxThreadIdleTime to: 5
   [junit4]   2> 645409 T1953 oashc.HttpShardHandlerFactory.getParameter Setting sizeOfQueue to: -1
   [junit4]   2> 645409 T1953 oashc.HttpShardHandlerFactory.getParameter Setting fairnessPolicy to: false
   [junit4]   2> 645409 T1953 oascsi.HttpClientUtil.createClient Creating new http client, config:maxConnectionsPerHost=20&maxConnections=10000&socketTimeout=120000&connTimeout=15000&retry=false
   [junit4]   2> 645413 T1953 oasc.ZkContainer.initZooKeeper Zookeeper client=127.0.0.1:57173/solr
   [junit4]   2> 645413 T1953 oasc.ZkController.checkChrootPath zkHost includes chroot
   [junit4]   2> 645414 T1953 oascc.ConnectionManager.waitForConnected Waiting for client to connect to ZooKeeper
   [junit4]   2> 645415 T1991 oascc.ConnectionManager.process Watcher org.apache.solr.common.cloud.ConnectionManager@12f1b4b name:ZooKeeperConnection Watcher:127.0.0.1:57173 got event WatchedEvent state:SyncConnected type:None path:null path:null type:None
   [junit4]   2> 645415 T1953 oascc.ConnectionManager.waitForConnected Client is connected to ZooKeeper
   [junit4]   2> 645417 T1953 oascsi.HttpClientUtil.createClient Creating new http client, config:maxConnections=500&maxConnectionsPerHost=16&socketTimeout=120000&connTimeout=15000
   [junit4]   2> 645419 T1953 oascc.ConnectionManager.waitForConnected Waiting for client to connect to ZooKeeper
   [junit4]   2> 645420 T1993 oascc.ConnectionManager.process Watcher org.apache.solr.common.cloud.ConnectionManager@e1cbc1 name:ZooKeeperConnection Watcher:127.0.0.1:57173/solr got event WatchedEvent state:SyncConnected type:None path:null path:null type:None
   [junit4]   2> 645420 T1953 oascc.ConnectionManager.waitForConnected Client is connected to ZooKeeper
   [junit4]   2> 645423 T1953 oascc.ZkStateReader.createClusterStateWatchersAndUpdate Updating cluster state from ZooKeeper... 
   [junit4]   2> 646425 T1953 oasc.ZkController.createEphemeralLiveNode Register node as live in ZooKeeper:/live_nodes/127.0.0.1:56171_
   [junit4]   2> 646426 T1953 oascc.SolrZkClient.makePath makePath: /live_nodes/127.0.0.1:56171_
   [junit4]   2> 646429 T1980 oascc.ZkStateReader$3.process Updating live nodes... (2)
   [junit4]   2> 646429 T1993 oascc.ZkStateReader$3.process Updating live nodes... (2)
   [junit4]   2> 646429 T1975 oascc.ZkStateReader$3.process Updating live nodes... (2)
   [junit4]   2> 646435 T1953 oasc.CorePropertiesLocator.discover Looking for core definitions underneath /mnt/ssd/jenkins/workspace/Lucene-Solr-trunk-Linux/solr/build/solr-core/test/J1/./org.apache.solr.cloud.CollectionsAPIDistributedZkTest-jetty1-1375318854985
   [junit4]   2> 646458 T1953 oasc.CorePropertiesLocator.discoverUnder Found core conf in /mnt/ssd/jenkins/workspace/Lucene-Solr-trunk-Linux/solr/build/solr-core/test/J1/./org.apache.solr.cloud.CollectionsAPIDistributedZkTest-jetty1-1375318854985/conf/
   [junit4]   2> 646459 T1953 oasc.CorePropertiesLocator.discover Found 1 core definitions
   [junit4]   2> 646460 T1953 oass.SolrDispatchFilter.init user.dir=/mnt/ssd/jenkins/workspace/Lucene-Solr-trunk-Linux/solr/build/solr-core/test/J1
   [junit4]   2> 646460 T1953 oass.SolrDispatchFilter.init SolrDispatchFilter.init() done
   [junit4]   2> 646460 T1953 oascsi.HttpClientUtil.createClient Creating new http client, config:maxConnections=128&maxConnectionsPerHost=32&followRedirects=false
   [junit4]   2> 646525 T1953 oejs.Server.doStart jetty-8.1.10.v20130312
   [junit4]   2> 646527 T1953 oejs.AbstractConnector.doStart Started SelectChannelConnector@127.0.0.1:40304
   [junit4]   2> 646528 T1953 oass.SolrDispatchFilter.init SolrDispatchFilter.init()
   [junit4]   2> 646528 T1953 oasc.SolrResourceLoader.locateSolrHome JNDI not configured for solr (NoInitialContextEx)
   [junit4]   2> 646529 T1953 oasc.SolrResourceLoader.locateSolrHome using system property solr.solr.home: /mnt/ssd/jenkins/workspace/Lucene-Solr-trunk-Linux/solr/build/solr-core/test/J1/./org.apache.solr.cloud.CollectionsAPIDistributedZkTest-jetty2-1375318856157
   [junit4]   2> 646529 T1953 oasc.SolrResourceLoader.<init> new SolrResourceLoader for directory: '/mnt/ssd/jenkins/workspace/Lucene-Solr-trunk-Linux/solr/build/solr-core/test/J1/./org.apache.solr.cloud.CollectionsAPIDistributedZkTest-jetty2-1375318856157/'
   [junit4]   2> 646540 T1953 oasc.ConfigSolr.fromFile Loading container configuration from /mnt/ssd/jenkins/workspace/Lucene-Solr-trunk-Linux/solr/build/solr-core/test/J1/./org.apache.solr.cloud.CollectionsAPIDistributedZkTest-jetty2-1375318856157/solr.xml
   [junit4]   2> 646576 T1953 oasc.ConfigSolrXml.<init> Config-defined core root directory: 
   [junit4]   2> 646577 T1953 oasc.CoreContainer.<init> New CoreContainer 6188217
   [junit4]   2> 646577 T1953 oasc.CoreContainer.load Loading cores into CoreContainer [instanceDir=/mnt/ssd/jenkins/workspace/Lucene-Solr-trunk-Linux/solr/build/solr-core/test/J1/./org.apache.solr.cloud.CollectionsAPIDistributedZkTest-jetty2-1375318856157/]
   [junit4]   2> 646578 T1953 oashc.HttpShardHandlerFactory.getParameter Setting socketTimeout to: 120000
   [junit4]   2> 646579 T1953 oashc.HttpShardHandlerFactory.getParameter Setting urlScheme to: http://
   [junit4]   2> 646579 T1953 oashc.HttpShardHandlerFactory.getParameter Setting connTimeout to: 15000
   [junit4]   2> 646579 T1953 oashc.HttpShardHandlerFactory.getParameter Setting maxConnectionsPerHost to: 20
   [junit4]   2> 646580 T1953 oashc.HttpShardHandlerFactory.getParameter Setting corePoolSize to: 0
   [junit4]   2> 646580 T1953 oashc.HttpShardHandlerFactory.getParameter Setting maximumPoolSize to: 2147483647
   [junit4]   2> 646581 T1953 oashc.HttpShardHandlerFactory.getParameter Setting maxThreadIdleTime to: 5
   [junit4]   2> 646581 T1953 oashc.HttpShardHandlerFactory.getParameter Setting sizeOfQueue to: -1
   [junit4]   2> 646582 T1953 oashc.HttpShardHandlerFactory.getParameter Setting fairnessPolicy to: false
   [junit4]   2> 646582 T1953 oascsi.HttpClientUtil.createClient Creating new http client, config:maxConnectionsPerHost=20&maxConnections=10000&socketTimeout=120000&connTimeout=15000&retry=false
   [junit4]   2> 646585 T1953 oasc.ZkContainer.initZooKeeper Zookeeper client=127.0.0.1:57173/solr
   [junit4]   2> 646586 T1953 oasc.ZkController.checkChrootPath zkHost includes chroot
   [junit4]   2> 646587 T1953 oascc.ConnectionManager.waitForConnected Waiting for client to connect to ZooKeeper
   [junit4]   2> 646588 T2005 oascc.ConnectionManager.process Watcher org.apache.solr.common.cloud.ConnectionManager@47da5d name:ZooKeeperConnection Watcher:127.0.0.1:57173 got event WatchedEvent state:SyncConnected type:None path:null path:null type:None
   [junit4]   2> 646588 T1953 oascc.ConnectionManager.waitForConnected Client is connected to ZooKeeper
   [junit4]   2> 646590 T1953 oascsi.HttpClientUtil.createClient Creating new http client, config:maxConnections=500&maxConnectionsPerHost=16&socketTimeout=120000&connTimeout=15000
   [junit4]   2> 646604 T1953 oascc.ConnectionManager.waitForConnected Waiting for client to connect to ZooKeeper
   [junit4]   2> 646606 T2007 oascc.ConnectionManager.process Watcher org.apache.solr.common.cloud.ConnectionManager@1bac282 name:ZooKeeperConnection Watcher:127.0.0.1:57173/solr got event WatchedEvent state:SyncConnected type:None path:null path:null type:None
   [junit4]   2> 646606 T1953 oascc.ConnectionManager.waitForConnected Client is connected to ZooKeeper
   [junit4]   2> 646609 T1953 oascc.ZkStateReader.createClusterStateWatchersAndUpdate Updating cluster state from ZooKeeper... 
   [junit4]   2> 647611 T1953 oasc.ZkController.createEphemeralLiveNode Register node as live in ZooKeeper:/live_nodes/127.0.0.1:40304_
   [junit4]   2> 647612 T1953 oascc.SolrZkClient.makePath makePath: /live_nodes/127.0.0.1:40304_
   [junit4]   2> 647615 T1975 oascc.ZkStateReader$3.process Updating live nodes... (3)
   [junit4]   2> 647615 T1980 oascc.ZkStateReader$3.process Updating live nodes... (3)
   [junit4]   2> 647615 T1993 oascc.ZkStateReader$3.process Updating live nodes... (3)
   [junit4]   2> 647615 T2007 oascc.ZkStateReader$3.process Updating live nodes... (3)
   [junit4]   2> 647621 T1953 oasc.CorePropertiesLocator.discover Looking for core definitions underneath /mnt/ssd/jenkins/workspace/Lucene-Solr-trunk-Linux/solr/build/solr-core/test/J1/./org.apache.solr.cloud.CollectionsAPIDistributedZkTest-jetty2-1375318856157
   [junit4]   2> 647656 T1953 oasc.CorePropertiesLocator.discoverUnder Found core conf in /mnt/ssd/jenkins/workspace/Lucene-Solr-trunk-Linux/solr/build/solr-core/test/J1/./org.apache.solr.cloud.CollectionsAPIDistributedZkTest-jetty2-1375318856157/conf/
   [junit4]   2> 647657 T1953 oasc.CorePropertiesLocator.discover Found 1 core definitions
   [junit4]   2> 647657 T1953 oass.SolrDispatchFilter.init user.dir=/mnt/ssd/jenkins/workspace/Lucene-Solr-trunk-Linux/solr/build/solr-core/test/J1
   [junit4]   2> 647658 T1953 oass.SolrDispatchFilter.init SolrDispatchFilter.init() done
   [junit4]   2> 647658 T1953 oascsi.HttpClientUtil.createClient Creating new http client, config:maxConnections=128&maxConnectionsPerHost=32&followRedirects=false
   [junit4]   2> 647740 T1953 oejs.Server.doStart jetty-8.1.10.v20130312
   [junit4]   2> 647742 T1953 oejs.AbstractConnector.doStart Started SelectChannelConnector@127.0.0.1:53925
   [junit4]   2> 647743 T1953 oass.SolrDispatchFilter.init SolrDispatchFilter.init()
   [junit4]   2> 647743 T1953 oasc.SolrResourceLoader.locateSolrHome JNDI not configured for solr (NoInitialContextEx)
   [junit4]   2> 647743 T1953 oasc.SolrResourceLoader.locateSolrHome using system property solr.solr.home: /mnt/ssd/jenkins/workspace/Lucene-Solr-trunk-Linux/solr/build/solr-core/test/J1/./org.apache.solr.cloud.CollectionsAPIDistributedZkTest-jetty3-1375318857356
   [junit4]   2> 647744 T1953 oasc.SolrResourceLoader.<init> new SolrResourceLoader for directory: '/mnt/ssd/jenkins/workspace/Lucene-Solr-trunk-Linux/solr/build/solr-core/test/J1/./org.apache.solr.cloud.CollectionsAPIDistributedZkTest-jetty3-1375318857356/'
   [junit4]   2> 647755 T1953 oasc.ConfigSolr.fromFile Loading container configuration from /mnt/ssd/jenkins/workspace/Lucene-Solr-trunk-Linux/solr/build/solr-core/test/J1/./org.apache.solr.cloud.CollectionsAPIDistributedZkTest-jetty3-1375318857356/solr.xml
   [junit4]   2> 647794 T1953 oasc.ConfigSolrXml.<init> Config-defined core root directory: 
   [junit4]   2> 647795 T1953 oasc.CoreContainer.<init> New CoreContainer 16606306
   [junit4]   2> 647795 T1953 oasc.CoreContainer.load Loading cores into CoreContainer [instanceDir=/mnt/ssd/jenkins/workspace/Lucene-Solr-trunk-Linux/solr/build/solr-core/test/J1/./org.apache.solr.cloud.CollectionsAPIDistributedZkTest-jetty3-1375318857356/]
   [junit4]   2> 647797 T1953 oashc.HttpShardHandlerFactory.getParameter Setting socketTimeout to: 120000
   [junit4]   2> 647797 T1953 oashc.HttpShardHandlerFactory.getParameter Setting urlScheme to: http://
   [junit4]   2> 647797 T1953 oashc.HttpShardHandlerFactory.getParameter Setting connTimeout to: 15000
   [junit4]   2> 647798 T1953 oashc.HttpShardHandlerFactory.getParameter Setting maxConnectionsPerHost to: 20
   [junit4]   2> 647798 T1953 oashc.HttpShardHandlerFactory.getParameter Setting corePoolSize to: 0
   [junit4]   2> 647798 T1953 oashc.HttpShardHandlerFactory.getParameter Setting maximumPoolSize to: 2147483647
   [junit4]   2> 647798 T1953 oashc.HttpShardHandlerFactory.getParameter Setting maxThreadIdleTime to: 5
   [junit4]   2> 647799 T1953 oashc.HttpShardHandlerFactory.getParameter Setting sizeOfQueue to: -1
   [junit4]   2> 647799 T1953 oashc.HttpShardHandlerFactory.getParameter Setting fairnessPolicy to: false
   [junit4]   2> 647799 T1953 oascsi.HttpClientUtil.createClient Creating new http client, config:maxConnectionsPerHost=20&maxConnections=10000&socketTimeout=120000&connTimeout=15000&retry=false
   [junit4]   2> 647802 T1953 oasc.ZkContainer.initZooKeeper Zookeeper client=127.0.0.1:57173/solr
   [junit4]   2> 647803 T1953 oasc.ZkController.checkChrootPath zkHost includes chroot
   [junit4]   2> 647804 T1953 oascc.ConnectionManager.waitForConnected Waiting for client to connect to ZooKeeper
   [junit4]   2> 647805 T2019 oascc.ConnectionManager.process Watcher org.apache.solr.common.cloud.ConnectionManager@1f9534b name:ZooKeeperConnection Watcher:127.0.0.1:57173 got event WatchedEvent state:SyncConnected type:None path:null path:null type:None
   [junit4]   2> 647805 T1953 oascc.ConnectionManager.waitForConnected Client is connected to ZooKeeper
   [junit4]   2> 647806 T1953 oascsi.HttpClientUtil.createClient Creating new http client, config:maxConnections=500&maxConnectionsPerHost=16&socketTimeout=120000&connTimeout=15000
   [junit4]   2> 647809 T1953 oascc.ConnectionManager.waitForConnected Waiting for client to connect to ZooKeeper
   [junit4]   2> 647810 T2021 oascc.ConnectionManager.process Watcher org.apache.solr.common.cloud.ConnectionManager@1292ba9 name:ZooKeeperConnection Watcher:127.0.0.1:57173/solr got event WatchedEvent state:SyncConnected type:None path:null path:null type:None
   [junit4]   2> 647811 T1953 oascc.ConnectionManager.waitForConnected Client is connected to ZooKeeper
   [junit4]   2> 647813 T1953 oascc.ZkStateReader.createClusterStateWatchersAndUpdate Updating cluster state from ZooKeeper... 
   [junit4]   2> 648816 T1953 oasc.ZkController.createEphemeralLiveNode Register node as live in ZooKeeper:/live_nodes/127.0.0.1:53925_
   [junit4]   2> 648817 T1953 oascc.SolrZkClient.makePath makePath: /live_nodes/127.0.0.1:53925_
   [junit4]   2> 648820 T1980 oascc.ZkStateReader$3.process Updating live nodes... (4)
   [junit4]   2> 648820 T1993 oascc.ZkStateReader$3.process Updating live nodes... (4)
   [junit4]   2> 648820 T2007 oascc.ZkStateReader$3.process Updating live nodes... (4)
   [junit4]   2> 648820 T1975 oascc.ZkStateReader$3.process Updating live nodes... (4)
   [junit4]   2> 648820 T2021 oascc.ZkStateReader$3.process Updating live nodes... (4)
   [junit4]   2> 648825 T1953 oasc.CorePropertiesLocator.discover Looking for core definitions underneath /mnt/ssd/jenkins/workspace/Lucene-Solr-trunk-Linux/solr/build/solr-core/test/J1/./org.apache.solr.cloud.CollectionsAPIDistributedZkTest-jetty3-1375318857356
   [junit4]   2> 648848 T1953 oasc.CorePropertiesLocator.discoverUnder Found core conf in /mnt/ssd/jenkins/workspace/Lucene-Solr-trunk-Linux/solr/build/solr-core/test/J1/./org.apache.solr.cloud.CollectionsAPIDistributedZkTest-jetty3-1375318857356/conf/
   [junit4]   2> 648849 T1953 oasc.CorePropertiesLocator.discover Found 1 core definitions
   [junit4]   2> 648850 T1953 oass.SolrDispatchFilter.init user.dir=/mnt/ssd/jenkins/workspace/Lucene-Solr-trunk-Linux/solr/build/solr-core/test/J1
   [junit4]   2> 648850 T1953 oass.SolrDispatchFilter.init SolrDispatchFilter.init() done
   [junit4]   2> 648850 T1953 oascsi.HttpClientUtil.createClient Creating new http client, config:maxConnections=128&maxConnectionsPerHost=32&followRedirects=false
   [junit4]   2> 648915 T1953 oejs.Server.doStart jetty-8.1.10.v20130312
   [junit4]   2> 648917 T1953 oejs.AbstractConnector.doStart Started SelectChannelConnector@127.0.0.1:56956
   [junit4]   2> 648918 T1953 oass.SolrDispatchFilter.init SolrDispatchFilter.init()
   [junit4]   2> 648918 T1953 oasc.SolrResourceLoader.locateSolrHome JNDI not configured for solr (NoInitialContextEx)
   [junit4]   2> 648918 T1953 oasc.SolrResourceLoader.locateSolrHome using system property solr.solr.home: /mnt/ssd/jenkins/workspace/Lucene-Solr-trunk-Linux/solr/build/solr-core/test/J1/./org.apache.solr.cloud.CollectionsAPIDistributedZkTest-jetty4-1375318858547
   [junit4]   2> 648919 T1953 oasc.SolrResourceLoader.<init> new SolrResourceLoader for directory: '/mnt/ssd/jenkins/workspace/Lucene-Solr-trunk-Linux/solr/build/solr-core/test/J1/./org.apache.solr.cloud.CollectionsAPIDistributedZkTest-jetty4-1375318858547/'
   [junit4]   2> 648929 T1953 oasc.ConfigSolr.fromFile Loading container configuration from /mnt/ssd/jenkins/workspace/Lucene-Solr-trunk-Linux/solr/build/solr-core/test/J1/./org.apache.solr.cloud.CollectionsAPIDistributedZkTest-jetty4-1375318858547/solr.xml
   [junit4]   2> 648966 T1953 oasc.ConfigSolrXml.<init> Config-defined core root directory: 
   [junit4]   2> 648966 T1953 oasc.CoreContainer.<init> New CoreContainer 11027234
   [junit4]   2> 648967 T1953 oasc.CoreContainer.load Loading cores into CoreContainer [instanceDir=/mnt/ssd/jenkins/workspace/Lucene-Solr-trunk-Linux/solr/build/solr-core/test/J1/./org.apache.solr.cloud.CollectionsAPIDistributedZkTest-jetty4-1375318858547/]
   [junit4]   2> 648968 T1953 oashc.HttpShardHandlerFactory.getParameter Setting socketTimeout to: 120000
   [junit4]   2> 648968 T1953 oashc.HttpShardHandlerFactory.getParameter Setting urlScheme to: http://
   [junit4]   2> 648968 T1953 oashc.HttpShardHandlerFactory.getParameter Setting connTimeout to: 15000
   [junit4]   2> 648969 T1953 oashc.HttpShardHandlerFactory.getParameter Setting maxConnectionsPerHost to: 20
   [junit4]   2> 648969 T1953 oashc.HttpShardHandlerFactory.getParameter Setting corePoolSize to: 0
   [junit4]   2> 648969 T1953 oashc.HttpShardHandlerFactory.getParameter Setting maximumPoolSize to: 2147483647
   [junit4]   2> 648969 T1953 oashc.HttpShardHandlerFactory.getParameter Setting maxThreadIdleTime to: 5
   [junit4]   2> 648970 T1953 oashc.HttpShardHandlerFactory.getParameter Setting sizeOfQueue to: -1
   [junit4]   2> 648970 T1953 oashc.HttpShardHandlerFactory.getParameter Setting fairnessPolicy to: false
   [junit4]   2> 648970 T1953 oascsi.HttpClientUtil.createClient Creating new http client, config:maxConnectionsPerHost=20&maxConnections=10000&socketTimeout=120000&connTimeout=15000&retry=false
   [junit4]   2> 648973 T1953 oasc.ZkContainer.initZooKeeper Zookeeper client=127.0.0.1:57173/solr
   [junit4]   2> 648974 T1953 oasc.ZkController.checkChrootPath zkHost includes chroot
   [junit4]   2> 648974 T1953 oascc.ConnectionManager.waitForConnected Waiting for client to connect to ZooKeeper
   [junit4]   2> 648976 T2033 oascc.ConnectionManager.process Watcher org.apache.solr.common.cloud.ConnectionManager@6d5625 name:ZooKeeperConnection Watcher:127.0.0.1:57173 got event WatchedEvent state:SyncConnected type:None path:null path:null type:None
   [junit4]   2> 648976 T1953 oascc.ConnectionManager.waitForConnected Client is connected to ZooKeeper
   [junit4]   2> 648977 T1953 oascsi.HttpClientUtil.createClient Creating new http client, config:maxConnections=500&maxConnectionsPerHost=16&socketTimeout=120000&connTimeout=15000
   [junit4]   2> 648980 T1953 oascc.ConnectionManager.waitForConnected Waiting for client to connect to ZooKeeper
   [junit4]   2> 648983 T2035 oascc.ConnectionManager.process Watcher org.apache.solr.common.cloud.ConnectionManager@be4791 name:ZooKeeperConnection Watcher:127.0.0.1:57173/solr got event WatchedEvent state:SyncConnected type:None path:null path:null type:None
   [junit4]   2> 648983 T1953 oascc.ConnectionManager.waitForConnected Client is connected to ZooKeeper
   [junit4]   2> 648986 T1953 oascc.ZkStateReader.createClusterStateWatchersAndUpdate Updating cluster state from ZooKeeper... 
   [junit4]   2> 649988 T1953 oasc.ZkController.createEphemeralLiveNode Register node as live in ZooKeeper:/live_nodes/127.0.0.1:56956_
   [junit4]   2> 649990 T1953 oascc.SolrZkClient.makePath makePath: /live_nodes/127.0.0.1:56956_
   [junit4]   2> 649994 T2021 oascc.ZkStateReader$3.process Updating live nodes... (5)
   [junit4]   2> 649994 T1980 oascc.ZkStateReader$3.process Updating live nodes... (5)
   [junit4]   2> 649994 T2035 oascc.ZkStateReader$3.process Updating live nodes... (5)
   [junit4]   2> 649994 T1993 oascc.ZkStateReader$3.process Updating live nodes... (5)
   [junit4]   2> 649994 T1975 oascc.ZkStateReader$3.process Updating live nodes... (5)
   [junit4]   2> 649994 T2007 oascc.ZkStateReader$3.process Updating live nodes... (5)
   [junit4]   2> 649999 T1953 oasc.CorePropertiesLocator.discover Looking for core definitions underneath /mnt/ssd/jenkins/workspace/Lucene-Solr-trunk-Linux/solr/build/solr-core/test/J1/./org.apache.solr.cloud.CollectionsAPIDistributedZkTest-jetty4-1375318858547
   [junit4]   2> 650023 T1953 oasc.CorePropertiesLocator.discoverUnder Found core conf in /mnt/ssd/jenkins/workspace/Lucene-Solr-trunk-Linux/solr/build/solr-core/test/J1/./org.apache.solr.cloud.CollectionsAPIDistributedZkTest-jetty4-1375318858547/conf/
   [junit4]   2> 650023 T1953 oasc.CorePropertiesLocator.discover Found 1 core definitions
   [junit4]   2> 650024 T1953 oass.SolrDispatchFilter.init user.dir=/mnt/ssd/jenkins/workspace/Lucene-Solr-trunk-Linux/solr/build/solr-core/test/J1
   [junit4]   2> 650024 T1953 oass.SolrDispatchFilter.init SolrDispatchFilter.init() done
   [junit4]   2> 650025 T1953 oascsi.HttpClientUtil.createClient Creating new http client, config:maxConnections=128&maxConnectionsPerHost=32&followRedirects=false
   [junit4]   2> 650028 T1953 oascsi.HttpClientUtil.createClient Creating new http client, config:maxConnections=128&maxConnectionsPerHost=32&followRedirects=false
   [junit4]   2> 650031 T1987 oasha.CollectionsHandler.handleCreateAction Creating Collection : numShards=2&name=nodes_used_collection&replicationFactor=2&action=CREATE&wt=javabin&version=2
   [junit4]   2> 650032 T1975 oasc.DistributedQueue$LatchChildWatcher.process Watcher fired on path: /overseer/collection-queue-work state: SyncConnected type NodeChildrenChanged
   [junit4]   2> 650033 T1977 oasc.OverseerCollectionProcessor.run Overseer Collection Processor: Get the message id:/overseer/collection-queue-work/qn-0000000000 message:{
   [junit4]   2> 	  "operation":"createcollection",
   [junit4]   2> 	  "numShards":"2",
   [junit4]   2> 	  "name":"nodes_used_collection",
   [junit4]   2> 	  "replicationFactor":"2"}
   [junit4]   2> 650034 T1977 oasc.OverseerCollectionProcessor.processMessage WARN OverseerCollectionProcessor.processMessage : createcollection , {
   [junit4]   2> 	  "operation":"createcollection",
   [junit4]   2> 	  "numShards":"2",
   [junit4]   2> 	  "name":"nodes_used_collection",
   [junit4]   2> 	  "replicationFactor":"2"}
   [junit4]   2> 651262 T1976 oascc.ZkStateReader.updateClusterState Updating cloud state from ZooKeeper... 
   [junit4]   2> 651263 T1976 oasc.Overseer$ClusterStateUpdater.buildCollection building a new collection: nodes_used_collection
   [junit4]   2> 651263 T1976 oasc.Overseer$ClusterStateUpdater.createCollection Create collection nodes_used_collection with shards [shard1, shard2]
   [junit4]   2> 651267 T2007 oascc.ZkStateReader$2.process A cluster state change: WatchedEvent state:SyncConnected type:NodeDataChanged path:/clusterstate.json, has occurred - updating... (live nodes size: 5)
   [junit4]   2> 651267 T2021 oascc.ZkStateReader$2.process A cluster state change: WatchedEvent state:SyncConnected type:NodeDataChanged path:/clusterstate.json, has occurred - updating... (live nodes size: 5)
   [junit4]   2> 651267 T2035 oascc.ZkStateReader$2.process A cluster state change: WatchedEvent state:SyncConnected type:NodeDataChanged path:/clusterstate.json, has occurred - updating... (live nodes size: 5)
   [junit4]   2> 651267 T1980 oascc.ZkStateReader$2.process A cluster state change: WatchedEvent state:SyncConnected type:NodeDataChanged path:/clusterstate.json, has occurred - updating... (live nodes size: 5)
   [junit4]   2> 651267 T1975 oascc.ZkStateReader$2.process A cluster state change: WatchedEvent state:SyncConnected type:NodeDataChanged path:/clusterstate.json, has occurred - updating... (live nodes size: 5)
   [junit4]   2> 651267 T1993 oascc.ZkStateReader$2.process A cluster state change: WatchedEvent state:SyncConnected type:NodeDataChanged path:/clusterstate.json, has occurred - updating... (live nodes size: 5)
   [junit4]   2> 651338 T1977 oasc.OverseerCollectionProcessor.createCollection going to create cores replicas shardNames [shard1, shard2] , repFactor : 2
   [junit4]   2> 651338 T1977 oasc.OverseerCollectionProcessor.createCollection Creating shard nodes_used_collection_shard1_replica1 as part of slice shard1 of collection nodes_used_collection on 127.0.0.1:53925_
   [junit4]   2> 651339 T1977 oasc.OverseerCollectionProcessor.createCollection Creating shard nodes_used_collection_shard1_replica2 as part of slice shard1 of collection nodes_used_collection on 127.0.0.1:56171_
   [junit4]   2> 651340 T1977 oasc.OverseerCollectionProcessor.createCollection Creating shard nodes_used_collection_shard2_replica1 as part of slice shard2 of collection nodes_used_collection on 127.0.0.1:50200_
   [junit4]   2> 651340 T1977 oasc.OverseerCollectionProcessor.createCollection Creating shard nodes_used_collection_shard2_replica2 as part of slice shard2 of collection nodes_used_collection on 127.0.0.1:40304_
   [junit4]   2> 651341 T1988 oasc.ZkController.publish publishing core=nodes_used_collection_shard1_replica2 state=down
   [junit4]   2> 651341 T2016 oasc.ZkController.publish publishing core=nodes_used_collection_shard1_replica1 state=down
   [junit4]   2> 651342 T2002 oasc.ZkController.publish publishing core=nodes_used_collection_shard2_replica2 state=down
   [junit4]   2> 651342 T1968 oasc.ZkController.publish publishing core=nodes_used_collection_shard2_replica1 state=down
   [junit4]   2> 651343 T1988 oasc.ZkController.waitForCoreNodeName look for our core node name
   [junit4]   2> 651343 T2016 oasc.ZkController.waitForCoreNodeName look for our core node name
   [junit4]   2> 651343 T1968 oasc.ZkController.waitForCoreNodeName look for our core node name
   [junit4]   2> 651343 T2002 oasc.ZkController.waitForCoreNodeName look for our core node name
   [junit4]   2> 652771 T1976 oascc.ZkStateReader.updateClusterState Updating cloud state from ZooKeeper... 
   [junit4]   2> 652773 T1976 oasc.Overseer$ClusterStateUpdater.updateState WARN Could not find collection node for nodes_used_collection, skipping publish state
   [junit4]   2> 652773 T1976 oasc.Overseer$ClusterStateUpdater.updateState Update state numShards=2 message={
   [junit4]   2> 	  "operation":"state",
   [junit4]   2> 	  "core_node_name":"core_node1",
   [junit4]   2> 	  "numShards":"2",
   [junit4]   2> 	  "shard":"shard1",
   [junit4]   2> 	  "roles":null,
   [junit4]   2> 	  "state":"down",
   [junit4]   2> 	  "shard_state":"active",
   [junit4]   2> 	  "core":"nodes_used_collection_shard1_replica2",
   [junit4]   2> 	  "collection":"nodes_used_collection",
   [junit4]   2> 	  "shard_range":null,
   [junit4]   2> 	  "node_name":"127.0.0.1:56171_",
   [junit4]   2> 	  "base_url":"http://127.0.0.1:56171"}
   [junit4]   2> 652776 T1976 oasc.Overseer$ClusterStateUpdater.updateState WARN Could not find collection node for nodes_used_collection, skipping publish state
   [junit4]   2> 652777 T1976 oasc.Overseer$ClusterStateUpdater.updateState Update state numShards=2 message={
   [junit4]   2> 	  "operation":"state",
   [junit4]   2> 	  "core_node_name":"core_node2",
   [junit4]   2> 	  "numShards":"2",
   [junit4]   2> 	  "shard":"shard1",
   [junit4]   2> 	  "roles":null,
   [junit4]   2> 	  "state":"down",
   [junit4]   2> 	  "shard_state":"active",
   [junit4]   2> 	  "core":"nodes_used_collection_shard1_replica1",
   [junit4]   2> 	  "collection":"nodes_used_collection",
   [junit4]   2> 	  "shard_range":null,
   [junit4]   2> 	  "node_name":"127.0.0.1:53925_",
   [junit4]   2> 	  "base_url":"http://127.0.0.1:53925"}
   [junit4]   2> 652780 T1976 oasc.Overseer$ClusterStateUpdater.updateState WARN Could not find collection node for nodes_used_collection, skipping publish state
   [junit4]   2> 652780 T1976 oasc.Overseer$ClusterStateUpdater.updateState Update state numShards=2 message={
   [junit4]   2> 	  "operation":"state",
   [junit4]   2> 	  "core_node_name":"core_node3",
   [junit4]   2> 	  "numShards":"2",
   [junit4]   2> 	  "shard":"shard2",
   [junit4]   2> 	  "roles":null,
   [junit4]   2> 	  "state":"down",
   [junit4]   2> 	  "shard_state":"active",
   [junit4]   2> 	  "core":"nodes_used_collection_shard2_replica2",
   [junit4]   2> 	  "collection":"nodes_used_collection",
   [junit4]   2> 	  "shard_range":null,
   [junit4]   2> 	  "node_name":"127.0.0.1:40304_",
   [junit4]   2> 	  "base_url":"http://127.0.0.1:40304"}
   [junit4]   2> 652784 T1976 oasc.Overseer$ClusterStateUpdater.updateState WARN Could not find collection node for nodes_used_collection, skipping publish state
   [junit4]   2> 652784 T1976 oasc.Overseer$ClusterStateUpdater.updateState Update state numShards=2 message={
   [junit4]   2> 	  "operation":"state",
   [junit4]   2> 	  "core_node_name":"core_node4",
   [junit4]   2> 	  "numShards":"2",
   [junit4]   2> 	  "shard":"shard2",
   [junit4]   2> 	  "roles":null,
   [junit4]   2> 	  "state":"down",
   [junit4]   2> 	  "shard_state":"active",
   [junit4]   2> 	  "core":"nodes_used_collection_shard2_replica1",
   [junit4]   2> 	  "collection":"nodes_used_collection",
   [junit4]   2> 	  "shard_range":null,
   [junit4]   2> 	  "node_name":"127.0.0.1:50200_",
   [junit4]   2> 	  "base_url":"http://127.0.0.1:50200"}
   [junit4]   2> 652788 T2035 oascc.ZkStateReader$2.process A cluster state change: WatchedEvent state:SyncConnected type:NodeDataChanged path:/clusterstate.json, has occurred - updating... (live nodes size: 5)
   [junit4]   2> 652788 T1980 oascc.ZkStateReader$2.process A cluster state change: WatchedEvent state:SyncConnected type:NodeDataChanged path:/clusterstate.json, has occurred - updating... (live nodes size: 5)
   [junit4]   2> 652788 T1993 oascc.ZkStateReader$2.process A cluster state change: WatchedEvent state:SyncConnected type:NodeDataChanged path:/clusterstate.json, has occurred - updating... (live nodes size: 5)
   [junit4]   2> 652788 T1975 oascc.ZkStateReader$2.process A cluster state change: WatchedEvent state:SyncConnected type:NodeDataChanged path:/clusterstate.json, has occurred - updating... (live nodes size: 5)
   [junit4]   2> 652788 T2007 oascc.ZkStateReader$2.process A cluster state change: WatchedEvent state:SyncConnected type:NodeDataChanged path:/clusterstate.json, has occurred - updating... (live nodes size: 5)
   [junit4]   2> 652788 T2021 oascc.ZkStateReader$2.process A cluster state change: WatchedEvent state:SyncConnected type:NodeDataChanged path:/clusterstate.json, has occurred - updating... (live nodes size: 5)
   [junit4]   2> 653343 T1988 oasc.ZkController.waitForShardId waiting to find shard id in clusterstate for nodes_used_collection_shard1_replica2
   [junit4]   2> 653344 T2016 oasc.ZkController.waitForShardId waiting to find shard id in clusterstate for nodes_used_collection_shard1_replica1
   [junit4]   2> 653344 T1968 oasc.ZkController.waitForShardId waiting to find shard id in clusterstate for nodes_used_collection_shard2_replica1
   [junit4]   2> 653345 T2016 oasc.CorePropertiesLocator.writePropertiesFile ERROR Couldn't persist core properties to /mnt/ssd/jenkins/workspace/Lucene-Solr-trunk-Linux/solr/build/solr-core/test/J1/./org.apache.solr.cloud.CollectionsAPIDistributedZkTest-jetty3-1375318857356/nodes_used_collection_shard1_replica1/core.properties: java.io.FileNotFoundException: /mnt/ssd/jenkins/workspace/Lucene-Solr-trunk-Linux/solr/build/solr-core/test/J1/./org.apache.solr.cloud.CollectionsAPIDistributedZkTest-jetty3-1375318857356/nodes_used_collection_shard1_replica1/core.properties (No such file or directory)
   [junit4]   2> 653344 T2002 oasc.ZkController.waitForShardId waiting to find shard id in clusterstate for nodes_used_collection_shard2_replica2
   [junit4]   2> 653344 T1988 oasc.CorePropertiesLocator.writePropertiesFile ERROR Couldn't persist core properties to /mnt/ssd/jenkins/workspace/Lucene-Solr-trunk-Linux/solr/build/solr-core/test/J1/./org.apache.solr.cloud.CollectionsAPIDistributedZkTest-jetty1-1375318854985/nodes_used_collection_shard1_replica2/core.properties: java.io.FileNotFoundException: /mnt/ssd/jenkins/workspace/Lucene-Solr-trunk-Linux/solr/build/solr-core/test/J1/./org.apache.solr.cloud.CollectionsAPIDistributedZkTest-jetty1-1375318854985/nodes_used_collection_shard1_replica2/core.properties (No such file or directory)
   [junit4]   2> 653346 T2002 oasc.CorePropertiesLocator.writePropertiesFile ERROR Couldn't persist core properties to /mnt/ssd/jenkins/workspace/Lucene-Solr-trunk-Linux/solr/build/solr-core/test/J1/./org.apache.solr.cloud.CollectionsAPIDistributedZkTest-jetty2-1375318856157/nodes_used_collection_shard2_replica2/core.properties: java.io.FileNotFoundException: /mnt/ssd/jenkins/workspace/Lucene-Solr-trunk-Linux/solr/build/solr-core/test/J1/./org.apache.solr.cloud.CollectionsAPIDistributedZkTest-jetty2-1375318856157/nodes_used_collection_shard2_replica2/core.properties (No such file or directory)
   [junit4]   2> 653345 T2016 oasc.CoreContainer.create Creating SolrCore 'nodes_used_collection_shard1_replica1' using instanceDir: /mnt/ssd/jenkins/workspace/Lucene-Solr-trunk-Linux/solr/build/solr-core/test/J1/./org.apache.solr.cloud.CollectionsAPIDistributedZkTest-jetty3-1375318857356/nodes_used_collection_shard1_replica1
   [junit4]   2> 653346 T2016 oasc.ZkController.createCollectionZkNode Check for collection zkNode:nodes_used_collection
   [junit4]   2> 653345 T1968 oasc.CorePropertiesLocator.writePropertiesFile ERROR Couldn't persist core properties to /mnt/ssd/jenkins/workspace/Lucene-Solr-trunk-Linux/solr/build/solr-core/test/J1/./org.apache.solr.cloud.CollectionsAPIDistributedZkTest-controljetty-1375318854735/nodes_used_collection_shard2_replica1/core.properties: java.io.FileNotFoundException: /mnt/ssd/jenkins/workspace/Lucene-Solr-trunk-Linux/solr/build/solr-core/test/J1/./org.apache.solr.cloud.CollectionsAPIDistributedZkTest-controljetty-1375318854735/nodes_used_collection_shard2_replica1/core.properties (No such file or directory)
   [junit4]   2> 653347 T1968 oasc.CoreContainer.create Creating SolrCore 'nodes_used_collection_shard2_replica1' using instanceDir: /mnt/ssd/jenkins/workspace/Lucene-Solr-trunk-Linux/solr/build/solr-core/test/J1/./org.apache.solr.cloud.CollectionsAPIDistributedZkTest-controljetty-1375318854735/nodes_used_collection_shard2_replica1
   [junit4]   2> 653348 T1968 oasc.ZkController.createCollectionZkNode Check for collection zkNode:nodes_used_collection
   [junit4]   2> 653346 T2002 oasc.CoreContainer.create Creating SolrCore 'nodes_used_collection_shard2_replica2' using instanceDir: /mnt/ssd/jenkins/workspace/Lucene-Solr-trunk-Linux/solr/build/solr-core/test/J1/./org.apache.solr.cloud.CollectionsAPIDistributedZkTest-jetty2-1375318856157/nodes_used_collection_shard2_replica2
   [junit4]   2> 653348 T1968 oasc.ZkController.createCollectionZkNode Creating collection in ZooKeeper:nodes_used_collection
   [junit4]   2> 653346 T1988 oasc.CoreContainer.create Creating SolrCore 'nodes_used_collection_shard1_replica2' using instanceDir: /mnt/ssd/jenkins/workspace/Lucene-Solr-trunk-Linux/solr/build/solr-core/test/J1/./org.apache.solr.cloud.CollectionsAPIDistributedZkTest-jetty1-1375318854985/nodes_used_collection_shard1_replica2
   [junit4]   2> 653349 T1988 oasc.ZkController.createCollectionZkNode Check for collection zkNode:nodes_used_collection
   [junit4]   2> 653348 T1968 oasc.ZkController.getConfName Looking for collection configName
   [junit4]   2> 653348 T2002 oasc.ZkController.createCollectionZkNode Check for collection zkNode:nodes_used_collection
   [junit4]   2> 653347 T2016 oasc.ZkController.createCollectionZkNode Creating collection in ZooKeeper:nodes_used_collection
   [junit4]   2> 653349 T1988 oasc.ZkController.createCollectionZkNode Creating collection in ZooKeeper:nodes_used_collection
   [junit4]   2> 653350 T1968 oasc.ZkController.getConfName Only one config set found in zk - using it:conf1
   [junit4]   2> 653350 T2002 oasc.ZkController.createCollectionZkNode Creating collection in ZooKeeper:nodes_used_collection
   [junit4]   2> 653350 T2016 oasc.ZkController.getConfName Looking for collection configName
   [junit4]   2> 653351 T2002 oasc.ZkController.getConfName Looking for collection configName
   [junit4]   2> 653350 T1968 oascc.SolrZkClient.makePath makePath: /collections/nodes_used_collection
   [junit4]   2> 653350 T1988 oasc.ZkController.getConfName Looking for collection configName
   [junit4]   2> 653352 T2016 oasc.ZkController.getConfName Only one config set found in zk - using it:conf1
   [junit4]   2> 653352 T2016 oascc.SolrZkClient.makePath makePath: /collections/nodes_used_collection
   [junit4]   2> 653353 T1988 oasc.ZkController.getConfName Only one config set found in zk - using it:conf1
   [junit4]   2> 653352 T2002 oasc.ZkController.getConfName Only one config set found in zk - using it:conf1
   [junit4]   2> 653353 T1988 oascc.SolrZkClient.makePath makePath: /collections/nodes_used_collection
   [junit4]   2> 653353 T2002 oascc.SolrZkClient.makePath makePath: /collections/nodes_used_collection
   [junit4]   2> 653354 T1968 oasc.ZkController.readConfigName Load collection config from:/collections/nodes_used_collection
   [junit4]   2> 653355 T2016 oasc.ZkController.readConfigName Load collection config from:/collections/nodes_used_collection
   [junit4]   2> 653356 T1968 oasc.SolrResourceLoader.<init> new SolrResourceLoader for directory: '/mnt/ssd/jenkins/workspace/Lucene-Solr-trunk-Linux/solr/build/solr-core/test/J1/./org.apache.solr.cloud.CollectionsAPIDistributedZkTest-controljetty-1375318854735/nodes_used_collection_shard2_replica1/'
   [junit4]   2> 653356 T1988 oasc.ZkController.readConfigName Load collection config from:/collections/nodes_used_collection
   [junit4]   2> 653357 T2016 oasc.SolrResourceLoader.<init> new SolrResourceLoader for directory: '/mnt/ssd/jenkins/workspace/Lucene-Solr-trunk-Linux/solr/build/solr-core/test/J1/./org.apache.solr.cloud.CollectionsAPIDistributedZkTest-jetty3-1375318857356/nodes_used_collection_shard1_replica1/'
   [junit4]   2> 653357 T2002 oasc.ZkController.readConfigName Load collection config from:/collections/nodes_used_collection
   [junit4]   2> 653358 T1988 oasc.SolrResourceLoader.<init> new SolrResourceLoader for directory: '/mnt/ssd/jenkins/workspace/Lucene-Solr-trunk-Linux/solr/build/solr-core/test/J1/./org.apache.solr.cloud.CollectionsAPIDistributedZkTest-jetty1-1375318854985/nodes_used_collection_shard1_replica2/'
   [junit4]   2> 653359 T2002 oasc.SolrResourceLoader.<init> new SolrResourceLoader for directory: '/mnt/ssd/jenkins/workspace/Lucene-Solr-trunk-Linux/solr/build/solr-core/test/J1/./org.apache.solr.cloud.CollectionsAPIDistributedZkTest-jetty2-1375318856157/nodes_used_collection_shard2_replica2/'
   [junit4]   2> 653411 T1968 oasc.SolrConfig.<init> Using Lucene MatchVersion: LUCENE_50
   [junit4]   2> 653413 T2016 oasc.SolrConfig.<init> Using Lucene MatchVersion: LUCENE_50
   [junit4]   2> 653418 T1988 oasc.SolrConfig.<init> Using Lucene MatchVersion: LUCENE_50
   [junit4]   2> 653430 T2002 oasc.SolrConfig.<init> Using Lucene MatchVersion: LUCENE_50
   [junit4]   2> 653484 T1968 oasc.SolrConfig.<init> Loaded SolrConfig: solrconfig.xml
   [junit4]   2> 653485 T2016 oasc.SolrConfig.<init> Loaded SolrConfig: solrconfig.xml
   [junit4]   2> 653486 T1968 oass.IndexSchema.readSchema Reading Solr Schema from schema.xml
   [junit4]   2> 653487 T2016 oass.IndexSchema.readSchema Reading Solr Schema from schema.xml
   [junit4]   2> 653490 T1988 oasc.SolrConfig.<init> Loaded SolrConfig: solrconfig.xml
   [junit4]   2> 653491 T1988 oass.IndexSchema.readSchema Reading Solr Schema from schema.xml
   [junit4]   2> 653496 T2002 oasc.SolrConfig.<init> Loaded SolrConfig: solrconfig.xml
   [junit4]   2> 653497 T2002 oass.IndexSchema.readSchema Reading Solr Schema from schema.xml
   [junit4]   2> 653499 T1968 oass.IndexSchema.readSchema [nodes_used_collection_shard2_replica1] Schema name=test
   [junit4]   2> 653500 T2016 oass.IndexSchema.readSchema [nodes_used_collection_shard1_replica1] Schema name=test
   [junit4]   2> 653506 T1988 oass.IndexSchema.readSchema [nodes_used_collection_shard1_replica2] Schema name=test
   [junit4]   2> 653511 T2002 oass.IndexSchema.readSchema [nodes_used_collection_shard2_replica2] Schema name=test
   [junit4]   2> 654041 T2016 oass.OpenExchangeRatesOrgProvider.init Initialized with rates=open-exchange-rates.json, refreshInterval=1440.
   [junit4]   2> 654047 T2016 oass.IndexSchema.readSchema default search field in schema is text
   [junit4]   2> 654051 T2016 oass.IndexSchema.readSchema unique key field: id
   [junit4]   2> 654060 T2016 oass.FileExchangeRateProvider.reload Reloading exchange rates from file currency.xml
   [junit4]   2> 654063 T2016 oass.FileExchangeRateProvider.reload Reloading exchange rates from file currency.xml
   [junit4]   2> 654067 T2016 oass.OpenExchangeRatesOrgProvider.reload Reloading exchange rates from open-exchange-rates.json
   [junit4]   2> 654068 T2016 oass.OpenExchangeRatesOrgProvider$OpenExchangeRates.<init> WARN Unknown key IMPORTANT NOTE
   [junit4]   2> 654068 T2016 oass.OpenExchangeRatesOrgProvider$OpenExchangeRates.<init> WARN Expected key, got STRING
   [junit4]   2> 654068 T2016 oass.OpenExchangeRatesOrgProvider.reload Reloading exchange rates from open-exchange-rates.json
   [junit4]   2> 654069 T2016 oass.OpenExchangeRatesOrgProvider$OpenExchangeRates.<init> WARN Unknown key IMPORTANT NOTE
   [junit4]   2> 654069 T2016 oass.OpenExchangeRatesOrgProvider$OpenExchangeRates.<init> WARN Expected key, got STRING
   [junit4]   2> 654070 T2016 oasc.SolrCore.initDirectoryFactory org.apache.solr.core.MockDirectoryFactory
   [junit4]   2> 654070 T2016 oasc.SolrCore.<init> [nodes_used_collection_shard1_replica1] Opening new SolrCore at /mnt/ssd/jenkins/workspace/Lucene-Solr-trunk-Linux/solr/build/solr-core/test/J1/./org.apache.solr.cloud.CollectionsAPIDistributedZkTest-jetty3-1375318857356/nodes_used_collection_shard1_replica1/, dataDir=/mnt/ssd/jenkins/workspace/Lucene-Solr-trunk-Linux/solr/build/solr-core/test/J1/./org.apache.solr.cloud.CollectionsAPIDistributedZkTest-jetty3-1375318857356//nodes_used_collection_shard1_replica1/data/
   [junit4]   2> 654070 T2016 oasc.JmxMonitoredMap.<init> JMX monitoring is enabled. Adding Solr mbeans to JMX Server: com.sun.jmx.mbeanserver.JmxMBeanServer@dc5122
   [junit4]   2> 654071 T2016 oasc.CachingDirectoryFactory.get return new directory for /mnt/ssd/jenkins/workspace/Lucene-Solr-trunk-Linux/solr/build/solr-core/test/J1/./org.apache.solr.cloud.CollectionsAPIDistributedZkTest-jetty3-1375318857356//nodes_used_collection_shard1_replica1/data
   [junit4]   2> 654071 T2016 oasc.SolrCore.getNewIndexDir New index directory detected: old=null new=/mnt/ssd/jenkins/workspace/Lucene-Solr-trunk-Linux/solr/build/solr-core/test/J1/./org.apache.solr.cloud.CollectionsAPIDistributedZkTest-jetty3-1375318857356//nodes_used_collection_shard1_replica1/data/index/
   [junit4]   2> 654072 T2016 oasc.SolrCore.initIndex WARN [nodes_used_collection_shard1_replica1] Solr index directory '/mnt/ssd/jenkins/workspace/Lucene-Solr-trunk-Linux/solr/build/solr-core/test/J1/./org.apache.solr.cloud.CollectionsAPIDistributedZkTest-jetty3-1375318857356/nodes_used_collection_shard1_replica1/data/index' doesn't exist. Creating new index...
   [junit4]   2> 654072 T2016 oasc.CachingDirectoryFactory.get return new directory for /mnt/ssd/jenkins/workspace/Lucene-Solr-trunk-Linux/solr/build/solr-core/test/J1/./org.apache.solr.cloud.CollectionsAPIDistributedZkTest-jetty3-1375318857356//nodes_used_collection_shard1_replica1/data/index
   [junit4]   2> 654073 T2016 oasc.SolrDeletionPolicy.onCommit SolrDeletionPolicy.onCommit: commits: num=1
   [junit4]   2> 		commit{dir=MockDirWrapper(org.apache.lucene.store.RAMDirectory@17024eb lockFactory=org.apache.lucene.store.NativeFSLockFactory@146742f),segFN=segments_1,generation=1}
   [junit4]   2> 654074 T2016 oasc.SolrDeletionPolicy.updateCommits newest commit generation = 1
   [junit4]   2> 654076 T2016 oasup.UpdateRequestProcessorChain.init inserting DistributedUpdateProcessorFactory into updateRequestProcessorChain "dedupe"
   [junit4]   2> 654077 T2016 oasup.UpdateRequestProcessorChain.init inserting DistributedUpdateProcessorFactory into updateRequestProcessorChain "stored_sig"
   [junit4]   2> 654077 T2016 oasup.UpdateRequestProcessorChain.init inserting DistributedUpdateProcessorFactory into updateRequestProcessorChain "distrib-dup-test-chain-implicit"
   [junit4]   2> 654078 T2016 oasc.RequestHandlers.initHandlersFromConfig created standard: solr.StandardRequestHandler
   [junit4]   2> 654078 T2016 oasc.RequestHandlers.initHandlersFromConfig created /get: solr.RealTimeGetHandler
   [junit4]   2> 654079 T2016 oasc.RequestHandlers.initHandlersFromConfig adding lazy requestHandler: solr.ReplicationHandler
   [junit4]   2> 654079 T2016 oasc.RequestHandlers.initHandlersFromConfig created /replication: solr.ReplicationHandler
   [junit4]   2> 654079 T2016 oasc.RequestHandlers.initHandlersFromConfig created /update: solr.UpdateRequestHandler
   [junit4]   2> 654080 T2016 oasc.RequestHandlers.initHandlersFromConfig created /admin/: org.apache.solr.handler.admin.AdminHandlers
   [junit4]   2> 654082 T1988 oass.OpenExchangeRatesOrgProvider.init Initialized with rates=open-exchange-rates.json, refreshInterval=1440.
   [junit4]   2> 654082 T2016 oashl.XMLLoader.init xsltCacheLifetimeSeconds=60
   [junit4]   2> 654085 T2016 oass.SolrIndexSearcher.<init> Opening Searcher@1c86e05 main
   [junit4]   2> 654085 T2016 oasu.CommitTracker.<init> Hard AutoCommit: disabled
   [junit4]   2> 654086 T2016 oasu.CommitTracker.<init> Soft AutoCommit: disabled
   [junit4]   2> 654090 T2041 oasc.SolrCore.registerSearcher [nodes_used_collection_shard1_replica1] Registered new searcher Searcher@1c86e05 main{StandardDirectoryReader(segments_1:1)}
   [junit4]   2> 654091 T2016 oasc.CoreContainer.registerCore registering core: nodes_used_collection_shard1_replica1
   [junit4]   2> 654092 T1988 oass.IndexSchema.readSchema default search field in schema is text
   [junit4]   2> 654092 T2016 oasc.ZkController.register Register replica - core:nodes_used_collection_shard1_replica1 address:http://127.0.0.1:53925 collection:nodes_used_collection shard:shard1
   [junit4]   2> 654092 T2016 oascsi.HttpClientUtil.createClient Creating new http client, config:maxConnections=10000&maxConnectionsPerHost=20&connTimeout=15000&socketTimeout=30000&retry=false
   [junit4]   2> 654096 T2016 oascc.SolrZkClient.makePath makePath: /collections/nodes_used_collection/leader_elect/shard1/election
   [junit4]   2> 654096 T1988 oass.IndexSchema.readSchema unique key field: id
   [junit4]   2> 654101 T2016 oasc.ShardLeaderElectionContext.runLeaderProcess Running the leader process for shard shard1
   [junit4]   2> 654104 T2016 oasc.ShardLeaderElectionContext.waitForReplicasToComeUp Waiting until we see more replicas up for shard shard1: total=2 found=1 timeoutin=180000
   [junit4]   2> 654109 T1988 oass.FileExchangeRateProvider.reload Reloading exchange rates from file currency.xml
   [junit4]   2> 654122 T1988 oass.FileExchangeRateProvider.reload Reloading exchange rates from file currency.xml
   [junit4]   2> 654127 T1988 oass.OpenExchangeRatesOrgProvider.reload Reloading exchange rates from open-exchange-rates.json
   [junit4]   2> 654128 T1988 oass.OpenExchangeRatesOrgProvider$OpenExchangeRates.<init> WARN Unknown key IMPORTANT NOTE
   [junit4]   2> 654129 T1988 oass.OpenExchangeRatesOrgProvider$OpenExchangeRates.<init> WARN Expected key, got STRING
   [junit4]   2> 654129 T1988 oass.OpenExchangeRatesOrgProvider.reload Reloading exchange rates from open-exchange-rates.json
   [junit4]   2> 654130 T1988 oass.OpenExchangeRatesOrgProvider$OpenExchangeRates.<init> WARN Unknown key IMPORTANT NOTE
   [junit4]   2> 654131 T1988 oass.OpenExchangeRatesOrgProvider$OpenExchangeRates.<init> WARN Expected key, got STRING
   [junit4]   2> 654131 T1988 oasc.SolrCore.initDirectoryFactory org.apache.solr.core.MockDirectoryFactory
   [junit4]   2> 654132 T1988 oasc.SolrCore.<init> [nodes_used_collection_shard1_replica2] Opening new SolrCore at /mnt/ssd/jenkins/workspace/Lucene-Solr-trunk-Linux/solr/build/solr-core/test/J1/./org.apache.solr.cloud.CollectionsAPIDistributedZkTest-jetty1-1375318854985/nodes_used_collection_shard1_replica2/, dataDir=/mnt/ssd/jenkins/workspace/Lucene-Solr-trunk-Linux/solr/build/solr-core/test/J1/./org.apache.solr.cloud.CollectionsAPIDistributedZkTest-jetty1-1375318854985//nodes_used_collection_shard1_replica2/data/
   [junit4]   2> 654132 T1988 oasc.JmxMonitoredMap.<init> JMX monitoring is enabled. Adding Solr mbeans to JMX Server: com.sun.jmx.mbeanserver.JmxMBeanServer@dc5122
   [junit4]   2> 654133 T1988 oasc.CachingDirectoryFactory.get return new directory for /mnt/ssd/jenkins/workspace/Lucene-Solr-trunk-Linux/solr/build/solr-core/test/J1/./org.apache.solr.cloud.CollectionsAPIDistributedZkTest-jetty1-1375318854985//nodes_used_collection_shard1_replica2/data
   [junit4]   2> 654133 T1988 oasc.SolrCore.getNewIndexDir New index directory detected: old=null new=/mnt/ssd/jenkins/workspace/Lucene-Solr-trunk-Linux/solr/build/solr-core/test/J1/./org.apache.solr.cloud.CollectionsAPIDistributedZkTest-jetty1-1375318854985//nodes_used_collection_shard1_replica2/data/index/
   [junit4]   2> 654134 T1988 oasc.SolrCore.initIndex WARN [nodes_used_collection_shard1_replica2] Solr index directory '/mnt/ssd/jenkins/workspace/Lucene-Solr-trunk-Linux/solr/build/solr-core/test/J1/./org.apache.solr.cloud.CollectionsAPIDistributedZkTest-jetty1-1375318854985/nodes_used_collection_shard1_replica2/data/index' doesn't exist. Creating new index...
   [junit4]   2> 654134 T1988 oasc.CachingDirectoryFactory.get return new directory for /mnt/ssd/jenkins/workspace/Lucene-Solr-trunk-Linux/solr/build/solr-core/test/J1/./org.apache.solr.cloud.CollectionsAPIDistributedZkTest-jetty1-1375318854985//nodes_used_collection_shard1_replica2/data/index
   [junit4]   2> 654136 T1988 oasc.SolrDeletionPolicy.onCommit SolrDeletionPolicy.onCommit: commits: num=1
   [junit4]   2> 		commit{dir=MockDirWrapper(org.apache.lucene.store.RAMDirectory@1a93d5 lockFactory=org.apache.lucene.store.NativeFSLockFactory@198d1ca),segFN=segments_1,generation=1}
   [junit4]   2> 654137 T1988 oasc.SolrDeletionPolicy.updateCommits newest commit generation = 1
   [junit4]   2> 654141 T1988 oasup.UpdateRequestProcessorChain.init inserting DistributedUpdateProcessorFactory into updateRequestProcessorChain "dedupe"
   [junit4]   2> 654142 T1988 oasup.UpdateRequestProcessorChain.init inserting DistributedUpdateProcessorFactory into updateRequestProcessorChain "stored_sig"
   [junit4]   2> 654142 T1988 oasup.UpdateRequestProcessorChain.init inserting DistributedUpdateProcessorFactory into updateRequestProcessorChain "distrib-dup-test-chain-implicit"
   [junit4]   2> 654143 T1988 oasc.RequestHandlers.initHandlersFromConfig created standard: solr.StandardRequestHandler
   [junit4]   2> 654144 T1988 oasc.RequestHandlers.initHandlersFromConfig created /get: solr.RealTimeGetHandler
   [junit4]   2> 654144 T1988 oasc.RequestHandlers.initHandlersFromConfig adding lazy requestHandler: solr.ReplicationHandler
   [junit4]   2> 654145 T1988 oasc.RequestHandlers.initHandlersFromConfig created /replication: solr.ReplicationHandler
   [junit4]   2> 654146 T1988 oasc.RequestHandlers.initHandlersFromConfig created /update: solr.UpdateRequestHandler
   [junit4]   2> 654146 T1988 oasc.RequestHandlers.initHandlersFromConfig created /admin/: org.apache.solr.handler.admin.AdminHandlers
   [junit4]   2> 654150 T1988 oashl.XMLLoader.init xsltCacheLifetimeSeconds=60
   [junit4]   2> 654153 T1988 oass.SolrIndexSearcher.<init> Opening Searcher@1d80eeb main
   [junit4]   2> 654154 T1988 oasu.CommitTracker.<init> Hard AutoCommit: disabled
   [junit4]   2> 654155 T1988 oasu.CommitTracker.<init> Soft AutoCommit: disabled
   [junit4]   2> 654161 T2042 oasc.SolrCore.registerSearcher [nodes_used_collection_shard1_replica2] Registered new searcher Searcher@1d80eeb main{StandardDirectoryReader(segments_1:1)}
   [junit4]   2> 654163 T1988 oasc.CoreContainer.registerCore registering core: nodes_used_collection_shard1_replica2
   [junit4]   2> 654164 T1988 oasc.ZkController.register Register replica - core:nodes_used_collection_shard1_replica2 address:http://127.0.0.1:56171 collection:nodes_used_collection shard:shard1
   [junit4]   2> 654164 T1988 oascsi.HttpClientUtil.createClient Creating new http client, config:maxConnections=10000&maxConnectionsPerHost=20&connTimeout=15000&socketTimeout=30000&retry=false
   [junit4]   2> 654166 T2002 oass.OpenExchangeRatesOrgProvider.init Initialized with rates=open-exchange-rates.json, refreshInterval=1440.
   [junit4]   2> 654173 T2002 oass.IndexSchema.readSchema default search field in schema is text
   [junit4]   2> 654176 T2002 oass.IndexSchema.readSchema unique key field: id
   [junit4]   2> 654184 T1968 oass.OpenExchangeRatesOrgProvider.init Initialized with rates=open-exchange-rates.json, refreshInterval=1440.
   [junit4]   2> 654185 T2002 oass.FileExchangeRateProvider.reload Reloading exchange rates from file currency.xml
   [junit4]   2> 654189 T2002 oass.FileExchangeRateProvider.reload Reloading exchange rates from file currency.xml
   [junit4]   2> 654190 T1968 oass.IndexSchema.readSchema default search field in schema is text
   [junit4]   2> 654192 T2002 oass.OpenExchangeRatesOrgProvider.reload Reloading exchange rates from open-exchange-rates.json
   [junit4]   2> 654193 T1968 oass.IndexSchema.readSchema unique key field: id
   [junit4]   2> 654193 T2002 oass.OpenExchangeRatesOrgProvider$OpenExchangeRates.<init> WARN Unknown key IMPORTANT NOTE
   [junit4]   2> 654194 T2002 oass.OpenExchangeRatesOrgProvider$OpenExchangeRates.<init> WARN Expected key, got STRING
   [junit4]   2> 654194 T2002 oass.OpenExchangeRatesOrgProvider.reload Reloading exchange rates from open-exchange-rates.json
   [junit4]   2> 654195 T2002 oass.OpenExchangeRatesOrgProvider$OpenExchangeRates.<init> WARN Unknown key IMPORTANT NOTE
   [junit4]   2> 654195 T2002 oass.OpenExchangeRatesOrgProvider$OpenExchangeRates.<init> WARN Expected key, got STRING
   [junit4]   2> 654196 T2002 oasc.SolrCore.initDirectoryFactory org.apache.solr.core.MockDirectoryFactory
   [junit4]   2> 654196 T2002 oasc.SolrCore.<init> [nodes_used_collection_shard2_replica2] Opening new SolrCore at /mnt/ssd/jenkins/workspace/Lucene-Solr-trunk-Linux/solr/build/solr-core/test/J1/./org.apache.solr.cloud.CollectionsAPIDistributedZkTest-jetty2-1375318856157/nodes_used_collection_shard2_replica2/, dataDir=/mnt/ssd/jenkins/workspace/Lucene-Solr-trunk-Linux/solr/build/solr-core/test/J1/./org.apache.solr.cloud.CollectionsAPIDistributedZkTest-jetty2-1375318856157//nodes_used_collection_shard2_replica2/data/
   [junit4]   2> 654196 T2002 oasc.JmxMonitoredMap.<init> JMX monitoring is enabled. Adding Solr mbeans to JMX Server: com.sun.jmx.mbeanserver.JmxMBeanServer@dc5122
   [junit4]   2> 654197 T2002 oasc.CachingDirectoryFactory.get return new directory for /mnt/ssd/jenkins/workspace/Lucene-Solr-trunk-Linux/solr/build/solr-core/test/J1/./org.apache.solr.cloud.CollectionsAPIDistributedZkTest-jetty2-1375318856157//nodes_used_collection_shard2_replica2/data
   [junit4]   2> 654197 T2002 oasc.SolrCore.getNewIndexDir New index directory detected: old=null new=/mnt/ssd/jenkins/workspace/Lucene-Solr-trunk-Linux/solr/build/solr-core/test/J1/./org.apache.solr.cloud.CollectionsAPIDistributedZkTest-jetty2-1375318856157//nodes_used_collection_shard2_replica2/data/index/
   [junit4]   2> 654198 T2002 oasc.SolrCore.initIndex WARN [nodes_used_collection_shard2_replica2] Solr index directory '/mnt/ssd/jenkins/workspace/Lucene-Solr-trunk-Linux/solr/build/solr-core/test/J1/./org.apache.solr.cloud.CollectionsAPIDistributedZkTest-jetty2-1375318856157/nodes_used_collection_shard2_replica2/data/index' doesn't exist. Creating new index...
   [junit4]   2> 654198 T2002 oasc.CachingDirectoryFactory.get return new directory for /mnt/ssd/jenkins/workspace/Lucene-Solr-trunk-Linux/solr/build/solr-core/test/J1/./org.apache.solr.cloud.CollectionsAPIDistributedZkTest-jetty2-1375318856157//nodes_used_collection_shard2_replica2/data/index
   [junit4]   2> 654200 T2002 oasc.SolrDeletionPolicy.onCommit SolrDeletionPolicy.onCommit: commits: num=1
   [junit4]   2> 		commit{dir=MockDirWrapper(org.apache.lucene.store.RAMDirectory@abea0d lockFactory=org.apache.lucene.store.NativeFSLockFactory@834bf6),segFN=segments_1,generation=1}
   [junit4]   2> 654200 T2002 oasc.SolrDeletionPolicy.updateCommits newest commit generation = 1
   [junit4]   2> 654203 T1968 oass.FileExchangeRateProvider.reload Reloading exchange rates from file currency.xml
   [junit4]   2> 654203 T2002 oasup.UpdateRequestProcessorChain.init inserting DistributedUpdateProcessorFactory into updateRequestProcessorChain "dedupe"
   [junit4]   2> 654203 T2002 oasup.UpdateRequestProcessorChain.init inserting DistributedUpdateProcessorFactory into updateRequestProcessorChain "stored_sig"
   [junit4]   2> 654204 T2002 oasup.UpdateRequestProcessorChain.init inserting DistributedUpdateProcessorFactory into updateRequestProcessorChain "distrib-dup-test-chain-implicit"
   [junit4]   2> 654204 T2002 oasc.RequestHandlers.initHandlersFromConfig created standard: solr.StandardRequestHandler
   [junit4]   2> 654205 T2002 oasc.RequestHandlers.initHandlersFromConfig created /get: solr.RealTimeGetHandler
   [junit4]   2> 654205 T2002 oasc.RequestHandlers.initHandlersFromConfig adding lazy requestHandler: solr.ReplicationHandler
   [junit4]   2> 654205 T2002 oasc.RequestHandlers.initHandlersFromConfig created /replication: solr.ReplicationHandler
   [junit4]   2> 654206 T2002 oasc.RequestHandlers.initHandlersFromConfig created /update: solr.UpdateRequestHandler
   [junit4]   2> 654206 T2002 oasc.RequestHandlers.initHandlersFromConfig created /admin/: org.apache.solr.handler.admin.AdminHandlers
   [junit4]   2> 654207 T1968 oass.FileExchangeRateProvider.reload Reloading exchange rates from file currency.xml
   [junit4]   2> 654209 T2002 oashl.XMLLoader.init xsltCacheLifetimeSeconds=60
   [junit4]   2> 654211 T1968 oass.OpenExchangeRatesOrgProvider.reload Reloading exchange rates from open-exchange-rates.json
   [junit4]   2> 654211 T2002 oass.SolrIndexSearcher.<init> Opening Searcher@36af0e main
   [junit4]   2> 654212 T1968 oass.OpenExchangeRatesOrgProvider$OpenExchangeRates.<init> WARN Unknown key IMPORTANT NOTE
   [junit4]   2> 654212 T1968 oass.OpenExchangeRatesOrgProvider$OpenExchangeRates.<init> WARN Expected key, got STRING
   [junit4]   2> 654212 T2002 oasu.CommitTracker.<init> Hard AutoCommit: disabled
   [junit4]   2> 654212 T1968 oass.OpenExchangeRatesOrgProvider.reload Reloading exchange rates from open-exchange-rates.json
   [junit4]   2> 654213 T2002 oasu.CommitTracker.<init> Soft AutoCommit: disabled
   [junit4]   2> 654214 T1968 oass.OpenExchangeRatesOrgProvider$OpenExchangeRates.<init> WARN Unknown key IMPORTANT NOTE
   [junit4]   2> 654214 T1968 oass.OpenExchangeRatesOrgProvider$OpenExchangeRates.<init> WARN Expected key, got STRING
   [junit4]   2> 654214 T1968 oasc.SolrCore.initDirectoryFactory org.apache.solr.core.MockDirectoryFactory
   [junit4]   2> 654214 T1968 oasc.SolrCore.<init> [nodes_used_collection_shard2_replica1] Opening new SolrCore at /mnt/ssd/jenkins/workspace/Lucene-Solr-trunk-Linux/solr/build/solr-core/test/J1/./org.apache.solr.cloud.CollectionsAPIDistributedZkTest-controljetty-1375318854735/nodes_used_collection_shard2_replica1/, dataDir=/mnt/ssd/jenkins/workspace/Lucene-Solr-trunk-Linux/solr/build/solr-core/test/J1/./org.apache.solr.cloud.CollectionsAPIDistributedZkTest-controljetty-1375318854735//nodes_used_collection_shard2_replica1/data/
   [junit4]   2> 654215 T1968 oasc.JmxMonitoredMap.<init> JMX monitoring is enabled. Adding Solr mbeans to JMX Server: com.sun.jmx.mbeanserver.JmxMBeanServer@dc5122
   [junit4]   2> 654216 T1968 oasc.CachingDirectoryFactory.get return new directory for /mnt/ssd/jenkins/workspace/Lucene-Solr-trunk-Linux/solr/build/solr-core/test/J1/./org.apache.solr.cloud.CollectionsAPIDistributedZkTest-controljetty-1375318854735//nodes_used_collection_shard2_replica1/data
   [junit4]   2> 654216 T1968 oasc.SolrCore.getNewIndexDir New index directory detected: old=null new=/mnt/ssd/jenkins/workspace/Lucene-Solr-trunk-Linux/solr/build/solr-core/test/J1/./org.apache.solr.cloud.CollectionsAPIDistributedZkTest-controljetty-1375318854735//nodes_used_collection_shard2_replica1/data/index/
   [junit4]   2> 654216 T1968 oasc.SolrCore.initIndex WARN [nodes_used_collection_shard2_replica1] Solr index directory '/mnt/ssd/jenkins/workspace/Lucene-Solr-trunk-Linux/solr/build/solr-core/test/J1/./org.apache.solr.cloud.CollectionsAPIDistributedZkTest-controljetty-1375318854735/nodes_used_collection_shard2_replica1/data/index' doesn't exist. Creating new index...
   [junit4]   2> 654217 T1968 oasc.CachingDirectoryFactory.get return new directory for /mnt/ssd/jenkins/workspace/Lucene-Solr-trunk-Linux/solr/build/solr-core/test/J1/./org.apache.solr.cloud.CollectionsAPIDistributedZkTest-controljetty-1375318854735//nodes_used_collection_shard2_replica1/data/index
   [junit4]   2> 654218 T1968 oasc.SolrDeletionPolicy.onCommit SolrDeletionPolicy.onCommit: commits: num=1
   [junit4]   2> 		commit{dir=MockDirWrapper(org.apache.lucene.store.RAMDirectory@4b3d26 lockFactory=org.apache.lucene.store.NativeFSLockFactory@5bea0b),segFN=segments_1,generation=1}
   [junit4]   2> 654218 T1968 oasc.SolrDeletionPolicy.updateCommits newest commit generation = 1
   [junit4]   2> 654218 T2043 oasc.SolrCore.registerSearcher [nodes_used_collection_shard2_replica2] Registered new searcher Searcher@36af0e main{StandardDirectoryReader(segments_1:1)}
   [junit4]   2> 654220 T2002 oasc.CoreContainer.registerCore registering core: nodes_used_collection_shard2_replica2
   [junit4]   2> 654220 T2002 oasc.ZkController.register Register replica - core:nodes_used_collection_shard2_replica2 address:http://127.0.0.1:40304 collection:nodes_used_collection shard:shard2
   [junit4]   2> 654221 T2002 oascsi.HttpClientUtil.createClient Creating new http client, config:maxConnections=10000&maxConnectionsPerHost=20&connTimeout=15000&socketTimeout=30000&retry=false
   [junit4]   2> 654221 T1968 oasup.UpdateRequestProcessorChain.init inserting DistributedUpdateProcessorFactory into updateRequestProcessorChain "dedupe"
   [junit4]   2> 654222 T1968 oasup.UpdateRequestProcessorChain.init inserting DistributedUpdateProcessorFactory into updateRequestProcessorChain "stored_sig"
   [junit4]   2> 654222 T1968 oasup.UpdateRequestProcessorChain.init inserting DistributedUpdateProcessorFactory into updateRequestProcessorChain "distrib-dup-test-chain-implicit"
   [junit4]   2> 654223 T1968 oasc.RequestHandlers.initHandlersFromConfig created standard: solr.StandardRequestHandler
   [junit4]   2> 654223 T1968 oasc.RequestHandlers.initHandlersFromConfig created /get: solr.RealTimeGetHandler
   [junit4]   2> 654223 T1968 oasc.RequestHandlers.initHandlersFromConfig adding lazy requestHandler: solr.ReplicationHandler
   [junit4]   2> 654224 T1968 oasc.RequestHandlers.initHandlersFromConfig created /replication: solr.ReplicationHandler
   [junit4]   2> 654224 T1968 oasc.RequestHandlers.initHandlersFromConfig created /update: solr.UpdateRequestHandler
   [junit4]   2> 654225 T1968 oasc.RequestHandlers.initHandlersFromConfig created /admin/: org.apache.solr.handler.admin.AdminHandlers
   [junit4]   2> 654226 T2002 oascc.SolrZkClient.makePath makePath: /collections/nodes_used_collection/leader_elect/shard2/election
   [junit4]   2> 654227 T1968 oashl.XMLLoader.init xsltCacheLifetimeSeconds=60
   [junit4]   2> 654230 T1968 oass.SolrIndexSearcher.<init> Opening Searcher@a46448 main
   [junit4]   2> 654231 T1968 oasu.CommitTracker.<init> Hard AutoCommit: disabled
   [junit4]   2> 654231 T2002 oasc.ShardLeaderElectionContext.runLeaderProcess Running the leader process for shard shard2
   [junit4]   2> 654231 T1968 oasu.CommitTracker.<init> Soft AutoCommit: disabled
   [junit4]   2> 654234 T2002 oasc.ShardLeaderElectionContext.waitForReplicasToComeUp Waiting until we see more replicas up for shard shard2: total=2 found=1 timeoutin=180000
   [junit4]   2> 654237 T2044 oasc.SolrCore.registerSearcher [nodes_used_collection_shard2_replica1] Registered new searcher Searcher@a46448 main{StandardDirectoryReader(segments_1:1)}
   [junit4]   2> 654239 T1968 oasc.CoreContainer.registerCore registering core: nodes_used_collection_shard2_replica1
   [junit4]   2> 654240 T1968 oasc.ZkController.register Register replica - core:nodes_used_collection_shard2_replica1 address:http://127.0.0.1:50200 collection:nodes_used_collection shard:shard2
   [junit4]   2> 654240 T1968 oascsi.HttpClientUtil.createClient Creating new http client, config:maxConnections=10000&maxConnectionsPerHost=20&connTimeout=15000&socketTimeout=30000&retry=false
   [junit4]   2> 654296 T1976 oascc.ZkStateReader.updateClusterState Updating cloud state from ZooKeeper... 
   [junit4]   2> 654301 T2035 oascc.ZkStateReader$2.process A cluster state change: WatchedEvent state:SyncConnected type:NodeDataChanged path:/clusterstate.json, has occurred - updating... (live nodes size: 5)
   [junit4]   2> 654301 T1993 oascc.ZkStateReader$2.process A cluster state change: WatchedEvent state:SyncConnected type:NodeDataChanged path:/clusterstate.json, has occurred - updating... (live nodes size: 5)
   [junit4]   2> 654301 T1975 oascc.ZkStateReader$2.process A cluster state change: WatchedEvent state:SyncConnected type:NodeDataChanged path:/clusterstate.json, has occurred - updating... (live nodes size: 5)
   [junit4]   2> 654301 T2021 oascc.ZkStateReader$2.process A cluster state change: WatchedEvent state:SyncConnected type:NodeDataChanged path:/clusterstate.json, has occurred - updating... (live nodes size: 5)
   [junit4]   2> 654301 T2007 oascc.ZkStateReader$2.process A cluster state change: WatchedEvent state:SyncConnected type:NodeDataChanged path:/clusterstate.json, has occurred - updating... (live nodes size: 5)
   [junit4]   2> 654301 T1980 oascc.ZkStateReader$2.process A cluster state change: WatchedEvent state:SyncConnected type:NodeDataChanged path:/clusterstate.json, has occurred - updating... (live nodes size: 5)
   [junit4]   2> 654606 T2016 oasc.ShardLeaderElectionContext.waitForReplicasToComeUp Enough replicas found to continue.
   [junit4]   2> 654606 T2016 oasc.ShardLeaderElectionContext.runLeaderProcess I may be the new leader - try and sync
   [junit4]   2> 654606 T2016 oasc.SyncStrategy.sync Sync replicas to http://127.0.0.1:53925/nodes_used_collection_shard1_replica1/
   [junit4]   2> 654607 T2016 oasu.PeerSync.sync PeerSync: core=nodes_used_collection_shard1_replica1 url=http://127.0.0.1:53925 START replicas=[http://127.0.0.1:56171/nodes_used_collection_shard1_replica2/] nUpdates=100
   [junit4]   2> 654607 T2016 oasu.PeerSync.sync PeerSync: core=nodes_used_collection_shard1_replica1 url=http://127.0.0.1:53925 DONE.  We have no versions.  sync failed.
   [junit4]   2> 654607 T2016 oasc.SyncStrategy.syncReplicas Leader's attempt to sync with shard failed, moving to the next candidate
   [junit4]   2> 654608 T2016 oasc.ShardLeaderElectionContext.runLeaderProcess We failed sync, but we have no versions - we can't sync in that case - we were active before, so become leader anyway
   [junit4]   2> 654608 T2016 oasc.ShardLeaderElectionContext.runLeaderProcess I am the new leader: http://127.0.0.1:53925/nodes_used_collection_shard1_replica1/ shard1
   [junit4]   2> 654608 T2016 oascc.SolrZkClient.makePath makePath: /collections/nodes_used_collection/leaders/shard1
   [junit4]   2> ASYNC  NEW_CORE C2802 name=nodes_used_collection_shard1_replica2 org.apache.solr.core.SolrCore@1033ff5 url=http://127.0.0.1:56171/nodes_used_collection_shard1_replica2 node=127.0.0.1:56171_ C2802_STATE=coll:nodes_used_collection core:nodes_used_collection_shard1_replica2 props:{state=down, core=nodes_used_collection_shard1_replica2, node_name=127.0.0.1:56171_, base_url=http://127.0.0.1:56171}
   [junit4]   2> 654615 T1989 C2802 P56171 oasc.SolrCore.execute [nodes_used_collection_shard1_replica2] webapp= path=/get params={getVersions=100&distrib=false&wt=javabin&qt=/get&version=2} status=0 QTime=1 
   [junit4]   2> 654735 T2002 oasc.ShardLeaderElectionContext.waitForReplicasToComeUp Enough replicas found to continue.
   [junit4]   2> 654736 T2002 oasc.ShardLeaderElectionContext.runLeaderProcess I may be the new leader - try and sync
   [junit4]   2> 654736 T2002 oasc.SyncStrategy.sync Sync replicas to http://127.0.0.1:40304/nodes_used_collection_shard2_replica2/
   [junit4]   2> 654736 T2002 oasu.PeerSync.sy

[...truncated too long message...]

,null}
   [junit4]   2> 770902 T1953 oas.SolrTestCaseJ4.tearDown ###Ending testDistribSearch
   [junit4]   2> 770904 T1953 oasc.ZkTestServer.send4LetterWord connecting to 127.0.0.1:57173 57173
   [junit4]   1> client port:0.0.0.0/0.0.0.0:0
   [junit4]   2> NOTE: reproduce with: ant test  -Dtestcase=CollectionsAPIDistributedZkTest -Dtests.method=testDistribSearch -Dtests.seed=737B4C9C32C05245 -Dtests.multiplier=3 -Dtests.slow=true -Dtests.locale=no_NO -Dtests.timezone=Pacific/Midway -Dtests.file.encoding=ISO-8859-1
   [junit4] ERROR    126s J1 | CollectionsAPIDistributedZkTest.testDistribSearch <<<
   [junit4]    > Throwable #1: org.apache.solr.client.solrj.SolrServerException: Server refused connection at: http://127.0.0.1:56171
   [junit4]    > 	at __randomizedtesting.SeedInfo.seed([737B4C9C32C05245:F29DC284459F3279]:0)
   [junit4]    > 	at org.apache.solr.client.solrj.impl.HttpSolrServer.request(HttpSolrServer.java:428)
   [junit4]    > 	at org.apache.solr.client.solrj.impl.HttpSolrServer.request(HttpSolrServer.java:180)
   [junit4]    > 	at org.apache.solr.cloud.CollectionsAPIDistributedZkTest.testCustomCollectionsAPI(CollectionsAPIDistributedZkTest.java:764)
   [junit4]    > 	at org.apache.solr.cloud.CollectionsAPIDistributedZkTest.doTest(CollectionsAPIDistributedZkTest.java:159)
   [junit4]    > 	at org.apache.solr.BaseDistributedSearchTestCase.testDistribSearch(BaseDistributedSearchTestCase.java:835)
   [junit4]    > 	at java.lang.Thread.run(Thread.java:724)
   [junit4]    > Caused by: org.apache.http.conn.HttpHostConnectException: Connection to http://127.0.0.1:56171 refused
   [junit4]    > 	at org.apache.http.impl.conn.DefaultClientConnectionOperator.openConnection(DefaultClientConnectionOperator.java:190)
   [junit4]    > 	at org.apache.http.impl.conn.ManagedClientConnectionImpl.open(ManagedClientConnectionImpl.java:294)
   [junit4]    > 	at org.apache.http.impl.client.DefaultRequestDirector.tryConnect(DefaultRequestDirector.java:645)
   [junit4]    > 	at org.apache.http.impl.client.DefaultRequestDirector.execute(DefaultRequestDirector.java:480)
   [junit4]    > 	at org.apache.http.impl.client.AbstractHttpClient.execute(AbstractHttpClient.java:906)
   [junit4]    > 	at org.apache.http.impl.client.AbstractHttpClient.execute(AbstractHttpClient.java:805)
   [junit4]    > 	at org.apache.http.impl.client.AbstractHttpClient.execute(AbstractHttpClient.java:784)
   [junit4]    > 	at org.apache.solr.client.solrj.impl.HttpSolrServer.request(HttpSolrServer.java:365)
   [junit4]    > 	... 44 more
   [junit4]    > Caused by: java.net.ConnectException: Connection refused
   [junit4]    > 	at java.net.PlainSocketImpl.socketConnect(Native Method)
   [junit4]    > 	at java.net.AbstractPlainSocketImpl.doConnect(AbstractPlainSocketImpl.java:339)
   [junit4]    > 	at java.net.AbstractPlainSocketImpl.connectToAddress(AbstractPlainSocketImpl.java:200)
   [junit4]    > 	at java.net.AbstractPlainSocketImpl.connect(AbstractPlainSocketImpl.java:182)
   [junit4]    > 	at java.net.SocksSocketImpl.connect(SocksSocketImpl.java:392)
   [junit4]    > 	at java.net.Socket.connect(Socket.java:579)
   [junit4]    > 	at org.apache.http.conn.scheme.PlainSocketFactory.connectSocket(PlainSocketFactory.java:127)
   [junit4]    > 	at org.apache.http.impl.conn.DefaultClientConnectionOperator.openConnection(DefaultClientConnectionOperator.java:180)
   [junit4]    > 	... 51 more
   [junit4]   2> 770922 T1953 oas.SolrTestCaseJ4.deleteCore ###deleteCore
   [junit4]   2> 126233 T1952 ccr.ThreadLeakControl.checkThreadLeaks WARNING Will linger awaiting termination of 3 leaked thread(s).
   [junit4]   2> 772126 T2035 oascc.ZkStateReader$2.process WARN ZooKeeper watch triggered, but Solr cannot talk to ZK
   [junit4]   2> 772126 T2035 oascc.ZkStateReader$3.process WARN ZooKeeper watch triggered, but Solr cannot talk to ZK
   [junit4]   2> 772126 T2035 oasc.LeaderElector$1.process WARN  org.apache.zookeeper.KeeperException$SessionExpiredException: KeeperErrorCode = Session expired for /collections/new_implicit_coll_1/leader_elect/c/election
   [junit4]   2> 	at org.apache.zookeeper.KeeperException.create(KeeperException.java:127)
   [junit4]   2> 	at org.apache.zookeeper.KeeperException.create(KeeperException.java:51)
   [junit4]   2> 	at org.apache.zookeeper.ZooKeeper.getChildren(ZooKeeper.java:1468)
   [junit4]   2> 	at org.apache.solr.common.cloud.SolrZkClient$6.execute(SolrZkClient.java:235)
   [junit4]   2> 	at org.apache.solr.common.cloud.SolrZkClient$6.execute(SolrZkClient.java:232)
   [junit4]   2> 	at org.apache.solr.common.cloud.ZkCmdExecutor.retryOperation(ZkCmdExecutor.java:65)
   [junit4]   2> 	at org.apache.solr.common.cloud.SolrZkClient.getChildren(SolrZkClient.java:232)
   [junit4]   2> 	at org.apache.solr.cloud.LeaderElector.checkIfIamLeader(LeaderElector.java:84)
   [junit4]   2> 	at org.apache.solr.cloud.LeaderElector.access$000(LeaderElector.java:55)
   [junit4]   2> 	at org.apache.solr.cloud.LeaderElector$1.process(LeaderElector.java:129)
   [junit4]   2> 	at org.apache.zookeeper.ClientCnxn$EventThread.processEvent(ClientCnxn.java:519)
   [junit4]   2> 	at org.apache.zookeeper.ClientCnxn$EventThread.run(ClientCnxn.java:495)
   [junit4]   2> 
   [junit4]   2> 772127 T2035 oasc.LeaderElector$1.process WARN  org.apache.zookeeper.KeeperException$SessionExpiredException: KeeperErrorCode = Session expired for /collections/new_implicit_coll_1/leader_elect/b/election
   [junit4]   2> 	at org.apache.zookeeper.KeeperException.create(KeeperException.java:127)
   [junit4]   2> 	at org.apache.zookeeper.KeeperException.create(KeeperException.java:51)
   [junit4]   2> 	at org.apache.zookeeper.ZooKeeper.getChildren(ZooKeeper.java:1468)
   [junit4]   2> 	at org.apache.solr.common.cloud.SolrZkClient$6.execute(SolrZkClient.java:235)
   [junit4]   2> 	at org.apache.solr.common.cloud.SolrZkClient$6.execute(SolrZkClient.java:232)
   [junit4]   2> 	at org.apache.solr.common.cloud.ZkCmdExecutor.retryOperation(ZkCmdExecutor.java:65)
   [junit4]   2> 	at org.apache.solr.common.cloud.SolrZkClient.getChildren(SolrZkClient.java:232)
   [junit4]   2> 	at org.apache.solr.cloud.LeaderElector.checkIfIamLeader(LeaderElector.java:84)
   [junit4]   2> 	at org.apache.solr.cloud.LeaderElector.access$000(LeaderElector.java:55)
   [junit4]   2> 	at org.apache.solr.cloud.LeaderElector$1.process(LeaderElector.java:129)
   [junit4]   2> 	at org.apache.zookeeper.ClientCnxn$EventThread.processEvent(ClientCnxn.java:519)
   [junit4]   2> 	at org.apache.zookeeper.ClientCnxn$EventThread.run(ClientCnxn.java:495)
   [junit4]   2> 
   [junit4]   2> NOTE: test params are: codec=Lucene41, sim=DefaultSimilarity, locale=no_NO, timezone=Pacific/Midway
   [junit4]   2> NOTE: Linux 3.2.0-51-generic i386/Oracle Corporation 1.7.0_25 (32-bit)/cpus=8,threads=12,free=102731672,total=302710784
   [junit4]   2> NOTE: All tests run in this JVM: [DirectSolrSpellCheckerTest, ConvertedLegacyTest, TestBinaryField, PathHierarchyTokenizerFactoryTest, DOMUtilTest, SolrIndexConfigTest, SuggesterWFSTTest, FileUtilsTest, TestFiltering, HdfsCollectionsAPIDistributedZkTest, TestSchemaResource, TestFieldCollectionResource, DistanceFunctionTest, TestCopyFieldCollectionResource, DebugComponentTest, SampleTest, TestMultiCoreConfBootstrap, SuggesterTSTTest, TestSolr4Spatial, JSONWriterTest, TestPostingsSolrHighlighter, HdfsUnloadDistributedZkTest, TestRandomFaceting, SpellCheckCollatorTest, HdfsRecoveryZkTest, EchoParamsTest, TestAddFieldRealTimeGet, IndexBasedSpellCheckerTest, RequestHandlersTest, BadCopyFieldTest, RequiredFieldsTest, TestJmxMonitoredMap, SolrPluginUtilsTest, SignatureUpdateProcessorFactoryTest, CurrencyFieldOpenExchangeTest, TestSuggestSpellingConverter, TestBM25SimilarityFactory, TestOmitPositions, HighlighterConfigTest, TestComponentsName, TestSchemaSimilarityResource, HdfsSyncSliceTest, TestCodecSupport, TestPartialUpdateDeduplication, TestElisionMultitermQuery, HardAutoCommitTest, OutputWriterTest, OpenExchangeRatesOrgProviderTest, TestDistributedGrouping, TestCSVResponseWriter, TestRecovery, DisMaxRequestHandlerTest, TestIndexSearcher, NotRequiredUniqueKeyTest, TestReload, TestCSVLoader, StandardRequestHandlerTest, OpenCloseCoreStressTest, IndexSchemaRuntimeFieldTest, TestFastOutputStream, TestClassNameShortening, TestRangeQuery, URLClassifyProcessorTest, TestLazyCores, TestUpdate, DeleteShardTest, TestInfoStreamLogging, TestStressReorder, TestDFRSimilarityFactory, XsltUpdateRequestHandlerTest, BadIndexSchemaTest, TestIndexingPerformance, DocumentAnalysisRequestHandlerTest, TestQueryTypes, TestRandomMergePolicy, BlockCacheTest, ChaosMonkeySafeLeaderTest, BasicDistributedZk2Test, CollectionsAPIDistributedZkTest]
   [junit4] Completed on J1 in 127.52s, 1 test, 1 error <<< FAILURES!

[...truncated 522 lines...]
BUILD FAILED
/mnt/ssd/jenkins/workspace/Lucene-Solr-trunk-Linux/build.xml:389: The following error occurred while executing this line:
/mnt/ssd/jenkins/workspace/Lucene-Solr-trunk-Linux/build.xml:369: The following error occurred while executing this line:
/mnt/ssd/jenkins/workspace/Lucene-Solr-trunk-Linux/build.xml:39: The following error occurred while executing this line:
/mnt/ssd/jenkins/workspace/Lucene-Solr-trunk-Linux/solr/build.xml:181: The following error occurred while executing this line:
/mnt/ssd/jenkins/workspace/Lucene-Solr-trunk-Linux/solr/common-build.xml:449: The following error occurred while executing this line:
/mnt/ssd/jenkins/workspace/Lucene-Solr-trunk-Linux/lucene/common-build.xml:1230: The following error occurred while executing this line:
/mnt/ssd/jenkins/workspace/Lucene-Solr-trunk-Linux/lucene/common-build.xml:873: There were test failures: 320 suites, 1345 tests, 1 error, 34 ignored (6 assumptions)

Total time: 43 minutes 4 seconds
Build step 'Invoke Ant' marked build as failure
Description set: Java: 32bit/jdk1.7.0_25 -client -XX:+UseParallelGC
Archiving artifacts
Recording test results
Email was triggered for: Failure
Sending email for trigger: Failure



Mime
View raw message