lucene-dev mailing list archives

Site index · List index
Message view « Date » · « Thread »
Top « Date » · « Thread »
From Apache Jenkins Server <jenk...@builds.apache.org>
Subject [JENKINS] Lucene-Solr-Tests-trunk-Java7 - Build # 4202 - Still Failing
Date Fri, 02 Aug 2013 09:59:21 GMT
Build: https://builds.apache.org/job/Lucene-Solr-Tests-trunk-Java7/4202/

1 tests failed.
FAILED:  org.apache.solr.cloud.CollectionsAPIDistributedZkTest.testDistribSearch

Error Message:
IOException occured when talking to server at: http://127.0.0.1:26634

Stack Trace:
org.apache.solr.client.solrj.SolrServerException: IOException occured when talking to server at: http://127.0.0.1:26634
	at __randomizedtesting.SeedInfo.seed([C3F44CBF6E03B599:4212C2A7195CD5A5]:0)
	at org.apache.solr.client.solrj.impl.HttpSolrServer.request(HttpSolrServer.java:435)
	at org.apache.solr.client.solrj.impl.HttpSolrServer.request(HttpSolrServer.java:180)
	at org.apache.solr.cloud.AbstractFullDistribZkTestBase.createCollection(AbstractFullDistribZkTestBase.java:1535)
	at org.apache.solr.cloud.CollectionsAPIDistributedZkTest.testCustomCollectionsAPI(CollectionsAPIDistributedZkTest.java:677)
	at org.apache.solr.cloud.CollectionsAPIDistributedZkTest.doTest(CollectionsAPIDistributedZkTest.java:159)
	at org.apache.solr.BaseDistributedSearchTestCase.testDistribSearch(BaseDistributedSearchTestCase.java:835)
	at sun.reflect.NativeMethodAccessorImpl.invoke0(Native Method)
	at sun.reflect.NativeMethodAccessorImpl.invoke(NativeMethodAccessorImpl.java:57)
	at sun.reflect.DelegatingMethodAccessorImpl.invoke(DelegatingMethodAccessorImpl.java:43)
	at java.lang.reflect.Method.invoke(Method.java:606)
	at com.carrotsearch.randomizedtesting.RandomizedRunner.invoke(RandomizedRunner.java:1559)
	at com.carrotsearch.randomizedtesting.RandomizedRunner.access$600(RandomizedRunner.java:79)
	at com.carrotsearch.randomizedtesting.RandomizedRunner$6.evaluate(RandomizedRunner.java:737)
	at com.carrotsearch.randomizedtesting.RandomizedRunner$7.evaluate(RandomizedRunner.java:773)
	at com.carrotsearch.randomizedtesting.RandomizedRunner$8.evaluate(RandomizedRunner.java:787)
	at com.carrotsearch.randomizedtesting.rules.SystemPropertiesRestoreRule$1.evaluate(SystemPropertiesRestoreRule.java:53)
	at org.apache.lucene.util.TestRuleSetupTeardownChained$1.evaluate(TestRuleSetupTeardownChained.java:50)
	at org.apache.lucene.util.TestRuleFieldCacheSanity$1.evaluate(TestRuleFieldCacheSanity.java:51)
	at org.apache.lucene.util.AbstractBeforeAfterRule$1.evaluate(AbstractBeforeAfterRule.java:46)
	at com.carrotsearch.randomizedtesting.rules.SystemPropertiesInvariantRule$1.evaluate(SystemPropertiesInvariantRule.java:55)
	at org.apache.lucene.util.TestRuleThreadAndTestName$1.evaluate(TestRuleThreadAndTestName.java:49)
	at org.apache.lucene.util.TestRuleIgnoreAfterMaxFailures$1.evaluate(TestRuleIgnoreAfterMaxFailures.java:70)
	at org.apache.lucene.util.TestRuleMarkFailure$1.evaluate(TestRuleMarkFailure.java:48)
	at com.carrotsearch.randomizedtesting.rules.StatementAdapter.evaluate(StatementAdapter.java:36)
	at com.carrotsearch.randomizedtesting.ThreadLeakControl$StatementRunner.run(ThreadLeakControl.java:358)
	at com.carrotsearch.randomizedtesting.ThreadLeakControl.forkTimeoutingTask(ThreadLeakControl.java:782)
	at com.carrotsearch.randomizedtesting.ThreadLeakControl$3.evaluate(ThreadLeakControl.java:442)
	at com.carrotsearch.randomizedtesting.RandomizedRunner.runSingleTest(RandomizedRunner.java:746)
	at com.carrotsearch.randomizedtesting.RandomizedRunner$3.evaluate(RandomizedRunner.java:648)
	at com.carrotsearch.randomizedtesting.RandomizedRunner$4.evaluate(RandomizedRunner.java:682)
	at com.carrotsearch.randomizedtesting.RandomizedRunner$5.evaluate(RandomizedRunner.java:693)
	at com.carrotsearch.randomizedtesting.rules.StatementAdapter.evaluate(StatementAdapter.java:36)
	at com.carrotsearch.randomizedtesting.rules.SystemPropertiesRestoreRule$1.evaluate(SystemPropertiesRestoreRule.java:53)
	at org.apache.lucene.util.AbstractBeforeAfterRule$1.evaluate(AbstractBeforeAfterRule.java:46)
	at org.apache.lucene.util.TestRuleStoreClassName$1.evaluate(TestRuleStoreClassName.java:42)
	at com.carrotsearch.randomizedtesting.rules.SystemPropertiesInvariantRule$1.evaluate(SystemPropertiesInvariantRule.java:55)
	at com.carrotsearch.randomizedtesting.rules.NoShadowingOrOverridesOnMethodsRule$1.evaluate(NoShadowingOrOverridesOnMethodsRule.java:39)
	at com.carrotsearch.randomizedtesting.rules.NoShadowingOrOverridesOnMethodsRule$1.evaluate(NoShadowingOrOverridesOnMethodsRule.java:39)
	at com.carrotsearch.randomizedtesting.rules.StatementAdapter.evaluate(StatementAdapter.java:36)
	at org.apache.lucene.util.TestRuleAssertionsRequired$1.evaluate(TestRuleAssertionsRequired.java:43)
	at org.apache.lucene.util.TestRuleMarkFailure$1.evaluate(TestRuleMarkFailure.java:48)
	at org.apache.lucene.util.TestRuleIgnoreAfterMaxFailures$1.evaluate(TestRuleIgnoreAfterMaxFailures.java:70)
	at org.apache.lucene.util.TestRuleIgnoreTestSuites$1.evaluate(TestRuleIgnoreTestSuites.java:55)
	at com.carrotsearch.randomizedtesting.rules.StatementAdapter.evaluate(StatementAdapter.java:36)
	at com.carrotsearch.randomizedtesting.ThreadLeakControl$StatementRunner.run(ThreadLeakControl.java:358)
	at java.lang.Thread.run(Thread.java:724)
Caused by: org.apache.http.conn.ConnectTimeoutException: Connect to 127.0.0.1:26634 timed out
	at org.apache.http.conn.scheme.PlainSocketFactory.connectSocket(PlainSocketFactory.java:129)
	at org.apache.http.impl.conn.DefaultClientConnectionOperator.openConnection(DefaultClientConnectionOperator.java:180)
	at org.apache.http.impl.conn.ManagedClientConnectionImpl.open(ManagedClientConnectionImpl.java:294)
	at org.apache.http.impl.client.DefaultRequestDirector.tryConnect(DefaultRequestDirector.java:645)
	at org.apache.http.impl.client.DefaultRequestDirector.execute(DefaultRequestDirector.java:480)
	at org.apache.http.impl.client.AbstractHttpClient.execute(AbstractHttpClient.java:906)
	at org.apache.http.impl.client.AbstractHttpClient.execute(AbstractHttpClient.java:805)
	at org.apache.http.impl.client.AbstractHttpClient.execute(AbstractHttpClient.java:784)
	at org.apache.solr.client.solrj.impl.HttpSolrServer.request(HttpSolrServer.java:365)
	... 45 more




Build Log:
[...truncated 9707 lines...]
   [junit4] Suite: org.apache.solr.cloud.CollectionsAPIDistributedZkTest
   [junit4]   2> 839956 T2241 oas.BaseDistributedSearchTestCase.initHostContext Setting hostContext system property: /
   [junit4]   2> 839962 T2241 oas.SolrTestCaseJ4.setUp ###Starting testDistribSearch
   [junit4]   2> Creating dataDir: /usr/home/hudson/hudson-slave/workspace/Lucene-Solr-Tests-trunk-Java7/solr/build/solr-core/test/J1/./solrtest-CollectionsAPIDistributedZkTest-1375436330279
   [junit4]   2> 839964 T2241 oasc.ZkTestServer.run STARTING ZK TEST SERVER
   [junit4]   2> 839965 T2242 oasc.ZkTestServer$ZKServerMain.runFromConfig Starting server
   [junit4]   2> 840066 T2241 oasc.ZkTestServer.run start zk server on port:26555
   [junit4]   2> 840067 T2241 oascc.ConnectionManager.waitForConnected Waiting for client to connect to ZooKeeper
   [junit4]   2> 840071 T2248 oascc.ConnectionManager.process Watcher org.apache.solr.common.cloud.ConnectionManager@3e0475c1 name:ZooKeeperConnection Watcher:127.0.0.1:26555 got event WatchedEvent state:SyncConnected type:None path:null path:null type:None
   [junit4]   2> 840072 T2241 oascc.ConnectionManager.waitForConnected Client is connected to ZooKeeper
   [junit4]   2> 840072 T2241 oascc.SolrZkClient.makePath makePath: /solr
   [junit4]   2> 840077 T2241 oascc.ConnectionManager.waitForConnected Waiting for client to connect to ZooKeeper
   [junit4]   2> 840085 T2250 oascc.ConnectionManager.process Watcher org.apache.solr.common.cloud.ConnectionManager@17efe317 name:ZooKeeperConnection Watcher:127.0.0.1:26555/solr got event WatchedEvent state:SyncConnected type:None path:null path:null type:None
   [junit4]   2> 840085 T2241 oascc.ConnectionManager.waitForConnected Client is connected to ZooKeeper
   [junit4]   2> 840086 T2241 oascc.SolrZkClient.makePath makePath: /collections/collection1
   [junit4]   2> 840090 T2241 oascc.SolrZkClient.makePath makePath: /collections/collection1/shards
   [junit4]   2> 840099 T2241 oascc.SolrZkClient.makePath makePath: /collections/control_collection
   [junit4]   2> 840101 T2241 oascc.SolrZkClient.makePath makePath: /collections/control_collection/shards
   [junit4]   2> 840105 T2241 oasc.AbstractZkTestCase.putConfig put /usr/home/hudson/hudson-slave/workspace/Lucene-Solr-Tests-trunk-Java7/solr/build/solr-core/test-files/solr/collection1/conf/solrconfig-tlog.xml to /configs/conf1/solrconfig.xml
   [junit4]   2> 840106 T2241 oascc.SolrZkClient.makePath makePath: /configs/conf1/solrconfig.xml
   [junit4]   2> 840112 T2241 oasc.AbstractZkTestCase.putConfig put /usr/home/hudson/hudson-slave/workspace/Lucene-Solr-Tests-trunk-Java7/solr/build/solr-core/test-files/solr/collection1/conf/schema.xml to /configs/conf1/schema.xml
   [junit4]   2> 840113 T2241 oascc.SolrZkClient.makePath makePath: /configs/conf1/schema.xml
   [junit4]   2> 840216 T2241 oasc.AbstractZkTestCase.putConfig put /usr/home/hudson/hudson-slave/workspace/Lucene-Solr-Tests-trunk-Java7/solr/build/solr-core/test-files/solr/collection1/conf/stopwords.txt to /configs/conf1/stopwords.txt
   [junit4]   2> 840217 T2241 oascc.SolrZkClient.makePath makePath: /configs/conf1/stopwords.txt
   [junit4]   2> 840221 T2241 oasc.AbstractZkTestCase.putConfig put /usr/home/hudson/hudson-slave/workspace/Lucene-Solr-Tests-trunk-Java7/solr/build/solr-core/test-files/solr/collection1/conf/protwords.txt to /configs/conf1/protwords.txt
   [junit4]   2> 840221 T2241 oascc.SolrZkClient.makePath makePath: /configs/conf1/protwords.txt
   [junit4]   2> 840231 T2241 oasc.AbstractZkTestCase.putConfig put /usr/home/hudson/hudson-slave/workspace/Lucene-Solr-Tests-trunk-Java7/solr/build/solr-core/test-files/solr/collection1/conf/currency.xml to /configs/conf1/currency.xml
   [junit4]   2> 840232 T2241 oascc.SolrZkClient.makePath makePath: /configs/conf1/currency.xml
   [junit4]   2> 840235 T2241 oasc.AbstractZkTestCase.putConfig put /usr/home/hudson/hudson-slave/workspace/Lucene-Solr-Tests-trunk-Java7/solr/build/solr-core/test-files/solr/collection1/conf/open-exchange-rates.json to /configs/conf1/open-exchange-rates.json
   [junit4]   2> 840236 T2241 oascc.SolrZkClient.makePath makePath: /configs/conf1/open-exchange-rates.json
   [junit4]   2> 840240 T2241 oasc.AbstractZkTestCase.putConfig put /usr/home/hudson/hudson-slave/workspace/Lucene-Solr-Tests-trunk-Java7/solr/build/solr-core/test-files/solr/collection1/conf/mapping-ISOLatin1Accent.txt to /configs/conf1/mapping-ISOLatin1Accent.txt
   [junit4]   2> 840241 T2241 oascc.SolrZkClient.makePath makePath: /configs/conf1/mapping-ISOLatin1Accent.txt
   [junit4]   2> 840244 T2241 oasc.AbstractZkTestCase.putConfig put /usr/home/hudson/hudson-slave/workspace/Lucene-Solr-Tests-trunk-Java7/solr/build/solr-core/test-files/solr/collection1/conf/old_synonyms.txt to /configs/conf1/old_synonyms.txt
   [junit4]   2> 840245 T2241 oascc.SolrZkClient.makePath makePath: /configs/conf1/old_synonyms.txt
   [junit4]   2> 840248 T2241 oasc.AbstractZkTestCase.putConfig put /usr/home/hudson/hudson-slave/workspace/Lucene-Solr-Tests-trunk-Java7/solr/build/solr-core/test-files/solr/collection1/conf/synonyms.txt to /configs/conf1/synonyms.txt
   [junit4]   2> 840249 T2241 oascc.SolrZkClient.makePath makePath: /configs/conf1/synonyms.txt
   [junit4]   2> 840529 T2241 oejs.Server.doStart jetty-8.1.10.v20130312
   [junit4]   2> 840534 T2241 oejs.AbstractConnector.doStart Started SocketConnector@127.0.0.1:26559
   [junit4]   2> 840535 T2241 oass.SolrDispatchFilter.init SolrDispatchFilter.init()
   [junit4]   2> 840535 T2241 oasc.SolrResourceLoader.locateSolrHome JNDI not configured for solr (NoInitialContextEx)
   [junit4]   2> 840536 T2241 oasc.SolrResourceLoader.locateSolrHome using system property solr.solr.home: /usr/home/hudson/hudson-slave/workspace/Lucene-Solr-Tests-trunk-Java7/solr/build/solr-core/test/J1/./org.apache.solr.cloud.CollectionsAPIDistributedZkTest-controljetty-1375436330568
   [junit4]   2> 840536 T2241 oasc.SolrResourceLoader.<init> new SolrResourceLoader for directory: '/usr/home/hudson/hudson-slave/workspace/Lucene-Solr-Tests-trunk-Java7/solr/build/solr-core/test/J1/./org.apache.solr.cloud.CollectionsAPIDistributedZkTest-controljetty-1375436330568/'
   [junit4]   2> 840576 T2241 oasc.ConfigSolr.fromFile Loading container configuration from /usr/home/hudson/hudson-slave/workspace/Lucene-Solr-Tests-trunk-Java7/solr/build/solr-core/test/J1/./org.apache.solr.cloud.CollectionsAPIDistributedZkTest-controljetty-1375436330568/solr.xml
   [junit4]   2> 840667 T2241 oasc.ConfigSolrXml.<init> Config-defined core root directory: 
   [junit4]   2> 840668 T2241 oasc.CoreContainer.<init> New CoreContainer 1221872554
   [junit4]   2> 840668 T2241 oasc.CoreContainer.load Loading cores into CoreContainer [instanceDir=/usr/home/hudson/hudson-slave/workspace/Lucene-Solr-Tests-trunk-Java7/solr/build/solr-core/test/J1/./org.apache.solr.cloud.CollectionsAPIDistributedZkTest-controljetty-1375436330568/]
   [junit4]   2> 840670 T2241 oashc.HttpShardHandlerFactory.getParameter Setting socketTimeout to: 120000
   [junit4]   2> 840671 T2241 oashc.HttpShardHandlerFactory.getParameter Setting urlScheme to: http://
   [junit4]   2> 840671 T2241 oashc.HttpShardHandlerFactory.getParameter Setting connTimeout to: 15000
   [junit4]   2> 840672 T2241 oashc.HttpShardHandlerFactory.getParameter Setting maxConnectionsPerHost to: 20
   [junit4]   2> 840672 T2241 oashc.HttpShardHandlerFactory.getParameter Setting corePoolSize to: 0
   [junit4]   2> 840673 T2241 oashc.HttpShardHandlerFactory.getParameter Setting maximumPoolSize to: 2147483647
   [junit4]   2> 840673 T2241 oashc.HttpShardHandlerFactory.getParameter Setting maxThreadIdleTime to: 5
   [junit4]   2> 840674 T2241 oashc.HttpShardHandlerFactory.getParameter Setting sizeOfQueue to: -1
   [junit4]   2> 840674 T2241 oashc.HttpShardHandlerFactory.getParameter Setting fairnessPolicy to: false
   [junit4]   2> 840675 T2241 oascsi.HttpClientUtil.createClient Creating new http client, config:maxConnectionsPerHost=20&maxConnections=10000&socketTimeout=120000&connTimeout=15000&retry=false
   [junit4]   2> 840693 T2241 oasc.ZkContainer.initZooKeeper Zookeeper client=127.0.0.1:26555/solr
   [junit4]   2> 840693 T2241 oasc.ZkController.checkChrootPath zkHost includes chroot
   [junit4]   2> 840694 T2241 oascc.ConnectionManager.waitForConnected Waiting for client to connect to ZooKeeper
   [junit4]   2> 840698 T2261 oascc.ConnectionManager.process Watcher org.apache.solr.common.cloud.ConnectionManager@6c5815b6 name:ZooKeeperConnection Watcher:127.0.0.1:26555 got event WatchedEvent state:SyncConnected type:None path:null path:null type:None
   [junit4]   2> 840698 T2241 oascc.ConnectionManager.waitForConnected Client is connected to ZooKeeper
   [junit4]   2> 840712 T2241 oascsi.HttpClientUtil.createClient Creating new http client, config:maxConnections=500&maxConnectionsPerHost=16&socketTimeout=120000&connTimeout=15000
   [junit4]   2> 840725 T2241 oascc.ConnectionManager.waitForConnected Waiting for client to connect to ZooKeeper
   [junit4]   2> 840727 T2263 oascc.ConnectionManager.process Watcher org.apache.solr.common.cloud.ConnectionManager@3739eeb4 name:ZooKeeperConnection Watcher:127.0.0.1:26555/solr got event WatchedEvent state:SyncConnected type:None path:null path:null type:None
   [junit4]   2> 840727 T2241 oascc.ConnectionManager.waitForConnected Client is connected to ZooKeeper
   [junit4]   2> 840730 T2241 oascc.SolrZkClient.makePath makePath: /overseer/queue
   [junit4]   2> 840738 T2241 oascc.SolrZkClient.makePath makePath: /overseer/collection-queue-work
   [junit4]   2> 840742 T2241 oascc.SolrZkClient.makePath makePath: /live_nodes
   [junit4]   2> 840749 T2241 oasc.ZkController.createEphemeralLiveNode Register node as live in ZooKeeper:/live_nodes/127.0.0.1:26559_
   [junit4]   2> 840751 T2241 oascc.SolrZkClient.makePath makePath: /live_nodes/127.0.0.1:26559_
   [junit4]   2> 840755 T2241 oascc.SolrZkClient.makePath makePath: /overseer_elect/election
   [junit4]   2> 840773 T2241 oascc.SolrZkClient.makePath makePath: /overseer_elect/leader
   [junit4]   2> 840776 T2241 oasc.Overseer.start Overseer (id=90140595341623299-127.0.0.1:26559_-n_0000000000) starting
   [junit4]   2> 840787 T2241 oascc.SolrZkClient.makePath makePath: /overseer/queue-work
   [junit4]   2> 840798 T2265 oasc.OverseerCollectionProcessor.run Process current queue of collection creations
   [junit4]   2> 840799 T2241 oascc.SolrZkClient.makePath makePath: /clusterstate.json
   [junit4]   2> 840802 T2241 oascc.SolrZkClient.makePath makePath: /aliases.json
   [junit4]   2> 840805 T2241 oascc.ZkStateReader.createClusterStateWatchersAndUpdate Updating cluster state from ZooKeeper... 
   [junit4]   2> 840808 T2264 oasc.Overseer$ClusterStateUpdater.run Starting to work on the main queue
   [junit4]   2> 840811 T2241 oasc.CorePropertiesLocator.discover Looking for core definitions underneath /usr/home/hudson/hudson-slave/workspace/Lucene-Solr-Tests-trunk-Java7/solr/build/solr-core/test/J1/./org.apache.solr.cloud.CollectionsAPIDistributedZkTest-controljetty-1375436330568
   [junit4]   2> 840816 T2241 oasc.CorePropertiesLocator.discoverUnder Found core conf in /usr/home/hudson/hudson-slave/workspace/Lucene-Solr-Tests-trunk-Java7/solr/build/solr-core/test/J1/./org.apache.solr.cloud.CollectionsAPIDistributedZkTest-controljetty-1375436330568/conf/
   [junit4]   2> 840985 T2241 oasc.CorePropertiesLocator.discover Found 1 core definitions
   [junit4]   2> 840986 T2241 oass.SolrDispatchFilter.init user.dir=/usr/home/hudson/hudson-slave/workspace/Lucene-Solr-Tests-trunk-Java7/solr/build/solr-core/test/J1
   [junit4]   2> 840987 T2241 oass.SolrDispatchFilter.init SolrDispatchFilter.init() done
   [junit4]   2> 840988 T2241 oascsi.HttpClientUtil.createClient Creating new http client, config:maxConnections=128&maxConnectionsPerHost=32&followRedirects=false
   [junit4]   2> 841005 T2241 oascsi.HttpClientUtil.createClient Creating new http client, config:
   [junit4]   2> 841006 T2241 oascc.ConnectionManager.waitForConnected Waiting for client to connect to ZooKeeper
   [junit4]   2> 841009 T2268 oascc.ConnectionManager.process Watcher org.apache.solr.common.cloud.ConnectionManager@48ffd847 name:ZooKeeperConnection Watcher:127.0.0.1:26555/solr got event WatchedEvent state:SyncConnected type:None path:null path:null type:None
   [junit4]   2> 841009 T2241 oascc.ConnectionManager.waitForConnected Client is connected to ZooKeeper
   [junit4]   2> 841011 T2241 oascc.ZkStateReader.createClusterStateWatchersAndUpdate Updating cluster state from ZooKeeper... 
   [junit4]   2> 841014 T2241 oasc.ChaosMonkey.monkeyLog monkey: init - expire sessions:true cause connection loss:true
   [junit4]   2> 841292 T2241 oejs.Server.doStart jetty-8.1.10.v20130312
   [junit4]   2> 841296 T2241 oejs.AbstractConnector.doStart Started SocketConnector@127.0.0.1:26563
   [junit4]   2> 841297 T2241 oass.SolrDispatchFilter.init SolrDispatchFilter.init()
   [junit4]   2> 841297 T2241 oasc.SolrResourceLoader.locateSolrHome JNDI not configured for solr (NoInitialContextEx)
   [junit4]   2> 841298 T2241 oasc.SolrResourceLoader.locateSolrHome using system property solr.solr.home: /usr/home/hudson/hudson-slave/workspace/Lucene-Solr-Tests-trunk-Java7/solr/build/solr-core/test/J1/./org.apache.solr.cloud.CollectionsAPIDistributedZkTest-jetty1-1375436331329
   [junit4]   2> 841298 T2241 oasc.SolrResourceLoader.<init> new SolrResourceLoader for directory: '/usr/home/hudson/hudson-slave/workspace/Lucene-Solr-Tests-trunk-Java7/solr/build/solr-core/test/J1/./org.apache.solr.cloud.CollectionsAPIDistributedZkTest-jetty1-1375436331329/'
   [junit4]   2> 841338 T2241 oasc.ConfigSolr.fromFile Loading container configuration from /usr/home/hudson/hudson-slave/workspace/Lucene-Solr-Tests-trunk-Java7/solr/build/solr-core/test/J1/./org.apache.solr.cloud.CollectionsAPIDistributedZkTest-jetty1-1375436331329/solr.xml
   [junit4]   2> 841430 T2241 oasc.ConfigSolrXml.<init> Config-defined core root directory: 
   [junit4]   2> 841431 T2241 oasc.CoreContainer.<init> New CoreContainer 1049345661
   [junit4]   2> 841431 T2241 oasc.CoreContainer.load Loading cores into CoreContainer [instanceDir=/usr/home/hudson/hudson-slave/workspace/Lucene-Solr-Tests-trunk-Java7/solr/build/solr-core/test/J1/./org.apache.solr.cloud.CollectionsAPIDistributedZkTest-jetty1-1375436331329/]
   [junit4]   2> 841433 T2241 oashc.HttpShardHandlerFactory.getParameter Setting socketTimeout to: 120000
   [junit4]   2> 841434 T2241 oashc.HttpShardHandlerFactory.getParameter Setting urlScheme to: http://
   [junit4]   2> 841434 T2241 oashc.HttpShardHandlerFactory.getParameter Setting connTimeout to: 15000
   [junit4]   2> 841435 T2241 oashc.HttpShardHandlerFactory.getParameter Setting maxConnectionsPerHost to: 20
   [junit4]   2> 841435 T2241 oashc.HttpShardHandlerFactory.getParameter Setting corePoolSize to: 0
   [junit4]   2> 841435 T2241 oashc.HttpShardHandlerFactory.getParameter Setting maximumPoolSize to: 2147483647
   [junit4]   2> 841436 T2241 oashc.HttpShardHandlerFactory.getParameter Setting maxThreadIdleTime to: 5
   [junit4]   2> 841436 T2241 oashc.HttpShardHandlerFactory.getParameter Setting sizeOfQueue to: -1
   [junit4]   2> 841437 T2241 oashc.HttpShardHandlerFactory.getParameter Setting fairnessPolicy to: false
   [junit4]   2> 841437 T2241 oascsi.HttpClientUtil.createClient Creating new http client, config:maxConnectionsPerHost=20&maxConnections=10000&socketTimeout=120000&connTimeout=15000&retry=false
   [junit4]   2> 841455 T2241 oasc.ZkContainer.initZooKeeper Zookeeper client=127.0.0.1:26555/solr
   [junit4]   2> 841456 T2241 oasc.ZkController.checkChrootPath zkHost includes chroot
   [junit4]   2> 841457 T2241 oascc.ConnectionManager.waitForConnected Waiting for client to connect to ZooKeeper
   [junit4]   2> 841460 T2279 oascc.ConnectionManager.process Watcher org.apache.solr.common.cloud.ConnectionManager@230e0313 name:ZooKeeperConnection Watcher:127.0.0.1:26555 got event WatchedEvent state:SyncConnected type:None path:null path:null type:None
   [junit4]   2> 841460 T2241 oascc.ConnectionManager.waitForConnected Client is connected to ZooKeeper
   [junit4]   2> 841463 T2241 oascsi.HttpClientUtil.createClient Creating new http client, config:maxConnections=500&maxConnectionsPerHost=16&socketTimeout=120000&connTimeout=15000
   [junit4]   2> 841475 T2241 oascc.ConnectionManager.waitForConnected Waiting for client to connect to ZooKeeper
   [junit4]   2> 841477 T2281 oascc.ConnectionManager.process Watcher org.apache.solr.common.cloud.ConnectionManager@83a37e9 name:ZooKeeperConnection Watcher:127.0.0.1:26555/solr got event WatchedEvent state:SyncConnected type:None path:null path:null type:None
   [junit4]   2> 841477 T2241 oascc.ConnectionManager.waitForConnected Client is connected to ZooKeeper
   [junit4]   2> 841490 T2241 oascc.ZkStateReader.createClusterStateWatchersAndUpdate Updating cluster state from ZooKeeper... 
   [junit4]   2> 842495 T2241 oasc.ZkController.createEphemeralLiveNode Register node as live in ZooKeeper:/live_nodes/127.0.0.1:26563_
   [junit4]   2> 842497 T2241 oascc.SolrZkClient.makePath makePath: /live_nodes/127.0.0.1:26563_
   [junit4]   2> 842509 T2263 oascc.ZkStateReader$3.process Updating live nodes... (2)
   [junit4]   2> 842510 T2281 oascc.ZkStateReader$3.process Updating live nodes... (2)
   [junit4]   2> 842510 T2268 oascc.ZkStateReader$3.process Updating live nodes... (2)
   [junit4]   2> 842518 T2241 oasc.CorePropertiesLocator.discover Looking for core definitions underneath /usr/home/hudson/hudson-slave/workspace/Lucene-Solr-Tests-trunk-Java7/solr/build/solr-core/test/J1/./org.apache.solr.cloud.CollectionsAPIDistributedZkTest-jetty1-1375436331329
   [junit4]   2> 842520 T2241 oasc.CorePropertiesLocator.discoverUnder Found core conf in /usr/home/hudson/hudson-slave/workspace/Lucene-Solr-Tests-trunk-Java7/solr/build/solr-core/test/J1/./org.apache.solr.cloud.CollectionsAPIDistributedZkTest-jetty1-1375436331329/conf/
   [junit4]   2> 842708 T2241 oasc.CorePropertiesLocator.discover Found 1 core definitions
   [junit4]   2> 842709 T2241 oass.SolrDispatchFilter.init user.dir=/usr/home/hudson/hudson-slave/workspace/Lucene-Solr-Tests-trunk-Java7/solr/build/solr-core/test/J1
   [junit4]   2> 842710 T2241 oass.SolrDispatchFilter.init SolrDispatchFilter.init() done
   [junit4]   2> 842710 T2241 oascsi.HttpClientUtil.createClient Creating new http client, config:maxConnections=128&maxConnectionsPerHost=32&followRedirects=false
   [junit4]   2> 843045 T2241 oejs.Server.doStart jetty-8.1.10.v20130312
   [junit4]   2> 843049 T2241 oejs.AbstractConnector.doStart Started SocketConnector@127.0.0.1:26634
   [junit4]   2> 843050 T2241 oass.SolrDispatchFilter.init SolrDispatchFilter.init()
   [junit4]   2> 843051 T2241 oasc.SolrResourceLoader.locateSolrHome JNDI not configured for solr (NoInitialContextEx)
   [junit4]   2> 843052 T2241 oasc.SolrResourceLoader.locateSolrHome using system property solr.solr.home: /usr/home/hudson/hudson-slave/workspace/Lucene-Solr-Tests-trunk-Java7/solr/build/solr-core/test/J1/./org.apache.solr.cloud.CollectionsAPIDistributedZkTest-jetty2-1375436333042
   [junit4]   2> 843053 T2241 oasc.SolrResourceLoader.<init> new SolrResourceLoader for directory: '/usr/home/hudson/hudson-slave/workspace/Lucene-Solr-Tests-trunk-Java7/solr/build/solr-core/test/J1/./org.apache.solr.cloud.CollectionsAPIDistributedZkTest-jetty2-1375436333042/'
   [junit4]   2> 843134 T2241 oasc.ConfigSolr.fromFile Loading container configuration from /usr/home/hudson/hudson-slave/workspace/Lucene-Solr-Tests-trunk-Java7/solr/build/solr-core/test/J1/./org.apache.solr.cloud.CollectionsAPIDistributedZkTest-jetty2-1375436333042/solr.xml
   [junit4]   2> 843225 T2241 oasc.ConfigSolrXml.<init> Config-defined core root directory: 
   [junit4]   2> 843226 T2241 oasc.CoreContainer.<init> New CoreContainer 1678627367
   [junit4]   2> 843227 T2241 oasc.CoreContainer.load Loading cores into CoreContainer [instanceDir=/usr/home/hudson/hudson-slave/workspace/Lucene-Solr-Tests-trunk-Java7/solr/build/solr-core/test/J1/./org.apache.solr.cloud.CollectionsAPIDistributedZkTest-jetty2-1375436333042/]
   [junit4]   2> 843229 T2241 oashc.HttpShardHandlerFactory.getParameter Setting socketTimeout to: 120000
   [junit4]   2> 843229 T2241 oashc.HttpShardHandlerFactory.getParameter Setting urlScheme to: http://
   [junit4]   2> 843230 T2241 oashc.HttpShardHandlerFactory.getParameter Setting connTimeout to: 15000
   [junit4]   2> 843230 T2241 oashc.HttpShardHandlerFactory.getParameter Setting maxConnectionsPerHost to: 20
   [junit4]   2> 843231 T2241 oashc.HttpShardHandlerFactory.getParameter Setting corePoolSize to: 0
   [junit4]   2> 843231 T2241 oashc.HttpShardHandlerFactory.getParameter Setting maximumPoolSize to: 2147483647
   [junit4]   2> 843232 T2241 oashc.HttpShardHandlerFactory.getParameter Setting maxThreadIdleTime to: 5
   [junit4]   2> 843232 T2241 oashc.HttpShardHandlerFactory.getParameter Setting sizeOfQueue to: -1
   [junit4]   2> 843233 T2241 oashc.HttpShardHandlerFactory.getParameter Setting fairnessPolicy to: false
   [junit4]   2> 843233 T2241 oascsi.HttpClientUtil.createClient Creating new http client, config:maxConnectionsPerHost=20&maxConnections=10000&socketTimeout=120000&connTimeout=15000&retry=false
   [junit4]   2> 843249 T2241 oasc.ZkContainer.initZooKeeper Zookeeper client=127.0.0.1:26555/solr
   [junit4]   2> 843249 T2241 oasc.ZkController.checkChrootPath zkHost includes chroot
   [junit4]   2> 843250 T2241 oascc.ConnectionManager.waitForConnected Waiting for client to connect to ZooKeeper
   [junit4]   2> 843258 T2293 oascc.ConnectionManager.process Watcher org.apache.solr.common.cloud.ConnectionManager@3e64478b name:ZooKeeperConnection Watcher:127.0.0.1:26555 got event WatchedEvent state:SyncConnected type:None path:null path:null type:None
   [junit4]   2> 843258 T2241 oascc.ConnectionManager.waitForConnected Client is connected to ZooKeeper
   [junit4]   2> 843270 T2241 oascsi.HttpClientUtil.createClient Creating new http client, config:maxConnections=500&maxConnectionsPerHost=16&socketTimeout=120000&connTimeout=15000
   [junit4]   2> 843280 T2241 oascc.ConnectionManager.waitForConnected Waiting for client to connect to ZooKeeper
   [junit4]   2> 843282 T2295 oascc.ConnectionManager.process Watcher org.apache.solr.common.cloud.ConnectionManager@67009a9 name:ZooKeeperConnection Watcher:127.0.0.1:26555/solr got event WatchedEvent state:SyncConnected type:None path:null path:null type:None
   [junit4]   2> 843282 T2241 oascc.ConnectionManager.waitForConnected Client is connected to ZooKeeper
   [junit4]   2> 843287 T2241 oascc.ZkStateReader.createClusterStateWatchersAndUpdate Updating cluster state from ZooKeeper... 
   [junit4]   2> 844291 T2241 oasc.ZkController.createEphemeralLiveNode Register node as live in ZooKeeper:/live_nodes/127.0.0.1:26634_
   [junit4]   2> 844296 T2241 oascc.SolrZkClient.makePath makePath: /live_nodes/127.0.0.1:26634_
   [junit4]   2> 844300 T2281 oascc.ZkStateReader$3.process Updating live nodes... (3)
   [junit4]   2> 844300 T2295 oascc.ZkStateReader$3.process Updating live nodes... (3)
   [junit4]   2> 844300 T2263 oascc.ZkStateReader$3.process Updating live nodes... (3)
   [junit4]   2> 844300 T2268 oascc.ZkStateReader$3.process Updating live nodes... (3)
   [junit4]   2> 844318 T2241 oasc.CorePropertiesLocator.discover Looking for core definitions underneath /usr/home/hudson/hudson-slave/workspace/Lucene-Solr-Tests-trunk-Java7/solr/build/solr-core/test/J1/./org.apache.solr.cloud.CollectionsAPIDistributedZkTest-jetty2-1375436333042
   [junit4]   2> 844486 T2241 oasc.CorePropertiesLocator.discoverUnder Found core conf in /usr/home/hudson/hudson-slave/workspace/Lucene-Solr-Tests-trunk-Java7/solr/build/solr-core/test/J1/./org.apache.solr.cloud.CollectionsAPIDistributedZkTest-jetty2-1375436333042/conf/
   [junit4]   2> 844489 T2241 oasc.CorePropertiesLocator.discover Found 1 core definitions
   [junit4]   2> 844490 T2241 oass.SolrDispatchFilter.init user.dir=/usr/home/hudson/hudson-slave/workspace/Lucene-Solr-Tests-trunk-Java7/solr/build/solr-core/test/J1
   [junit4]   2> 844490 T2241 oass.SolrDispatchFilter.init SolrDispatchFilter.init() done
   [junit4]   2> 844491 T2241 oascsi.HttpClientUtil.createClient Creating new http client, config:maxConnections=128&maxConnectionsPerHost=32&followRedirects=false
   [junit4]   2> 844782 T2241 oejs.Server.doStart jetty-8.1.10.v20130312
   [junit4]   2> 844785 T2241 oejs.AbstractConnector.doStart Started SocketConnector@127.0.0.1:26637
   [junit4]   2> 844786 T2241 oass.SolrDispatchFilter.init SolrDispatchFilter.init()
   [junit4]   2> 844787 T2241 oasc.SolrResourceLoader.locateSolrHome JNDI not configured for solr (NoInitialContextEx)
   [junit4]   2> 844787 T2241 oasc.SolrResourceLoader.locateSolrHome using system property solr.solr.home: /usr/home/hudson/hudson-slave/workspace/Lucene-Solr-Tests-trunk-Java7/solr/build/solr-core/test/J1/./org.apache.solr.cloud.CollectionsAPIDistributedZkTest-jetty3-1375436334821
   [junit4]   2> 844788 T2241 oasc.SolrResourceLoader.<init> new SolrResourceLoader for directory: '/usr/home/hudson/hudson-slave/workspace/Lucene-Solr-Tests-trunk-Java7/solr/build/solr-core/test/J1/./org.apache.solr.cloud.CollectionsAPIDistributedZkTest-jetty3-1375436334821/'
   [junit4]   2> 844827 T2241 oasc.ConfigSolr.fromFile Loading container configuration from /usr/home/hudson/hudson-slave/workspace/Lucene-Solr-Tests-trunk-Java7/solr/build/solr-core/test/J1/./org.apache.solr.cloud.CollectionsAPIDistributedZkTest-jetty3-1375436334821/solr.xml
   [junit4]   2> 844917 T2241 oasc.ConfigSolrXml.<init> Config-defined core root directory: 
   [junit4]   2> 844918 T2241 oasc.CoreContainer.<init> New CoreContainer 763650248
   [junit4]   2> 844919 T2241 oasc.CoreContainer.load Loading cores into CoreContainer [instanceDir=/usr/home/hudson/hudson-slave/workspace/Lucene-Solr-Tests-trunk-Java7/solr/build/solr-core/test/J1/./org.apache.solr.cloud.CollectionsAPIDistributedZkTest-jetty3-1375436334821/]
   [junit4]   2> 844921 T2241 oashc.HttpShardHandlerFactory.getParameter Setting socketTimeout to: 120000
   [junit4]   2> 844921 T2241 oashc.HttpShardHandlerFactory.getParameter Setting urlScheme to: http://
   [junit4]   2> 844922 T2241 oashc.HttpShardHandlerFactory.getParameter Setting connTimeout to: 15000
   [junit4]   2> 844922 T2241 oashc.HttpShardHandlerFactory.getParameter Setting maxConnectionsPerHost to: 20
   [junit4]   2> 844923 T2241 oashc.HttpShardHandlerFactory.getParameter Setting corePoolSize to: 0
   [junit4]   2> 844923 T2241 oashc.HttpShardHandlerFactory.getParameter Setting maximumPoolSize to: 2147483647
   [junit4]   2> 844923 T2241 oashc.HttpShardHandlerFactory.getParameter Setting maxThreadIdleTime to: 5
   [junit4]   2> 844924 T2241 oashc.HttpShardHandlerFactory.getParameter Setting sizeOfQueue to: -1
   [junit4]   2> 844925 T2241 oashc.HttpShardHandlerFactory.getParameter Setting fairnessPolicy to: false
   [junit4]   2> 844925 T2241 oascsi.HttpClientUtil.createClient Creating new http client, config:maxConnectionsPerHost=20&maxConnections=10000&socketTimeout=120000&connTimeout=15000&retry=false
   [junit4]   2> 844941 T2241 oasc.ZkContainer.initZooKeeper Zookeeper client=127.0.0.1:26555/solr
   [junit4]   2> 844941 T2241 oasc.ZkController.checkChrootPath zkHost includes chroot
   [junit4]   2> 844942 T2241 oascc.ConnectionManager.waitForConnected Waiting for client to connect to ZooKeeper
   [junit4]   2> 844971 T2307 oascc.ConnectionManager.process Watcher org.apache.solr.common.cloud.ConnectionManager@579902d7 name:ZooKeeperConnection Watcher:127.0.0.1:26555 got event WatchedEvent state:SyncConnected type:None path:null path:null type:None
   [junit4]   2> 844972 T2241 oascc.ConnectionManager.waitForConnected Client is connected to ZooKeeper
   [junit4]   2> 844975 T2241 oascsi.HttpClientUtil.createClient Creating new http client, config:maxConnections=500&maxConnectionsPerHost=16&socketTimeout=120000&connTimeout=15000
   [junit4]   2> 844986 T2241 oascc.ConnectionManager.waitForConnected Waiting for client to connect to ZooKeeper
   [junit4]   2> 844988 T2309 oascc.ConnectionManager.process Watcher org.apache.solr.common.cloud.ConnectionManager@6796e909 name:ZooKeeperConnection Watcher:127.0.0.1:26555/solr got event WatchedEvent state:SyncConnected type:None path:null path:null type:None
   [junit4]   2> 844988 T2241 oascc.ConnectionManager.waitForConnected Client is connected to ZooKeeper
   [junit4]   2> 845000 T2241 oascc.ZkStateReader.createClusterStateWatchersAndUpdate Updating cluster state from ZooKeeper... 
   [junit4]   2> 846004 T2241 oasc.ZkController.createEphemeralLiveNode Register node as live in ZooKeeper:/live_nodes/127.0.0.1:26637_
   [junit4]   2> 846007 T2241 oascc.SolrZkClient.makePath makePath: /live_nodes/127.0.0.1:26637_
   [junit4]   2> 846012 T2268 oascc.ZkStateReader$3.process Updating live nodes... (4)
   [junit4]   2> 846013 T2309 oascc.ZkStateReader$3.process Updating live nodes... (4)
   [junit4]   2> 846013 T2295 oascc.ZkStateReader$3.process Updating live nodes... (4)
   [junit4]   2> 846012 T2281 oascc.ZkStateReader$3.process Updating live nodes... (4)
   [junit4]   2> 846013 T2263 oascc.ZkStateReader$3.process Updating live nodes... (4)
   [junit4]   2> 846022 T2241 oasc.CorePropertiesLocator.discover Looking for core definitions underneath /usr/home/hudson/hudson-slave/workspace/Lucene-Solr-Tests-trunk-Java7/solr/build/solr-core/test/J1/./org.apache.solr.cloud.CollectionsAPIDistributedZkTest-jetty3-1375436334821
   [junit4]   2> 846192 T2241 oasc.CorePropertiesLocator.discoverUnder Found core conf in /usr/home/hudson/hudson-slave/workspace/Lucene-Solr-Tests-trunk-Java7/solr/build/solr-core/test/J1/./org.apache.solr.cloud.CollectionsAPIDistributedZkTest-jetty3-1375436334821/conf/
   [junit4]   2> 846196 T2241 oasc.CorePropertiesLocator.discover Found 1 core definitions
   [junit4]   2> 846199 T2241 oass.SolrDispatchFilter.init user.dir=/usr/home/hudson/hudson-slave/workspace/Lucene-Solr-Tests-trunk-Java7/solr/build/solr-core/test/J1
   [junit4]   2> 846200 T2241 oass.SolrDispatchFilter.init SolrDispatchFilter.init() done
   [junit4]   2> 846200 T2241 oascsi.HttpClientUtil.createClient Creating new http client, config:maxConnections=128&maxConnectionsPerHost=32&followRedirects=false
   [junit4]   2> 846491 T2241 oejs.Server.doStart jetty-8.1.10.v20130312
   [junit4]   2> 846494 T2241 oejs.AbstractConnector.doStart Started SocketConnector@127.0.0.1:26640
   [junit4]   2> 846495 T2241 oass.SolrDispatchFilter.init SolrDispatchFilter.init()
   [junit4]   2> 846496 T2241 oasc.SolrResourceLoader.locateSolrHome JNDI not configured for solr (NoInitialContextEx)
   [junit4]   2> 846496 T2241 oasc.SolrResourceLoader.locateSolrHome using system property solr.solr.home: /usr/home/hudson/hudson-slave/workspace/Lucene-Solr-Tests-trunk-Java7/solr/build/solr-core/test/J1/./org.apache.solr.cloud.CollectionsAPIDistributedZkTest-jetty4-1375436336531
   [junit4]   2> 846497 T2241 oasc.SolrResourceLoader.<init> new SolrResourceLoader for directory: '/usr/home/hudson/hudson-slave/workspace/Lucene-Solr-Tests-trunk-Java7/solr/build/solr-core/test/J1/./org.apache.solr.cloud.CollectionsAPIDistributedZkTest-jetty4-1375436336531/'
   [junit4]   2> 846536 T2241 oasc.ConfigSolr.fromFile Loading container configuration from /usr/home/hudson/hudson-slave/workspace/Lucene-Solr-Tests-trunk-Java7/solr/build/solr-core/test/J1/./org.apache.solr.cloud.CollectionsAPIDistributedZkTest-jetty4-1375436336531/solr.xml
   [junit4]   2> 846613 T2241 oasc.ConfigSolrXml.<init> Config-defined core root directory: 
   [junit4]   2> 846613 T2241 oasc.CoreContainer.<init> New CoreContainer 1053387577
   [junit4]   2> 846614 T2241 oasc.CoreContainer.load Loading cores into CoreContainer [instanceDir=/usr/home/hudson/hudson-slave/workspace/Lucene-Solr-Tests-trunk-Java7/solr/build/solr-core/test/J1/./org.apache.solr.cloud.CollectionsAPIDistributedZkTest-jetty4-1375436336531/]
   [junit4]   2> 846615 T2241 oashc.HttpShardHandlerFactory.getParameter Setting socketTimeout to: 120000
   [junit4]   2> 846615 T2241 oashc.HttpShardHandlerFactory.getParameter Setting urlScheme to: http://
   [junit4]   2> 846616 T2241 oashc.HttpShardHandlerFactory.getParameter Setting connTimeout to: 15000
   [junit4]   2> 846616 T2241 oashc.HttpShardHandlerFactory.getParameter Setting maxConnectionsPerHost to: 20
   [junit4]   2> 846616 T2241 oashc.HttpShardHandlerFactory.getParameter Setting corePoolSize to: 0
   [junit4]   2> 846617 T2241 oashc.HttpShardHandlerFactory.getParameter Setting maximumPoolSize to: 2147483647
   [junit4]   2> 846617 T2241 oashc.HttpShardHandlerFactory.getParameter Setting maxThreadIdleTime to: 5
   [junit4]   2> 846617 T2241 oashc.HttpShardHandlerFactory.getParameter Setting sizeOfQueue to: -1
   [junit4]   2> 846618 T2241 oashc.HttpShardHandlerFactory.getParameter Setting fairnessPolicy to: false
   [junit4]   2> 846618 T2241 oascsi.HttpClientUtil.createClient Creating new http client, config:maxConnectionsPerHost=20&maxConnections=10000&socketTimeout=120000&connTimeout=15000&retry=false
   [junit4]   2> 846629 T2241 oasc.ZkContainer.initZooKeeper Zookeeper client=127.0.0.1:26555/solr
   [junit4]   2> 846630 T2241 oasc.ZkController.checkChrootPath zkHost includes chroot
   [junit4]   2> 846631 T2241 oascc.ConnectionManager.waitForConnected Waiting for client to connect to ZooKeeper
   [junit4]   2> 846634 T2321 oascc.ConnectionManager.process Watcher org.apache.solr.common.cloud.ConnectionManager@41f6587c name:ZooKeeperConnection Watcher:127.0.0.1:26555 got event WatchedEvent state:SyncConnected type:None path:null path:null type:None
   [junit4]   2> 846634 T2241 oascc.ConnectionManager.waitForConnected Client is connected to ZooKeeper
   [junit4]   2> 846653 T2241 oascsi.HttpClientUtil.createClient Creating new http client, config:maxConnections=500&maxConnectionsPerHost=16&socketTimeout=120000&connTimeout=15000
   [junit4]   2> 846666 T2241 oascc.ConnectionManager.waitForConnected Waiting for client to connect to ZooKeeper
   [junit4]   2> 846667 T2323 oascc.ConnectionManager.process Watcher org.apache.solr.common.cloud.ConnectionManager@5c31543e name:ZooKeeperConnection Watcher:127.0.0.1:26555/solr got event WatchedEvent state:SyncConnected type:None path:null path:null type:None
   [junit4]   2> 846668 T2241 oascc.ConnectionManager.waitForConnected Client is connected to ZooKeeper
   [junit4]   2> 846679 T2241 oascc.ZkStateReader.createClusterStateWatchersAndUpdate Updating cluster state from ZooKeeper... 
   [junit4]   2> 847683 T2241 oasc.ZkController.createEphemeralLiveNode Register node as live in ZooKeeper:/live_nodes/127.0.0.1:26640_
   [junit4]   2> 847687 T2241 oascc.SolrZkClient.makePath makePath: /live_nodes/127.0.0.1:26640_
   [junit4]   2> 847692 T2263 oascc.ZkStateReader$3.process Updating live nodes... (5)
   [junit4]   2> 847692 T2309 oascc.ZkStateReader$3.process Updating live nodes... (5)
   [junit4]   2> 847692 T2323 oascc.ZkStateReader$3.process Updating live nodes... (5)
   [junit4]   2> 847692 T2281 oascc.ZkStateReader$3.process Updating live nodes... (5)
   [junit4]   2> 847692 T2295 oascc.ZkStateReader$3.process Updating live nodes... (5)
   [junit4]   2> 847692 T2268 oascc.ZkStateReader$3.process Updating live nodes... (5)
   [junit4]   2> 847713 T2241 oasc.CorePropertiesLocator.discover Looking for core definitions underneath /usr/home/hudson/hudson-slave/workspace/Lucene-Solr-Tests-trunk-Java7/solr/build/solr-core/test/J1/./org.apache.solr.cloud.CollectionsAPIDistributedZkTest-jetty4-1375436336531
   [junit4]   2> 847883 T2241 oasc.CorePropertiesLocator.discoverUnder Found core conf in /usr/home/hudson/hudson-slave/workspace/Lucene-Solr-Tests-trunk-Java7/solr/build/solr-core/test/J1/./org.apache.solr.cloud.CollectionsAPIDistributedZkTest-jetty4-1375436336531/conf/
   [junit4]   2> 847885 T2241 oasc.CorePropertiesLocator.discover Found 1 core definitions
   [junit4]   2> 847886 T2241 oass.SolrDispatchFilter.init user.dir=/usr/home/hudson/hudson-slave/workspace/Lucene-Solr-Tests-trunk-Java7/solr/build/solr-core/test/J1
   [junit4]   2> 847887 T2241 oass.SolrDispatchFilter.init SolrDispatchFilter.init() done
   [junit4]   2> 847887 T2241 oascsi.HttpClientUtil.createClient Creating new http client, config:maxConnections=128&maxConnectionsPerHost=32&followRedirects=false
   [junit4]   2> 847903 T2241 oascsi.HttpClientUtil.createClient Creating new http client, config:maxConnections=128&maxConnectionsPerHost=32&followRedirects=false
   [junit4]   2> 847914 T2271 oasha.CollectionsHandler.handleCreateAction Creating Collection : numShards=2&name=nodes_used_collection&replicationFactor=2&action=CREATE&wt=javabin&version=2
   [junit4]   2> 847916 T2263 oasc.DistributedQueue$LatchChildWatcher.process Watcher fired on path: /overseer/collection-queue-work state: SyncConnected type NodeChildrenChanged
   [junit4]   2> 847918 T2265 oasc.OverseerCollectionProcessor.run Overseer Collection Processor: Get the message id:/overseer/collection-queue-work/qn-0000000000 message:{
   [junit4]   2> 	  "operation":"createcollection",
   [junit4]   2> 	  "numShards":"2",
   [junit4]   2> 	  "name":"nodes_used_collection",
   [junit4]   2> 	  "replicationFactor":"2"}
   [junit4]   2> 847918 T2265 oasc.OverseerCollectionProcessor.processMessage WARN OverseerCollectionProcessor.processMessage : createcollection , {
   [junit4]   2> 	  "operation":"createcollection",
   [junit4]   2> 	  "numShards":"2",
   [junit4]   2> 	  "name":"nodes_used_collection",
   [junit4]   2> 	  "replicationFactor":"2"}
   [junit4]   2> 848319 T2264 oascc.ZkStateReader.updateClusterState Updating cloud state from ZooKeeper... 
   [junit4]   2> 848320 T2264 oasc.Overseer$ClusterStateUpdater.buildCollection building a new collection: nodes_used_collection
   [junit4]   2> 848320 T2264 oasc.Overseer$ClusterStateUpdater.createCollection Create collection nodes_used_collection with shards [shard1, shard2]
   [junit4]   2> 848325 T2268 oascc.ZkStateReader$2.process A cluster state change: WatchedEvent state:SyncConnected type:NodeDataChanged path:/clusterstate.json, has occurred - updating... (live nodes size: 5)
   [junit4]   2> 848326 T2295 oascc.ZkStateReader$2.process A cluster state change: WatchedEvent state:SyncConnected type:NodeDataChanged path:/clusterstate.json, has occurred - updating... (live nodes size: 5)
   [junit4]   2> 848326 T2323 oascc.ZkStateReader$2.process A cluster state change: WatchedEvent state:SyncConnected type:NodeDataChanged path:/clusterstate.json, has occurred - updating... (live nodes size: 5)
   [junit4]   2> 848326 T2281 oascc.ZkStateReader$2.process A cluster state change: WatchedEvent state:SyncConnected type:NodeDataChanged path:/clusterstate.json, has occurred - updating... (live nodes size: 5)
   [junit4]   2> 848325 T2309 oascc.ZkStateReader$2.process A cluster state change: WatchedEvent state:SyncConnected type:NodeDataChanged path:/clusterstate.json, has occurred - updating... (live nodes size: 5)
   [junit4]   2> 848326 T2263 oascc.ZkStateReader$2.process A cluster state change: WatchedEvent state:SyncConnected type:NodeDataChanged path:/clusterstate.json, has occurred - updating... (live nodes size: 5)
   [junit4]   2> 848340 T2265 oasc.OverseerCollectionProcessor.createCollection going to create cores replicas shardNames [shard1, shard2] , repFactor : 2
   [junit4]   2> 848340 T2265 oasc.OverseerCollectionProcessor.createCollection Creating shard nodes_used_collection_shard1_replica1 as part of slice shard1 of collection nodes_used_collection on 127.0.0.1:26559_
   [junit4]   2> 848341 T2265 oasc.OverseerCollectionProcessor.createCollection Creating shard nodes_used_collection_shard1_replica2 as part of slice shard1 of collection nodes_used_collection on 127.0.0.1:26640_
   [junit4]   2> 848342 T2265 oasc.OverseerCollectionProcessor.createCollection Creating shard nodes_used_collection_shard2_replica1 as part of slice shard2 of collection nodes_used_collection on 127.0.0.1:26563_
   [junit4]   2> 848342 T2265 oasc.OverseerCollectionProcessor.createCollection Creating shard nodes_used_collection_shard2_replica2 as part of slice shard2 of collection nodes_used_collection on 127.0.0.1:26634_
   [junit4]   2> 848345 T2253 oasc.ZkController.publish publishing core=nodes_used_collection_shard1_replica1 state=down
   [junit4]   2> 848345 T2313 oasc.ZkController.publish publishing core=nodes_used_collection_shard1_replica2 state=down
   [junit4]   2> 848346 T2272 oasc.ZkController.publish publishing core=nodes_used_collection_shard2_replica1 state=down
   [junit4]   2> 848346 T2285 oasc.ZkController.publish publishing core=nodes_used_collection_shard2_replica2 state=down
   [junit4]   2> 848347 T2253 oasc.ZkController.waitForCoreNodeName look for our core node name
   [junit4]   2> 848348 T2313 oasc.ZkController.waitForCoreNodeName look for our core node name
   [junit4]   2> 848358 T2272 oasc.ZkController.waitForCoreNodeName look for our core node name
   [junit4]   2> 848358 T2285 oasc.ZkController.waitForCoreNodeName look for our core node name
   [junit4]   2> 849837 T2264 oascc.ZkStateReader.updateClusterState Updating cloud state from ZooKeeper... 
   [junit4]   2> 849838 T2264 oasc.Overseer$ClusterStateUpdater.updateState WARN Could not find collection node for nodes_used_collection, skipping publish state
   [junit4]   2> 849839 T2264 oasc.Overseer$ClusterStateUpdater.updateState Update state numShards=2 message={
   [junit4]   2> 	  "operation":"state",
   [junit4]   2> 	  "core_node_name":"core_node1",
   [junit4]   2> 	  "numShards":"2",
   [junit4]   2> 	  "shard":"shard1",
   [junit4]   2> 	  "roles":null,
   [junit4]   2> 	  "state":"down",
   [junit4]   2> 	  "shard_state":"active",
   [junit4]   2> 	  "core":"nodes_used_collection_shard1_replica1",
   [junit4]   2> 	  "collection":"nodes_used_collection",
   [junit4]   2> 	  "shard_range":null,
   [junit4]   2> 	  "node_name":"127.0.0.1:26559_",
   [junit4]   2> 	  "base_url":"http://127.0.0.1:26559"}
   [junit4]   2> 849844 T2264 oasc.Overseer$ClusterStateUpdater.updateState WARN Could not find collection node for nodes_used_collection, skipping publish state
   [junit4]   2> 849844 T2264 oasc.Overseer$ClusterStateUpdater.updateState Update state numShards=2 message={
   [junit4]   2> 	  "operation":"state",
   [junit4]   2> 	  "core_node_name":"core_node2",
   [junit4]   2> 	  "numShards":"2",
   [junit4]   2> 	  "shard":"shard1",
   [junit4]   2> 	  "roles":null,
   [junit4]   2> 	  "state":"down",
   [junit4]   2> 	  "shard_state":"active",
   [junit4]   2> 	  "core":"nodes_used_collection_shard1_replica2",
   [junit4]   2> 	  "collection":"nodes_used_collection",
   [junit4]   2> 	  "shard_range":null,
   [junit4]   2> 	  "node_name":"127.0.0.1:26640_",
   [junit4]   2> 	  "base_url":"http://127.0.0.1:26640"}
   [junit4]   2> 849860 T2264 oasc.Overseer$ClusterStateUpdater.updateState WARN Could not find collection node for nodes_used_collection, skipping publish state
   [junit4]   2> 849861 T2264 oasc.Overseer$ClusterStateUpdater.updateState Update state numShards=2 message={
   [junit4]   2> 	  "operation":"state",
   [junit4]   2> 	  "core_node_name":"core_node3",
   [junit4]   2> 	  "numShards":"2",
   [junit4]   2> 	  "shard":"shard2",
   [junit4]   2> 	  "roles":null,
   [junit4]   2> 	  "state":"down",
   [junit4]   2> 	  "shard_state":"active",
   [junit4]   2> 	  "core":"nodes_used_collection_shard2_replica1",
   [junit4]   2> 	  "collection":"nodes_used_collection",
   [junit4]   2> 	  "shard_range":null,
   [junit4]   2> 	  "node_name":"127.0.0.1:26563_",
   [junit4]   2> 	  "base_url":"http://127.0.0.1:26563"}
   [junit4]   2> 849866 T2264 oasc.Overseer$ClusterStateUpdater.updateState WARN Could not find collection node for nodes_used_collection, skipping publish state
   [junit4]   2> 849866 T2264 oasc.Overseer$ClusterStateUpdater.updateState Update state numShards=2 message={
   [junit4]   2> 	  "operation":"state",
   [junit4]   2> 	  "core_node_name":"core_node4",
   [junit4]   2> 	  "numShards":"2",
   [junit4]   2> 	  "shard":"shard2",
   [junit4]   2> 	  "roles":null,
   [junit4]   2> 	  "state":"down",
   [junit4]   2> 	  "shard_state":"active",
   [junit4]   2> 	  "core":"nodes_used_collection_shard2_replica2",
   [junit4]   2> 	  "collection":"nodes_used_collection",
   [junit4]   2> 	  "shard_range":null,
   [junit4]   2> 	  "node_name":"127.0.0.1:26634_",
   [junit4]   2> 	  "base_url":"http://127.0.0.1:26634"}
   [junit4]   2> 849877 T2263 oascc.ZkStateReader$2.process A cluster state change: WatchedEvent state:SyncConnected type:NodeDataChanged path:/clusterstate.json, has occurred - updating... (live nodes size: 5)
   [junit4]   2> 849877 T2323 oascc.ZkStateReader$2.process A cluster state change: WatchedEvent state:SyncConnected type:NodeDataChanged path:/clusterstate.json, has occurred - updating... (live nodes size: 5)
   [junit4]   2> 849877 T2281 oascc.ZkStateReader$2.process A cluster state change: WatchedEvent state:SyncConnected type:NodeDataChanged path:/clusterstate.json, has occurred - updating... (live nodes size: 5)
   [junit4]   2> 849877 T2295 oascc.ZkStateReader$2.process A cluster state change: WatchedEvent state:SyncConnected type:NodeDataChanged path:/clusterstate.json, has occurred - updating... (live nodes size: 5)
   [junit4]   2> 849877 T2309 oascc.ZkStateReader$2.process A cluster state change: WatchedEvent state:SyncConnected type:NodeDataChanged path:/clusterstate.json, has occurred - updating... (live nodes size: 5)
   [junit4]   2> 849877 T2268 oascc.ZkStateReader$2.process A cluster state change: WatchedEvent state:SyncConnected type:NodeDataChanged path:/clusterstate.json, has occurred - updating... (live nodes size: 5)
   [junit4]   2> 850349 T2253 oasc.ZkController.waitForShardId waiting to find shard id in clusterstate for nodes_used_collection_shard1_replica1
   [junit4]   2> 850350 T2313 oasc.ZkController.waitForShardId waiting to find shard id in clusterstate for nodes_used_collection_shard1_replica2
   [junit4]   2> 850350 T2253 oasc.CorePropertiesLocator.writePropertiesFile ERROR Couldn't persist core properties to /usr/home/hudson/hudson-slave/workspace/Lucene-Solr-Tests-trunk-Java7/solr/build/solr-core/test/J1/./org.apache.solr.cloud.CollectionsAPIDistributedZkTest-controljetty-1375436330568/nodes_used_collection_shard1_replica1/core.properties: java.io.FileNotFoundException: /usr/home/hudson/hudson-slave/workspace/Lucene-Solr-Tests-trunk-Java7/solr/build/solr-core/test/J1/./org.apache.solr.cloud.CollectionsAPIDistributedZkTest-controljetty-1375436330568/nodes_used_collection_shard1_replica1/core.properties (No such file or directory)
   [junit4]   2> 850351 T2253 oasc.CoreContainer.create Creating SolrCore 'nodes_used_collection_shard1_replica1' using instanceDir: /usr/home/hudson/hudson-slave/workspace/Lucene-Solr-Tests-trunk-Java7/solr/build/solr-core/test/J1/./org.apache.solr.cloud.CollectionsAPIDistributedZkTest-controljetty-1375436330568/nodes_used_collection_shard1_replica1
   [junit4]   2> 850351 T2253 oasc.ZkController.createCollectionZkNode Check for collection zkNode:nodes_used_collection
   [junit4]   2> 850351 T2313 oasc.CorePropertiesLocator.writePropertiesFile ERROR Couldn't persist core properties to /usr/home/hudson/hudson-slave/workspace/Lucene-Solr-Tests-trunk-Java7/solr/build/solr-core/test/J1/./org.apache.solr.cloud.CollectionsAPIDistributedZkTest-jetty4-1375436336531/nodes_used_collection_shard1_replica2/core.properties: java.io.FileNotFoundException: /usr/home/hudson/hudson-slave/workspace/Lucene-Solr-Tests-trunk-Java7/solr/build/solr-core/test/J1/./org.apache.solr.cloud.CollectionsAPIDistributedZkTest-jetty4-1375436336531/nodes_used_collection_shard1_replica2/core.properties (No such file or directory)
   [junit4]   2> 850352 T2313 oasc.CoreContainer.create Creating SolrCore 'nodes_used_collection_shard1_replica2' using instanceDir: /usr/home/hudson/hudson-slave/workspace/Lucene-Solr-Tests-trunk-Java7/solr/build/solr-core/test/J1/./org.apache.solr.cloud.CollectionsAPIDistributedZkTest-jetty4-1375436336531/nodes_used_collection_shard1_replica2
   [junit4]   2> 850352 T2253 oasc.ZkController.createCollectionZkNode Creating collection in ZooKeeper:nodes_used_collection
   [junit4]   2> 850352 T2313 oasc.ZkController.createCollectionZkNode Check for collection zkNode:nodes_used_collection
   [junit4]   2> 850352 T2253 oasc.ZkController.getConfName Looking for collection configName
   [junit4]   2> 850353 T2313 oasc.ZkController.createCollectionZkNode Creating collection in ZooKeeper:nodes_used_collection
   [junit4]   2> 850354 T2313 oasc.ZkController.getConfName Looking for collection configName
   [junit4]   2> 850354 T2253 oasc.ZkController.getConfName Only one config set found in zk - using it:conf1
   [junit4]   2> 850354 T2253 oascc.SolrZkClient.makePath makePath: /collections/nodes_used_collection
   [junit4]   2> 850355 T2313 oasc.ZkController.getConfName Only one config set found in zk - using it:conf1
   [junit4]   2> 850355 T2313 oascc.SolrZkClient.makePath makePath: /collections/nodes_used_collection
   [junit4]   2> 850360 T2285 oasc.ZkController.waitForShardId waiting to find shard id in clusterstate for nodes_used_collection_shard2_replica2
   [junit4]   2> 850360 T2272 oasc.ZkController.waitForShardId waiting to find shard id in clusterstate for nodes_used_collection_shard2_replica1
   [junit4]   2> 850361 T2285 oasc.CorePropertiesLocator.writePropertiesFile ERROR Couldn't persist core properties to /usr/home/hudson/hudson-slave/workspace/Lucene-Solr-Tests-trunk-Java7/solr/build/solr-core/test/J1/./org.apache.solr.cloud.CollectionsAPIDistributedZkTest-jetty2-1375436333042/nodes_used_collection_shard2_replica2/core.properties: java.io.FileNotFoundException: /usr/home/hudson/hudson-slave/workspace/Lucene-Solr-Tests-trunk-Java7/solr/build/solr-core/test/J1/./org.apache.solr.cloud.CollectionsAPIDistributedZkTest-jetty2-1375436333042/nodes_used_collection_shard2_replica2/core.properties (No such file or directory)
   [junit4]   2> 850361 T2272 oasc.CorePropertiesLocator.writePropertiesFile ERROR Couldn't persist core properties to /usr/home/hudson/hudson-slave/workspace/Lucene-Solr-Tests-trunk-Java7/solr/build/solr-core/test/J1/./org.apache.solr.cloud.CollectionsAPIDistributedZkTest-jetty1-1375436331329/nodes_used_collection_shard2_replica1/core.properties: java.io.FileNotFoundException: /usr/home/hudson/hudson-slave/workspace/Lucene-Solr-Tests-trunk-Java7/solr/build/solr-core/test/J1/./org.apache.solr.cloud.CollectionsAPIDistributedZkTest-jetty1-1375436331329/nodes_used_collection_shard2_replica1/core.properties (No such file or directory)
   [junit4]   2> 850361 T2285 oasc.CoreContainer.create Creating SolrCore 'nodes_used_collection_shard2_replica2' using instanceDir: /usr/home/hudson/hudson-slave/workspace/Lucene-Solr-Tests-trunk-Java7/solr/build/solr-core/test/J1/./org.apache.solr.cloud.CollectionsAPIDistributedZkTest-jetty2-1375436333042/nodes_used_collection_shard2_replica2
   [junit4]   2> 850361 T2272 oasc.CoreContainer.create Creating SolrCore 'nodes_used_collection_shard2_replica1' using instanceDir: /usr/home/hudson/hudson-slave/workspace/Lucene-Solr-Tests-trunk-Java7/solr/build/solr-core/test/J1/./org.apache.solr.cloud.CollectionsAPIDistributedZkTest-jetty1-1375436331329/nodes_used_collection_shard2_replica1
   [junit4]   2> 850362 T2285 oasc.ZkController.createCollectionZkNode Check for collection zkNode:nodes_used_collection
   [junit4]   2> 850362 T2272 oasc.ZkController.createCollectionZkNode Check for collection zkNode:nodes_used_collection
   [junit4]   2> 850363 T2285 oasc.ZkController.createCollectionZkNode Collection zkNode exists
   [junit4]   2> 850363 T2285 oasc.ZkController.readConfigName Load collection config from:/collections/nodes_used_collection
   [junit4]   2> 850363 T2272 oasc.ZkController.createCollectionZkNode Collection zkNode exists
   [junit4]   2> 850364 T2272 oasc.ZkController.readConfigName Load collection config from:/collections/nodes_used_collection
   [junit4]   2> 850363 T2253 oasc.ZkController.readConfigName Load collection config from:/collections/nodes_used_collection
   [junit4]   2> 850377 T2313 oasc.ZkController.readConfigName Load collection config from:/collections/nodes_used_collection
   [junit4]   2> 850377 T2285 oasc.SolrResourceLoader.<init> new SolrResourceLoader for directory: '/usr/home/hudson/hudson-slave/workspace/Lucene-Solr-Tests-trunk-Java7/solr/build/solr-core/test/J1/./org.apache.solr.cloud.CollectionsAPIDistributedZkTest-jetty2-1375436333042/nodes_used_collection_shard2_replica2/'
   [junit4]   2> 850378 T2253 oasc.SolrResourceLoader.<init> new SolrResourceLoader for directory: '/usr/home/hudson/hudson-slave/workspace/Lucene-Solr-Tests-trunk-Java7/solr/build/solr-core/test/J1/./org.apache.solr.cloud.CollectionsAPIDistributedZkTest-controljetty-1375436330568/nodes_used_collection_shard1_replica1/'
   [junit4]   2> 850377 T2272 oasc.SolrResourceLoader.<init> new SolrResourceLoader for directory: '/usr/home/hudson/hudson-slave/workspace/Lucene-Solr-Tests-trunk-Java7/solr/build/solr-core/test/J1/./org.apache.solr.cloud.CollectionsAPIDistributedZkTest-jetty1-1375436331329/nodes_used_collection_shard2_replica1/'
   [junit4]   2> 850378 T2313 oasc.SolrResourceLoader.<init> new SolrResourceLoader for directory: '/usr/home/hudson/hudson-slave/workspace/Lucene-Solr-Tests-trunk-Java7/solr/build/solr-core/test/J1/./org.apache.solr.cloud.CollectionsAPIDistributedZkTest-jetty4-1375436336531/nodes_used_collection_shard1_replica2/'
   [junit4]   2> 850489 T2285 oasc.SolrConfig.<init> Using Lucene MatchVersion: LUCENE_50
   [junit4]   2> 850489 T2313 oasc.SolrConfig.<init> Using Lucene MatchVersion: LUCENE_50
   [junit4]   2> 850489 T2253 oasc.SolrConfig.<init> Using Lucene MatchVersion: LUCENE_50
   [junit4]   2> 850500 T2272 oasc.SolrConfig.<init> Using Lucene MatchVersion: LUCENE_50
   [junit4]   2> 850568 T2285 oasc.SolrConfig.<init> Loaded SolrConfig: solrconfig.xml
   [junit4]   2> 850568 T2253 oasc.SolrConfig.<init> Loaded SolrConfig: solrconfig.xml
   [junit4]   2> 850579 T2272 oasc.SolrConfig.<init> Loaded SolrConfig: solrconfig.xml
   [junit4]   2> 850585 T2313 oasc.SolrConfig.<init> Loaded SolrConfig: solrconfig.xml
   [junit4]   2> 850670 T2253 oass.IndexSchema.readSchema Reading Solr Schema from schema.xml
   [junit4]   2> 850670 T2285 oass.IndexSchema.readSchema Reading Solr Schema from schema.xml
   [junit4]   2> 850679 T2285 oass.IndexSchema.readSchema [nodes_used_collection_shard2_replica2] Schema name=test
   [junit4]   2> 850679 T2253 oass.IndexSchema.readSchema [nodes_used_collection_shard1_replica1] Schema name=test
   [junit4]   2> 850680 T2272 oass.IndexSchema.readSchema Reading Solr Schema from schema.xml
   [junit4]   2> 850687 T2313 oass.IndexSchema.readSchema Reading Solr Schema from schema.xml
   [junit4]   2> 850688 T2272 oass.IndexSchema.readSchema [nodes_used_collection_shard2_replica1] Schema name=test
   [junit4]   2> 850701 T2313 oass.IndexSchema.readSchema [nodes_used_collection_shard1_replica2] Schema name=test
   [junit4]   2> 851378 T2253 oass.OpenExchangeRatesOrgProvider.init Initialized with rates=open-exchange-rates.json, refreshInterval=1440.
   [junit4]   2> 851391 T2253 oass.IndexSchema.readSchema default search field in schema is text
   [junit4]   2> 851395 T2253 oass.IndexSchema.readSchema unique key field: id
   [junit4]   2> 851427 T2253 oass.FileExchangeRateProvider.reload Reloading exchange rates from file currency.xml
   [junit4]   2> 851432 T2253 oass.FileExchangeRateProvider.reload Reloading exchange rates from file currency.xml
   [junit4]   2> 851436 T2253 oass.OpenExchangeRatesOrgProvider.reload Reloading exchange rates from open-exchange-rates.json
   [junit4]   2> 851437 T2253 oass.OpenExchangeRatesOrgProvider$OpenExchangeRates.<init> WARN Unknown key IMPORTANT NOTE
   [junit4]   2> 851438 T2253 oass.OpenExchangeRatesOrgProvider$OpenExchangeRates.<init> WARN Expected key, got STRING
   [junit4]   2> 851438 T2253 oass.OpenExchangeRatesOrgProvider.reload Reloading exchange rates from open-exchange-rates.json
   [junit4]   2> 851439 T2253 oass.OpenExchangeRatesOrgProvider$OpenExchangeRates.<init> WARN Unknown key IMPORTANT NOTE
   [junit4]   2> 851439 T2253 oass.OpenExchangeRatesOrgProvider$OpenExchangeRates.<init> WARN Expected key, got STRING
   [junit4]   2> 851440 T2253 oasc.SolrCore.initDirectoryFactory org.apache.solr.core.MockDirectoryFactory
   [junit4]   2> 851440 T2253 oasc.SolrCore.<init> [nodes_used_collection_shard1_replica1] Opening new SolrCore at /usr/home/hudson/hudson-slave/workspace/Lucene-Solr-Tests-trunk-Java7/solr/build/solr-core/test/J1/./org.apache.solr.cloud.CollectionsAPIDistributedZkTest-controljetty-1375436330568/nodes_used_collection_shard1_replica1/, dataDir=/usr/home/hudson/hudson-slave/workspace/Lucene-Solr-Tests-trunk-Java7/solr/build/solr-core/test/J1/./org.apache.solr.cloud.CollectionsAPIDistributedZkTest-controljetty-1375436330568//nodes_used_collection_shard1_replica1/data/
   [junit4]   2> 851440 T2253 oasc.JmxMonitoredMap.<init> JMX monitoring is enabled. Adding Solr mbeans to JMX Server: com.sun.jmx.mbeanserver.JmxMBeanServer@44a2786
   [junit4]   2> 851441 T2253 oasc.CachingDirectoryFactory.get return new directory for /usr/home/hudson/hudson-slave/workspace/Lucene-Solr-Tests-trunk-Java7/solr/build/solr-core/test/J1/./org.apache.solr.cloud.CollectionsAPIDistributedZkTest-controljetty-1375436330568//nodes_used_collection_shard1_replica1/data
   [junit4]   2> 851442 T2253 oasc.SolrCore.getNewIndexDir New index directory detected: old=null new=/usr/home/hudson/hudson-slave/workspace/Lucene-Solr-Tests-trunk-Java7/solr/build/solr-core/test/J1/./org.apache.solr.cloud.CollectionsAPIDistributedZkTest-controljetty-1375436330568//nodes_used_collection_shard1_replica1/data/index/
   [junit4]   2> 851442 T2253 oasc.SolrCore.initIndex WARN [nodes_used_collection_shard1_replica1] Solr index directory '/usr/home/hudson/hudson-slave/workspace/Lucene-Solr-Tests-trunk-Java7/solr/build/solr-core/test/J1/./org.apache.solr.cloud.CollectionsAPIDistributedZkTest-controljetty-1375436330568/nodes_used_collection_shard1_replica1/data/index' doesn't exist. Creating new index...
   [junit4]   2> 851442 T2253 oasc.CachingDirectoryFactory.get return new directory for /usr/home/hudson/hudson-slave/workspace/Lucene-Solr-Tests-trunk-Java7/solr/build/solr-core/test/J1/./org.apache.solr.cloud.CollectionsAPIDistributedZkTest-controljetty-1375436330568//nodes_used_collection_shard1_replica1/data/index
   [junit4]   2> 851448 T2253 oasc.SolrDeletionPolicy.onCommit SolrDeletionPolicy.onCommit: commits: num=1
   [junit4]   2> 		commit{dir=MockDirWrapper(org.apache.lucene.store.RAMDirectory@73d422f2 lockFactory=org.apache.lucene.store.NativeFSLockFactory@48cf870b),segFN=segments_1,generation=1}
   [junit4]   2> 851448 T2253 oasc.SolrDeletionPolicy.updateCommits newest commit generation = 1
   [junit4]   2> 851453 T2253 oasup.UpdateRequestProcessorChain.init inserting DistributedUpdateProcessorFactory into updateRequestProcessorChain "dedupe"
   [junit4]   2> 851453 T2253 oasup.UpdateRequestProcessorChain.init inserting DistributedUpdateProcessorFactory into updateRequestProcessorChain "stored_sig"
   [junit4]   2> 851454 T2253 oasup.UpdateRequestProcessorChain.init inserting DistributedUpdateProcessorFactory into updateRequestProcessorChain "distrib-dup-test-chain-implicit"
   [junit4]   2> 851454 T2253 oasc.RequestHandlers.initHandlersFromConfig created standard: solr.StandardRequestHandler
   [junit4]   2> 851455 T2253 oasc.RequestHandlers.initHandlersFromConfig created /get: solr.RealTimeGetHandler
   [junit4]   2> 851455 T2253 oasc.RequestHandlers.initHandlersFromConfig adding lazy requestHandler: solr.ReplicationHandler
   [junit4]   2> 851456 T2253 oasc.RequestHandlers.initHandlersFromConfig created /replication: solr.ReplicationHandler
   [junit4]   2> 851456 T2253 oasc.RequestHandlers.initHandlersFromConfig created /update: solr.UpdateRequestHandler
   [junit4]   2> 851457 T2253 oasc.RequestHandlers.initHandlersFromConfig created /admin/: org.apache.solr.handler.admin.AdminHandlers
   [junit4]   2> 851479 T2272 oass.OpenExchangeRatesOrgProvider.init Initialized with rates=open-exchange-rates.json, refreshInterval=1440.
   [junit4]   2> 851480 T2253 oashl.XMLLoader.init xsltCacheLifetimeSeconds=60
   [junit4]   2> 851484 T2253 oass.SolrIndexSearcher.<init> Opening Searcher@798c7d48 main
   [junit4]   2> 851484 T2285 oass.OpenExchangeRatesOrgProvider.init Initialized with rates=open-exchange-rates.json, refreshInterval=1440.
   [junit4]   2> 851485 T2253 oasu.CommitTracker.<init> Hard AutoCommit: disabled
   [junit4]   2> 851486 T2253 oasu.CommitTracker.<init> Soft AutoCommit: disabled
   [junit4]   2> 851489 T2329 oasc.SolrCore.registerSearcher [nodes_used_collection_shard1_replica1] Registered new searcher Searcher@798c7d48 main{StandardDirectoryReader(segments_1:1)}
   [junit4]   2> 851490 T2253 oasc.CoreContainer.registerCore registering core: nodes_used_collection_shard1_replica1
   [junit4]   2> 851491 T2253 oasc.ZkController.register Register replica - core:nodes_used_collection_shard1_replica1 address:http://127.0.0.1:26559 collection:nodes_used_collection shard:shard1
   [junit4]   2> 851491 T2253 oascsi.HttpClientUtil.createClient Creating new http client, config:maxConnections=10000&maxConnectionsPerHost=20&connTimeout=15000&socketTimeout=30000&retry=false
   [junit4]   2> 851493 T2285 oass.IndexSchema.readSchema default search field in schema is text
   [junit4]   2> 851493 T2272 oass.IndexSchema.readSchema default search field in schema is text
   [junit4]   2> 851497 T2285 oass.IndexSchema.readSchema unique key field: id
   [junit4]   2> 851498 T2313 oass.OpenExchangeRatesOrgProvider.init Initialized with rates=open-exchange-rates.json, refreshInterval=1440.
   [junit4]   2> 851499 T2272 oass.IndexSchema.readSchema unique key field: id
   [junit4]   2> 851505 T2253 oascc.SolrZkClient.makePath makePath: /collections/nodes_used_collection/leader_elect/shard1/election
   [junit4]   2> 851508 T2313 oass.IndexSchema.readSchema default search field in schema is text
   [junit4]   2> 851513 T2313 oass.IndexSchema.readSchema unique key field: id
   [junit4]   2> 851524 T2285 oass.FileExchangeRateProvider.reload Reloading exchange rates from file currency.xml
   [junit4]   2> 851526 T2253 oasc.ShardLeaderElectionContext.runLeaderProcess Running the leader process for shard shard1
   [junit4]   2> 851529 T2272 oass.FileExchangeRateProvider.reload Reloading exchange rates from file currency.xml
   [junit4]   2> 851530 T2253 oasc.ShardLeaderElectionContext.waitForReplicasToComeUp Waiting until we see more replicas up for shard shard1: total=2 found=1 timeoutin=180000
   [junit4]   2> 851535 T2313 oass.FileExchangeRateProvider.reload Reloading exchange rates from file currency.xml
   [junit4]   2> 851543 T2285 oass.FileExchangeRateProvider.reload Reloading exchange rates from file currency.xml
   [junit4]   2> 851543 T2313 oass.FileExchangeRateProvider.reload Reloading exchange rates from file currency.xml
   [junit4]   2> 851543 T2272 oass.FileExchangeRateProvider.reload Reloading exchange rates from file currency.xml
   [junit4]   2> 851547 T2285 oass.OpenExchangeRatesOrgProvider.reload Reloading exchange rates from open-exchange-rates.json
   [junit4]   2> 851547 T2272 oass.OpenExchangeRatesOrgProvider.reload Reloading exchange rates from open-exchange-rates.json
   [junit4]   2> 851547 T2313 oass.OpenExchangeRatesOrgProvider.reload Reloading exchange rates from open-exchange-rates.json
   [junit4]   2> 851548 T2285 oass.OpenExchangeRatesOrgProvider$OpenExchangeRates.<init> WARN Unknown key IMPORTANT NOTE
   [junit4]   2> 851549 T2272 oass.OpenExchangeRatesOrgProvider$OpenExchangeRates.<init> WARN Unknown key IMPORTANT NOTE
   [junit4]   2> 851549 T2313 oass.OpenExchangeRatesOrgProvider$OpenExchangeRates.<init> WARN Unknown key IMPORTANT NOTE
   [junit4]   2> 851549 T2313 oass.OpenExchangeRatesOrgProvider$OpenExchangeRates.<init> WARN Expected key, got STRING
   [junit4]   2> 851549 T2285 oass.OpenExchangeRatesOrgProvider$OpenExchangeRates.<init> WARN Expected key, got STRING
   [junit4]   2> 851550 T2313 oass.OpenExchangeRatesOrgProvider.reload Reloading exchange rates from open-exchange-rates.json
   [junit4]   2> 851549 T2272 oass.OpenExchangeRatesOrgProvider$OpenExchangeRates.<init> WARN Expected key, got STRING
   [junit4]   2> 851550 T2285 oass.OpenExchangeRatesOrgProvider.reload Reloading exchange rates from open-exchange-rates.json
   [junit4]   2> 851551 T2272 oass.OpenExchangeRatesOrgProvider.reload Reloading exchange rates from open-exchange-rates.json
   [junit4]   2> 851551 T2313 oass.OpenExchangeRatesOrgProvider$OpenExchangeRates.<init> WARN Unknown key IMPORTANT NOTE
   [junit4]   2> 851551 T2313 oass.OpenExchangeRatesOrgProvider$OpenExchangeRates.<init> WARN Expected key, got STRING
   [junit4]   2> 851552 T2285 oass.OpenExchangeRatesOrgProvider$OpenExchangeRates.<init> WARN Unknown key IMPORTANT NOTE
   [junit4]   2> 851552 T2272 oass.OpenExchangeRatesOrgProvider$OpenExchangeRates.<init> WARN Unknown key IMPORTANT NOTE
   [junit4]   2> 851552 T2285 oass.OpenExchangeRatesOrgProvider$OpenExchangeRates.<init> WARN Expected key, got STRING
   [junit4]   2> 851552 T2313 oasc.SolrCore.initDirectoryFactory org.apache.solr.core.MockDirectoryFactory
   [junit4]   2> 851553 T2285 oasc.SolrCore.initDirectoryFactory org.apache.solr.core.MockDirectoryFactory
   [junit4]   2> 851552 T2272 oass.OpenExchangeRatesOrgProvider$OpenExchangeRates.<init> WARN Expected key, got STRING
   [junit4]   2> 851553 T2285 oasc.SolrCore.<init> [nodes_used_collection_shard2_replica2] Opening new SolrCore at /usr/home/hudson/hudson-slave/workspace/Lucene-Solr-Tests-trunk-Java7/solr/build/solr-core/test/J1/./org.apache.solr.cloud.CollectionsAPIDistributedZkTest-jetty2-1375436333042/nodes_used_collection_shard2_replica2/, dataDir=/usr/home/hudson/hudson-slave/workspace/Lucene-Solr-Tests-trunk-Java7/solr/build/solr-core/test/J1/./org.apache.solr.cloud.CollectionsAPIDistributedZkTest-jetty2-1375436333042//nodes_used_collection_shard2_replica2/data/
   [junit4]   2> 851553 T2313 oasc.SolrCore.<init> [nodes_used_collection_shard1_replica2] Opening new SolrCore at /usr/home/hudson/hudson-slave/workspace/Lucene-Solr-Tests-trunk-Java7/solr/build/solr-core/test/J1/./org.apache.solr.cloud.CollectionsAPIDistributedZkTest-jetty4-1375436336531/nodes_used_collection_shard1_replica2/, dataDir=/usr/home/hudson/hudson-slave/workspace/Lucene-Solr-Tests-trunk-Java7/solr/build/solr-core/test/J1/./org.apache.solr.cloud.CollectionsAPIDistributedZkTest-jetty4-1375436336531//nodes_used_collection_shard1_replica2/data/
   [junit4]   2> 851554 T2285 oasc.JmxMonitoredMap.<init> JMX monitoring is enabled. Adding Solr mbeans to JMX Server: com.sun.jmx.mbeanserver.JmxMBeanServer@44a2786
   [junit4]   2> 851553 T2272 oasc.SolrCore.initDirectoryFactory org.apache.solr.core.MockDirectoryFactory
   [junit4]   2> 851554 T2313 oasc.JmxMonitoredMap.<init> JMX monitoring is enabled. Adding Solr mbeans to JMX Server: com.sun.jmx.mbeanserver.JmxMBeanServer@44a2786
   [junit4]   2> 851555 T2272 oasc.SolrCore.<init> [nodes_used_collection_shard2_replica1] Opening new SolrCore at /usr/home/hudson/hudson-slave/workspace/Lucene-Solr-Tests-trunk-Java7/solr/build/solr-core/test/J1/./org.apache.solr.cloud.CollectionsAPIDistributedZkTest-jetty1-1375436331329/nodes_used_collection_shard2_replica1/, dataDir=/usr/home/hudson/hudson-slave/workspace/Lucene-Solr-Tests-trunk-Java7/solr/build/solr-core/test/J1/./org.apache.solr.cloud.CollectionsAPIDistributedZkTest-jetty1-1375436331329//nodes_used_collection_shard2_replica1/data/
   [junit4]   2> 851555 T2285 oasc.CachingDirectoryFactory.get return new directory for /usr/home/hudson/hudson-slave/workspace/Lucene-Solr-Tests-trunk-Java7/solr/build/solr-core/test/J1/./org.apache.solr.cloud.CollectionsAPIDistributedZkTest-jetty2-1375436333042//nodes_used_collection_shard2_replica2/data
   [junit4]   2> 851555 T2313 oasc.CachingDirectoryFactory.get return new directory for /usr/home/hudson/hudson-slave/workspace/Lucene-Solr-Tests-trunk-Java7/solr/build/solr-core/test/J1/./org.apache.solr.cloud.CollectionsAPIDistributedZkTest-jetty4-1375436336531//nodes_used_collection_shard1_replica2/data
   [junit4]   2> 851555 T2272 oasc.JmxMonitoredMap.<init> JMX monitoring is enabled. Adding Solr mbeans to JMX Server: com.sun.jmx.mbeanserver.JmxMBeanServer@44a2786
   [junit4]   2> 851556 T2313 oasc.SolrCore.getNewIndexDir New index directory detected: old=null new=/usr/home/hudson/hudson-slave/workspace/Lucene-Solr-Tests-trunk-Java7/solr/build/solr-core/test/J1/./org.apache.solr.cloud.CollectionsAPIDistributedZkTest-jetty4-1375436336531//nodes_used_collection_shard1_replica2/data/index/
   [junit4]   2> 851555 T2285 oasc.SolrCore.getNewIndexDir New index directory detected: old=null new=/usr/home/hudson/hudson-slave/workspace/Lucene-Solr-Tests-trunk-Java7/solr/build/solr-core/test/J1/./org.apache.solr.cloud.CollectionsAPIDistributedZkTest-jetty2-1375436333042//nodes_used_collection_shard2_replica2/data/index/
   [junit4]   2> 851556 T2272 oasc.CachingDirectoryFactory.get return new directory for /usr/home/hudson/hudson-slave/workspace/Lucene-Solr-Tests-trunk-Java7/solr/build/solr-core/test/J1/./org.apache.solr.cloud.CollectionsAPIDistributedZkTest-jetty1-1375436331329//nodes_used_collection_shard2_replica1/data
   [junit4]   2> 851556 T2285 oasc.SolrCore.initIndex WARN [nodes_used_collection_shard2_replica2] Solr index directory '/usr/home/hudson/hudson-slave/workspace/Lucene-Solr-Tests-trunk-Java7/solr/build/solr-core/test/J1/./org.apache.solr.cloud.CollectionsAPIDistributedZkTest-jetty2-1375436333042/nodes_used_collection_shard2_replica2/data/index' doesn't exist. Creating new index...
   [junit4]   2> 851556 T2313 oasc.SolrCore.initIndex WARN [nodes_used_collection_shard1_replica2] Solr index directory '/usr/home/hudson/hudson-slave/workspace/Lucene-Solr-Tests-trunk-Java7/solr/build/solr-core/test/J1/./org.apache.solr.cloud.CollectionsAPIDistributedZkTest-jetty4-1375436336531/nodes_used_collection_shard1_replica2/data/index' doesn't exist. Creating new index...
   [junit4]   2> 851557 T2285 oasc.CachingDirectoryFactory.get return new directory for /usr/home/hudson/hudson-slave/workspace/Lucene-Solr-Tests-trunk-Java7/solr/build/solr-core/test/J1/./org.apache.solr.cloud.CollectionsAPIDistributedZkTest-jetty2-1375436333042//nodes_used_collection_shard2_replica2/data/index
   [junit4]   2> 851557 T2272 oasc.SolrCore.getNewIndexDir New index directory detected: old=null new=/usr/home/hudson/hudson-slave/workspace/Lucene-Solr-Tests-trunk-Java7/solr/build/solr-core/test/J1/./org.apache.solr.cloud.CollectionsAPIDistributedZkTest-jetty1-1375436331329//nodes_used_collection_shard2_replica1/data/index/
   [junit4]   2> 851558 T2313 oasc.CachingDirectoryFactory.get return new directory for /usr/home/hudson/hudson-slave/workspace/Lucene-Solr-Tests-trunk-Java7/solr/build/solr-core/test/J1/./org.apache.solr.cloud.CollectionsAPIDistributedZkTest-jetty4-1375436336531//nodes_used_collection_shard1_replica2/data/index
   [junit4]   2> 851558 T2272 oasc.SolrCore.initIndex WARN [nodes_used_collection_shard2_replica1] Solr index directory '/usr/home/hudson/hudson-slave/workspace/Lucene-Solr-Tests-trunk-Java7/solr/build/solr-core/test/J1/./org.apache.solr.cloud.CollectionsAPIDistributedZkTest-jetty1-1375436331329/nodes_used_collection_shard2_replica1/data/index' doesn't exist. Creating new index...
   [junit4]   2> 851559 T2272 oasc.CachingDirectoryFactory.get return new directory for /usr/home/hudson/hudson-slave/workspace/Lucene-Solr-Tests-trunk-Java7/solr/build/solr-core/test/J1/./org.apache.solr.cloud.CollectionsAPIDistributedZkTest-jetty1-1375436331329//nodes_used_collection_shard2_replica1/data/index
   [junit4]   2> 851562 T2285 oasc.SolrDeletionPolicy.onCommit SolrDeletionPolicy.onCommit: commits: num=1
   [junit4]   2> 		commit{dir=MockDirWrapper(org.apache.lucene.store.RAMDirectory@2af4fd13 lockFactory=org.apache.lucene.store.NativeFSLockFactory@2cbdab2d),segFN=segments_1,generation=1}
   [junit4]   2> 851562 T2313 oasc.SolrDeletionPolicy.onCommit SolrDeletionPolicy.onCommit: commits: num=1
   [junit4]   2> 		commit{dir=MockDirWrapper(org.apache.lucene.store.RAMDirectory@4d6ee77 lockFactory=org.apache.lucene.store.NativeFSLockFactory@1d213b8a),segFN=segments_1,generation=1}
   [junit4]   2> 851562 T2285 oasc.SolrDeletionPolicy.updateCommits newest commit generation = 1
   [junit4]   2> 851563 T2272 oasc.SolrDeletionPolicy.onCommit SolrDeletionPolicy.onCommit: commits: num=1
   [junit4]   2> 		commit{dir=MockDirWrapper(org.apache.lucene.store.RAMDirectory@5cf73954 lockFactory=org.apache.lucene.store.NativeFSLockFactory@295eda31),segFN=segments_1,generation=1}
   [junit4]   2> 851563 T2313 oasc.SolrDeletionPolicy.updateCommits newest commit generation = 1
   [junit4]   2> 851563 T2272 oasc.SolrDeletionPolicy.updateCommits newest commit generation = 1
   [junit4]   2> 851567 T2285 oasup.UpdateRequestProcessorChain.init inserting DistributedUpdateProcessorFactory into updateRequestProcessorChain "dedupe"
   [junit4]   2> 851567 T2285 oasup.UpdateRequestProcessorChain.init inserting DistributedUpdateProcessorFactory into updateRequestProcessorChain "stored_sig"
   [junit4]   2> 851568 T2313 oasup.UpdateRequestProcessorChain.init inserting DistributedUpdateProcessorFactory into updateRequestProcessorChain "dedupe"
   [junit4]   2> 851568 T2272 oasup.UpdateRequestProcessorChain.init inserting DistributedUpdateProcessorFactory into updateRequestProcessorChain "dedupe"
   [junit4]   2> 851568 T2285 oasup.UpdateRequestProcessorChain.init inserting DistributedUpdateProcessorFactory into updateRequestProcessorChain "distrib-dup-test-chain-implicit"
   [junit4]   2> 851568 T2313 oasup.UpdateRequestProcessorChain.init inserting DistributedUpdateProcessorFactory into updateRequestProcessorChain "stored_sig"
   [junit4]   2> 851568 T2272 oasup.UpdateRequestProcessorChain.init inserting DistributedUpdateProcessorFactory into updateRequestProcessorChain "stored_sig"
   [junit4]   2> 851569 T2285 oasc.RequestHandlers.initHandlersFromConfig created standard: solr.StandardRequestHandler
   [junit4]   2> 851569 T2313 oasup.UpdateRequestProcessorChain.init inserting DistributedUpdateProcessorFactory into updateRequestProcessorChain "distrib-dup-test-chain-implicit"
   [junit4]   2> 851569 T2272 oasup.UpdateRequestProcessorChain.init inserting DistributedUpdateProcessorFactory into updateRequestProcessorChain "distrib-dup-test-chain-implicit"
   [junit4]   2> 851569 T2285 oasc.RequestHandlers.initHandlersFromConfig created /get: solr.RealTimeGetHandler
   [junit4]   2> 851570 T2313 oasc.RequestHandlers.initHandlersFromConfig created standard: solr.StandardRequestHandler
   [junit4]   2> 851570 T2272 oasc.RequestHandlers.initHandlersFromConfig created standard: solr.StandardRequestHandler
   [junit4]   2> 851570 T2285 oasc.RequestHandlers.initHandlersFromConfig adding lazy requestHandler: solr.ReplicationHandler
   [junit4]   2> 851571 T2313 oasc.RequestHandlers.initHandlersFromConfig created /get: solr.RealTimeGetHandler
   [junit4]   2> 851571 T2285 oasc.RequestHandlers.initHandlersFromConfig created /replication: solr.ReplicationHandler
   [junit4]   2> 851571 T2272 oasc.RequestHandlers.initHandlersFromConfig created /get: solr.RealTimeGetHandler
   [junit4]   2> 851571 T2313 oasc.RequestHandlers.initHandlersFromConfig adding lazy requestHandler: solr.ReplicationHandler
   [junit4]   2> 851572 T2285 oasc.RequestHandlers.initHandlersFromConfig created /update: solr.UpdateRequestHandler
   [junit4]   2> 851572 T2272 oasc.RequestHandlers.initHandlersFromConfig adding lazy requestHandler: solr.ReplicationHandler
   [junit4]   2> 851572 T2285 oasc.RequestHandlers.initHandlersFromConfig created /admin/: org.apache.solr.handler.admin.AdminHandlers
   [junit4]   2> 851572 T2313 oasc.RequestHandlers.initHandlersFromConfig created /replication: solr.ReplicationHandler
   [junit4]   2> 851572 T2272 oasc.RequestHandlers.initHandlersFromConfig created /replication: solr.ReplicationHandler
   [junit4]   2> 851573 T2313 oasc.RequestHandlers.initHandlersFromConfig created /update: solr.UpdateRequestHandler
   [junit4]   2> 851573 T2272 oasc.RequestHandlers.initHandlersFromConfig created /update: solr.UpdateRequestHandler
   [junit4]   2> 851574 T2313 oasc.RequestHandlers.initHandlersFromConfig created /admin/: org.apache.solr.handler.admin.AdminHandlers
   [junit4]   2> 851574 T2272 oasc.RequestHandlers.initHandlersFromConfig created /admin/: org.apache.solr.handler.admin.AdminHandlers
   [junit4]   2> 851589 T2272 oashl.XMLLoader.init xsltCacheLifetimeSeconds=60
   [junit4]   2> 851589 T2313 oashl.XMLLoader.init xsltCacheLifetimeSeconds=60
   [junit4]   2> 851589 T2285 oashl.XMLLoader.init xsltCacheLifetimeSeconds=60
   [junit4]   2> 851596 T2272 oass.SolrIndexSearcher.<init> Opening Searcher@81f19b3 main
   [junit4]   2> 851596 T2285 oass.SolrIndexSearcher.<init> Opening Searcher@4d5fc883 main
   [junit4]   2> 851596 T2313 oass.SolrIndexSearcher.<init> Opening Searcher@4cb9076f main
   [junit4]   2> 851598 T2272 oasu.CommitTracker.<init> Hard AutoCommit: disabled
   [junit4]   2> 851598 T2285 oasu.CommitTracker.<init> Hard AutoCommit: disabled
   [junit4]   2> 851598 T2313 oasu.CommitTracker.<init> Hard AutoCommit: disabled
   [junit4]   2> 851598 T2272 oasu.CommitTracker.<init> Soft AutoCommit: disabled
   [junit4]   2> 851599 T2313 oasu.CommitTracker.<init> Soft AutoCommit: disabled
   [junit4]   2> 851598 T2285 oasu.CommitTracker.<init> Soft AutoCommit: disabled
   [junit4]   2> 851602 T2330 oasc.SolrCore.registerSearcher [nodes_used_collection_shard2_replica1] Registered new searcher Searcher@81f19b3 main{StandardDirectoryReader(segments_1:1)}
   [junit4]   2> 851602 T2332 oasc.SolrCore.registerSearcher [nodes_used_collection_shard2_replica2] Registered new searcher Searcher@4d5fc883 main{StandardDirectoryReader(segments_1:1)}
   [junit4]   2> 851602 T2331 oasc.SolrCore.registerSearcher [nodes_used_collection_shard1_replica2] Registered new searcher Searcher@4cb9076f main{StandardDirectoryReader(segments_1:1)}
   [junit4]   2> 851604 T2272 oasc.CoreContainer.registerCore registering core: nodes_used_collection_shard2_replica1
   [junit4]   2> 851604 T2272 oasc.ZkController.register Register replica - core:nodes_used_collection_shard2_replica1 address:http://127.0.0.1:26563 collection:nodes_used_collection shard:shard2
   [junit4]   2> 851604 T2285 oasc.CoreContainer.registerCore registering core: nodes_used_collection_shard2_replica2
   [junit4]   2> 851605 T2272 oascsi.HttpClientUtil.createClient Creating new http client, config:maxConnections=10000&maxConnectionsPerHost=20&connTimeout=15000&socketTimeout=30000&retry=false
   [junit4]   2> 851605 T2285 oasc.ZkController.register Register replica - core:nodes_used_collection_shard2_replica2 address:http://127.0.0.1:26634 collection:nodes_used_collection shard:shard2
   [junit4]   2> 851605 T2313 oasc.CoreContainer.registerCore registering core: nodes_used_collection_shard1_replica2
   [junit4]   2> 851605 T2285 oascsi.HttpClientUtil.createClient Creating new http client, config:maxConnections=10000&maxConnectionsPerHost=20&connTimeout=15000&socketTimeout=30000&retry=false
   [junit4]   2> 851606 T2313 oasc.ZkController.register Register replica - core:nodes_used_collection_shard1_replica2 address:http://127.0.0.1:26640 collection:nodes_used_collection shard:shard1
   [junit4]   2> 851607 T2313 oascsi.HttpClientUtil.createClient Creating new http client, config:maxConnections=10000&maxConnectionsPerHost=20&connTimeout=15000&socketTimeout=30000&retry=false
   [junit4]   2> 851620 T2272 oascc.SolrZkClient.makePath makePath: /collections/nodes_used_collection/leader_elect/shard2/election
   [junit4]   2> 851620 T2285 oascc.SolrZkClient.makePath makePath: /collections/nodes_used_collection/leader_elect/shard2/election
   [junit4]   2> 851649 T2272 oasc.ShardLeaderElectionContext.runLeaderProcess Running the leader process for shard shard2
   [junit4]   2> 851661 T2272 oasc.ShardLeaderElectionContext.waitForReplicasToComeUp Enough replicas found to continue.
   [junit4]   2> 851661 T2272 oasc.ShardLeaderElectionContext.runLeaderProcess I may be the new leader - try and sync
   [junit4]   2> 851662 T2272 oasc.SyncStrategy.sync Sync replicas to http://127.0.0.1:26563/nodes_used_collection_shard2_replica1/
   [junit4]   2> 851662 T2272 oasu.PeerSync.sync PeerSync: core=nodes_used_collection_shard2_replica1 url=http://127.0.0.1:26563 START replicas=[http://127.0.0.1:26634/nodes_used_collection_shard2_replica2/] nUpdates=100
   [junit4]   2> 851663 T2272 oasu.PeerSync.sync PeerSync: core=nodes_used_collection_shard2_replica1 url=http://127.0.0.1:26563 DONE.  We have no versions.  sync failed.
   [junit4]   2> 851663 T2272 oasc.SyncStrategy.syncReplicas Leader's attempt to sync with shard failed, moving to the next candidate
   [junit4]   2> 851664 T2272 oasc.ShardLeaderElectionContext.runLeaderProcess We failed sync, but we have no versions - we can't sync in that case - we were active before, so become leader anyway
   [junit4]   2> 851665 T2272 oasc.ShardLeaderElectionContext.runLeaderProcess I am the new leader: http://127.0.0.1:26563/nodes_used_collection_shard2_replica1/ shard2
   [junit4]   2> 851665 T2272 oascc.SolrZkClient.makePath makePath: /collections/nodes_used_collection/leaders/shard2
   [junit4]   2> ASYNC  NEW_CORE C2389 name=nodes_used_collection_shard2_replica2 org.apache.solr.core.SolrCore@11cc4cd0 url=http://127.0.0.1:26634/nodes_used_collection_shard2_replica2 node=127.0.0.1:26634_ C2389_STATE=coll:nodes_used_collection core:nodes_used_collection_shard2_replica2 props:{state=down, core=nodes_used_collection_shard2_replica2, node_name=127.0.0.1:26634_, base_url=http://127.0.0.1:26634}
   [junit4]   2> 851671 T2286 C2389 P26634 oasc.SolrCore.execute [nodes_used_collection_shard2_replica2] webapp= path=/get params={getVersions=100&distrib=false&wt=javabin&qt=/get&version=2} status=0 QTime=0 
   [junit4]   2> 852032 T2253 oasc.ShardLeaderElectionContext.waitForReplicasToComeUp Enough replicas found to continue.
   [junit4]   2> 852033 T2253 oasc.ShardLeaderElectionContext.runLeaderProcess I may be the new leader - try and sync
   [junit4]   2> 852033 T2253 oasc.SyncStrategy.sync Sync replicas to http://127.0.0.1:26559/nodes_used_collection_shard1_replica1/
   [junit4]   2> 852034 T2253 oasu.PeerSync.sync PeerSync: core=nodes_used_collection_shard1_replica1 url=http://127.0.0.1:26559 START replicas=[http://127.0.0.1:26640/nodes_used_collection_shard1_replica2/] nUpdates=100
   [junit4]   2> 852034 T2253 oasu.PeerSync.sync PeerSync: core=nodes_used_collection_shard1_replica1 url=http://127.0.0.1:26559 DONE.  We have no versions.  sync failed.
   [junit4]   2> 852034 T2253 oasc.SyncStrategy.syncReplicas Leader's attempt to sync with shard failed, moving to the next candidate
   [junit4]   2> 852035 T2253 oasc.ShardLeaderElectionContext.runLeaderProcess We failed sync, but we have no versions - we can't sync in that case - we were active before, so become leader anyway
   [junit4]   2> 852035 T2253 oasc.ShardLeaderElectionContext.runLeaderProcess I am the new leader: http://127.0.0.1:26559/nodes_used_collection_shard1_replica1/ shard1
   [junit4]   2> 852036 T2253 oascc.SolrZkClient.makePath makePath: /collections/nodes_used_collection/leaders/shard1
   [jun

[...truncated too long message...]

testDistribSearch -Dtests.seed=C3F44CBF6E03B599 -Dtests.multiplier=3 -Dtests.slow=true -Dtests.locale=pl_PL -Dtests.timezone=America/Buenos_Aires -Dtests.file.encoding=US-ASCII
   [junit4] ERROR    166s J1 | CollectionsAPIDistributedZkTest.testDistribSearch <<<
   [junit4]    > Throwable #1: org.apache.solr.client.solrj.SolrServerException: IOException occured when talking to server at: http://127.0.0.1:26634
   [junit4]    > 	at __randomizedtesting.SeedInfo.seed([C3F44CBF6E03B599:4212C2A7195CD5A5]:0)
   [junit4]    > 	at org.apache.solr.client.solrj.impl.HttpSolrServer.request(HttpSolrServer.java:435)
   [junit4]    > 	at org.apache.solr.client.solrj.impl.HttpSolrServer.request(HttpSolrServer.java:180)
   [junit4]    > 	at org.apache.solr.cloud.AbstractFullDistribZkTestBase.createCollection(AbstractFullDistribZkTestBase.java:1535)
   [junit4]    > 	at org.apache.solr.cloud.CollectionsAPIDistributedZkTest.testCustomCollectionsAPI(CollectionsAPIDistributedZkTest.java:677)
   [junit4]    > 	at org.apache.solr.cloud.CollectionsAPIDistributedZkTest.doTest(CollectionsAPIDistributedZkTest.java:159)
   [junit4]    > 	at org.apache.solr.BaseDistributedSearchTestCase.testDistribSearch(BaseDistributedSearchTestCase.java:835)
   [junit4]    > 	at java.lang.Thread.run(Thread.java:724)
   [junit4]    > Caused by: org.apache.http.conn.ConnectTimeoutException: Connect to 127.0.0.1:26634 timed out
   [junit4]    > 	at org.apache.http.conn.scheme.PlainSocketFactory.connectSocket(PlainSocketFactory.java:129)
   [junit4]    > 	at org.apache.http.impl.conn.DefaultClientConnectionOperator.openConnection(DefaultClientConnectionOperator.java:180)
   [junit4]    > 	at org.apache.http.impl.conn.ManagedClientConnectionImpl.open(ManagedClientConnectionImpl.java:294)
   [junit4]    > 	at org.apache.http.impl.client.DefaultRequestDirector.tryConnect(DefaultRequestDirector.java:645)
   [junit4]    > 	at org.apache.http.impl.client.DefaultRequestDirector.execute(DefaultRequestDirector.java:480)
   [junit4]    > 	at org.apache.http.impl.client.AbstractHttpClient.execute(AbstractHttpClient.java:906)
   [junit4]    > 	at org.apache.http.impl.client.AbstractHttpClient.execute(AbstractHttpClient.java:805)
   [junit4]    > 	at org.apache.http.impl.client.AbstractHttpClient.execute(AbstractHttpClient.java:784)
   [junit4]    > 	at org.apache.solr.client.solrj.impl.HttpSolrServer.request(HttpSolrServer.java:365)
   [junit4]    > 	... 45 more
   [junit4]   2> 1006343 T2241 oas.SolrTestCaseJ4.deleteCore ###deleteCore
   [junit4]   2> 166397 T2240 ccr.ThreadLeakControl.checkThreadLeaks WARNING Will linger awaiting termination of 1 leaked thread(s).
   [junit4]   2> 1006372 T2323 oasc.LeaderElector$1.process WARN  org.apache.zookeeper.KeeperException$SessionExpiredException: KeeperErrorCode = Session expired for /collections/new_implicit_coll_1/leader_elect/d/election
   [junit4]   2> 	at org.apache.zookeeper.KeeperException.create(KeeperException.java:127)
   [junit4]   2> 	at org.apache.zookeeper.KeeperException.create(KeeperException.java:51)
   [junit4]   2> 	at org.apache.zookeeper.ZooKeeper.getChildren(ZooKeeper.java:1468)
   [junit4]   2> 	at org.apache.solr.common.cloud.SolrZkClient$6.execute(SolrZkClient.java:235)
   [junit4]   2> 	at org.apache.solr.common.cloud.SolrZkClient$6.execute(SolrZkClient.java:232)
   [junit4]   2> 	at org.apache.solr.common.cloud.ZkCmdExecutor.retryOperation(ZkCmdExecutor.java:65)
   [junit4]   2> 	at org.apache.solr.common.cloud.SolrZkClient.getChildren(SolrZkClient.java:232)
   [junit4]   2> 	at org.apache.solr.cloud.LeaderElector.checkIfIamLeader(LeaderElector.java:84)
   [junit4]   2> 	at org.apache.solr.cloud.LeaderElector.access$000(LeaderElector.java:55)
   [junit4]   2> 	at org.apache.solr.cloud.LeaderElector$1.process(LeaderElector.java:129)
   [junit4]   2> 	at org.apache.zookeeper.ClientCnxn$EventThread.processEvent(ClientCnxn.java:519)
   [junit4]   2> 	at org.apache.zookeeper.ClientCnxn$EventThread.run(ClientCnxn.java:495)
   [junit4]   2> 
   [junit4]   2> 1006372 T2323 oasc.LeaderElector$1.process WARN  org.apache.zookeeper.KeeperException$SessionExpiredException: KeeperErrorCode = Session expired for /collections/new_implicit_coll_1/leader_elect/a/election
   [junit4]   2> 	at org.apache.zookeeper.KeeperException.create(KeeperException.java:127)
   [junit4]   2> 	at org.apache.zookeeper.KeeperException.create(KeeperException.java:51)
   [junit4]   2> 	at org.apache.zookeeper.ZooKeeper.getChildren(ZooKeeper.java:1468)
   [junit4]   2> 	at org.apache.solr.common.cloud.SolrZkClient$6.execute(SolrZkClient.java:235)
   [junit4]   2> 	at org.apache.solr.common.cloud.SolrZkClient$6.execute(SolrZkClient.java:232)
   [junit4]   2> 	at org.apache.solr.common.cloud.ZkCmdExecutor.retryOperation(ZkCmdExecutor.java:65)
   [junit4]   2> 	at org.apache.solr.common.cloud.SolrZkClient.getChildren(SolrZkClient.java:232)
   [junit4]   2> 	at org.apache.solr.cloud.LeaderElector.checkIfIamLeader(LeaderElector.java:84)
   [junit4]   2> 	at org.apache.solr.cloud.LeaderElector.access$000(LeaderElector.java:55)
   [junit4]   2> 	at org.apache.solr.cloud.LeaderElector$1.process(LeaderElector.java:129)
   [junit4]   2> 	at org.apache.zookeeper.ClientCnxn$EventThread.processEvent(ClientCnxn.java:519)
   [junit4]   2> 	at org.apache.zookeeper.ClientCnxn$EventThread.run(ClientCnxn.java:495)
   [junit4]   2> 
   [junit4]   2> 1006373 T2323 oascc.ZkStateReader$2.process A cluster state change: WatchedEvent state:SyncConnected type:NodeChildrenChanged path:/live_nodes, has occurred - updating... (live nodes size: 1)
   [junit4]   2> 1006373 T2323 oascc.ZkStateReader$2.process WARN ZooKeeper watch triggered, but Solr cannot talk to ZK
   [junit4]   2> 1006373 T2323 oascc.ZkStateReader$3.process WARN ZooKeeper watch triggered, but Solr cannot talk to ZK
   [junit4]   2> NOTE: test params are: codec=Lucene42: {timestamp=PostingsFormat(name=MockSep), range_facet_l=PostingsFormat(name=MockSep), id=PostingsFormat(name=TestBloomFilteredLucene41Postings), range_facet_sl=MockVariableIntBlock(baseBlockSize=73), a_t=PostingsFormat(name=MockSep), text=MockVariableIntBlock(baseBlockSize=73), range_facet_si=PostingsFormat(name=MockRandom), _version_=PostingsFormat(name=MockSep), other_tl1=PostingsFormat(name=MockSep), multiDefault=PostingsFormat(name=MockRandom), a_si=PostingsFormat(name=MockRandom), intDefault=PostingsFormat(name=MockSep)}, docValues:{timestamp=DocValuesFormat(name=Asserting)}, sim=RandomSimilarityProvider(queryNorm=true,coord=yes): {}, locale=pl_PL, timezone=America/Buenos_Aires
   [junit4]   2> NOTE: FreeBSD 9.1-RELEASE-p3 amd64/Oracle Corporation 1.7.0_25 (64-bit)/cpus=16,threads=13,free=314647368,total=536870912
   [junit4]   2> NOTE: All tests run in this JVM: [TestComponentsName, UpdateParamsTest, HdfsCollectionsAPIDistributedZkTest, TestInfoStreamLogging, TestWordDelimiterFilterFactory, HdfsDirectoryTest, TestIndexingPerformance, CurrencyFieldOpenExchangeTest, TestUpdate, TestDFRSimilarityFactory, TestNumberUtils, TestStressLucene, TestBM25SimilarityFactory, URLClassifyProcessorTest, ZkNodePropsTest, PathHierarchyTokenizerFactoryTest, HighlighterConfigTest, TestDefaultSimilarityFactory, TestCollationField, ClusterStateTest, TestMergePolicyConfig, TestRecovery, EchoParamsTest, BadIndexSchemaTest, TestRTGBase, RequiredFieldsTest, SpellCheckCollatorTest, DeleteShardTest, TestAtomicUpdateErrorCases, TestStressReorder, SolrCmdDistributorTest, TestZkChroot, TestDistributedGrouping, TestUniqueKeyFieldResource, OpenCloseCoreStressTest, DOMUtilTest, TestSchemaSimilarityResource, TestBinaryField, SpellPossibilityIteratorTest, ChaosMonkeySafeLeaderTest, TestAddFieldRealTimeGet, NumericFieldsTest, DefaultValueUpdateProcessorTest, TestMultiCoreConfBootstrap, TestHashPartitioner, DocumentAnalysisRequestHandlerTest, TestArbitraryIndexDir, HdfsUnloadDistributedZkTest, TestLuceneMatchVersion, HdfsBasicDistributedZk2Test, TestCSVResponseWriter, TestPropInject, SolrIndexConfigTest, StandardRequestHandlerTest, TestRandomFaceting, TestDistributedSearch, TestFoldingMultitermQuery, TimeZoneUtilsTest, BadCopyFieldTest, TestRecoveryHdfs, CoreAdminCreateDiscoverTest, TestFieldCollectionResource, OpenExchangeRatesOrgProviderTest, TestElisionMultitermQuery, CoreContainerCoreInitFailuresTest, TestSolr4Spatial, TestClassNameShortening, UniqFieldsUpdateProcessorFactoryTest, NotRequiredUniqueKeyTest, TestSolrXMLSerializer, SolrRequestParserTest, DocValuesMultiTest, TestCopyFieldCollectionResource, TestCoreDiscovery, TestSchemaResource, SuggesterTSTTest, BasicDistributedZk2Test, CollectionsAPIDistributedZkTest]
   [junit4] Completed on J1 in 166.68s, 1 test, 1 error <<< FAILURES!

[...truncated 587 lines...]
BUILD FAILED
/usr/home/hudson/hudson-slave/workspace/Lucene-Solr-Tests-trunk-Java7/build.xml:389: The following error occurred while executing this line:
/usr/home/hudson/hudson-slave/workspace/Lucene-Solr-Tests-trunk-Java7/build.xml:369: The following error occurred while executing this line:
/usr/home/hudson/hudson-slave/workspace/Lucene-Solr-Tests-trunk-Java7/build.xml:39: The following error occurred while executing this line:
/usr/home/hudson/hudson-slave/workspace/Lucene-Solr-Tests-trunk-Java7/solr/build.xml:181: The following error occurred while executing this line:
/usr/home/hudson/hudson-slave/workspace/Lucene-Solr-Tests-trunk-Java7/solr/common-build.xml:449: The following error occurred while executing this line:
/usr/home/hudson/hudson-slave/workspace/Lucene-Solr-Tests-trunk-Java7/lucene/common-build.xml:1230: The following error occurred while executing this line:
/usr/home/hudson/hudson-slave/workspace/Lucene-Solr-Tests-trunk-Java7/lucene/common-build.xml:873: There were test failures: 320 suites, 1347 tests, 1 error, 34 ignored (6 assumptions)

Total time: 57 minutes 11 seconds
Build step 'Invoke Ant' marked build as failure
Archiving artifacts
Recording test results
Email was triggered for: Failure
Sending email for trigger: Failure



Mime
View raw message