lucene-dev mailing list archives

Site index · List index
Message view « Date » · « Thread »
Top « Date » · « Thread »
From Policeman Jenkins Server <jenk...@thetaphi.de>
Subject [JENKINS] Lucene-Solr-trunk-Linux (32bit/jdk1.7.0_25) - Build # 6828 - Failure!
Date Thu, 01 Aug 2013 12:53:04 GMT
Build: http://jenkins.thetaphi.de/job/Lucene-Solr-trunk-Linux/6828/
Java: 32bit/jdk1.7.0_25 -client -XX:+UseSerialGC

1 tests failed.
FAILED:  org.apache.solr.cloud.CollectionsAPIDistributedZkTest.testDistribSearch

Error Message:
Server refused connection at: http://127.0.0.1:45911

Stack Trace:
org.apache.solr.client.solrj.SolrServerException: Server refused connection at: http://127.0.0.1:45911
	at __randomizedtesting.SeedInfo.seed([6B893AFB328AD36C:EA6FB4E345D5B350]:0)
	at org.apache.solr.client.solrj.impl.HttpSolrServer.request(HttpSolrServer.java:428)
	at org.apache.solr.client.solrj.impl.HttpSolrServer.request(HttpSolrServer.java:180)
	at org.apache.solr.cloud.AbstractFullDistribZkTestBase.createCollection(AbstractFullDistribZkTestBase.java:1535)
	at org.apache.solr.cloud.CollectionsAPIDistributedZkTest.testCustomCollectionsAPI(CollectionsAPIDistributedZkTest.java:677)
	at org.apache.solr.cloud.CollectionsAPIDistributedZkTest.doTest(CollectionsAPIDistributedZkTest.java:159)
	at org.apache.solr.BaseDistributedSearchTestCase.testDistribSearch(BaseDistributedSearchTestCase.java:835)
	at sun.reflect.NativeMethodAccessorImpl.invoke0(Native Method)
	at sun.reflect.NativeMethodAccessorImpl.invoke(NativeMethodAccessorImpl.java:57)
	at sun.reflect.DelegatingMethodAccessorImpl.invoke(DelegatingMethodAccessorImpl.java:43)
	at java.lang.reflect.Method.invoke(Method.java:606)
	at com.carrotsearch.randomizedtesting.RandomizedRunner.invoke(RandomizedRunner.java:1559)
	at com.carrotsearch.randomizedtesting.RandomizedRunner.access$600(RandomizedRunner.java:79)
	at com.carrotsearch.randomizedtesting.RandomizedRunner$6.evaluate(RandomizedRunner.java:737)
	at com.carrotsearch.randomizedtesting.RandomizedRunner$7.evaluate(RandomizedRunner.java:773)
	at com.carrotsearch.randomizedtesting.RandomizedRunner$8.evaluate(RandomizedRunner.java:787)
	at com.carrotsearch.randomizedtesting.rules.SystemPropertiesRestoreRule$1.evaluate(SystemPropertiesRestoreRule.java:53)
	at org.apache.lucene.util.TestRuleSetupTeardownChained$1.evaluate(TestRuleSetupTeardownChained.java:50)
	at org.apache.lucene.util.TestRuleFieldCacheSanity$1.evaluate(TestRuleFieldCacheSanity.java:51)
	at org.apache.lucene.util.AbstractBeforeAfterRule$1.evaluate(AbstractBeforeAfterRule.java:46)
	at com.carrotsearch.randomizedtesting.rules.SystemPropertiesInvariantRule$1.evaluate(SystemPropertiesInvariantRule.java:55)
	at org.apache.lucene.util.TestRuleThreadAndTestName$1.evaluate(TestRuleThreadAndTestName.java:49)
	at org.apache.lucene.util.TestRuleIgnoreAfterMaxFailures$1.evaluate(TestRuleIgnoreAfterMaxFailures.java:70)
	at org.apache.lucene.util.TestRuleMarkFailure$1.evaluate(TestRuleMarkFailure.java:48)
	at com.carrotsearch.randomizedtesting.rules.StatementAdapter.evaluate(StatementAdapter.java:36)
	at com.carrotsearch.randomizedtesting.ThreadLeakControl$StatementRunner.run(ThreadLeakControl.java:358)
	at com.carrotsearch.randomizedtesting.ThreadLeakControl.forkTimeoutingTask(ThreadLeakControl.java:782)
	at com.carrotsearch.randomizedtesting.ThreadLeakControl$3.evaluate(ThreadLeakControl.java:442)
	at com.carrotsearch.randomizedtesting.RandomizedRunner.runSingleTest(RandomizedRunner.java:746)
	at com.carrotsearch.randomizedtesting.RandomizedRunner$3.evaluate(RandomizedRunner.java:648)
	at com.carrotsearch.randomizedtesting.RandomizedRunner$4.evaluate(RandomizedRunner.java:682)
	at com.carrotsearch.randomizedtesting.RandomizedRunner$5.evaluate(RandomizedRunner.java:693)
	at com.carrotsearch.randomizedtesting.rules.StatementAdapter.evaluate(StatementAdapter.java:36)
	at com.carrotsearch.randomizedtesting.rules.SystemPropertiesRestoreRule$1.evaluate(SystemPropertiesRestoreRule.java:53)
	at org.apache.lucene.util.AbstractBeforeAfterRule$1.evaluate(AbstractBeforeAfterRule.java:46)
	at org.apache.lucene.util.TestRuleStoreClassName$1.evaluate(TestRuleStoreClassName.java:42)
	at com.carrotsearch.randomizedtesting.rules.SystemPropertiesInvariantRule$1.evaluate(SystemPropertiesInvariantRule.java:55)
	at com.carrotsearch.randomizedtesting.rules.NoShadowingOrOverridesOnMethodsRule$1.evaluate(NoShadowingOrOverridesOnMethodsRule.java:39)
	at com.carrotsearch.randomizedtesting.rules.NoShadowingOrOverridesOnMethodsRule$1.evaluate(NoShadowingOrOverridesOnMethodsRule.java:39)
	at com.carrotsearch.randomizedtesting.rules.StatementAdapter.evaluate(StatementAdapter.java:36)
	at org.apache.lucene.util.TestRuleAssertionsRequired$1.evaluate(TestRuleAssertionsRequired.java:43)
	at org.apache.lucene.util.TestRuleMarkFailure$1.evaluate(TestRuleMarkFailure.java:48)
	at org.apache.lucene.util.TestRuleIgnoreAfterMaxFailures$1.evaluate(TestRuleIgnoreAfterMaxFailures.java:70)
	at org.apache.lucene.util.TestRuleIgnoreTestSuites$1.evaluate(TestRuleIgnoreTestSuites.java:55)
	at com.carrotsearch.randomizedtesting.rules.StatementAdapter.evaluate(StatementAdapter.java:36)
	at com.carrotsearch.randomizedtesting.ThreadLeakControl$StatementRunner.run(ThreadLeakControl.java:358)
	at java.lang.Thread.run(Thread.java:724)
Caused by: org.apache.http.conn.HttpHostConnectException: Connection to http://127.0.0.1:45911 refused
	at org.apache.http.impl.conn.DefaultClientConnectionOperator.openConnection(DefaultClientConnectionOperator.java:190)
	at org.apache.http.impl.conn.ManagedClientConnectionImpl.open(ManagedClientConnectionImpl.java:294)
	at org.apache.http.impl.client.DefaultRequestDirector.tryConnect(DefaultRequestDirector.java:645)
	at org.apache.http.impl.client.DefaultRequestDirector.execute(DefaultRequestDirector.java:480)
	at org.apache.http.impl.client.AbstractHttpClient.execute(AbstractHttpClient.java:906)
	at org.apache.http.impl.client.AbstractHttpClient.execute(AbstractHttpClient.java:805)
	at org.apache.http.impl.client.AbstractHttpClient.execute(AbstractHttpClient.java:784)
	at org.apache.solr.client.solrj.impl.HttpSolrServer.request(HttpSolrServer.java:365)
	... 45 more
Caused by: java.net.ConnectException: Connection refused
	at java.net.PlainSocketImpl.socketConnect(Native Method)
	at java.net.AbstractPlainSocketImpl.doConnect(AbstractPlainSocketImpl.java:339)
	at java.net.AbstractPlainSocketImpl.connectToAddress(AbstractPlainSocketImpl.java:200)
	at java.net.AbstractPlainSocketImpl.connect(AbstractPlainSocketImpl.java:182)
	at java.net.SocksSocketImpl.connect(SocksSocketImpl.java:392)
	at java.net.Socket.connect(Socket.java:579)
	at org.apache.http.conn.scheme.PlainSocketFactory.connectSocket(PlainSocketFactory.java:127)
	at org.apache.http.impl.conn.DefaultClientConnectionOperator.openConnection(DefaultClientConnectionOperator.java:180)
	... 52 more




Build Log:
[...truncated 9793 lines...]
   [junit4] Suite: org.apache.solr.cloud.CollectionsAPIDistributedZkTest
   [junit4]   2> 850259 T2537 oas.BaseDistributedSearchTestCase.initHostContext Setting hostContext system property: /
   [junit4]   2> 850262 T2537 oas.SolrTestCaseJ4.setUp ###Starting testDistribSearch
   [junit4]   2> Creating dataDir: /mnt/ssd/jenkins/workspace/Lucene-Solr-trunk-Linux/solr/build/solr-core/test/J1/./solrtest-CollectionsAPIDistributedZkTest-1375361092447
   [junit4]   2> 850262 T2537 oasc.ZkTestServer.run STARTING ZK TEST SERVER
   [junit4]   2> 850263 T2538 oasc.ZkTestServer$ZKServerMain.runFromConfig Starting server
   [junit4]   2> 850363 T2537 oasc.ZkTestServer.run start zk server on port:46367
   [junit4]   2> 850364 T2537 oascc.ConnectionManager.waitForConnected Waiting for client to connect to ZooKeeper
   [junit4]   2> 850793 T2544 oascc.ConnectionManager.process Watcher org.apache.solr.common.cloud.ConnectionManager@bb23b0 name:ZooKeeperConnection Watcher:127.0.0.1:46367 got event WatchedEvent state:SyncConnected type:None path:null path:null type:None
   [junit4]   2> 850794 T2537 oascc.ConnectionManager.waitForConnected Client is connected to ZooKeeper
   [junit4]   2> 850795 T2537 oascc.SolrZkClient.makePath makePath: /solr
   [junit4]   2> 850802 T2537 oascc.ConnectionManager.waitForConnected Waiting for client to connect to ZooKeeper
   [junit4]   2> 850805 T2546 oascc.ConnectionManager.process Watcher org.apache.solr.common.cloud.ConnectionManager@12997c8 name:ZooKeeperConnection Watcher:127.0.0.1:46367/solr got event WatchedEvent state:SyncConnected type:None path:null path:null type:None
   [junit4]   2> 850805 T2537 oascc.ConnectionManager.waitForConnected Client is connected to ZooKeeper
   [junit4]   2> 850806 T2537 oascc.SolrZkClient.makePath makePath: /collections/collection1
   [junit4]   2> 850811 T2537 oascc.SolrZkClient.makePath makePath: /collections/collection1/shards
   [junit4]   2> 850815 T2537 oascc.SolrZkClient.makePath makePath: /collections/control_collection
   [junit4]   2> 850817 T2537 oascc.SolrZkClient.makePath makePath: /collections/control_collection/shards
   [junit4]   2> 850820 T2537 oasc.AbstractZkTestCase.putConfig put /mnt/ssd/jenkins/workspace/Lucene-Solr-trunk-Linux/solr/build/solr-core/test-files/solr/collection1/conf/solrconfig-tlog.xml to /configs/conf1/solrconfig.xml
   [junit4]   2> 850820 T2537 oascc.SolrZkClient.makePath makePath: /configs/conf1/solrconfig.xml
   [junit4]   2> 850824 T2537 oasc.AbstractZkTestCase.putConfig put /mnt/ssd/jenkins/workspace/Lucene-Solr-trunk-Linux/solr/build/solr-core/test-files/solr/collection1/conf/schema.xml to /configs/conf1/schema.xml
   [junit4]   2> 850824 T2537 oascc.SolrZkClient.makePath makePath: /configs/conf1/schema.xml
   [junit4]   2> 850827 T2537 oasc.AbstractZkTestCase.putConfig put /mnt/ssd/jenkins/workspace/Lucene-Solr-trunk-Linux/solr/build/solr-core/test-files/solr/collection1/conf/stopwords.txt to /configs/conf1/stopwords.txt
   [junit4]   2> 850828 T2537 oascc.SolrZkClient.makePath makePath: /configs/conf1/stopwords.txt
   [junit4]   2> 850832 T2537 oasc.AbstractZkTestCase.putConfig put /mnt/ssd/jenkins/workspace/Lucene-Solr-trunk-Linux/solr/build/solr-core/test-files/solr/collection1/conf/protwords.txt to /configs/conf1/protwords.txt
   [junit4]   2> 850833 T2537 oascc.SolrZkClient.makePath makePath: /configs/conf1/protwords.txt
   [junit4]   2> 850835 T2537 oasc.AbstractZkTestCase.putConfig put /mnt/ssd/jenkins/workspace/Lucene-Solr-trunk-Linux/solr/build/solr-core/test-files/solr/collection1/conf/currency.xml to /configs/conf1/currency.xml
   [junit4]   2> 850835 T2537 oascc.SolrZkClient.makePath makePath: /configs/conf1/currency.xml
   [junit4]   2> 850838 T2537 oasc.AbstractZkTestCase.putConfig put /mnt/ssd/jenkins/workspace/Lucene-Solr-trunk-Linux/solr/build/solr-core/test-files/solr/collection1/conf/open-exchange-rates.json to /configs/conf1/open-exchange-rates.json
   [junit4]   2> 850838 T2537 oascc.SolrZkClient.makePath makePath: /configs/conf1/open-exchange-rates.json
   [junit4]   2> 850840 T2537 oasc.AbstractZkTestCase.putConfig put /mnt/ssd/jenkins/workspace/Lucene-Solr-trunk-Linux/solr/build/solr-core/test-files/solr/collection1/conf/mapping-ISOLatin1Accent.txt to /configs/conf1/mapping-ISOLatin1Accent.txt
   [junit4]   2> 850840 T2537 oascc.SolrZkClient.makePath makePath: /configs/conf1/mapping-ISOLatin1Accent.txt
   [junit4]   2> 850843 T2537 oasc.AbstractZkTestCase.putConfig put /mnt/ssd/jenkins/workspace/Lucene-Solr-trunk-Linux/solr/build/solr-core/test-files/solr/collection1/conf/old_synonyms.txt to /configs/conf1/old_synonyms.txt
   [junit4]   2> 850843 T2537 oascc.SolrZkClient.makePath makePath: /configs/conf1/old_synonyms.txt
   [junit4]   2> 850846 T2537 oasc.AbstractZkTestCase.putConfig put /mnt/ssd/jenkins/workspace/Lucene-Solr-trunk-Linux/solr/build/solr-core/test-files/solr/collection1/conf/synonyms.txt to /configs/conf1/synonyms.txt
   [junit4]   2> 850846 T2537 oascc.SolrZkClient.makePath makePath: /configs/conf1/synonyms.txt
   [junit4]   2> 850918 T2537 oejs.Server.doStart jetty-8.1.10.v20130312
   [junit4]   2> 850921 T2537 oejs.AbstractConnector.doStart Started SelectChannelConnector@127.0.0.1:50370
   [junit4]   2> 850921 T2537 oass.SolrDispatchFilter.init SolrDispatchFilter.init()
   [junit4]   2> 850922 T2537 oasc.SolrResourceLoader.locateSolrHome JNDI not configured for solr (NoInitialContextEx)
   [junit4]   2> 850922 T2537 oasc.SolrResourceLoader.locateSolrHome using system property solr.solr.home: /mnt/ssd/jenkins/workspace/Lucene-Solr-trunk-Linux/solr/build/solr-core/test/J1/./org.apache.solr.cloud.CollectionsAPIDistributedZkTest-controljetty-1375361093036
   [junit4]   2> 850922 T2537 oasc.SolrResourceLoader.<init> new SolrResourceLoader for directory: '/mnt/ssd/jenkins/workspace/Lucene-Solr-trunk-Linux/solr/build/solr-core/test/J1/./org.apache.solr.cloud.CollectionsAPIDistributedZkTest-controljetty-1375361093036/'
   [junit4]   2> 850933 T2537 oasc.ConfigSolr.fromFile Loading container configuration from /mnt/ssd/jenkins/workspace/Lucene-Solr-trunk-Linux/solr/build/solr-core/test/J1/./org.apache.solr.cloud.CollectionsAPIDistributedZkTest-controljetty-1375361093036/solr.xml
   [junit4]   2> 850993 T2537 oasc.ConfigSolrXml.<init> Config-defined core root directory: 
   [junit4]   2> 850994 T2537 oasc.CoreContainer.<init> New CoreContainer 21110579
   [junit4]   2> 850994 T2537 oasc.CoreContainer.load Loading cores into CoreContainer [instanceDir=/mnt/ssd/jenkins/workspace/Lucene-Solr-trunk-Linux/solr/build/solr-core/test/J1/./org.apache.solr.cloud.CollectionsAPIDistributedZkTest-controljetty-1375361093036/]
   [junit4]   2> 850996 T2537 oashc.HttpShardHandlerFactory.getParameter Setting socketTimeout to: 120000
   [junit4]   2> 850997 T2537 oashc.HttpShardHandlerFactory.getParameter Setting urlScheme to: http://
   [junit4]   2> 850997 T2537 oashc.HttpShardHandlerFactory.getParameter Setting connTimeout to: 15000
   [junit4]   2> 850998 T2537 oashc.HttpShardHandlerFactory.getParameter Setting maxConnectionsPerHost to: 20
   [junit4]   2> 850998 T2537 oashc.HttpShardHandlerFactory.getParameter Setting corePoolSize to: 0
   [junit4]   2> 850998 T2537 oashc.HttpShardHandlerFactory.getParameter Setting maximumPoolSize to: 2147483647
   [junit4]   2> 850999 T2537 oashc.HttpShardHandlerFactory.getParameter Setting maxThreadIdleTime to: 5
   [junit4]   2> 850999 T2537 oashc.HttpShardHandlerFactory.getParameter Setting sizeOfQueue to: -1
   [junit4]   2> 850999 T2537 oashc.HttpShardHandlerFactory.getParameter Setting fairnessPolicy to: false
   [junit4]   2> 851000 T2537 oascsi.HttpClientUtil.createClient Creating new http client, config:maxConnectionsPerHost=20&maxConnections=10000&socketTimeout=120000&connTimeout=15000&retry=false
   [junit4]   2> 851002 T2537 oasc.ZkContainer.initZooKeeper Zookeeper client=127.0.0.1:46367/solr
   [junit4]   2> 851003 T2537 oasc.ZkController.checkChrootPath zkHost includes chroot
   [junit4]   2> 851004 T2537 oascc.ConnectionManager.waitForConnected Waiting for client to connect to ZooKeeper
   [junit4]   2> 851005 T2557 oascc.ConnectionManager.process Watcher org.apache.solr.common.cloud.ConnectionManager@1f9755d name:ZooKeeperConnection Watcher:127.0.0.1:46367 got event WatchedEvent state:SyncConnected type:None path:null path:null type:None
   [junit4]   2> 851006 T2537 oascc.ConnectionManager.waitForConnected Client is connected to ZooKeeper
   [junit4]   2> 851008 T2537 oascsi.HttpClientUtil.createClient Creating new http client, config:maxConnections=500&maxConnectionsPerHost=16&socketTimeout=120000&connTimeout=15000
   [junit4]   2> 851011 T2537 oascc.ConnectionManager.waitForConnected Waiting for client to connect to ZooKeeper
   [junit4]   2> 851012 T2559 oascc.ConnectionManager.process Watcher org.apache.solr.common.cloud.ConnectionManager@d8453c name:ZooKeeperConnection Watcher:127.0.0.1:46367/solr got event WatchedEvent state:SyncConnected type:None path:null path:null type:None
   [junit4]   2> 851012 T2537 oascc.ConnectionManager.waitForConnected Client is connected to ZooKeeper
   [junit4]   2> 851014 T2537 oascc.SolrZkClient.makePath makePath: /overseer/queue
   [junit4]   2> 851019 T2537 oascc.SolrZkClient.makePath makePath: /overseer/collection-queue-work
   [junit4]   2> 851023 T2537 oascc.SolrZkClient.makePath makePath: /live_nodes
   [junit4]   2> 851025 T2537 oasc.ZkController.createEphemeralLiveNode Register node as live in ZooKeeper:/live_nodes/127.0.0.1:50370_
   [junit4]   2> 851026 T2537 oascc.SolrZkClient.makePath makePath: /live_nodes/127.0.0.1:50370_
   [junit4]   2> 851030 T2537 oascc.SolrZkClient.makePath makePath: /overseer_elect/election
   [junit4]   2> 851038 T2537 oascc.SolrZkClient.makePath makePath: /overseer_elect/leader
   [junit4]   2> 851041 T2537 oasc.Overseer.start Overseer (id=90135664554737667-127.0.0.1:50370_-n_0000000000) starting
   [junit4]   2> 851045 T2537 oascc.SolrZkClient.makePath makePath: /overseer/queue-work
   [junit4]   2> 851050 T2561 oasc.OverseerCollectionProcessor.run Process current queue of collection creations
   [junit4]   2> 851051 T2537 oascc.SolrZkClient.makePath makePath: /clusterstate.json
   [junit4]   2> 851054 T2537 oascc.SolrZkClient.makePath makePath: /aliases.json
   [junit4]   2> 851056 T2537 oascc.ZkStateReader.createClusterStateWatchersAndUpdate Updating cluster state from ZooKeeper... 
   [junit4]   2> 851060 T2560 oasc.Overseer$ClusterStateUpdater.run Starting to work on the main queue
   [junit4]   2> 851064 T2537 oasc.CorePropertiesLocator.discover Looking for core definitions underneath /mnt/ssd/jenkins/workspace/Lucene-Solr-trunk-Linux/solr/build/solr-core/test/J1/./org.apache.solr.cloud.CollectionsAPIDistributedZkTest-controljetty-1375361093036
   [junit4]   2> 851098 T2537 oasc.CorePropertiesLocator.discoverUnder Found core conf in /mnt/ssd/jenkins/workspace/Lucene-Solr-trunk-Linux/solr/build/solr-core/test/J1/./org.apache.solr.cloud.CollectionsAPIDistributedZkTest-controljetty-1375361093036/conf/
   [junit4]   2> 851099 T2537 oasc.CorePropertiesLocator.discover Found 1 core definitions
   [junit4]   2> 851099 T2537 oass.SolrDispatchFilter.init user.dir=/mnt/ssd/jenkins/workspace/Lucene-Solr-trunk-Linux/solr/build/solr-core/test/J1
   [junit4]   2> 851100 T2537 oass.SolrDispatchFilter.init SolrDispatchFilter.init() done
   [junit4]   2> 851100 T2537 oascsi.HttpClientUtil.createClient Creating new http client, config:maxConnections=128&maxConnectionsPerHost=32&followRedirects=false
   [junit4]   2> 851103 T2537 oascsi.HttpClientUtil.createClient Creating new http client, config:
   [junit4]   2> 851104 T2537 oascc.ConnectionManager.waitForConnected Waiting for client to connect to ZooKeeper
   [junit4]   2> 851105 T2564 oascc.ConnectionManager.process Watcher org.apache.solr.common.cloud.ConnectionManager@106f9f7 name:ZooKeeperConnection Watcher:127.0.0.1:46367/solr got event WatchedEvent state:SyncConnected type:None path:null path:null type:None
   [junit4]   2> 851105 T2537 oascc.ConnectionManager.waitForConnected Client is connected to ZooKeeper
   [junit4]   2> 851107 T2537 oascc.ZkStateReader.createClusterStateWatchersAndUpdate Updating cluster state from ZooKeeper... 
   [junit4]   2> 851109 T2537 oasc.ChaosMonkey.monkeyLog monkey: init - expire sessions:true cause connection loss:true
   [junit4]   2> 851174 T2537 oejs.Server.doStart jetty-8.1.10.v20130312
   [junit4]   2> 851176 T2537 oejs.AbstractConnector.doStart Started SelectChannelConnector@127.0.0.1:50992
   [junit4]   2> 851176 T2537 oass.SolrDispatchFilter.init SolrDispatchFilter.init()
   [junit4]   2> 851176 T2537 oasc.SolrResourceLoader.locateSolrHome JNDI not configured for solr (NoInitialContextEx)
   [junit4]   2> 851177 T2537 oasc.SolrResourceLoader.locateSolrHome using system property solr.solr.home: /mnt/ssd/jenkins/workspace/Lucene-Solr-trunk-Linux/solr/build/solr-core/test/J1/./org.apache.solr.cloud.CollectionsAPIDistributedZkTest-jetty1-1375361093294
   [junit4]   2> 851177 T2537 oasc.SolrResourceLoader.<init> new SolrResourceLoader for directory: '/mnt/ssd/jenkins/workspace/Lucene-Solr-trunk-Linux/solr/build/solr-core/test/J1/./org.apache.solr.cloud.CollectionsAPIDistributedZkTest-jetty1-1375361093294/'
   [junit4]   2> 851188 T2537 oasc.ConfigSolr.fromFile Loading container configuration from /mnt/ssd/jenkins/workspace/Lucene-Solr-trunk-Linux/solr/build/solr-core/test/J1/./org.apache.solr.cloud.CollectionsAPIDistributedZkTest-jetty1-1375361093294/solr.xml
   [junit4]   2> 851249 T2537 oasc.ConfigSolrXml.<init> Config-defined core root directory: 
   [junit4]   2> 851250 T2537 oasc.CoreContainer.<init> New CoreContainer 33357339
   [junit4]   2> 851251 T2537 oasc.CoreContainer.load Loading cores into CoreContainer [instanceDir=/mnt/ssd/jenkins/workspace/Lucene-Solr-trunk-Linux/solr/build/solr-core/test/J1/./org.apache.solr.cloud.CollectionsAPIDistributedZkTest-jetty1-1375361093294/]
   [junit4]   2> 851253 T2537 oashc.HttpShardHandlerFactory.getParameter Setting socketTimeout to: 120000
   [junit4]   2> 851254 T2537 oashc.HttpShardHandlerFactory.getParameter Setting urlScheme to: http://
   [junit4]   2> 851254 T2537 oashc.HttpShardHandlerFactory.getParameter Setting connTimeout to: 15000
   [junit4]   2> 851255 T2537 oashc.HttpShardHandlerFactory.getParameter Setting maxConnectionsPerHost to: 20
   [junit4]   2> 851255 T2537 oashc.HttpShardHandlerFactory.getParameter Setting corePoolSize to: 0
   [junit4]   2> 851256 T2537 oashc.HttpShardHandlerFactory.getParameter Setting maximumPoolSize to: 2147483647
   [junit4]   2> 851257 T2537 oashc.HttpShardHandlerFactory.getParameter Setting maxThreadIdleTime to: 5
   [junit4]   2> 851257 T2537 oashc.HttpShardHandlerFactory.getParameter Setting sizeOfQueue to: -1
   [junit4]   2> 851258 T2537 oashc.HttpShardHandlerFactory.getParameter Setting fairnessPolicy to: false
   [junit4]   2> 851258 T2537 oascsi.HttpClientUtil.createClient Creating new http client, config:maxConnectionsPerHost=20&maxConnections=10000&socketTimeout=120000&connTimeout=15000&retry=false
   [junit4]   2> 851261 T2537 oasc.ZkContainer.initZooKeeper Zookeeper client=127.0.0.1:46367/solr
   [junit4]   2> 851261 T2537 oasc.ZkController.checkChrootPath zkHost includes chroot
   [junit4]   2> 851262 T2537 oascc.ConnectionManager.waitForConnected Waiting for client to connect to ZooKeeper
   [junit4]   2> 851263 T2575 oascc.ConnectionManager.process Watcher org.apache.solr.common.cloud.ConnectionManager@3a4544 name:ZooKeeperConnection Watcher:127.0.0.1:46367 got event WatchedEvent state:SyncConnected type:None path:null path:null type:None
   [junit4]   2> 851264 T2537 oascc.ConnectionManager.waitForConnected Client is connected to ZooKeeper
   [junit4]   2> 851265 T2537 oascsi.HttpClientUtil.createClient Creating new http client, config:maxConnections=500&maxConnectionsPerHost=16&socketTimeout=120000&connTimeout=15000
   [junit4]   2> 851271 T2537 oascc.ConnectionManager.waitForConnected Waiting for client to connect to ZooKeeper
   [junit4]   2> 851272 T2577 oascc.ConnectionManager.process Watcher org.apache.solr.common.cloud.ConnectionManager@a4473a name:ZooKeeperConnection Watcher:127.0.0.1:46367/solr got event WatchedEvent state:SyncConnected type:None path:null path:null type:None
   [junit4]   2> 851272 T2537 oascc.ConnectionManager.waitForConnected Client is connected to ZooKeeper
   [junit4]   2> 851276 T2537 oascc.ZkStateReader.createClusterStateWatchersAndUpdate Updating cluster state from ZooKeeper... 
   [junit4]   2> 852280 T2537 oasc.ZkController.createEphemeralLiveNode Register node as live in ZooKeeper:/live_nodes/127.0.0.1:50992_
   [junit4]   2> 852283 T2537 oascc.SolrZkClient.makePath makePath: /live_nodes/127.0.0.1:50992_
   [junit4]   2> 852287 T2559 oascc.ZkStateReader$3.process Updating live nodes... (2)
   [junit4]   2> 852288 T2577 oascc.ZkStateReader$3.process Updating live nodes... (2)
   [junit4]   2> 852287 T2564 oascc.ZkStateReader$3.process Updating live nodes... (2)
   [junit4]   2> 852296 T2537 oasc.CorePropertiesLocator.discover Looking for core definitions underneath /mnt/ssd/jenkins/workspace/Lucene-Solr-trunk-Linux/solr/build/solr-core/test/J1/./org.apache.solr.cloud.CollectionsAPIDistributedZkTest-jetty1-1375361093294
   [junit4]   2> 852332 T2537 oasc.CorePropertiesLocator.discoverUnder Found core conf in /mnt/ssd/jenkins/workspace/Lucene-Solr-trunk-Linux/solr/build/solr-core/test/J1/./org.apache.solr.cloud.CollectionsAPIDistributedZkTest-jetty1-1375361093294/conf/
   [junit4]   2> 852332 T2537 oasc.CorePropertiesLocator.discover Found 1 core definitions
   [junit4]   2> 852333 T2537 oass.SolrDispatchFilter.init user.dir=/mnt/ssd/jenkins/workspace/Lucene-Solr-trunk-Linux/solr/build/solr-core/test/J1
   [junit4]   2> 852333 T2537 oass.SolrDispatchFilter.init SolrDispatchFilter.init() done
   [junit4]   2> 852333 T2537 oascsi.HttpClientUtil.createClient Creating new http client, config:maxConnections=128&maxConnectionsPerHost=32&followRedirects=false
   [junit4]   2> 852401 T2537 oejs.Server.doStart jetty-8.1.10.v20130312
   [junit4]   2> 852403 T2537 oejs.AbstractConnector.doStart Started SelectChannelConnector@127.0.0.1:45911
   [junit4]   2> 852404 T2537 oass.SolrDispatchFilter.init SolrDispatchFilter.init()
   [junit4]   2> 852404 T2537 oasc.SolrResourceLoader.locateSolrHome JNDI not configured for solr (NoInitialContextEx)
   [junit4]   2> 852404 T2537 oasc.SolrResourceLoader.locateSolrHome using system property solr.solr.home: /mnt/ssd/jenkins/workspace/Lucene-Solr-trunk-Linux/solr/build/solr-core/test/J1/./org.apache.solr.cloud.CollectionsAPIDistributedZkTest-jetty2-1375361094521
   [junit4]   2> 852405 T2537 oasc.SolrResourceLoader.<init> new SolrResourceLoader for directory: '/mnt/ssd/jenkins/workspace/Lucene-Solr-trunk-Linux/solr/build/solr-core/test/J1/./org.apache.solr.cloud.CollectionsAPIDistributedZkTest-jetty2-1375361094521/'
   [junit4]   2> 852420 T2537 oasc.ConfigSolr.fromFile Loading container configuration from /mnt/ssd/jenkins/workspace/Lucene-Solr-trunk-Linux/solr/build/solr-core/test/J1/./org.apache.solr.cloud.CollectionsAPIDistributedZkTest-jetty2-1375361094521/solr.xml
   [junit4]   2> 852478 T2537 oasc.ConfigSolrXml.<init> Config-defined core root directory: 
   [junit4]   2> 852479 T2537 oasc.CoreContainer.<init> New CoreContainer 33151826
   [junit4]   2> 852479 T2537 oasc.CoreContainer.load Loading cores into CoreContainer [instanceDir=/mnt/ssd/jenkins/workspace/Lucene-Solr-trunk-Linux/solr/build/solr-core/test/J1/./org.apache.solr.cloud.CollectionsAPIDistributedZkTest-jetty2-1375361094521/]
   [junit4]   2> 852480 T2537 oashc.HttpShardHandlerFactory.getParameter Setting socketTimeout to: 120000
   [junit4]   2> 852481 T2537 oashc.HttpShardHandlerFactory.getParameter Setting urlScheme to: http://
   [junit4]   2> 852481 T2537 oashc.HttpShardHandlerFactory.getParameter Setting connTimeout to: 15000
   [junit4]   2> 852481 T2537 oashc.HttpShardHandlerFactory.getParameter Setting maxConnectionsPerHost to: 20
   [junit4]   2> 852482 T2537 oashc.HttpShardHandlerFactory.getParameter Setting corePoolSize to: 0
   [junit4]   2> 852482 T2537 oashc.HttpShardHandlerFactory.getParameter Setting maximumPoolSize to: 2147483647
   [junit4]   2> 852482 T2537 oashc.HttpShardHandlerFactory.getParameter Setting maxThreadIdleTime to: 5
   [junit4]   2> 852482 T2537 oashc.HttpShardHandlerFactory.getParameter Setting sizeOfQueue to: -1
   [junit4]   2> 852483 T2537 oashc.HttpShardHandlerFactory.getParameter Setting fairnessPolicy to: false
   [junit4]   2> 852483 T2537 oascsi.HttpClientUtil.createClient Creating new http client, config:maxConnectionsPerHost=20&maxConnections=10000&socketTimeout=120000&connTimeout=15000&retry=false
   [junit4]   2> 852486 T2537 oasc.ZkContainer.initZooKeeper Zookeeper client=127.0.0.1:46367/solr
   [junit4]   2> 852486 T2537 oasc.ZkController.checkChrootPath zkHost includes chroot
   [junit4]   2> 852487 T2537 oascc.ConnectionManager.waitForConnected Waiting for client to connect to ZooKeeper
   [junit4]   2> 852488 T2589 oascc.ConnectionManager.process Watcher org.apache.solr.common.cloud.ConnectionManager@5eede4 name:ZooKeeperConnection Watcher:127.0.0.1:46367 got event WatchedEvent state:SyncConnected type:None path:null path:null type:None
   [junit4]   2> 852488 T2537 oascc.ConnectionManager.waitForConnected Client is connected to ZooKeeper
   [junit4]   2> 852490 T2537 oascsi.HttpClientUtil.createClient Creating new http client, config:maxConnections=500&maxConnectionsPerHost=16&socketTimeout=120000&connTimeout=15000
   [junit4]   2> 852493 T2537 oascc.ConnectionManager.waitForConnected Waiting for client to connect to ZooKeeper
   [junit4]   2> 852493 T2591 oascc.ConnectionManager.process Watcher org.apache.solr.common.cloud.ConnectionManager@b87631 name:ZooKeeperConnection Watcher:127.0.0.1:46367/solr got event WatchedEvent state:SyncConnected type:None path:null path:null type:None
   [junit4]   2> 852494 T2537 oascc.ConnectionManager.waitForConnected Client is connected to ZooKeeper
   [junit4]   2> 852498 T2537 oascc.ZkStateReader.createClusterStateWatchersAndUpdate Updating cluster state from ZooKeeper... 
   [junit4]   2> 853501 T2537 oasc.ZkController.createEphemeralLiveNode Register node as live in ZooKeeper:/live_nodes/127.0.0.1:45911_
   [junit4]   2> 853503 T2537 oascc.SolrZkClient.makePath makePath: /live_nodes/127.0.0.1:45911_
   [junit4]   2> 853507 T2564 oascc.ZkStateReader$3.process Updating live nodes... (3)
   [junit4]   2> 853507 T2591 oascc.ZkStateReader$3.process Updating live nodes... (3)
   [junit4]   2> 853507 T2559 oascc.ZkStateReader$3.process Updating live nodes... (3)
   [junit4]   2> 853507 T2577 oascc.ZkStateReader$3.process Updating live nodes... (3)
   [junit4]   2> 853516 T2537 oasc.CorePropertiesLocator.discover Looking for core definitions underneath /mnt/ssd/jenkins/workspace/Lucene-Solr-trunk-Linux/solr/build/solr-core/test/J1/./org.apache.solr.cloud.CollectionsAPIDistributedZkTest-jetty2-1375361094521
   [junit4]   2> 853541 T2537 oasc.CorePropertiesLocator.discoverUnder Found core conf in /mnt/ssd/jenkins/workspace/Lucene-Solr-trunk-Linux/solr/build/solr-core/test/J1/./org.apache.solr.cloud.CollectionsAPIDistributedZkTest-jetty2-1375361094521/conf/
   [junit4]   2> 853542 T2537 oasc.CorePropertiesLocator.discover Found 1 core definitions
   [junit4]   2> 853542 T2537 oass.SolrDispatchFilter.init user.dir=/mnt/ssd/jenkins/workspace/Lucene-Solr-trunk-Linux/solr/build/solr-core/test/J1
   [junit4]   2> 853543 T2537 oass.SolrDispatchFilter.init SolrDispatchFilter.init() done
   [junit4]   2> 853543 T2537 oascsi.HttpClientUtil.createClient Creating new http client, config:maxConnections=128&maxConnectionsPerHost=32&followRedirects=false
   [junit4]   2> 853610 T2537 oejs.Server.doStart jetty-8.1.10.v20130312
   [junit4]   2> 853612 T2537 oejs.AbstractConnector.doStart Started SelectChannelConnector@127.0.0.1:37651
   [junit4]   2> 853613 T2537 oass.SolrDispatchFilter.init SolrDispatchFilter.init()
   [junit4]   2> 853613 T2537 oasc.SolrResourceLoader.locateSolrHome JNDI not configured for solr (NoInitialContextEx)
   [junit4]   2> 853613 T2537 oasc.SolrResourceLoader.locateSolrHome using system property solr.solr.home: /mnt/ssd/jenkins/workspace/Lucene-Solr-trunk-Linux/solr/build/solr-core/test/J1/./org.apache.solr.cloud.CollectionsAPIDistributedZkTest-jetty3-1375361095731
   [junit4]   2> 853614 T2537 oasc.SolrResourceLoader.<init> new SolrResourceLoader for directory: '/mnt/ssd/jenkins/workspace/Lucene-Solr-trunk-Linux/solr/build/solr-core/test/J1/./org.apache.solr.cloud.CollectionsAPIDistributedZkTest-jetty3-1375361095731/'
   [junit4]   2> 853624 T2537 oasc.ConfigSolr.fromFile Loading container configuration from /mnt/ssd/jenkins/workspace/Lucene-Solr-trunk-Linux/solr/build/solr-core/test/J1/./org.apache.solr.cloud.CollectionsAPIDistributedZkTest-jetty3-1375361095731/solr.xml
   [junit4]   2> 853687 T2537 oasc.ConfigSolrXml.<init> Config-defined core root directory: 
   [junit4]   2> 853687 T2537 oasc.CoreContainer.<init> New CoreContainer 15844171
   [junit4]   2> 853687 T2537 oasc.CoreContainer.load Loading cores into CoreContainer [instanceDir=/mnt/ssd/jenkins/workspace/Lucene-Solr-trunk-Linux/solr/build/solr-core/test/J1/./org.apache.solr.cloud.CollectionsAPIDistributedZkTest-jetty3-1375361095731/]
   [junit4]   2> 853689 T2537 oashc.HttpShardHandlerFactory.getParameter Setting socketTimeout to: 120000
   [junit4]   2> 853689 T2537 oashc.HttpShardHandlerFactory.getParameter Setting urlScheme to: http://
   [junit4]   2> 853689 T2537 oashc.HttpShardHandlerFactory.getParameter Setting connTimeout to: 15000
   [junit4]   2> 853689 T2537 oashc.HttpShardHandlerFactory.getParameter Setting maxConnectionsPerHost to: 20
   [junit4]   2> 853690 T2537 oashc.HttpShardHandlerFactory.getParameter Setting corePoolSize to: 0
   [junit4]   2> 853690 T2537 oashc.HttpShardHandlerFactory.getParameter Setting maximumPoolSize to: 2147483647
   [junit4]   2> 853690 T2537 oashc.HttpShardHandlerFactory.getParameter Setting maxThreadIdleTime to: 5
   [junit4]   2> 853691 T2537 oashc.HttpShardHandlerFactory.getParameter Setting sizeOfQueue to: -1
   [junit4]   2> 853691 T2537 oashc.HttpShardHandlerFactory.getParameter Setting fairnessPolicy to: false
   [junit4]   2> 853691 T2537 oascsi.HttpClientUtil.createClient Creating new http client, config:maxConnectionsPerHost=20&maxConnections=10000&socketTimeout=120000&connTimeout=15000&retry=false
   [junit4]   2> 853694 T2537 oasc.ZkContainer.initZooKeeper Zookeeper client=127.0.0.1:46367/solr
   [junit4]   2> 853695 T2537 oasc.ZkController.checkChrootPath zkHost includes chroot
   [junit4]   2> 853695 T2537 oascc.ConnectionManager.waitForConnected Waiting for client to connect to ZooKeeper
   [junit4]   2> 853697 T2603 oascc.ConnectionManager.process Watcher org.apache.solr.common.cloud.ConnectionManager@5193b0 name:ZooKeeperConnection Watcher:127.0.0.1:46367 got event WatchedEvent state:SyncConnected type:None path:null path:null type:None
   [junit4]   2> 853697 T2537 oascc.ConnectionManager.waitForConnected Client is connected to ZooKeeper
   [junit4]   2> 853699 T2537 oascsi.HttpClientUtil.createClient Creating new http client, config:maxConnections=500&maxConnectionsPerHost=16&socketTimeout=120000&connTimeout=15000
   [junit4]   2> 853702 T2537 oascc.ConnectionManager.waitForConnected Waiting for client to connect to ZooKeeper
   [junit4]   2> 853703 T2605 oascc.ConnectionManager.process Watcher org.apache.solr.common.cloud.ConnectionManager@168bd68 name:ZooKeeperConnection Watcher:127.0.0.1:46367/solr got event WatchedEvent state:SyncConnected type:None path:null path:null type:None
   [junit4]   2> 853704 T2537 oascc.ConnectionManager.waitForConnected Client is connected to ZooKeeper
   [junit4]   2> 853708 T2537 oascc.ZkStateReader.createClusterStateWatchersAndUpdate Updating cluster state from ZooKeeper... 
   [junit4]   2> 854710 T2537 oasc.ZkController.createEphemeralLiveNode Register node as live in ZooKeeper:/live_nodes/127.0.0.1:37651_
   [junit4]   2> 854711 T2537 oascc.SolrZkClient.makePath makePath: /live_nodes/127.0.0.1:37651_
   [junit4]   2> 854714 T2564 oascc.ZkStateReader$3.process Updating live nodes... (4)
   [junit4]   2> 854714 T2577 oascc.ZkStateReader$3.process Updating live nodes... (4)
   [junit4]   2> 854714 T2559 oascc.ZkStateReader$3.process Updating live nodes... (4)
   [junit4]   2> 854715 T2605 oascc.ZkStateReader$3.process Updating live nodes... (4)
   [junit4]   2> 854715 T2591 oascc.ZkStateReader$3.process Updating live nodes... (4)
   [junit4]   2> 854720 T2537 oasc.CorePropertiesLocator.discover Looking for core definitions underneath /mnt/ssd/jenkins/workspace/Lucene-Solr-trunk-Linux/solr/build/solr-core/test/J1/./org.apache.solr.cloud.CollectionsAPIDistributedZkTest-jetty3-1375361095731
   [junit4]   2> 854752 T2537 oasc.CorePropertiesLocator.discoverUnder Found core conf in /mnt/ssd/jenkins/workspace/Lucene-Solr-trunk-Linux/solr/build/solr-core/test/J1/./org.apache.solr.cloud.CollectionsAPIDistributedZkTest-jetty3-1375361095731/conf/
   [junit4]   2> 854753 T2537 oasc.CorePropertiesLocator.discover Found 1 core definitions
   [junit4]   2> 854753 T2537 oass.SolrDispatchFilter.init user.dir=/mnt/ssd/jenkins/workspace/Lucene-Solr-trunk-Linux/solr/build/solr-core/test/J1
   [junit4]   2> 854754 T2537 oass.SolrDispatchFilter.init SolrDispatchFilter.init() done
   [junit4]   2> 854754 T2537 oascsi.HttpClientUtil.createClient Creating new http client, config:maxConnections=128&maxConnectionsPerHost=32&followRedirects=false
   [junit4]   2> 854821 T2537 oejs.Server.doStart jetty-8.1.10.v20130312
   [junit4]   2> 854822 T2537 oejs.AbstractConnector.doStart Started SelectChannelConnector@127.0.0.1:57527
   [junit4]   2> 854823 T2537 oass.SolrDispatchFilter.init SolrDispatchFilter.init()
   [junit4]   2> 854823 T2537 oasc.SolrResourceLoader.locateSolrHome JNDI not configured for solr (NoInitialContextEx)
   [junit4]   2> 854824 T2537 oasc.SolrResourceLoader.locateSolrHome using system property solr.solr.home: /mnt/ssd/jenkins/workspace/Lucene-Solr-trunk-Linux/solr/build/solr-core/test/J1/./org.apache.solr.cloud.CollectionsAPIDistributedZkTest-jetty4-1375361096942
   [junit4]   2> 854824 T2537 oasc.SolrResourceLoader.<init> new SolrResourceLoader for directory: '/mnt/ssd/jenkins/workspace/Lucene-Solr-trunk-Linux/solr/build/solr-core/test/J1/./org.apache.solr.cloud.CollectionsAPIDistributedZkTest-jetty4-1375361096942/'
   [junit4]   2> 854835 T2537 oasc.ConfigSolr.fromFile Loading container configuration from /mnt/ssd/jenkins/workspace/Lucene-Solr-trunk-Linux/solr/build/solr-core/test/J1/./org.apache.solr.cloud.CollectionsAPIDistributedZkTest-jetty4-1375361096942/solr.xml
   [junit4]   2> 854883 T2537 oasc.ConfigSolrXml.<init> Config-defined core root directory: 
   [junit4]   2> 854883 T2537 oasc.CoreContainer.<init> New CoreContainer 13266732
   [junit4]   2> 854884 T2537 oasc.CoreContainer.load Loading cores into CoreContainer [instanceDir=/mnt/ssd/jenkins/workspace/Lucene-Solr-trunk-Linux/solr/build/solr-core/test/J1/./org.apache.solr.cloud.CollectionsAPIDistributedZkTest-jetty4-1375361096942/]
   [junit4]   2> 854885 T2537 oashc.HttpShardHandlerFactory.getParameter Setting socketTimeout to: 120000
   [junit4]   2> 854885 T2537 oashc.HttpShardHandlerFactory.getParameter Setting urlScheme to: http://
   [junit4]   2> 854885 T2537 oashc.HttpShardHandlerFactory.getParameter Setting connTimeout to: 15000
   [junit4]   2> 854886 T2537 oashc.HttpShardHandlerFactory.getParameter Setting maxConnectionsPerHost to: 20
   [junit4]   2> 854886 T2537 oashc.HttpShardHandlerFactory.getParameter Setting corePoolSize to: 0
   [junit4]   2> 854886 T2537 oashc.HttpShardHandlerFactory.getParameter Setting maximumPoolSize to: 2147483647
   [junit4]   2> 854887 T2537 oashc.HttpShardHandlerFactory.getParameter Setting maxThreadIdleTime to: 5
   [junit4]   2> 854887 T2537 oashc.HttpShardHandlerFactory.getParameter Setting sizeOfQueue to: -1
   [junit4]   2> 854887 T2537 oashc.HttpShardHandlerFactory.getParameter Setting fairnessPolicy to: false
   [junit4]   2> 854888 T2537 oascsi.HttpClientUtil.createClient Creating new http client, config:maxConnectionsPerHost=20&maxConnections=10000&socketTimeout=120000&connTimeout=15000&retry=false
   [junit4]   2> 854891 T2537 oasc.ZkContainer.initZooKeeper Zookeeper client=127.0.0.1:46367/solr
   [junit4]   2> 854891 T2537 oasc.ZkController.checkChrootPath zkHost includes chroot
   [junit4]   2> 854893 T2537 oascc.ConnectionManager.waitForConnected Waiting for client to connect to ZooKeeper
   [junit4]   2> 854894 T2617 oascc.ConnectionManager.process Watcher org.apache.solr.common.cloud.ConnectionManager@1002893 name:ZooKeeperConnection Watcher:127.0.0.1:46367 got event WatchedEvent state:SyncConnected type:None path:null path:null type:None
   [junit4]   2> 854894 T2537 oascc.ConnectionManager.waitForConnected Client is connected to ZooKeeper
   [junit4]   2> 854896 T2537 oascsi.HttpClientUtil.createClient Creating new http client, config:maxConnections=500&maxConnectionsPerHost=16&socketTimeout=120000&connTimeout=15000
   [junit4]   2> 854899 T2537 oascc.ConnectionManager.waitForConnected Waiting for client to connect to ZooKeeper
   [junit4]   2> 854900 T2619 oascc.ConnectionManager.process Watcher org.apache.solr.common.cloud.ConnectionManager@1871073 name:ZooKeeperConnection Watcher:127.0.0.1:46367/solr got event WatchedEvent state:SyncConnected type:None path:null path:null type:None
   [junit4]   2> 854900 T2537 oascc.ConnectionManager.waitForConnected Client is connected to ZooKeeper
   [junit4]   2> 854903 T2537 oascc.ZkStateReader.createClusterStateWatchersAndUpdate Updating cluster state from ZooKeeper... 
   [junit4]   2> 855906 T2537 oasc.ZkController.createEphemeralLiveNode Register node as live in ZooKeeper:/live_nodes/127.0.0.1:57527_
   [junit4]   2> 855907 T2537 oascc.SolrZkClient.makePath makePath: /live_nodes/127.0.0.1:57527_
   [junit4]   2> 855912 T2564 oascc.ZkStateReader$3.process Updating live nodes... (5)
   [junit4]   2> 855912 T2559 oascc.ZkStateReader$3.process Updating live nodes... (5)
   [junit4]   2> 855912 T2577 oascc.ZkStateReader$3.process Updating live nodes... (5)
   [junit4]   2> 855912 T2619 oascc.ZkStateReader$3.process Updating live nodes... (5)
   [junit4]   2> 855912 T2591 oascc.ZkStateReader$3.process Updating live nodes... (5)
   [junit4]   2> 855912 T2605 oascc.ZkStateReader$3.process Updating live nodes... (5)
   [junit4]   2> 855921 T2537 oasc.CorePropertiesLocator.discover Looking for core definitions underneath /mnt/ssd/jenkins/workspace/Lucene-Solr-trunk-Linux/solr/build/solr-core/test/J1/./org.apache.solr.cloud.CollectionsAPIDistributedZkTest-jetty4-1375361096942
   [junit4]   2> 855954 T2537 oasc.CorePropertiesLocator.discoverUnder Found core conf in /mnt/ssd/jenkins/workspace/Lucene-Solr-trunk-Linux/solr/build/solr-core/test/J1/./org.apache.solr.cloud.CollectionsAPIDistributedZkTest-jetty4-1375361096942/conf/
   [junit4]   2> 855955 T2537 oasc.CorePropertiesLocator.discover Found 1 core definitions
   [junit4]   2> 855955 T2537 oass.SolrDispatchFilter.init user.dir=/mnt/ssd/jenkins/workspace/Lucene-Solr-trunk-Linux/solr/build/solr-core/test/J1
   [junit4]   2> 855956 T2537 oass.SolrDispatchFilter.init SolrDispatchFilter.init() done
   [junit4]   2> 855956 T2537 oascsi.HttpClientUtil.createClient Creating new http client, config:maxConnections=128&maxConnectionsPerHost=32&followRedirects=false
   [junit4]   2> 855959 T2537 oascsi.HttpClientUtil.createClient Creating new http client, config:maxConnections=128&maxConnectionsPerHost=32&followRedirects=false
   [junit4]   2> 855962 T2572 oasha.CollectionsHandler.handleCreateAction Creating Collection : numShards=2&name=nodes_used_collection&replicationFactor=2&action=CREATE&wt=javabin&version=2
   [junit4]   2> 855963 T2559 oasc.DistributedQueue$LatchChildWatcher.process Watcher fired on path: /overseer/collection-queue-work state: SyncConnected type NodeChildrenChanged
   [junit4]   2> 855964 T2561 oasc.OverseerCollectionProcessor.run Overseer Collection Processor: Get the message id:/overseer/collection-queue-work/qn-0000000000 message:{
   [junit4]   2> 	  "operation":"createcollection",
   [junit4]   2> 	  "numShards":"2",
   [junit4]   2> 	  "name":"nodes_used_collection",
   [junit4]   2> 	  "replicationFactor":"2"}
   [junit4]   2> 855965 T2561 oasc.OverseerCollectionProcessor.processMessage WARN OverseerCollectionProcessor.processMessage : createcollection , {
   [junit4]   2> 	  "operation":"createcollection",
   [junit4]   2> 	  "numShards":"2",
   [junit4]   2> 	  "name":"nodes_used_collection",
   [junit4]   2> 	  "replicationFactor":"2"}
   [junit4]   2> 857072 T2560 oascc.ZkStateReader.updateClusterState Updating cloud state from ZooKeeper... 
   [junit4]   2> 857073 T2560 oasc.Overseer$ClusterStateUpdater.buildCollection building a new collection: nodes_used_collection
   [junit4]   2> 857074 T2560 oasc.Overseer$ClusterStateUpdater.createCollection Create collection nodes_used_collection with shards [shard1, shard2]
   [junit4]   2> 857080 T2591 oascc.ZkStateReader$2.process A cluster state change: WatchedEvent state:SyncConnected type:NodeDataChanged path:/clusterstate.json, has occurred - updating... (live nodes size: 5)
   [junit4]   2> 857080 T2559 oascc.ZkStateReader$2.process A cluster state change: WatchedEvent state:SyncConnected type:NodeDataChanged path:/clusterstate.json, has occurred - updating... (live nodes size: 5)
   [junit4]   2> 857081 T2619 oascc.ZkStateReader$2.process A cluster state change: WatchedEvent state:SyncConnected type:NodeDataChanged path:/clusterstate.json, has occurred - updating... (live nodes size: 5)
   [junit4]   2> 857080 T2564 oascc.ZkStateReader$2.process A cluster state change: WatchedEvent state:SyncConnected type:NodeDataChanged path:/clusterstate.json, has occurred - updating... (live nodes size: 5)
   [junit4]   2> 857080 T2605 oascc.ZkStateReader$2.process A cluster state change: WatchedEvent state:SyncConnected type:NodeDataChanged path:/clusterstate.json, has occurred - updating... (live nodes size: 5)
   [junit4]   2> 857080 T2577 oascc.ZkStateReader$2.process A cluster state change: WatchedEvent state:SyncConnected type:NodeDataChanged path:/clusterstate.json, has occurred - updating... (live nodes size: 5)
   [junit4]   2> 857168 T2561 oasc.OverseerCollectionProcessor.createCollection going to create cores replicas shardNames [shard1, shard2] , repFactor : 2
   [junit4]   2> 857168 T2561 oasc.OverseerCollectionProcessor.createCollection Creating shard nodes_used_collection_shard1_replica1 as part of slice shard1 of collection nodes_used_collection on 127.0.0.1:50992_
   [junit4]   2> 857169 T2561 oasc.OverseerCollectionProcessor.createCollection Creating shard nodes_used_collection_shard1_replica2 as part of slice shard1 of collection nodes_used_collection on 127.0.0.1:37651_
   [junit4]   2> 857170 T2561 oasc.OverseerCollectionProcessor.createCollection Creating shard nodes_used_collection_shard2_replica1 as part of slice shard2 of collection nodes_used_collection on 127.0.0.1:45911_
   [junit4]   2> 857171 T2561 oasc.OverseerCollectionProcessor.createCollection Creating shard nodes_used_collection_shard2_replica2 as part of slice shard2 of collection nodes_used_collection on 127.0.0.1:50370_
   [junit4]   2> 857173 T2601 oasc.ZkController.publish publishing core=nodes_used_collection_shard1_replica2 state=down
   [junit4]   2> 857173 T2585 oasc.ZkController.publish publishing core=nodes_used_collection_shard2_replica1 state=down
   [junit4]   2> 857173 T2571 oasc.ZkController.publish publishing core=nodes_used_collection_shard1_replica1 state=down
   [junit4]   2> 857174 T2553 oasc.ZkController.publish publishing core=nodes_used_collection_shard2_replica2 state=down
   [junit4]   2> 857175 T2585 oasc.ZkController.waitForCoreNodeName look for our core node name
   [junit4]   2> 857175 T2601 oasc.ZkController.waitForCoreNodeName look for our core node name
   [junit4]   2> 857176 T2553 oasc.ZkController.waitForCoreNodeName look for our core node name
   [junit4]   2> 857175 T2571 oasc.ZkController.waitForCoreNodeName look for our core node name
   [junit4]   2> 858585 T2560 oascc.ZkStateReader.updateClusterState Updating cloud state from ZooKeeper... 
   [junit4]   2> 858586 T2560 oasc.Overseer$ClusterStateUpdater.updateState WARN Could not find collection node for nodes_used_collection, skipping publish state
   [junit4]   2> 858586 T2560 oasc.Overseer$ClusterStateUpdater.updateState Update state numShards=2 message={
   [junit4]   2> 	  "operation":"state",
   [junit4]   2> 	  "core_node_name":"core_node1",
   [junit4]   2> 	  "numShards":"2",
   [junit4]   2> 	  "shard":"shard1",
   [junit4]   2> 	  "roles":null,
   [junit4]   2> 	  "state":"down",
   [junit4]   2> 	  "shard_state":"active",
   [junit4]   2> 	  "core":"nodes_used_collection_shard1_replica2",
   [junit4]   2> 	  "collection":"nodes_used_collection",
   [junit4]   2> 	  "shard_range":null,
   [junit4]   2> 	  "node_name":"127.0.0.1:37651_",
   [junit4]   2> 	  "base_url":"http://127.0.0.1:37651"}
   [junit4]   2> 858589 T2560 oasc.Overseer$ClusterStateUpdater.updateState WARN Could not find collection node for nodes_used_collection, skipping publish state
   [junit4]   2> 858589 T2560 oasc.Overseer$ClusterStateUpdater.updateState Update state numShards=2 message={
   [junit4]   2> 	  "operation":"state",
   [junit4]   2> 	  "core_node_name":"core_node2",
   [junit4]   2> 	  "numShards":"2",
   [junit4]   2> 	  "shard":"shard2",
   [junit4]   2> 	  "roles":null,
   [junit4]   2> 	  "state":"down",
   [junit4]   2> 	  "shard_state":"active",
   [junit4]   2> 	  "core":"nodes_used_collection_shard2_replica1",
   [junit4]   2> 	  "collection":"nodes_used_collection",
   [junit4]   2> 	  "shard_range":null,
   [junit4]   2> 	  "node_name":"127.0.0.1:45911_",
   [junit4]   2> 	  "base_url":"http://127.0.0.1:45911"}
   [junit4]   2> 858592 T2560 oasc.Overseer$ClusterStateUpdater.updateState WARN Could not find collection node for nodes_used_collection, skipping publish state
   [junit4]   2> 858592 T2560 oasc.Overseer$ClusterStateUpdater.updateState Update state numShards=2 message={
   [junit4]   2> 	  "operation":"state",
   [junit4]   2> 	  "core_node_name":"core_node3",
   [junit4]   2> 	  "numShards":"2",
   [junit4]   2> 	  "shard":"shard1",
   [junit4]   2> 	  "roles":null,
   [junit4]   2> 	  "state":"down",
   [junit4]   2> 	  "shard_state":"active",
   [junit4]   2> 	  "core":"nodes_used_collection_shard1_replica1",
   [junit4]   2> 	  "collection":"nodes_used_collection",
   [junit4]   2> 	  "shard_range":null,
   [junit4]   2> 	  "node_name":"127.0.0.1:50992_",
   [junit4]   2> 	  "base_url":"http://127.0.0.1:50992"}
   [junit4]   2> 858595 T2560 oasc.Overseer$ClusterStateUpdater.updateState WARN Could not find collection node for nodes_used_collection, skipping publish state
   [junit4]   2> 858595 T2560 oasc.Overseer$ClusterStateUpdater.updateState Update state numShards=2 message={
   [junit4]   2> 	  "operation":"state",
   [junit4]   2> 	  "core_node_name":"core_node4",
   [junit4]   2> 	  "numShards":"2",
   [junit4]   2> 	  "shard":"shard2",
   [junit4]   2> 	  "roles":null,
   [junit4]   2> 	  "state":"down",
   [junit4]   2> 	  "shard_state":"active",
   [junit4]   2> 	  "core":"nodes_used_collection_shard2_replica2",
   [junit4]   2> 	  "collection":"nodes_used_collection",
   [junit4]   2> 	  "shard_range":null,
   [junit4]   2> 	  "node_name":"127.0.0.1:50370_",
   [junit4]   2> 	  "base_url":"http://127.0.0.1:50370"}
   [junit4]   2> 858645 T2564 oascc.ZkStateReader$2.process A cluster state change: WatchedEvent state:SyncConnected type:NodeDataChanged path:/clusterstate.json, has occurred - updating... (live nodes size: 5)
   [junit4]   2> 858645 T2605 oascc.ZkStateReader$2.process A cluster state change: WatchedEvent state:SyncConnected type:NodeDataChanged path:/clusterstate.json, has occurred - updating... (live nodes size: 5)
   [junit4]   2> 858645 T2619 oascc.ZkStateReader$2.process A cluster state change: WatchedEvent state:SyncConnected type:NodeDataChanged path:/clusterstate.json, has occurred - updating... (live nodes size: 5)
   [junit4]   2> 858645 T2591 oascc.ZkStateReader$2.process A cluster state change: WatchedEvent state:SyncConnected type:NodeDataChanged path:/clusterstate.json, has occurred - updating... (live nodes size: 5)
   [junit4]   2> 858645 T2577 oascc.ZkStateReader$2.process A cluster state change: WatchedEvent state:SyncConnected type:NodeDataChanged path:/clusterstate.json, has occurred - updating... (live nodes size: 5)
   [junit4]   2> 858645 T2559 oascc.ZkStateReader$2.process A cluster state change: WatchedEvent state:SyncConnected type:NodeDataChanged path:/clusterstate.json, has occurred - updating... (live nodes size: 5)
   [junit4]   2> 859176 T2585 oasc.ZkController.waitForShardId waiting to find shard id in clusterstate for nodes_used_collection_shard2_replica1
   [junit4]   2> 859177 T2601 oasc.ZkController.waitForShardId waiting to find shard id in clusterstate for nodes_used_collection_shard1_replica2
   [junit4]   2> 859177 T2553 oasc.ZkController.waitForShardId waiting to find shard id in clusterstate for nodes_used_collection_shard2_replica2
   [junit4]   2> 859177 T2601 oasc.CorePropertiesLocator.writePropertiesFile ERROR Couldn't persist core properties to /mnt/ssd/jenkins/workspace/Lucene-Solr-trunk-Linux/solr/build/solr-core/test/J1/./org.apache.solr.cloud.CollectionsAPIDistributedZkTest-jetty3-1375361095731/nodes_used_collection_shard1_replica2/core.properties: java.io.FileNotFoundException: /mnt/ssd/jenkins/workspace/Lucene-Solr-trunk-Linux/solr/build/solr-core/test/J1/./org.apache.solr.cloud.CollectionsAPIDistributedZkTest-jetty3-1375361095731/nodes_used_collection_shard1_replica2/core.properties (No such file or directory)
   [junit4]   2> 859177 T2585 oasc.CorePropertiesLocator.writePropertiesFile ERROR Couldn't persist core properties to /mnt/ssd/jenkins/workspace/Lucene-Solr-trunk-Linux/solr/build/solr-core/test/J1/./org.apache.solr.cloud.CollectionsAPIDistributedZkTest-jetty2-1375361094521/nodes_used_collection_shard2_replica1/core.properties: java.io.FileNotFoundException: /mnt/ssd/jenkins/workspace/Lucene-Solr-trunk-Linux/solr/build/solr-core/test/J1/./org.apache.solr.cloud.CollectionsAPIDistributedZkTest-jetty2-1375361094521/nodes_used_collection_shard2_replica1/core.properties (No such file or directory)
   [junit4]   2> 859178 T2601 oasc.CoreContainer.create Creating SolrCore 'nodes_used_collection_shard1_replica2' using instanceDir: /mnt/ssd/jenkins/workspace/Lucene-Solr-trunk-Linux/solr/build/solr-core/test/J1/./org.apache.solr.cloud.CollectionsAPIDistributedZkTest-jetty3-1375361095731/nodes_used_collection_shard1_replica2
   [junit4]   2> 859178 T2601 oasc.ZkController.createCollectionZkNode Check for collection zkNode:nodes_used_collection
   [junit4]   2> 859178 T2553 oasc.CorePropertiesLocator.writePropertiesFile ERROR Couldn't persist core properties to /mnt/ssd/jenkins/workspace/Lucene-Solr-trunk-Linux/solr/build/solr-core/test/J1/./org.apache.solr.cloud.CollectionsAPIDistributedZkTest-controljetty-1375361093036/nodes_used_collection_shard2_replica2/core.properties: java.io.FileNotFoundException: /mnt/ssd/jenkins/workspace/Lucene-Solr-trunk-Linux/solr/build/solr-core/test/J1/./org.apache.solr.cloud.CollectionsAPIDistributedZkTest-controljetty-1375361093036/nodes_used_collection_shard2_replica2/core.properties (No such file or directory)
   [junit4]   2> 859178 T2571 oasc.ZkController.waitForShardId waiting to find shard id in clusterstate for nodes_used_collection_shard1_replica1
   [junit4]   2> 859179 T2601 oasc.ZkController.createCollectionZkNode Creating collection in ZooKeeper:nodes_used_collection
   [junit4]   2> 859179 T2553 oasc.CoreContainer.create Creating SolrCore 'nodes_used_collection_shard2_replica2' using instanceDir: /mnt/ssd/jenkins/workspace/Lucene-Solr-trunk-Linux/solr/build/solr-core/test/J1/./org.apache.solr.cloud.CollectionsAPIDistributedZkTest-controljetty-1375361093036/nodes_used_collection_shard2_replica2
   [junit4]   2> 859178 T2585 oasc.CoreContainer.create Creating SolrCore 'nodes_used_collection_shard2_replica1' using instanceDir: /mnt/ssd/jenkins/workspace/Lucene-Solr-trunk-Linux/solr/build/solr-core/test/J1/./org.apache.solr.cloud.CollectionsAPIDistributedZkTest-jetty2-1375361094521/nodes_used_collection_shard2_replica1
   [junit4]   2> 859180 T2553 oasc.ZkController.createCollectionZkNode Check for collection zkNode:nodes_used_collection
   [junit4]   2> 859180 T2601 oasc.ZkController.getConfName Looking for collection configName
   [junit4]   2> 859180 T2571 oasc.CorePropertiesLocator.writePropertiesFile ERROR Couldn't persist core properties to /mnt/ssd/jenkins/workspace/Lucene-Solr-trunk-Linux/solr/build/solr-core/test/J1/./org.apache.solr.cloud.CollectionsAPIDistributedZkTest-jetty1-1375361093294/nodes_used_collection_shard1_replica1/core.properties: java.io.FileNotFoundException: /mnt/ssd/jenkins/workspace/Lucene-Solr-trunk-Linux/solr/build/solr-core/test/J1/./org.apache.solr.cloud.CollectionsAPIDistributedZkTest-jetty1-1375361093294/nodes_used_collection_shard1_replica1/core.properties (No such file or directory)
   [junit4]   2> 859181 T2553 oasc.ZkController.createCollectionZkNode Creating collection in ZooKeeper:nodes_used_collection
   [junit4]   2> 859180 T2585 oasc.ZkController.createCollectionZkNode Check for collection zkNode:nodes_used_collection
   [junit4]   2> 859182 T2553 oasc.ZkController.getConfName Looking for collection configName
   [junit4]   2> 859181 T2601 oasc.ZkController.getConfName Only one config set found in zk - using it:conf1
   [junit4]   2> 859181 T2571 oasc.CoreContainer.create Creating SolrCore 'nodes_used_collection_shard1_replica1' using instanceDir: /mnt/ssd/jenkins/workspace/Lucene-Solr-trunk-Linux/solr/build/solr-core/test/J1/./org.apache.solr.cloud.CollectionsAPIDistributedZkTest-jetty1-1375361093294/nodes_used_collection_shard1_replica1
   [junit4]   2> 859183 T2571 oasc.ZkController.createCollectionZkNode Check for collection zkNode:nodes_used_collection
   [junit4]   2> 859183 T2553 oasc.ZkController.getConfName Only one config set found in zk - using it:conf1
   [junit4]   2> 859183 T2601 oascc.SolrZkClient.makePath makePath: /collections/nodes_used_collection
   [junit4]   2> 859182 T2585 oasc.ZkController.createCollectionZkNode Creating collection in ZooKeeper:nodes_used_collection
   [junit4]   2> 859183 T2571 oasc.ZkController.createCollectionZkNode Creating collection in ZooKeeper:nodes_used_collection
   [junit4]   2> 859183 T2553 oascc.SolrZkClient.makePath makePath: /collections/nodes_used_collection
   [junit4]   2> 859184 T2571 oasc.ZkController.getConfName Looking for collection configName
   [junit4]   2> 859184 T2585 oasc.ZkController.getConfName Looking for collection configName
   [junit4]   2> 859185 T2601 oasc.ZkController.readConfigName Load collection config from:/collections/nodes_used_collection
   [junit4]   2> 859186 T2553 oasc.ZkController.readConfigName Load collection config from:/collections/nodes_used_collection
   [junit4]   2> 859186 T2571 oascc.SolrZkClient.makePath makePath: /collections/nodes_used_collection
   [junit4]   2> 859187 T2601 oasc.SolrResourceLoader.<init> new SolrResourceLoader for directory: '/mnt/ssd/jenkins/workspace/Lucene-Solr-trunk-Linux/solr/build/solr-core/test/J1/./org.apache.solr.cloud.CollectionsAPIDistributedZkTest-jetty3-1375361095731/nodes_used_collection_shard1_replica2/'
   [junit4]   2> 859186 T2585 oascc.SolrZkClient.makePath makePath: /collections/nodes_used_collection
   [junit4]   2> 859187 T2553 oasc.SolrResourceLoader.<init> new SolrResourceLoader for directory: '/mnt/ssd/jenkins/workspace/Lucene-Solr-trunk-Linux/solr/build/solr-core/test/J1/./org.apache.solr.cloud.CollectionsAPIDistributedZkTest-controljetty-1375361093036/nodes_used_collection_shard2_replica2/'
   [junit4]   2> 859188 T2571 oasc.ZkController.readConfigName Load collection config from:/collections/nodes_used_collection
   [junit4]   2> 859189 T2585 oasc.ZkController.readConfigName Load collection config from:/collections/nodes_used_collection
   [junit4]   2> 859190 T2585 oasc.SolrResourceLoader.<init> new SolrResourceLoader for directory: '/mnt/ssd/jenkins/workspace/Lucene-Solr-trunk-Linux/solr/build/solr-core/test/J1/./org.apache.solr.cloud.CollectionsAPIDistributedZkTest-jetty2-1375361094521/nodes_used_collection_shard2_replica1/'
   [junit4]   2> 859192 T2571 oasc.SolrResourceLoader.<init> new SolrResourceLoader for directory: '/mnt/ssd/jenkins/workspace/Lucene-Solr-trunk-Linux/solr/build/solr-core/test/J1/./org.apache.solr.cloud.CollectionsAPIDistributedZkTest-jetty1-1375361093294/nodes_used_collection_shard1_replica1/'
   [junit4]   2> 859261 T2601 oasc.SolrConfig.<init> Using Lucene MatchVersion: LUCENE_50
   [junit4]   2> 859267 T2585 oasc.SolrConfig.<init> Using Lucene MatchVersion: LUCENE_50
   [junit4]   2> 859274 T2571 oasc.SolrConfig.<init> Using Lucene MatchVersion: LUCENE_50
   [junit4]   2> 859295 T2553 oasc.SolrConfig.<init> Using Lucene MatchVersion: LUCENE_50
   [junit4]   2> 859331 T2601 oasc.SolrConfig.<init> Loaded SolrConfig: solrconfig.xml
   [junit4]   2> 859332 T2601 oass.IndexSchema.readSchema Reading Solr Schema from schema.xml
   [junit4]   2> 859341 T2601 oass.IndexSchema.readSchema [nodes_used_collection_shard1_replica2] Schema name=test
   [junit4]   2> 859363 T2571 oasc.SolrConfig.<init> Loaded SolrConfig: solrconfig.xml
   [junit4]   2> 859364 T2571 oass.IndexSchema.readSchema Reading Solr Schema from schema.xml
   [junit4]   2> 859365 T2585 oasc.SolrConfig.<init> Loaded SolrConfig: solrconfig.xml
   [junit4]   2> 859366 T2585 oass.IndexSchema.readSchema Reading Solr Schema from schema.xml
   [junit4]   2> 859378 T2571 oass.IndexSchema.readSchema [nodes_used_collection_shard1_replica1] Schema name=test
   [junit4]   2> 859379 T2553 oasc.SolrConfig.<init> Loaded SolrConfig: solrconfig.xml
   [junit4]   2> 859379 T2585 oass.IndexSchema.readSchema [nodes_used_collection_shard2_replica1] Schema name=test
   [junit4]   2> 859380 T2553 oass.IndexSchema.readSchema Reading Solr Schema from schema.xml
   [junit4]   2> 859399 T2553 oass.IndexSchema.readSchema [nodes_used_collection_shard2_replica2] Schema name=test
   [junit4]   2> 860086 T2585 oass.OpenExchangeRatesOrgProvider.init Initialized with rates=open-exchange-rates.json, refreshInterval=1440.
   [junit4]   2> 860095 T2585 oass.IndexSchema.readSchema default search field in schema is text
   [junit4]   2> 860104 T2585 oass.IndexSchema.readSchema unique key field: id
   [junit4]   2> 860114 T2585 oass.FileExchangeRateProvider.reload Reloading exchange rates from file currency.xml
   [junit4]   2> 860118 T2585 oass.FileExchangeRateProvider.reload Reloading exchange rates from file currency.xml
   [junit4]   2> 860121 T2585 oass.OpenExchangeRatesOrgProvider.reload Reloading exchange rates from open-exchange-rates.json
   [junit4]   2> 860122 T2585 oass.OpenExchangeRatesOrgProvider$OpenExchangeRates.<init> WARN Unknown key IMPORTANT NOTE
   [junit4]   2> 860123 T2585 oass.OpenExchangeRatesOrgProvider$OpenExchangeRates.<init> WARN Expected key, got STRING
   [junit4]   2> 860123 T2585 oass.OpenExchangeRatesOrgProvider.reload Reloading exchange rates from open-exchange-rates.json
   [junit4]   2> 860124 T2585 oass.OpenExchangeRatesOrgProvider$OpenExchangeRates.<init> WARN Unknown key IMPORTANT NOTE
   [junit4]   2> 860124 T2585 oass.OpenExchangeRatesOrgProvider$OpenExchangeRates.<init> WARN Expected key, got STRING
   [junit4]   2> 860124 T2585 oasc.SolrCore.initDirectoryFactory org.apache.solr.core.MockDirectoryFactory
   [junit4]   2> 860125 T2585 oasc.SolrCore.<init> [nodes_used_collection_shard2_replica1] Opening new SolrCore at /mnt/ssd/jenkins/workspace/Lucene-Solr-trunk-Linux/solr/build/solr-core/test/J1/./org.apache.solr.cloud.CollectionsAPIDistributedZkTest-jetty2-1375361094521/nodes_used_collection_shard2_replica1/, dataDir=/mnt/ssd/jenkins/workspace/Lucene-Solr-trunk-Linux/solr/build/solr-core/test/J1/./org.apache.solr.cloud.CollectionsAPIDistributedZkTest-jetty2-1375361094521//nodes_used_collection_shard2_replica1/data/
   [junit4]   2> 860125 T2585 oasc.JmxMonitoredMap.<init> JMX monitoring is enabled. Adding Solr mbeans to JMX Server: com.sun.jmx.mbeanserver.JmxMBeanServer@102b0a7
   [junit4]   2> 860126 T2585 oasc.CachingDirectoryFactory.get return new directory for /mnt/ssd/jenkins/workspace/Lucene-Solr-trunk-Linux/solr/build/solr-core/test/J1/./org.apache.solr.cloud.CollectionsAPIDistributedZkTest-jetty2-1375361094521//nodes_used_collection_shard2_replica1/data
   [junit4]   2> 860126 T2585 oasc.SolrCore.getNewIndexDir New index directory detected: old=null new=/mnt/ssd/jenkins/workspace/Lucene-Solr-trunk-Linux/solr/build/solr-core/test/J1/./org.apache.solr.cloud.CollectionsAPIDistributedZkTest-jetty2-1375361094521//nodes_used_collection_shard2_replica1/data/index/
   [junit4]   2> 860126 T2585 oasc.SolrCore.initIndex WARN [nodes_used_collection_shard2_replica1] Solr index directory '/mnt/ssd/jenkins/workspace/Lucene-Solr-trunk-Linux/solr/build/solr-core/test/J1/./org.apache.solr.cloud.CollectionsAPIDistributedZkTest-jetty2-1375361094521/nodes_used_collection_shard2_replica1/data/index' doesn't exist. Creating new index...
   [junit4]   2> 860127 T2585 oasc.CachingDirectoryFactory.get return new directory for /mnt/ssd/jenkins/workspace/Lucene-Solr-trunk-Linux/solr/build/solr-core/test/J1/./org.apache.solr.cloud.CollectionsAPIDistributedZkTest-jetty2-1375361094521//nodes_used_collection_shard2_replica1/data/index
   [junit4]   2> 860128 T2585 oasc.SolrDeletionPolicy.onCommit SolrDeletionPolicy.onCommit: commits: num=1
   [junit4]   2> 		commit{dir=MockDirWrapper(org.apache.lucene.store.RAMDirectory@1f39a1 lockFactory=org.apache.lucene.store.NativeFSLockFactory@5a05a2),segFN=segments_1,generation=1}
   [junit4]   2> 860129 T2585 oasc.SolrDeletionPolicy.updateCommits newest commit generation = 1
   [junit4]   2> 860132 T2585 oasup.UpdateRequestProcessorChain.init inserting DistributedUpdateProcessorFactory into updateRequestProcessorChain "dedupe"
   [junit4]   2> 860132 T2585 oasup.UpdateRequestProcessorChain.init inserting DistributedUpdateProcessorFactory into updateRequestProcessorChain "stored_sig"
   [junit4]   2> 860132 T2553 oass.OpenExchangeRatesOrgProvider.init Initialized with rates=open-exchange-rates.json, refreshInterval=1440.
   [junit4]   2> 860133 T2585 oasup.UpdateRequestProcessorChain.init inserting DistributedUpdateProcessorFactory into updateRequestProcessorChain "distrib-dup-test-chain-implicit"
   [junit4]   2> 860133 T2585 oasc.RequestHandlers.initHandlersFromConfig created standard: solr.StandardRequestHandler
   [junit4]   2> 860140 T2585 oasc.RequestHandlers.initHandlersFromConfig created /get: solr.RealTimeGetHandler
   [junit4]   2> 860140 T2585 oasc.RequestHandlers.initHandlersFromConfig adding lazy requestHandler: solr.ReplicationHandler
   [junit4]   2> 860140 T2585 oasc.RequestHandlers.initHandlersFromConfig created /replication: solr.ReplicationHandler
   [junit4]   2> 860141 T2585 oasc.RequestHandlers.initHandlersFromConfig created /update: solr.UpdateRequestHandler
   [junit4]   2> 860141 T2585 oasc.RequestHandlers.initHandlersFromConfig created /admin/: org.apache.solr.handler.admin.AdminHandlers
   [junit4]   2> 860144 T2585 oashl.XMLLoader.init xsltCacheLifetimeSeconds=60
   [junit4]   2> 860144 T2553 oass.IndexSchema.readSchema default search field in schema is text
   [junit4]   2> 860147 T2585 oass.SolrIndexSearcher.<init> Opening Searcher@17aead1 main
   [junit4]   2> 860147 T2585 oasu.CommitTracker.<init> Hard AutoCommit: disabled
   [junit4]   2> 860147 T2553 oass.IndexSchema.readSchema unique key field: id
   [junit4]   2> 860148 T2585 oasu.CommitTracker.<init> Soft AutoCommit: disabled
   [junit4]   2> 860153 T2625 oasc.SolrCore.registerSearcher [nodes_used_collection_shard2_replica1] Registered new searcher Searcher@17aead1 main{StandardDirectoryReader(segments_1:1)}
   [junit4]   2> 860156 T2585 oasc.CoreContainer.registerCore registering core: nodes_used_collection_shard2_replica1
   [junit4]   2> 860156 T2585 oasc.ZkController.register Register replica - core:nodes_used_collection_shard2_replica1 address:http://127.0.0.1:45911 collection:nodes_used_collection shard:shard2
   [junit4]   2> 860157 T2585 oascsi.HttpClientUtil.createClient Creating new http client, config:maxConnections=10000&maxConnectionsPerHost=20&connTimeout=15000&socketTimeout=30000&retry=false
   [junit4]   2> 860158 T2553 oass.FileExchangeRateProvider.reload Reloading exchange rates from file currency.xml
   [junit4]   2> 860162 T2585 oascc.SolrZkClient.makePath makePath: /collections/nodes_used_collection/leader_elect/shard2/election
   [junit4]   2> 860162 T2553 oass.FileExchangeRateProvider.reload Reloading exchange rates from file currency.xml
   [junit4]   2> 860166 T2553 oass.OpenExchangeRatesOrgProvider.reload Reloading exchange rates from open-exchange-rates.json
   [junit4]   2> 860167 T2553 oass.OpenExchangeRatesOrgProvider$OpenExchangeRates.<init> WARN Unknown key IMPORTANT NOTE
   [junit4]   2> 860168 T2553 oass.OpenExchangeRatesOrgProvider$OpenExchangeRates.<init> WARN Expected key, got STRING
   [junit4]   2> 860168 T2585 oasc.ShardLeaderElectionContext.runLeaderProcess Running the leader process for shard shard2
   [junit4]   2> 860168 T2553 oass.OpenExchangeRatesOrgProvider.reload Reloading exchange rates from open-exchange-rates.json
   [junit4]   2> 860169 T2553 oass.OpenExchangeRatesOrgProvider$OpenExchangeRates.<init> WARN Unknown key IMPORTANT NOTE
   [junit4]   2> 860170 T2553 oass.OpenExchangeRatesOrgProvider$OpenExchangeRates.<init> WARN Expected key, got STRING
   [junit4]   2> 860170 T2553 oasc.SolrCore.initDirectoryFactory org.apache.solr.core.MockDirectoryFactory
   [junit4]   2> 860170 T2585 oasc.ShardLeaderElectionContext.waitForReplicasToComeUp Waiting until we see more replicas up for shard shard2: total=2 found=1 timeoutin=180000
   [junit4]   2> 860171 T2553 oasc.SolrCore.<init> [nodes_used_collection_shard2_replica2] Opening new SolrCore at /mnt/ssd/jenkins/workspace/Lucene-Solr-trunk-Linux/solr/build/solr-core/test/J1/./org.apache.solr.cloud.CollectionsAPIDistributedZkTest-controljetty-1375361093036/nodes_used_collection_shard2_replica2/, dataDir=/mnt/ssd/jenkins/workspace/Lucene-Solr-trunk-Linux/solr/build/solr-core/test/J1/./org.apache.solr.cloud.CollectionsAPIDistributedZkTest-controljetty-1375361093036//nodes_used_collection_shard2_replica2/data/
   [junit4]   2> 860171 T2553 oasc.JmxMonitoredMap.<init> JMX monitoring is enabled. Adding Solr mbeans to JMX Server: com.sun.jmx.mbeanserver.JmxMBeanServer@102b0a7
   [junit4]   2> 860172 T2553 oasc.CachingDirectoryFactory.get return new directory for /mnt/ssd/jenkins/workspace/Lucene-Solr-trunk-Linux/solr/build/solr-core/test/J1/./org.apache.solr.cloud.CollectionsAPIDistributedZkTest-controljetty-1375361093036//nodes_used_collection_shard2_replica2/data
   [junit4]   2> 860172 T2553 oasc.SolrCore.getNewIndexDir New index directory detected: old=null new=/mnt/ssd/jenkins/workspace/Lucene-Solr-trunk-Linux/solr/build/solr-core/test/J1/./org.apache.solr.cloud.CollectionsAPIDistributedZkTest-controljetty-1375361093036//nodes_used_collection_shard2_replica2/data/index/
   [junit4]   2> 860173 T2553 oasc.SolrCore.initIndex WARN [nodes_used_collection_shard2_replica2] Solr index directory '/mnt/ssd/jenkins/workspace/Lucene-Solr-trunk-Linux/solr/build/solr-core/test/J1/./org.apache.solr.cloud.CollectionsAPIDistributedZkTest-controljetty-1375361093036/nodes_used_collection_shard2_replica2/data/index' doesn't exist. Creating new index...
   [junit4]   2> 860173 T2553 oasc.CachingDirectoryFactory.get return new directory for /mnt/ssd/jenkins/workspace/Lucene-Solr-trunk-Linux/solr/build/solr-core/test/J1/./org.apache.solr.cloud.CollectionsAPIDistributedZkTest-controljetty-1375361093036//nodes_used_collection_shard2_replica2/data/index
   [junit4]   2> 860174 T2571 oass.OpenExchangeRatesOrgProvider.init Initialized with rates=open-exchange-rates.json, refreshInterval=1440.
   [junit4]   2> 860175 T2553 oasc.SolrDeletionPolicy.onCommit SolrDeletionPolicy.onCommit: commits: num=1
   [junit4]   2> 		commit{dir=MockDirWrapper(org.apache.lucene.store.RAMDirectory@12d1cc1 lockFactory=org.apache.lucene.store.NativeFSLockFactory@10ee05b),segFN=segments_1,generation=1}
   [junit4]   2> 860175 T2553 oasc.SolrDeletionPolicy.updateCommits newest commit generation = 1
   [junit4]   2> 860175 T2601 oass.OpenExchangeRatesOrgProvider.init Initialized with rates=open-exchange-rates.json, refreshInterval=1440.
   [junit4]   2> 860178 T2553 oasup.UpdateRequestProcessorChain.init inserting DistributedUpdateProcessorFactory into updateRequestProcessorChain "dedupe"
   [junit4]   2> 860178 T2553 oasup.UpdateRequestProcessorChain.init inserting DistributedUpdateProcessorFactory into updateRequestProcessorChain "stored_sig"
   [junit4]   2> 860179 T2553 oasup.UpdateRequestProcessorChain.init inserting DistributedUpdateProcessorFactory into updateRequestProcessorChain "distrib-dup-test-chain-implicit"
   [junit4]   2> 860187 T2553 oasc.RequestHandlers.initHandlersFromConfig created standard: solr.StandardRequestHandler
   [junit4]   2> 860187 T2553 oasc.RequestHandlers.initHandlersFromConfig created /get: solr.RealTimeGetHandler
   [junit4]   2> 860188 T2553 oasc.RequestHandlers.initHandlersFromConfig adding lazy requestHandler: solr.ReplicationHandler
   [junit4]   2> 860188 T2553 oasc.RequestHandlers.initHandlersFromConfig created /replication: solr.ReplicationHandler
   [junit4]   2> 860188 T2553 oasc.RequestHandlers.initHandlersFromConfig created /update: solr.UpdateRequestHandler
   [junit4]   2> 860189 T2553 oasc.RequestHandlers.initHandlersFromConfig created /admin/: org.apache.solr.handler.admin.AdminHandlers
   [junit4]   2> 860190 T2571 oass.IndexSchema.readSchema default search field in schema is text
   [junit4]   2> 860191 T2553 oashl.XMLLoader.init xsltCacheLifetimeSeconds=60
   [junit4]   2> 860193 T2601 oass.IndexSchema.readSchema default search field in schema is text
   [junit4]   2> 860194 T2553 oass.SolrIndexSearcher.<init> Opening Searcher@13b749e main
   [junit4]   2> 860194 T2553 oasu.CommitTracker.<init> Hard AutoCommit: disabled
   [junit4]   2> 860195 T2553 oasu.CommitTracker.<init> Soft AutoCommit: disabled
   [junit4]   2> 860195 T2571 oass.IndexSchema.readSchema unique key field: id
   [junit4]   2> 860198 T2601 oass.IndexSchema.readSchema unique key field: id
   [junit4]   2> 860199 T2626 oasc.SolrCore.registerSearcher [nodes_used_collection_shard2_replica2] Registered new searcher Searcher@13b749e main{StandardDirectoryReader(segments_1:1)}
   [junit4]   2> 860202 T2553 oasc.CoreContainer.registerCore registering core: nodes_used_collection_shard2_replica2
   [junit4]   2> 860202 T2553 oasc.ZkController.register Register replica - core:nodes_used_collection_shard2_replica2 address:http://127.0.0.1:50370 collection:nodes_used_collection shard:shard2
   [junit4]   2> 860203 T2553 oascsi.HttpClientUtil.createClient Creating new http client, config:maxConnections=10000&maxConnectionsPerHost=20&connTimeout=15000&socketTimeout=30000&retry=false
   [junit4]   2> 860206 T2571 oass.FileExchangeRateProvider.reload Reloading exchange rates from file currency.xml
   [junit4]   2> 860208 T2601 oass.FileExchangeRateProvider.reload Reloading exchange rates from file currency.xml
   [junit4]   2> 860212 T2571 oass.FileExchangeRateProvider.reload Reloading exchange rates from file currency.xml
   [junit4]   2> 860212 T2601 oass.FileExchangeRateProvider.reload Reloading exchange rates from file currency.xml
   [junit4]   2> 860215 T2601 oass.OpenExchangeRatesOrgProvider.reload Reloading exchange rates from open-exchange-rates.json
   [junit4]   2> 860215 T2571 oass.OpenExchangeRatesOrgProvider.reload Reloading exchange rates from open-exchange-rates.json
   [junit4]   2> 860216 T2601 oass.OpenExchangeRatesOrgProvider$OpenExchangeRates.<init> WARN Unknown key IMPORTANT NOTE
   [junit4]   2> 860216 T2601 oass.OpenExchangeRatesOrgProvider$OpenExchangeRates.<init> WARN Expected key, got STRING
   [junit4]   2> 860216 T2571 oass.OpenExchangeRatesOrgProvider$OpenExchangeRates.<init> WARN Unknown key IMPORTANT NOTE
   [junit4]   2> 860217 T2571 oass.OpenExchangeRatesOrgProvider$OpenExchangeRates.<init> WARN Expected key, got STRING
   [junit4]   2> 860217 T2601 oass.OpenExchangeRatesOrgProvider.reload Reloading exchange rates from open-exchange-rates.json
   [junit4]   2> 860217 T2571 oass.OpenExchangeRatesOrgProvider.reload Reloading exchange rates from open-exchange-rates.json
   [junit4]   2> 860218 T2601 oass.OpenExchangeRatesOrgProvider$OpenExchangeRates.<init> WARN Unknown key IMPORTANT NOTE
   [junit4]   2> 860218 T2571 oass.OpenExchangeRatesOrgProvider$OpenExchangeRates.<init> WARN Unknown key IMPORTANT NOTE
   [junit4]   2> 860219 T2571 oass.OpenExchangeRatesOrgProvider$OpenExchangeRates.<init> WARN Expected key, got STRING
   [junit4]   2> 860218 T2601 oass.OpenExchangeRatesOrgProvider$OpenExchangeRates.<init> WARN Expected key, got STRING
   [junit4]   2> 860219 T2571 oasc.SolrCore.initDirectoryFactory org.apache.solr.core.MockDirectoryFactory
   [junit4]   2> 860219 T2601 oasc.SolrCore.initDirectoryFactory org.apache.solr.core.MockDirectoryFactory
   [junit4]   2> 860220 T2571 oasc.SolrCore.<init> [nodes_used_collection_shard1_replica1] Opening new SolrCore at /mnt/ssd/jenkins/workspace/Lucene-Solr-trunk-Linux/solr/build/solr-core/test/J1/./org.apache.solr.cloud.CollectionsAPIDistributedZkTest-jetty1-1375361093294/nodes_used_collection_shard1_replica1/, dataDir=/mnt/ssd/jenkins/workspace/Lucene-Solr-trunk-Linux/solr/build/solr-core/test/J1/./org.apache.solr.cloud.CollectionsAPIDistributedZkTest-jetty1-1375361093294//nodes_used_collection_shard1_replica1/data/
   [junit4]   2> 860220 T2601 oasc.SolrCore.<init> [nodes_used_collection_shard1_replica2] Opening new SolrCore at /mnt/ssd/jenkins/workspace/Lucene-Solr-trunk-Linux/solr/build/solr-core/test/J1/./org.apache.solr.cloud.CollectionsAPIDistributedZkTest-jetty3-1375361095731/nodes_used_collection_shard1_replica2/, dataDir=/mnt/ssd/jenkins/workspace/Lucene-Solr-trunk-Linux/solr/build/solr-core/test/J1/./org.apache.solr.cloud.CollectionsAPIDistributedZkTest-jetty3-1375361095731//nodes_used_collection_shard1_replica2/data/
   [junit4]   2> 860220 T2571 oasc.JmxMonitoredMap.<init> JMX monitoring is enabled. Adding Solr mbeans to JMX Server: com.sun.jmx.mbeanserver.JmxMBeanServer@102b0a7
   [junit4]   2> 860221 T2601 oasc.JmxMonitoredMap.<init> JMX monitoring is enabled. Adding Solr mbeans to JMX Server: com.sun.jmx.mbeanserver.JmxMBeanServer@102b0a7
   [junit4]   2> 860222 T2571 oasc.CachingDirectoryFactory.get return new directory for /mnt/ssd/jenkins/workspace/Lucene-Solr-trunk-Linux/solr/build/solr-core/test/J1/./org.apache.solr.cloud.CollectionsAPIDistributedZkTest-jetty1-1375361093294//nodes_used_collection_shard1_replica1/data
   [junit4]   2> 860222 T2601 oasc.CachingDirectoryFactory.get return new directory for /mnt/ssd/jenkins/workspace/Lucene-Solr-trunk-Linux/solr/build/solr-core/test/J1/./org.apache.solr.cloud.CollectionsAPIDistributedZkTest-jetty3-1375361095731//nodes_used_collection_shard1_replica2/data
   [junit4]   2> 860222 T2571 oasc.SolrCore.getNewIndexDir New index directory detected: old=null new=/mnt/ssd/jenkins/workspace/Lucene-Solr-trunk-Linux/solr/build/solr-core/test/J1/./org.apache.solr.cloud.CollectionsAPIDistributedZkTest-jetty1-1375361093294//nodes_used_collection_shard1_replica1/data/index/
   [junit4]   2> 860222 T2601 oasc.SolrCore.getNewIndexDir New index directory detected: old=null new=/mnt/ssd/jenkins/workspace/Lucene-Solr-trunk-Linux/solr/build/solr-core/test/J1/./org.apache.solr.cloud.CollectionsAPIDistributedZkTest-jetty3-1375361095731//nodes_used_collection_shard1_replica2/data/index/
   [junit4]   2> 860223 T2571 oasc.SolrCore.initIndex WARN [nodes_used_collection_shard1_replica1] Solr index directory '/mnt/ssd/jenkins/workspace/Lucene-Solr-trunk-Linux/solr/build/solr-core/test/J1/./org.apache.solr.cloud.CollectionsAPIDistributedZkTest-jetty1-1375361093294/nodes_used_collection_shard1_replica1/data/index' doesn't exist. Creating new index...
   [junit4]   2> 860223 T2601 oasc.SolrCore.initIndex WARN [nodes_used_collection_shard1_replica2] Solr index directory '/mnt/ssd/jenkins/workspace/Lucene-Solr-trunk-Linux/solr/build/solr-core/test/J1/./org.apache.solr.cloud.CollectionsAPIDistributedZkTest-jetty3-1375361095731/nodes_used_collection_shard1_replica2/data/index' doesn't exist. Creating new index...
   [junit4]   2> 860223 T2571 oasc.CachingDirectoryFactory.get return new directory for /mnt/ssd/jenkins/workspace/Lucene-Solr-trunk-Linux/solr/build/solr-core/test/J1/./org.apache.solr.cloud.CollectionsAPIDistributedZkTest-jetty1-1375361093294//nodes_used_collection_shard1_replica1/data/index
   [junit4]   2> 860224 T2601 oasc.CachingDirectoryFactory.get return new directory for /mnt/ssd/jenkins/workspace/Lucene-Solr-trunk-Linux/solr/build/solr-core/test/J1/./org.apache.solr.cloud.CollectionsAPIDistributedZkTest-jetty3-1375361095731//nodes_used_collection_shard1_replica2/data/index
   [junit4]   2> 860225 T2571 oasc.SolrDeletionPolicy.onCommit SolrDeletionPolicy.onCommit: commits: num=1
   [junit4]   2> 		commit{dir=MockDirWrapper(org.apache.lucene.store.RAMDirectory@3f1931 lockFactory=org.apache.lucene.store.NativeFSLockFactory@46689e),segFN=segments_1,generation=1}
   [junit4]   2> 860225 T2601 oasc.SolrDeletionPolicy.onCommit SolrDeletionPolicy.onCommit: commits: num=1
   [junit4]   2> 		commit{dir=MockDirWrapper(org.apache.lucene.store.RAMDirectory@15c7e14 lockFactory=org.apache.lucene.store.NativeFSLockFactory@3d1e81),segFN=segments_1,generation=1}
   [junit4]   2> 860225 T2571 oasc.SolrDeletionPolicy.updateCommits newest commit generation = 1
   [junit4]   2> 860226 T2601 oasc.SolrDeletionPolicy.updateCommits newest commit generation = 1
   [junit4]   2> 860229 T2571 oasup.UpdateRequestProcessorChain.init inserting DistributedUpdateProcessorFactory into updateRequestProcessorChain "dedupe"
   [junit4]   2> 860229 T2571 oasup.UpdateRequestProcessorChain.init inserting DistributedUpdateProcessorFactory into updateRequestProcessorChain "stored_sig"
   [junit4]   2> 860230 T2571 oasup.UpdateRequestProcessorChain.init inserting DistributedUpdateProcessorFactory into updateRequestProcessorChain "distrib-dup-test-chain-implicit"
   [junit4]   2> 860230 T2571 oasc.RequestHandlers.initHandlersFromConfig created standard: solr.StandardRequestHandler
   [junit4]   2> 860231 T2601 oasup.UpdateRequestProcessorChain.init inserting DistributedUpdateProcessorFactory into updateRequestProcessorChain "dedupe"
   [junit4]   2> 860231 T2571 oasc.RequestHandlers.initHandlersFromConfig created /get: solr.RealTimeGetHandler
   [junit4]   2> 860232 T2571 oasc.RequestHandlers.initHandlersFromConfig adding lazy requestHandler: solr.ReplicationHandler
   [junit4]   2> 860231 T2601 oasup.UpdateRequestProcessorChain.init inserting DistributedUpdateProcessorFactory into updateRequestProcessorChain "stored_sig"
   [junit4]   2> 860232 T2571 oasc.RequestHandlers.initHandlersFromConfig created /replication: solr.ReplicationHandler
   [junit4]   2> 860233 T2601 oasup.UpdateRequestProcessorChain.init inserting DistributedUpdateProcessorFactory into updateRequestProcessorChain "distrib-dup-test-chain-implicit"
   [junit4]   2> 860233 T2571 oasc.RequestHandlers.initHandlersFromConfig created /update: solr.UpdateRequestHandler
   [junit4]   2> 860234 T2571 oasc.RequestHandlers.initHandlersFromConfig created /admin/: org.apache.solr.handler.admin.AdminHandlers
   [junit4]   2> 860234 T2601 oasc.RequestHandlers.initHandlersFromConfig created standard: solr.StandardRequestHandler
   [junit4]   2> 860235 T2601 oasc.RequestHandlers.initHandlersFromConfig created /get: solr.RealTimeGetHandler
   [junit4]   2> 860235 T2601 oasc.RequestHandlers.initHandlersFromConfig adding lazy requestHandler: solr.ReplicationHandler
   [junit4]   2> 860236 T2601 oasc.RequestHandlers.initHandlersFromConfig created /replication: solr.ReplicationHandler
   [junit4]   2> 860236 T2571 oashl.XMLLoader.init xsltCacheLifetimeSeconds=60
   [junit4]   2> 860237 T2601 oasc.RequestHandlers.initHandlersFromConfig created /update: solr.UpdateRequestHandler
   [junit4]   2> 860237 T2601 oasc.RequestHandlers.initHandlersFromConfig created /admin/: org.apache.solr.handler.admin.AdminHandlers
   [junit4]   2> 860239 T2601 oashl.XMLLoader.init xsltCacheLifetimeSeconds=60
   [junit4]   2> 860239 T2571 oass.SolrIndexSearcher.<init> Opening Searcher@ab54dd main
   [junit4]   2> 860240 T2571 oasu.CommitTracker.<init> Hard AutoCommit: disabled
   [junit4]   2> 860240 T2571 oasu.CommitTracker.<init> Soft AutoCommit: disabled
   [junit4]   2> 860241 T2601 oass.SolrIndexSearcher.<init> Opening Searcher@1437c7f main
   [junit4]   2> 860242 T2601 oasu.CommitTracker.<init> Hard AutoCommit: disabled
   [junit4]   2> 860242 T2601 oasu.CommitTracker.<init> Soft AutoCommit: disabled
   [junit4]   2> 860248 T2628 oasc.SolrCore.registerSearcher [nodes_used_collection_shard1_replica2] Registered new searcher Searcher@1437c7f main{StandardDirectoryReader(segments_1:1)}
   [junit4]   2> 860248 T2627 oasc.SolrCore.registerSearcher [nodes_used_collection_shard1_replica1] Registered new searcher Searcher@ab54dd main{StandardDirectoryReader(segments_1:1)}
   [junit4]   2> 860250 T2571 oasc.CoreContainer.registerCore registering core: nodes_used_collection_shard1_replica1
   [junit4]   2> 860250 T2571 oasc.ZkController.register Register replica - core:nodes_used_collection_shard1_replica1 address:http://127.0.0.1:50992 collection:nodes_used_collection shard:shard1
   [junit4]   2> 860250 T2601 oasc.CoreContainer.registerCore registering core: nodes_used_collection_shard1_replica2
   [junit4]   2> 860251 T2571 oascsi.HttpClientUtil.createClient Creating new http client, config:maxConnections=10000&maxConnectionsPerHost=20&connTimeout=15000&socketTimeout=30000&retry=false
   [junit4]   2> 860251 T2601 oasc.ZkController.register Register replica - core:nodes_used_collection_shard1_replica2 address:http://127.0.0.1:37651 collection:nodes_used_collection shard:shard1
   [junit4]   2> 860251 T2601 oascsi.HttpClientUtil.createClient Creating new http client, config:maxConnections=10000&maxConnectionsPerHost=20&connTimeout=15000&socketTimeout=30000&retry=false
   [junit4]   2> 860254 T2571 oascc.SolrZkClient.makePath makePath: /collections/nodes_used_collection/leader_elect/shard1/election
   [junit4]   2> 860255 T2601 oascc.SolrZkClient.makePath makePath: /collections/nodes_used_collection/leader_elect/shard1/election
   [junit4]   2> 860260 T2601 oasc.ShardLeaderElectionContext.runLeaderProcess Running the leader process for shard shard1
   [junit4]   2> 860262 T2601 oasc.ShardLeaderElectionContext.waitForReplicasToComeUp Enough replicas found to continue.
   [junit4]   2> 860262 T2601 oasc.ShardLeaderElectionContext.runLeaderProcess I may be the new leader - try and sync
   [junit4]   2> 860262 T2601 oasc.SyncStrategy.sync Sync replicas to http://127.0.0.1:37651/nodes_used_collection_shard1_replica2/
   [junit4]   2> 860262 T2601 oasu.PeerSync.sync PeerSync: core=nodes_used_collection_shard1_replica2 url=http://127.0.0.1:37651 START replicas=[http://127.0.0.1:50992/nodes_used_collection_shard1_replica1/] nUpdates=100
   [junit4]   2> 860263 T2601 oasu.PeerSync.sync PeerSync: core=nodes_used_collection_shard1_replica2 url=http://127.0.0.1:37651 DONE.  We have no versions.  sync failed.
   [junit4]   2> 860263 T2601 oasc.SyncStrategy.syncReplicas Leader's attempt to sync with shard failed, moving to the next candidate
   [junit4]   2> 860263 T2601 oasc.ShardLeaderElectionContext.runLeaderProcess We failed sync, but we have no versions - we can't sync in that case - we were active before, so become leader anyway
   [junit4]   2> 860264 T2601 oasc.ShardLeaderElectionContext.runLeaderProcess I am the new leader: http://127.0.0.1:37651/nodes_used_collection_shard1_replica2/ shard1
   [junit4]   2> 860264 T2601 oascc.SolrZkClient.makePath makePath: /collections/nodes_used_collection/leaders/shard1
   [junit4]   2> ASYNC  NEW_CORE C2312 name=nodes_used_collection_shard1_replica1 org.apache.solr.core.SolrCore@1b302bb url=http://127.0.0.1:50992/nodes_used_collection_shard1_replica1 node=127.0.0.1:50992_ C2312_STATE=coll:nodes_used_collection core:nodes_used_collection_shard1_replica1 props:{state=down, core=nodes_used_collection_shard1_replica1, node_name=127.0.0.1:50992_, base_url=http://127.0.0.1:50992}
   [junit4]   2> 860269 T2570 C2312 P50992 oasc.SolrCore.execute [nodes_used_collection_shard1_replica1] webapp= path=/get params={getVersions=100&distrib=false&wt=javabin&qt=/get&version=2} status=0 QTime=1 
   [junit4]   2> 860672 T2585 oasc.ShardLeaderElectionContext.waitForReplicasToComeUp Enough replicas found to continue.
   [junit4]   2> 860672 T2585 oasc.ShardLeaderElectionContext.runLeaderProcess I may be the new leader - try and sync
   [junit4]   2> 860672 T2585 oasc.SyncStrategy.sync Sync replicas to http://127.0.0.1:45911/nodes_used_collection_shard2_replica1/
   [junit4]   2> 860673 T2585 oasu.PeerSync.sync PeerSync: core=nodes_used_collection_shard2_replica1 url=http://127.0.0.1:45911 START replicas=[http://127.0.0.1:50370/nodes_used_collection_shard2_replica2/] nUpdates=100
   [junit4]   2> 860674 T2585 oasu.PeerSync.sync PeerSync: core=nodes_used_collection_shard2_replica1 url=http://127.0.0.1:45911 DONE.  We have no versions.  sync failed.
   [junit4]   2> 860674 T2585 oasc.SyncStrategy.syncReplicas Leader's attempt to sync with shard failed, moving to the next candidate
   [junit4]   2> 860674 T2585 oasc.ShardLeaderElectionContext.runLeaderProcess We failed sync, but we have no versions - we can't sync in that case - we were active before, so become leader anyway
   [junit4]   2> 860675 T2585 oasc.ShardLeaderElectionContext.runLeaderProcess I am the new leader: http://127.0.0.1:45911/nodes_used_collection_shard2_replica1/ shard2
   [junit4]   2> 860675 T2585 oascc.SolrZkClient.makePath makePath: /collections/nodes_used_collection/leaders/shard2
   [junit4]   2> ASYNC  NEW_CORE C2313 name=nodes_used_collection_shard2_replica2 org.apache.solr.core.SolrCore@1e76bdf url=http://127.0.0.1:50370/nodes_used_collection_shard2_replica2 node=127.0.0.1:50370_ C2313_STATE=coll:nodes_used_collection core:nodes_used_collection_shard2_replica2 props:{state=down, core=nodes_used_collection_shard2_replica2, node_name=127.0.0.1:50370_, base_url=http://127.0.0.1:50370}
   [junit4]   2> 860679 T2555 C2313 P50370 oasc.SolrCore.execute [nodes_used_collection_shard2_replica2] webapp= path=/get params={getVersio

[...truncated too long message...]

ace/Lucene-Solr-trunk-Linux/solr/build/solr-core/test/J1/./org.apache.solr.cloud.CollectionsAPIDistributedZkTest-jetty4-1375361096942//new_implicit_coll_1_c_replica3/data
   [junit4]   2> 981206 T3018 oasc.Overseer$ClusterStateUpdater.amILeader According to ZK I (id=90135664554737676-127.0.0.1:57527_-n_0000000004) am no longer a leader.
   [junit4]   2> 981230 T2537 oejsh.ContextHandler.doStop stopped o.e.j.s.ServletContextHandler{/,null}
   [junit4]   2> 981283 T2537 oas.SolrTestCaseJ4.tearDown ###Ending testDistribSearch
   [junit4]   2> 981285 T2537 oasc.ZkTestServer.send4LetterWord connecting to 127.0.0.1:46367 46367
   [junit4]   1> client port:0.0.0.0/0.0.0.0:0
   [junit4]   2> NOTE: reproduce with: ant test  -Dtestcase=CollectionsAPIDistributedZkTest -Dtests.method=testDistribSearch -Dtests.seed=6B893AFB328AD36C -Dtests.multiplier=3 -Dtests.slow=true -Dtests.locale=ca -Dtests.timezone=America/Indianapolis -Dtests.file.encoding=UTF-8
   [junit4] ERROR    131s J1 | CollectionsAPIDistributedZkTest.testDistribSearch <<<
   [junit4]    > Throwable #1: org.apache.solr.client.solrj.SolrServerException: Server refused connection at: http://127.0.0.1:45911
   [junit4]    > 	at __randomizedtesting.SeedInfo.seed([6B893AFB328AD36C:EA6FB4E345D5B350]:0)
   [junit4]    > 	at org.apache.solr.client.solrj.impl.HttpSolrServer.request(HttpSolrServer.java:428)
   [junit4]    > 	at org.apache.solr.client.solrj.impl.HttpSolrServer.request(HttpSolrServer.java:180)
   [junit4]    > 	at org.apache.solr.cloud.AbstractFullDistribZkTestBase.createCollection(AbstractFullDistribZkTestBase.java:1535)
   [junit4]    > 	at org.apache.solr.cloud.CollectionsAPIDistributedZkTest.testCustomCollectionsAPI(CollectionsAPIDistributedZkTest.java:677)
   [junit4]    > 	at org.apache.solr.cloud.CollectionsAPIDistributedZkTest.doTest(CollectionsAPIDistributedZkTest.java:159)
   [junit4]    > 	at org.apache.solr.BaseDistributedSearchTestCase.testDistribSearch(BaseDistributedSearchTestCase.java:835)
   [junit4]    > 	at java.lang.Thread.run(Thread.java:724)
   [junit4]    > Caused by: org.apache.http.conn.HttpHostConnectException: Connection to http://127.0.0.1:45911 refused
   [junit4]    > 	at org.apache.http.impl.conn.DefaultClientConnectionOperator.openConnection(DefaultClientConnectionOperator.java:190)
   [junit4]    > 	at org.apache.http.impl.conn.ManagedClientConnectionImpl.open(ManagedClientConnectionImpl.java:294)
   [junit4]    > 	at org.apache.http.impl.client.DefaultRequestDirector.tryConnect(DefaultRequestDirector.java:645)
   [junit4]    > 	at org.apache.http.impl.client.DefaultRequestDirector.execute(DefaultRequestDirector.java:480)
   [junit4]    > 	at org.apache.http.impl.client.AbstractHttpClient.execute(AbstractHttpClient.java:906)
   [junit4]    > 	at org.apache.http.impl.client.AbstractHttpClient.execute(AbstractHttpClient.java:805)
   [junit4]    > 	at org.apache.http.impl.client.AbstractHttpClient.execute(AbstractHttpClient.java:784)
   [junit4]    > 	at org.apache.solr.client.solrj.impl.HttpSolrServer.request(HttpSolrServer.java:365)
   [junit4]    > 	... 45 more
   [junit4]    > Caused by: java.net.ConnectException: Connection refused
   [junit4]    > 	at java.net.PlainSocketImpl.socketConnect(Native Method)
   [junit4]    > 	at java.net.AbstractPlainSocketImpl.doConnect(AbstractPlainSocketImpl.java:339)
   [junit4]    > 	at java.net.AbstractPlainSocketImpl.connectToAddress(AbstractPlainSocketImpl.java:200)
   [junit4]    > 	at java.net.AbstractPlainSocketImpl.connect(AbstractPlainSocketImpl.java:182)
   [junit4]    > 	at java.net.SocksSocketImpl.connect(SocksSocketImpl.java:392)
   [junit4]    > 	at java.net.Socket.connect(Socket.java:579)
   [junit4]    > 	at org.apache.http.conn.scheme.PlainSocketFactory.connectSocket(PlainSocketFactory.java:127)
   [junit4]    > 	at org.apache.http.impl.conn.DefaultClientConnectionOperator.openConnection(DefaultClientConnectionOperator.java:180)
   [junit4]    > 	... 52 more
   [junit4]   2> 981309 T2537 oas.SolrTestCaseJ4.deleteCore ###deleteCore
   [junit4]   2> 131059 T2536 ccr.ThreadLeakControl.checkThreadLeaks WARNING Will linger awaiting termination of 2 leaked thread(s).
   [junit4]   2> 982507 T2619 oasc.LeaderElector$1.process WARN  org.apache.zookeeper.KeeperException$SessionExpiredException: KeeperErrorCode = Session expired for /collections/new_implicit_coll_1/leader_elect/b/election
   [junit4]   2> 	at org.apache.zookeeper.KeeperException.create(KeeperException.java:127)
   [junit4]   2> 	at org.apache.zookeeper.KeeperException.create(KeeperException.java:51)
   [junit4]   2> 	at org.apache.zookeeper.ZooKeeper.getChildren(ZooKeeper.java:1468)
   [junit4]   2> 	at org.apache.solr.common.cloud.SolrZkClient$6.execute(SolrZkClient.java:235)
   [junit4]   2> 	at org.apache.solr.common.cloud.SolrZkClient$6.execute(SolrZkClient.java:232)
   [junit4]   2> 	at org.apache.solr.common.cloud.ZkCmdExecutor.retryOperation(ZkCmdExecutor.java:65)
   [junit4]   2> 	at org.apache.solr.common.cloud.SolrZkClient.getChildren(SolrZkClient.java:232)
   [junit4]   2> 	at org.apache.solr.cloud.LeaderElector.checkIfIamLeader(LeaderElector.java:84)
   [junit4]   2> 	at org.apache.solr.cloud.LeaderElector.access$000(LeaderElector.java:55)
   [junit4]   2> 	at org.apache.solr.cloud.LeaderElector$1.process(LeaderElector.java:129)
   [junit4]   2> 	at org.apache.zookeeper.ClientCnxn$EventThread.processEvent(ClientCnxn.java:519)
   [junit4]   2> 	at org.apache.zookeeper.ClientCnxn$EventThread.run(ClientCnxn.java:495)
   [junit4]   2> 
   [junit4]   2> 982508 T2619 oascc.ZkStateReader$2.process A cluster state change: WatchedEvent state:SyncConnected type:NodeChildrenChanged path:/live_nodes, has occurred - updating... (live nodes size: 1)
   [junit4]   2> 982508 T2619 oascc.ZkStateReader$2.process WARN ZooKeeper watch triggered, but Solr cannot talk to ZK
   [junit4]   2> 982508 T2619 oascc.ZkStateReader$3.process WARN ZooKeeper watch triggered, but Solr cannot talk to ZK
   [junit4]   2> NOTE: test params are: codec=Lucene42: {timestamp=PostingsFormat(name=MockRandom), range_facet_l=PostingsFormat(name=MockRandom), id=MockFixedIntBlock(blockSize=1829), range_facet_sl=PostingsFormat(name=NestedPulsing), a_t=PostingsFormat(name=MockRandom), text=PostingsFormat(name=NestedPulsing), range_facet_si=Pulsing41(freqCutoff=3 minBlockSize=8 maxBlockSize=96), _version_=PostingsFormat(name=MockRandom), other_tl1=PostingsFormat(name=MockRandom), multiDefault=Pulsing41(freqCutoff=3 minBlockSize=8 maxBlockSize=96), a_si=Pulsing41(freqCutoff=3 minBlockSize=8 maxBlockSize=96), intDefault=PostingsFormat(name=MockRandom)}, docValues:{timestamp=DocValuesFormat(name=Lucene42)}, sim=DefaultSimilarity, locale=ca, timezone=America/Indianapolis
   [junit4]   2> NOTE: Linux 3.2.0-51-generic i386/Oracle Corporation 1.7.0_25 (32-bit)/cpus=8,threads=2,free=63458440,total=204156928
   [junit4]   2> NOTE: All tests run in this JVM: [TestReload, HdfsUnloadDistributedZkTest, TestAddFieldRealTimeGet, URLClassifyProcessorTest, TestRecovery, TestClassNameShortening, BasicZkTest, TestCopyFieldCollectionResource, BasicDistributedZk2Test, TestMergePolicyConfig, BlockCacheTest, TestCSVLoader, LeaderElectionIntegrationTest, StatsComponentTest, OutputWriterTest, TestFastOutputStream, TestRandomFaceting, TestUpdate, TermVectorComponentDistributedTest, DisMaxRequestHandlerTest, TestHashPartitioner, SpellCheckCollatorTest, TestComponentsName, DefaultValueUpdateProcessorTest, DocumentAnalysisRequestHandlerTest, SortByFunctionTest, RequiredFieldsTest, ShardRoutingCustomTest, TestJmxIntegration, SimplePostToolTest, TestSolrXMLSerializer, UniqFieldsUpdateProcessorFactoryTest, TestCollationField, TestQueryTypes, SolrRequestParserTest, ConvertedLegacyTest, FullSolrCloudDistribCmdsTest, TestElisionMultitermQuery, DirectSolrSpellCheckerTest, TestZkChroot, TestSuggestSpellingConverter, SolrCmdDistributorTest, BadCopyFieldTest, TestBM25SimilarityFactory, DeleteShardTest, HdfsCollectionsAPIDistributedZkTest, SolrCoreCheckLockOnStartupTest, TestSystemIdResolver, CoreAdminCreateDiscoverTest, TestManagedSchemaFieldResource, ZkSolrClientTest, UpdateParamsTest, EchoParamsTest, NoCacheHeaderTest, TestUniqueKeyFieldResource, TestPartialUpdateDeduplication, TestInfoStreamLogging, DebugComponentTest, TimeZoneUtilsTest, SolrIndexConfigTest, DocValuesMultiTest, XmlUpdateRequestHandlerTest, TestLuceneMatchVersion, TestSchemaResource, TestLazyCores, TestMultiCoreConfBootstrap, TestSolrJ, TestStressLucene, TestCodecSupport, SuggesterWFSTTest, DateMathParserTest, NumericFieldsTest, ShardSplitTest, TestDistributedSearch, TestPropInject, ChaosMonkeySafeLeaderTest, CollectionsAPIDistributedZkTest]
   [junit4] Completed on J1 in 132.35s, 1 test, 1 error <<< FAILURES!

[...truncated 536 lines...]
BUILD FAILED
/mnt/ssd/jenkins/workspace/Lucene-Solr-trunk-Linux/build.xml:389: The following error occurred while executing this line:
/mnt/ssd/jenkins/workspace/Lucene-Solr-trunk-Linux/build.xml:369: The following error occurred while executing this line:
/mnt/ssd/jenkins/workspace/Lucene-Solr-trunk-Linux/build.xml:39: The following error occurred while executing this line:
/mnt/ssd/jenkins/workspace/Lucene-Solr-trunk-Linux/solr/build.xml:181: The following error occurred while executing this line:
/mnt/ssd/jenkins/workspace/Lucene-Solr-trunk-Linux/solr/common-build.xml:449: The following error occurred while executing this line:
/mnt/ssd/jenkins/workspace/Lucene-Solr-trunk-Linux/lucene/common-build.xml:1230: The following error occurred while executing this line:
/mnt/ssd/jenkins/workspace/Lucene-Solr-trunk-Linux/lucene/common-build.xml:873: There were test failures: 320 suites, 1345 tests, 1 error, 34 ignored (6 assumptions)

Total time: 40 minutes 33 seconds
Build step 'Invoke Ant' marked build as failure
Description set: Java: 32bit/jdk1.7.0_25 -client -XX:+UseSerialGC
Archiving artifacts
Recording test results
Email was triggered for: Failure
Sending email for trigger: Failure



Mime
View raw message