lucene-dev mailing list archives

Site index · List index
Message view « Date » · « Thread »
Top « Date » · « Thread »
From Policeman Jenkins Server <jenk...@thetaphi.de>
Subject [JENKINS] Lucene-Solr-4.x-Linux (64bit/jdk1.7.0_25) - Build # 6780 - Failure!
Date Sat, 03 Aug 2013 09:49:00 GMT
Build: http://jenkins.thetaphi.de/job/Lucene-Solr-4.x-Linux/6780/
Java: 64bit/jdk1.7.0_25 -XX:-UseCompressedOops -XX:+UseSerialGC

1 tests failed.
FAILED:  org.apache.solr.cloud.CollectionsAPIDistributedZkTest.testDistribSearch

Error Message:
Server refused connection at: http://127.0.0.1:54833

Stack Trace:
org.apache.solr.client.solrj.SolrServerException: Server refused connection at: http://127.0.0.1:54833
	at __randomizedtesting.SeedInfo.seed([2A8B4DEFBEEA59F4:AB6DC3F7C9B539C8]:0)
	at org.apache.solr.client.solrj.impl.HttpSolrServer.request(HttpSolrServer.java:428)
	at org.apache.solr.client.solrj.impl.HttpSolrServer.request(HttpSolrServer.java:180)
	at org.apache.solr.cloud.CollectionsAPIDistributedZkTest.testCustomCollectionsAPI(CollectionsAPIDistributedZkTest.java:764)
	at org.apache.solr.cloud.CollectionsAPIDistributedZkTest.doTest(CollectionsAPIDistributedZkTest.java:159)
	at org.apache.solr.BaseDistributedSearchTestCase.testDistribSearch(BaseDistributedSearchTestCase.java:835)
	at sun.reflect.NativeMethodAccessorImpl.invoke0(Native Method)
	at sun.reflect.NativeMethodAccessorImpl.invoke(NativeMethodAccessorImpl.java:57)
	at sun.reflect.DelegatingMethodAccessorImpl.invoke(DelegatingMethodAccessorImpl.java:43)
	at java.lang.reflect.Method.invoke(Method.java:606)
	at com.carrotsearch.randomizedtesting.RandomizedRunner.invoke(RandomizedRunner.java:1559)
	at com.carrotsearch.randomizedtesting.RandomizedRunner.access$600(RandomizedRunner.java:79)
	at com.carrotsearch.randomizedtesting.RandomizedRunner$6.evaluate(RandomizedRunner.java:737)
	at com.carrotsearch.randomizedtesting.RandomizedRunner$7.evaluate(RandomizedRunner.java:773)
	at com.carrotsearch.randomizedtesting.RandomizedRunner$8.evaluate(RandomizedRunner.java:787)
	at com.carrotsearch.randomizedtesting.rules.SystemPropertiesRestoreRule$1.evaluate(SystemPropertiesRestoreRule.java:53)
	at org.apache.lucene.util.TestRuleSetupTeardownChained$1.evaluate(TestRuleSetupTeardownChained.java:50)
	at org.apache.lucene.util.TestRuleFieldCacheSanity$1.evaluate(TestRuleFieldCacheSanity.java:51)
	at org.apache.lucene.util.AbstractBeforeAfterRule$1.evaluate(AbstractBeforeAfterRule.java:46)
	at com.carrotsearch.randomizedtesting.rules.SystemPropertiesInvariantRule$1.evaluate(SystemPropertiesInvariantRule.java:55)
	at org.apache.lucene.util.TestRuleThreadAndTestName$1.evaluate(TestRuleThreadAndTestName.java:49)
	at org.apache.lucene.util.TestRuleIgnoreAfterMaxFailures$1.evaluate(TestRuleIgnoreAfterMaxFailures.java:70)
	at org.apache.lucene.util.TestRuleMarkFailure$1.evaluate(TestRuleMarkFailure.java:48)
	at com.carrotsearch.randomizedtesting.rules.StatementAdapter.evaluate(StatementAdapter.java:36)
	at com.carrotsearch.randomizedtesting.ThreadLeakControl$StatementRunner.run(ThreadLeakControl.java:358)
	at com.carrotsearch.randomizedtesting.ThreadLeakControl.forkTimeoutingTask(ThreadLeakControl.java:782)
	at com.carrotsearch.randomizedtesting.ThreadLeakControl$3.evaluate(ThreadLeakControl.java:442)
	at com.carrotsearch.randomizedtesting.RandomizedRunner.runSingleTest(RandomizedRunner.java:746)
	at com.carrotsearch.randomizedtesting.RandomizedRunner$3.evaluate(RandomizedRunner.java:648)
	at com.carrotsearch.randomizedtesting.RandomizedRunner$4.evaluate(RandomizedRunner.java:682)
	at com.carrotsearch.randomizedtesting.RandomizedRunner$5.evaluate(RandomizedRunner.java:693)
	at com.carrotsearch.randomizedtesting.rules.StatementAdapter.evaluate(StatementAdapter.java:36)
	at com.carrotsearch.randomizedtesting.rules.SystemPropertiesRestoreRule$1.evaluate(SystemPropertiesRestoreRule.java:53)
	at org.apache.lucene.util.AbstractBeforeAfterRule$1.evaluate(AbstractBeforeAfterRule.java:46)
	at org.apache.lucene.util.TestRuleStoreClassName$1.evaluate(TestRuleStoreClassName.java:42)
	at com.carrotsearch.randomizedtesting.rules.SystemPropertiesInvariantRule$1.evaluate(SystemPropertiesInvariantRule.java:55)
	at com.carrotsearch.randomizedtesting.rules.NoShadowingOrOverridesOnMethodsRule$1.evaluate(NoShadowingOrOverridesOnMethodsRule.java:39)
	at com.carrotsearch.randomizedtesting.rules.NoShadowingOrOverridesOnMethodsRule$1.evaluate(NoShadowingOrOverridesOnMethodsRule.java:39)
	at com.carrotsearch.randomizedtesting.rules.StatementAdapter.evaluate(StatementAdapter.java:36)
	at org.apache.lucene.util.TestRuleAssertionsRequired$1.evaluate(TestRuleAssertionsRequired.java:43)
	at org.apache.lucene.util.TestRuleMarkFailure$1.evaluate(TestRuleMarkFailure.java:48)
	at org.apache.lucene.util.TestRuleIgnoreAfterMaxFailures$1.evaluate(TestRuleIgnoreAfterMaxFailures.java:70)
	at org.apache.lucene.util.TestRuleIgnoreTestSuites$1.evaluate(TestRuleIgnoreTestSuites.java:55)
	at com.carrotsearch.randomizedtesting.rules.StatementAdapter.evaluate(StatementAdapter.java:36)
	at com.carrotsearch.randomizedtesting.ThreadLeakControl$StatementRunner.run(ThreadLeakControl.java:358)
	at java.lang.Thread.run(Thread.java:724)
Caused by: org.apache.http.conn.HttpHostConnectException: Connection to http://127.0.0.1:54833 refused
	at org.apache.http.impl.conn.DefaultClientConnectionOperator.openConnection(DefaultClientConnectionOperator.java:190)
	at org.apache.http.impl.conn.ManagedClientConnectionImpl.open(ManagedClientConnectionImpl.java:294)
	at org.apache.http.impl.client.DefaultRequestDirector.tryConnect(DefaultRequestDirector.java:645)
	at org.apache.http.impl.client.DefaultRequestDirector.execute(DefaultRequestDirector.java:480)
	at org.apache.http.impl.client.AbstractHttpClient.execute(AbstractHttpClient.java:906)
	at org.apache.http.impl.client.AbstractHttpClient.execute(AbstractHttpClient.java:805)
	at org.apache.http.impl.client.AbstractHttpClient.execute(AbstractHttpClient.java:784)
	at org.apache.solr.client.solrj.impl.HttpSolrServer.request(HttpSolrServer.java:365)
	... 44 more
Caused by: java.net.ConnectException: Connection refused
	at java.net.PlainSocketImpl.socketConnect(Native Method)
	at java.net.AbstractPlainSocketImpl.doConnect(AbstractPlainSocketImpl.java:339)
	at java.net.AbstractPlainSocketImpl.connectToAddress(AbstractPlainSocketImpl.java:200)
	at java.net.AbstractPlainSocketImpl.connect(AbstractPlainSocketImpl.java:182)
	at java.net.SocksSocketImpl.connect(SocksSocketImpl.java:392)
	at java.net.Socket.connect(Socket.java:579)
	at org.apache.http.conn.scheme.PlainSocketFactory.connectSocket(PlainSocketFactory.java:127)
	at org.apache.http.impl.conn.DefaultClientConnectionOperator.openConnection(DefaultClientConnectionOperator.java:180)
	... 51 more




Build Log:
[...truncated 9953 lines...]
   [junit4] Suite: org.apache.solr.cloud.CollectionsAPIDistributedZkTest
   [junit4]   2> 718298 T2203 oas.BaseDistributedSearchTestCase.initHostContext Setting hostContext system property: /
   [junit4]   2> 718305 T2203 oas.SolrTestCaseJ4.setUp ###Starting testDistribSearch
   [junit4]   2> Creating dataDir: /mnt/ssd/jenkins/workspace/Lucene-Solr-4.x-Linux/solr/build/solr-core/test/J1/./solrtest-CollectionsAPIDistributedZkTest-1375522690362
   [junit4]   2> 718306 T2203 oasc.ZkTestServer.run STARTING ZK TEST SERVER
   [junit4]   2> 718306 T2204 oasc.ZkTestServer$ZKServerMain.runFromConfig Starting server
   [junit4]   2> 718406 T2203 oasc.ZkTestServer.run start zk server on port:39965
   [junit4]   2> 718407 T2203 oascc.ConnectionManager.waitForConnected Waiting for client to connect to ZooKeeper
   [junit4]   2> 718635 T2210 oascc.ConnectionManager.process Watcher org.apache.solr.common.cloud.ConnectionManager@16554e9b name:ZooKeeperConnection Watcher:127.0.0.1:39965 got event WatchedEvent state:SyncConnected type:None path:null path:null type:None
   [junit4]   2> 718635 T2203 oascc.ConnectionManager.waitForConnected Client is connected to ZooKeeper
   [junit4]   2> 718635 T2203 oascc.SolrZkClient.makePath makePath: /solr
   [junit4]   2> 718639 T2203 oascc.ConnectionManager.waitForConnected Waiting for client to connect to ZooKeeper
   [junit4]   2> 718640 T2212 oascc.ConnectionManager.process Watcher org.apache.solr.common.cloud.ConnectionManager@47b7a6a2 name:ZooKeeperConnection Watcher:127.0.0.1:39965/solr got event WatchedEvent state:SyncConnected type:None path:null path:null type:None
   [junit4]   2> 718640 T2203 oascc.ConnectionManager.waitForConnected Client is connected to ZooKeeper
   [junit4]   2> 718641 T2203 oascc.SolrZkClient.makePath makePath: /collections/collection1
   [junit4]   2> 718643 T2203 oascc.SolrZkClient.makePath makePath: /collections/collection1/shards
   [junit4]   2> 718645 T2203 oascc.SolrZkClient.makePath makePath: /collections/control_collection
   [junit4]   2> 718646 T2203 oascc.SolrZkClient.makePath makePath: /collections/control_collection/shards
   [junit4]   2> 718648 T2203 oasc.AbstractZkTestCase.putConfig put /mnt/ssd/jenkins/workspace/Lucene-Solr-4.x-Linux/solr/build/solr-core/test-files/solr/collection1/conf/solrconfig-tlog.xml to /configs/conf1/solrconfig.xml
   [junit4]   2> 718649 T2203 oascc.SolrZkClient.makePath makePath: /configs/conf1/solrconfig.xml
   [junit4]   2> 718652 T2203 oasc.AbstractZkTestCase.putConfig put /mnt/ssd/jenkins/workspace/Lucene-Solr-4.x-Linux/solr/build/solr-core/test-files/solr/collection1/conf/schema.xml to /configs/conf1/schema.xml
   [junit4]   2> 718652 T2203 oascc.SolrZkClient.makePath makePath: /configs/conf1/schema.xml
   [junit4]   2> 718655 T2203 oasc.AbstractZkTestCase.putConfig put /mnt/ssd/jenkins/workspace/Lucene-Solr-4.x-Linux/solr/build/solr-core/test-files/solr/collection1/conf/stopwords.txt to /configs/conf1/stopwords.txt
   [junit4]   2> 718655 T2203 oascc.SolrZkClient.makePath makePath: /configs/conf1/stopwords.txt
   [junit4]   2> 718657 T2203 oasc.AbstractZkTestCase.putConfig put /mnt/ssd/jenkins/workspace/Lucene-Solr-4.x-Linux/solr/build/solr-core/test-files/solr/collection1/conf/protwords.txt to /configs/conf1/protwords.txt
   [junit4]   2> 718657 T2203 oascc.SolrZkClient.makePath makePath: /configs/conf1/protwords.txt
   [junit4]   2> 718659 T2203 oasc.AbstractZkTestCase.putConfig put /mnt/ssd/jenkins/workspace/Lucene-Solr-4.x-Linux/solr/build/solr-core/test-files/solr/collection1/conf/currency.xml to /configs/conf1/currency.xml
   [junit4]   2> 718659 T2203 oascc.SolrZkClient.makePath makePath: /configs/conf1/currency.xml
   [junit4]   2> 718661 T2203 oasc.AbstractZkTestCase.putConfig put /mnt/ssd/jenkins/workspace/Lucene-Solr-4.x-Linux/solr/build/solr-core/test-files/solr/collection1/conf/open-exchange-rates.json to /configs/conf1/open-exchange-rates.json
   [junit4]   2> 718661 T2203 oascc.SolrZkClient.makePath makePath: /configs/conf1/open-exchange-rates.json
   [junit4]   2> 718663 T2203 oasc.AbstractZkTestCase.putConfig put /mnt/ssd/jenkins/workspace/Lucene-Solr-4.x-Linux/solr/build/solr-core/test-files/solr/collection1/conf/mapping-ISOLatin1Accent.txt to /configs/conf1/mapping-ISOLatin1Accent.txt
   [junit4]   2> 718663 T2203 oascc.SolrZkClient.makePath makePath: /configs/conf1/mapping-ISOLatin1Accent.txt
   [junit4]   2> 718665 T2203 oasc.AbstractZkTestCase.putConfig put /mnt/ssd/jenkins/workspace/Lucene-Solr-4.x-Linux/solr/build/solr-core/test-files/solr/collection1/conf/old_synonyms.txt to /configs/conf1/old_synonyms.txt
   [junit4]   2> 718666 T2203 oascc.SolrZkClient.makePath makePath: /configs/conf1/old_synonyms.txt
   [junit4]   2> 718667 T2203 oasc.AbstractZkTestCase.putConfig put /mnt/ssd/jenkins/workspace/Lucene-Solr-4.x-Linux/solr/build/solr-core/test-files/solr/collection1/conf/synonyms.txt to /configs/conf1/synonyms.txt
   [junit4]   2> 718668 T2203 oascc.SolrZkClient.makePath makePath: /configs/conf1/synonyms.txt
   [junit4]   2> 718736 T2203 oejs.Server.doStart jetty-8.1.10.v20130312
   [junit4]   2> 718739 T2203 oejs.AbstractConnector.doStart Started SelectChannelConnector@127.0.0.1:33471
   [junit4]   2> 718739 T2203 oass.SolrDispatchFilter.init SolrDispatchFilter.init()
   [junit4]   2> 718740 T2203 oasc.SolrResourceLoader.locateSolrHome JNDI not configured for solr (NoInitialContextEx)
   [junit4]   2> 718740 T2203 oasc.SolrResourceLoader.locateSolrHome using system property solr.solr.home: /mnt/ssd/jenkins/workspace/Lucene-Solr-4.x-Linux/solr/build/solr-core/test/J1/./org.apache.solr.cloud.CollectionsAPIDistributedZkTest-controljetty-1375522690726
   [junit4]   2> 718740 T2203 oasc.SolrResourceLoader.<init> new SolrResourceLoader for directory: '/mnt/ssd/jenkins/workspace/Lucene-Solr-4.x-Linux/solr/build/solr-core/test/J1/./org.apache.solr.cloud.CollectionsAPIDistributedZkTest-controljetty-1375522690726/'
   [junit4]   2> 718750 T2203 oasc.ConfigSolr.fromFile Loading container configuration from /mnt/ssd/jenkins/workspace/Lucene-Solr-4.x-Linux/solr/build/solr-core/test/J1/./org.apache.solr.cloud.CollectionsAPIDistributedZkTest-controljetty-1375522690726/solr.xml
   [junit4]   2> 718781 T2203 oasc.ConfigSolrXml.<init> Config-defined core root directory: 
   [junit4]   2> 718781 T2203 oasc.CoreContainer.<init> New CoreContainer 863133147
   [junit4]   2> 718781 T2203 oasc.CoreContainer.load Loading cores into CoreContainer [instanceDir=/mnt/ssd/jenkins/workspace/Lucene-Solr-4.x-Linux/solr/build/solr-core/test/J1/./org.apache.solr.cloud.CollectionsAPIDistributedZkTest-controljetty-1375522690726/]
   [junit4]   2> 718782 T2203 oashc.HttpShardHandlerFactory.getParameter Setting socketTimeout to: 120000
   [junit4]   2> 718783 T2203 oashc.HttpShardHandlerFactory.getParameter Setting urlScheme to: http://
   [junit4]   2> 718783 T2203 oashc.HttpShardHandlerFactory.getParameter Setting connTimeout to: 15000
   [junit4]   2> 718783 T2203 oashc.HttpShardHandlerFactory.getParameter Setting maxConnectionsPerHost to: 20
   [junit4]   2> 718783 T2203 oashc.HttpShardHandlerFactory.getParameter Setting corePoolSize to: 0
   [junit4]   2> 718784 T2203 oashc.HttpShardHandlerFactory.getParameter Setting maximumPoolSize to: 2147483647
   [junit4]   2> 718784 T2203 oashc.HttpShardHandlerFactory.getParameter Setting maxThreadIdleTime to: 5
   [junit4]   2> 718784 T2203 oashc.HttpShardHandlerFactory.getParameter Setting sizeOfQueue to: -1
   [junit4]   2> 718784 T2203 oashc.HttpShardHandlerFactory.getParameter Setting fairnessPolicy to: false
   [junit4]   2> 718785 T2203 oascsi.HttpClientUtil.createClient Creating new http client, config:maxConnectionsPerHost=20&maxConnections=10000&socketTimeout=120000&connTimeout=15000&retry=false
   [junit4]   2> 718788 T2203 oasc.ZkContainer.initZooKeeper Zookeeper client=127.0.0.1:39965/solr
   [junit4]   2> 718788 T2203 oasc.ZkController.checkChrootPath zkHost includes chroot
   [junit4]   2> 718788 T2203 oascc.ConnectionManager.waitForConnected Waiting for client to connect to ZooKeeper
   [junit4]   2> 718790 T2223 oascc.ConnectionManager.process Watcher org.apache.solr.common.cloud.ConnectionManager@516d4c02 name:ZooKeeperConnection Watcher:127.0.0.1:39965 got event WatchedEvent state:SyncConnected type:None path:null path:null type:None
   [junit4]   2> 718790 T2203 oascc.ConnectionManager.waitForConnected Client is connected to ZooKeeper
   [junit4]   2> 718791 T2203 oascsi.HttpClientUtil.createClient Creating new http client, config:maxConnections=500&maxConnectionsPerHost=16&socketTimeout=120000&connTimeout=15000
   [junit4]   2> 718794 T2203 oascc.ConnectionManager.waitForConnected Waiting for client to connect to ZooKeeper
   [junit4]   2> 718796 T2225 oascc.ConnectionManager.process Watcher org.apache.solr.common.cloud.ConnectionManager@586639da name:ZooKeeperConnection Watcher:127.0.0.1:39965/solr got event WatchedEvent state:SyncConnected type:None path:null path:null type:None
   [junit4]   2> 718796 T2203 oascc.ConnectionManager.waitForConnected Client is connected to ZooKeeper
   [junit4]   2> 718797 T2203 oascc.SolrZkClient.makePath makePath: /overseer/queue
   [junit4]   2> 718799 T2203 oascc.SolrZkClient.makePath makePath: /overseer/collection-queue-work
   [junit4]   2> 718801 T2203 oascc.SolrZkClient.makePath makePath: /live_nodes
   [junit4]   2> 718802 T2203 oasc.ZkController.createEphemeralLiveNode Register node as live in ZooKeeper:/live_nodes/127.0.0.1:33471_
   [junit4]   2> 718803 T2203 oascc.SolrZkClient.makePath makePath: /live_nodes/127.0.0.1:33471_
   [junit4]   2> 718806 T2203 oascc.SolrZkClient.makePath makePath: /overseer_elect/election
   [junit4]   2> 718809 T2203 oascc.SolrZkClient.makePath makePath: /overseer_elect/leader
   [junit4]   2> 718811 T2203 oasc.Overseer.start Overseer (id=90146255035695107-127.0.0.1:33471_-n_0000000000) starting
   [junit4]   2> 718813 T2203 oascc.SolrZkClient.makePath makePath: /overseer/queue-work
   [junit4]   2> 718815 T2227 oasc.OverseerCollectionProcessor.run Process current queue of collection creations
   [junit4]   2> 718816 T2203 oascc.SolrZkClient.makePath makePath: /clusterstate.json
   [junit4]   2> 718818 T2203 oascc.SolrZkClient.makePath makePath: /aliases.json
   [junit4]   2> 718819 T2203 oascc.ZkStateReader.createClusterStateWatchersAndUpdate Updating cluster state from ZooKeeper... 
   [junit4]   2> 718821 T2226 oasc.Overseer$ClusterStateUpdater.run Starting to work on the main queue
   [junit4]   2> 718836 T2203 oasc.CorePropertiesLocator.discover Looking for core definitions underneath /mnt/ssd/jenkins/workspace/Lucene-Solr-4.x-Linux/solr/build/solr-core/test/J1/./org.apache.solr.cloud.CollectionsAPIDistributedZkTest-controljetty-1375522690726
   [junit4]   2> 718857 T2203 oasc.CorePropertiesLocator.discoverUnder Found core conf in /mnt/ssd/jenkins/workspace/Lucene-Solr-4.x-Linux/solr/build/solr-core/test/J1/./org.apache.solr.cloud.CollectionsAPIDistributedZkTest-controljetty-1375522690726/conf/
   [junit4]   2> 718858 T2203 oasc.CorePropertiesLocator.discover Found 1 core definitions
   [junit4]   2> 718858 T2203 oass.SolrDispatchFilter.init user.dir=/mnt/ssd/jenkins/workspace/Lucene-Solr-4.x-Linux/solr/build/solr-core/test/J1
   [junit4]   2> 718859 T2203 oass.SolrDispatchFilter.init SolrDispatchFilter.init() done
   [junit4]   2> 718859 T2203 oascsi.HttpClientUtil.createClient Creating new http client, config:maxConnections=128&maxConnectionsPerHost=32&followRedirects=false
   [junit4]   2> 718862 T2203 oascsi.HttpClientUtil.createClient Creating new http client, config:
   [junit4]   2> 718863 T2203 oascc.ConnectionManager.waitForConnected Waiting for client to connect to ZooKeeper
   [junit4]   2> 718865 T2230 oascc.ConnectionManager.process Watcher org.apache.solr.common.cloud.ConnectionManager@7783699c name:ZooKeeperConnection Watcher:127.0.0.1:39965/solr got event WatchedEvent state:SyncConnected type:None path:null path:null type:None
   [junit4]   2> 718865 T2203 oascc.ConnectionManager.waitForConnected Client is connected to ZooKeeper
   [junit4]   2> 718866 T2203 oascc.ZkStateReader.createClusterStateWatchersAndUpdate Updating cluster state from ZooKeeper... 
   [junit4]   2> 718868 T2203 oasc.ChaosMonkey.monkeyLog monkey: init - expire sessions:true cause connection loss:true
   [junit4]   2> 718932 T2203 oejs.Server.doStart jetty-8.1.10.v20130312
   [junit4]   2> 718934 T2203 oejs.AbstractConnector.doStart Started SelectChannelConnector@127.0.0.1:54833
   [junit4]   2> 718934 T2203 oass.SolrDispatchFilter.init SolrDispatchFilter.init()
   [junit4]   2> 718935 T2203 oasc.SolrResourceLoader.locateSolrHome JNDI not configured for solr (NoInitialContextEx)
   [junit4]   2> 718935 T2203 oasc.SolrResourceLoader.locateSolrHome using system property solr.solr.home: /mnt/ssd/jenkins/workspace/Lucene-Solr-4.x-Linux/solr/build/solr-core/test/J1/./org.apache.solr.cloud.CollectionsAPIDistributedZkTest-jetty1-1375522690924
   [junit4]   2> 718935 T2203 oasc.SolrResourceLoader.<init> new SolrResourceLoader for directory: '/mnt/ssd/jenkins/workspace/Lucene-Solr-4.x-Linux/solr/build/solr-core/test/J1/./org.apache.solr.cloud.CollectionsAPIDistributedZkTest-jetty1-1375522690924/'
   [junit4]   2> 718944 T2203 oasc.ConfigSolr.fromFile Loading container configuration from /mnt/ssd/jenkins/workspace/Lucene-Solr-4.x-Linux/solr/build/solr-core/test/J1/./org.apache.solr.cloud.CollectionsAPIDistributedZkTest-jetty1-1375522690924/solr.xml
   [junit4]   2> 718974 T2203 oasc.ConfigSolrXml.<init> Config-defined core root directory: 
   [junit4]   2> 718974 T2203 oasc.CoreContainer.<init> New CoreContainer 149453759
   [junit4]   2> 718975 T2203 oasc.CoreContainer.load Loading cores into CoreContainer [instanceDir=/mnt/ssd/jenkins/workspace/Lucene-Solr-4.x-Linux/solr/build/solr-core/test/J1/./org.apache.solr.cloud.CollectionsAPIDistributedZkTest-jetty1-1375522690924/]
   [junit4]   2> 718975 T2203 oashc.HttpShardHandlerFactory.getParameter Setting socketTimeout to: 120000
   [junit4]   2> 718976 T2203 oashc.HttpShardHandlerFactory.getParameter Setting urlScheme to: http://
   [junit4]   2> 718976 T2203 oashc.HttpShardHandlerFactory.getParameter Setting connTimeout to: 15000
   [junit4]   2> 718976 T2203 oashc.HttpShardHandlerFactory.getParameter Setting maxConnectionsPerHost to: 20
   [junit4]   2> 718977 T2203 oashc.HttpShardHandlerFactory.getParameter Setting corePoolSize to: 0
   [junit4]   2> 718977 T2203 oashc.HttpShardHandlerFactory.getParameter Setting maximumPoolSize to: 2147483647
   [junit4]   2> 718977 T2203 oashc.HttpShardHandlerFactory.getParameter Setting maxThreadIdleTime to: 5
   [junit4]   2> 718977 T2203 oashc.HttpShardHandlerFactory.getParameter Setting sizeOfQueue to: -1
   [junit4]   2> 718978 T2203 oashc.HttpShardHandlerFactory.getParameter Setting fairnessPolicy to: false
   [junit4]   2> 718978 T2203 oascsi.HttpClientUtil.createClient Creating new http client, config:maxConnectionsPerHost=20&maxConnections=10000&socketTimeout=120000&connTimeout=15000&retry=false
   [junit4]   2> 718981 T2203 oasc.ZkContainer.initZooKeeper Zookeeper client=127.0.0.1:39965/solr
   [junit4]   2> 718981 T2203 oasc.ZkController.checkChrootPath zkHost includes chroot
   [junit4]   2> 718982 T2203 oascc.ConnectionManager.waitForConnected Waiting for client to connect to ZooKeeper
   [junit4]   2> 718983 T2241 oascc.ConnectionManager.process Watcher org.apache.solr.common.cloud.ConnectionManager@5c795e1e name:ZooKeeperConnection Watcher:127.0.0.1:39965 got event WatchedEvent state:SyncConnected type:None path:null path:null type:None
   [junit4]   2> 718983 T2203 oascc.ConnectionManager.waitForConnected Client is connected to ZooKeeper
   [junit4]   2> 718984 T2203 oascsi.HttpClientUtil.createClient Creating new http client, config:maxConnections=500&maxConnectionsPerHost=16&socketTimeout=120000&connTimeout=15000
   [junit4]   2> 718987 T2203 oascc.ConnectionManager.waitForConnected Waiting for client to connect to ZooKeeper
   [junit4]   2> 718989 T2243 oascc.ConnectionManager.process Watcher org.apache.solr.common.cloud.ConnectionManager@4bb53ee name:ZooKeeperConnection Watcher:127.0.0.1:39965/solr got event WatchedEvent state:SyncConnected type:None path:null path:null type:None
   [junit4]   2> 718989 T2203 oascc.ConnectionManager.waitForConnected Client is connected to ZooKeeper
   [junit4]   2> 718992 T2203 oascc.ZkStateReader.createClusterStateWatchersAndUpdate Updating cluster state from ZooKeeper... 
   [junit4]   2> 719995 T2203 oasc.ZkController.createEphemeralLiveNode Register node as live in ZooKeeper:/live_nodes/127.0.0.1:54833_
   [junit4]   2> 719996 T2203 oascc.SolrZkClient.makePath makePath: /live_nodes/127.0.0.1:54833_
   [junit4]   2> 719999 T2225 oascc.ZkStateReader$3.process Updating live nodes... (2)
   [junit4]   2> 720000 T2243 oascc.ZkStateReader$3.process Updating live nodes... (2)
   [junit4]   2> 720000 T2230 oascc.ZkStateReader$3.process Updating live nodes... (2)
   [junit4]   2> 720003 T2203 oasc.CorePropertiesLocator.discover Looking for core definitions underneath /mnt/ssd/jenkins/workspace/Lucene-Solr-4.x-Linux/solr/build/solr-core/test/J1/./org.apache.solr.cloud.CollectionsAPIDistributedZkTest-jetty1-1375522690924
   [junit4]   2> 720025 T2203 oasc.CorePropertiesLocator.discoverUnder Found core conf in /mnt/ssd/jenkins/workspace/Lucene-Solr-4.x-Linux/solr/build/solr-core/test/J1/./org.apache.solr.cloud.CollectionsAPIDistributedZkTest-jetty1-1375522690924/conf/
   [junit4]   2> 720025 T2203 oasc.CorePropertiesLocator.discover Found 1 core definitions
   [junit4]   2> 720026 T2203 oass.SolrDispatchFilter.init user.dir=/mnt/ssd/jenkins/workspace/Lucene-Solr-4.x-Linux/solr/build/solr-core/test/J1
   [junit4]   2> 720026 T2203 oass.SolrDispatchFilter.init SolrDispatchFilter.init() done
   [junit4]   2> 720026 T2203 oascsi.HttpClientUtil.createClient Creating new http client, config:maxConnections=128&maxConnectionsPerHost=32&followRedirects=false
   [junit4]   2> 720092 T2203 oejs.Server.doStart jetty-8.1.10.v20130312
   [junit4]   2> 720094 T2203 oejs.AbstractConnector.doStart Started SelectChannelConnector@127.0.0.1:58702
   [junit4]   2> 720095 T2203 oass.SolrDispatchFilter.init SolrDispatchFilter.init()
   [junit4]   2> 720095 T2203 oasc.SolrResourceLoader.locateSolrHome JNDI not configured for solr (NoInitialContextEx)
   [junit4]   2> 720095 T2203 oasc.SolrResourceLoader.locateSolrHome using system property solr.solr.home: /mnt/ssd/jenkins/workspace/Lucene-Solr-4.x-Linux/solr/build/solr-core/test/J1/./org.apache.solr.cloud.CollectionsAPIDistributedZkTest-jetty2-1375522692085
   [junit4]   2> 720096 T2203 oasc.SolrResourceLoader.<init> new SolrResourceLoader for directory: '/mnt/ssd/jenkins/workspace/Lucene-Solr-4.x-Linux/solr/build/solr-core/test/J1/./org.apache.solr.cloud.CollectionsAPIDistributedZkTest-jetty2-1375522692085/'
   [junit4]   2> 720105 T2203 oasc.ConfigSolr.fromFile Loading container configuration from /mnt/ssd/jenkins/workspace/Lucene-Solr-4.x-Linux/solr/build/solr-core/test/J1/./org.apache.solr.cloud.CollectionsAPIDistributedZkTest-jetty2-1375522692085/solr.xml
   [junit4]   2> 720143 T2203 oasc.ConfigSolrXml.<init> Config-defined core root directory: 
   [junit4]   2> 720143 T2203 oasc.CoreContainer.<init> New CoreContainer 661659402
   [junit4]   2> 720144 T2203 oasc.CoreContainer.load Loading cores into CoreContainer [instanceDir=/mnt/ssd/jenkins/workspace/Lucene-Solr-4.x-Linux/solr/build/solr-core/test/J1/./org.apache.solr.cloud.CollectionsAPIDistributedZkTest-jetty2-1375522692085/]
   [junit4]   2> 720145 T2203 oashc.HttpShardHandlerFactory.getParameter Setting socketTimeout to: 120000
   [junit4]   2> 720145 T2203 oashc.HttpShardHandlerFactory.getParameter Setting urlScheme to: http://
   [junit4]   2> 720145 T2203 oashc.HttpShardHandlerFactory.getParameter Setting connTimeout to: 15000
   [junit4]   2> 720145 T2203 oashc.HttpShardHandlerFactory.getParameter Setting maxConnectionsPerHost to: 20
   [junit4]   2> 720146 T2203 oashc.HttpShardHandlerFactory.getParameter Setting corePoolSize to: 0
   [junit4]   2> 720146 T2203 oashc.HttpShardHandlerFactory.getParameter Setting maximumPoolSize to: 2147483647
   [junit4]   2> 720146 T2203 oashc.HttpShardHandlerFactory.getParameter Setting maxThreadIdleTime to: 5
   [junit4]   2> 720146 T2203 oashc.HttpShardHandlerFactory.getParameter Setting sizeOfQueue to: -1
   [junit4]   2> 720147 T2203 oashc.HttpShardHandlerFactory.getParameter Setting fairnessPolicy to: false
   [junit4]   2> 720147 T2203 oascsi.HttpClientUtil.createClient Creating new http client, config:maxConnectionsPerHost=20&maxConnections=10000&socketTimeout=120000&connTimeout=15000&retry=false
   [junit4]   2> 720150 T2203 oasc.ZkContainer.initZooKeeper Zookeeper client=127.0.0.1:39965/solr
   [junit4]   2> 720150 T2203 oasc.ZkController.checkChrootPath zkHost includes chroot
   [junit4]   2> 720151 T2203 oascc.ConnectionManager.waitForConnected Waiting for client to connect to ZooKeeper
   [junit4]   2> 720152 T2255 oascc.ConnectionManager.process Watcher org.apache.solr.common.cloud.ConnectionManager@50d7b64f name:ZooKeeperConnection Watcher:127.0.0.1:39965 got event WatchedEvent state:SyncConnected type:None path:null path:null type:None
   [junit4]   2> 720152 T2203 oascc.ConnectionManager.waitForConnected Client is connected to ZooKeeper
   [junit4]   2> 720154 T2203 oascsi.HttpClientUtil.createClient Creating new http client, config:maxConnections=500&maxConnectionsPerHost=16&socketTimeout=120000&connTimeout=15000
   [junit4]   2> 720157 T2203 oascc.ConnectionManager.waitForConnected Waiting for client to connect to ZooKeeper
   [junit4]   2> 720158 T2257 oascc.ConnectionManager.process Watcher org.apache.solr.common.cloud.ConnectionManager@f840552 name:ZooKeeperConnection Watcher:127.0.0.1:39965/solr got event WatchedEvent state:SyncConnected type:None path:null path:null type:None
   [junit4]   2> 720158 T2203 oascc.ConnectionManager.waitForConnected Client is connected to ZooKeeper
   [junit4]   2> 720162 T2203 oascc.ZkStateReader.createClusterStateWatchersAndUpdate Updating cluster state from ZooKeeper... 
   [junit4]   2> 721164 T2203 oasc.ZkController.createEphemeralLiveNode Register node as live in ZooKeeper:/live_nodes/127.0.0.1:58702_
   [junit4]   2> 721165 T2203 oascc.SolrZkClient.makePath makePath: /live_nodes/127.0.0.1:58702_
   [junit4]   2> 721169 T2230 oascc.ZkStateReader$3.process Updating live nodes... (3)
   [junit4]   2> 721169 T2243 oascc.ZkStateReader$3.process Updating live nodes... (3)
   [junit4]   2> 721169 T2225 oascc.ZkStateReader$3.process Updating live nodes... (3)
   [junit4]   2> 721169 T2257 oascc.ZkStateReader$3.process Updating live nodes... (3)
   [junit4]   2> 721172 T2203 oasc.CorePropertiesLocator.discover Looking for core definitions underneath /mnt/ssd/jenkins/workspace/Lucene-Solr-4.x-Linux/solr/build/solr-core/test/J1/./org.apache.solr.cloud.CollectionsAPIDistributedZkTest-jetty2-1375522692085
   [junit4]   2> 721194 T2203 oasc.CorePropertiesLocator.discoverUnder Found core conf in /mnt/ssd/jenkins/workspace/Lucene-Solr-4.x-Linux/solr/build/solr-core/test/J1/./org.apache.solr.cloud.CollectionsAPIDistributedZkTest-jetty2-1375522692085/conf/
   [junit4]   2> 721194 T2203 oasc.CorePropertiesLocator.discover Found 1 core definitions
   [junit4]   2> 721195 T2203 oass.SolrDispatchFilter.init user.dir=/mnt/ssd/jenkins/workspace/Lucene-Solr-4.x-Linux/solr/build/solr-core/test/J1
   [junit4]   2> 721195 T2203 oass.SolrDispatchFilter.init SolrDispatchFilter.init() done
   [junit4]   2> 721195 T2203 oascsi.HttpClientUtil.createClient Creating new http client, config:maxConnections=128&maxConnectionsPerHost=32&followRedirects=false
   [junit4]   2> 721270 T2203 oejs.Server.doStart jetty-8.1.10.v20130312
   [junit4]   2> 721272 T2203 oejs.AbstractConnector.doStart Started SelectChannelConnector@127.0.0.1:47852
   [junit4]   2> 721273 T2203 oass.SolrDispatchFilter.init SolrDispatchFilter.init()
   [junit4]   2> 721273 T2203 oasc.SolrResourceLoader.locateSolrHome JNDI not configured for solr (NoInitialContextEx)
   [junit4]   2> 721273 T2203 oasc.SolrResourceLoader.locateSolrHome using system property solr.solr.home: /mnt/ssd/jenkins/workspace/Lucene-Solr-4.x-Linux/solr/build/solr-core/test/J1/./org.apache.solr.cloud.CollectionsAPIDistributedZkTest-jetty3-1375522693254
   [junit4]   2> 721274 T2203 oasc.SolrResourceLoader.<init> new SolrResourceLoader for directory: '/mnt/ssd/jenkins/workspace/Lucene-Solr-4.x-Linux/solr/build/solr-core/test/J1/./org.apache.solr.cloud.CollectionsAPIDistributedZkTest-jetty3-1375522693254/'
   [junit4]   2> 721290 T2203 oasc.ConfigSolr.fromFile Loading container configuration from /mnt/ssd/jenkins/workspace/Lucene-Solr-4.x-Linux/solr/build/solr-core/test/J1/./org.apache.solr.cloud.CollectionsAPIDistributedZkTest-jetty3-1375522693254/solr.xml
   [junit4]   2> 721332 T2203 oasc.ConfigSolrXml.<init> Config-defined core root directory: 
   [junit4]   2> 721333 T2203 oasc.CoreContainer.<init> New CoreContainer 427493632
   [junit4]   2> 721333 T2203 oasc.CoreContainer.load Loading cores into CoreContainer [instanceDir=/mnt/ssd/jenkins/workspace/Lucene-Solr-4.x-Linux/solr/build/solr-core/test/J1/./org.apache.solr.cloud.CollectionsAPIDistributedZkTest-jetty3-1375522693254/]
   [junit4]   2> 721334 T2203 oashc.HttpShardHandlerFactory.getParameter Setting socketTimeout to: 120000
   [junit4]   2> 721334 T2203 oashc.HttpShardHandlerFactory.getParameter Setting urlScheme to: http://
   [junit4]   2> 721334 T2203 oashc.HttpShardHandlerFactory.getParameter Setting connTimeout to: 15000
   [junit4]   2> 721335 T2203 oashc.HttpShardHandlerFactory.getParameter Setting maxConnectionsPerHost to: 20
   [junit4]   2> 721335 T2203 oashc.HttpShardHandlerFactory.getParameter Setting corePoolSize to: 0
   [junit4]   2> 721335 T2203 oashc.HttpShardHandlerFactory.getParameter Setting maximumPoolSize to: 2147483647
   [junit4]   2> 721335 T2203 oashc.HttpShardHandlerFactory.getParameter Setting maxThreadIdleTime to: 5
   [junit4]   2> 721336 T2203 oashc.HttpShardHandlerFactory.getParameter Setting sizeOfQueue to: -1
   [junit4]   2> 721336 T2203 oashc.HttpShardHandlerFactory.getParameter Setting fairnessPolicy to: false
   [junit4]   2> 721336 T2203 oascsi.HttpClientUtil.createClient Creating new http client, config:maxConnectionsPerHost=20&maxConnections=10000&socketTimeout=120000&connTimeout=15000&retry=false
   [junit4]   2> 721340 T2203 oasc.ZkContainer.initZooKeeper Zookeeper client=127.0.0.1:39965/solr
   [junit4]   2> 721341 T2203 oasc.ZkController.checkChrootPath zkHost includes chroot
   [junit4]   2> 721341 T2203 oascc.ConnectionManager.waitForConnected Waiting for client to connect to ZooKeeper
   [junit4]   2> 721343 T2269 oascc.ConnectionManager.process Watcher org.apache.solr.common.cloud.ConnectionManager@4597780f name:ZooKeeperConnection Watcher:127.0.0.1:39965 got event WatchedEvent state:SyncConnected type:None path:null path:null type:None
   [junit4]   2> 721343 T2203 oascc.ConnectionManager.waitForConnected Client is connected to ZooKeeper
   [junit4]   2> 721345 T2203 oascsi.HttpClientUtil.createClient Creating new http client, config:maxConnections=500&maxConnectionsPerHost=16&socketTimeout=120000&connTimeout=15000
   [junit4]   2> 721348 T2203 oascc.ConnectionManager.waitForConnected Waiting for client to connect to ZooKeeper
   [junit4]   2> 721350 T2271 oascc.ConnectionManager.process Watcher org.apache.solr.common.cloud.ConnectionManager@428dbfc3 name:ZooKeeperConnection Watcher:127.0.0.1:39965/solr got event WatchedEvent state:SyncConnected type:None path:null path:null type:None
   [junit4]   2> 721350 T2203 oascc.ConnectionManager.waitForConnected Client is connected to ZooKeeper
   [junit4]   2> 721353 T2203 oascc.ZkStateReader.createClusterStateWatchersAndUpdate Updating cluster state from ZooKeeper... 
   [junit4]   2> 722356 T2203 oasc.ZkController.createEphemeralLiveNode Register node as live in ZooKeeper:/live_nodes/127.0.0.1:47852_
   [junit4]   2> 722357 T2203 oascc.SolrZkClient.makePath makePath: /live_nodes/127.0.0.1:47852_
   [junit4]   2> 722360 T2230 oascc.ZkStateReader$3.process Updating live nodes... (4)
   [junit4]   2> 722360 T2243 oascc.ZkStateReader$3.process Updating live nodes... (4)
   [junit4]   2> 722361 T2225 oascc.ZkStateReader$3.process Updating live nodes... (4)
   [junit4]   2> 722361 T2257 oascc.ZkStateReader$3.process Updating live nodes... (4)
   [junit4]   2> 722361 T2271 oascc.ZkStateReader$3.process Updating live nodes... (4)
   [junit4]   2> 722366 T2203 oasc.CorePropertiesLocator.discover Looking for core definitions underneath /mnt/ssd/jenkins/workspace/Lucene-Solr-4.x-Linux/solr/build/solr-core/test/J1/./org.apache.solr.cloud.CollectionsAPIDistributedZkTest-jetty3-1375522693254
   [junit4]   2> 722394 T2203 oasc.CorePropertiesLocator.discoverUnder Found core conf in /mnt/ssd/jenkins/workspace/Lucene-Solr-4.x-Linux/solr/build/solr-core/test/J1/./org.apache.solr.cloud.CollectionsAPIDistributedZkTest-jetty3-1375522693254/conf/
   [junit4]   2> 722395 T2203 oasc.CorePropertiesLocator.discover Found 1 core definitions
   [junit4]   2> 722395 T2203 oass.SolrDispatchFilter.init user.dir=/mnt/ssd/jenkins/workspace/Lucene-Solr-4.x-Linux/solr/build/solr-core/test/J1
   [junit4]   2> 722395 T2203 oass.SolrDispatchFilter.init SolrDispatchFilter.init() done
   [junit4]   2> 722396 T2203 oascsi.HttpClientUtil.createClient Creating new http client, config:maxConnections=128&maxConnectionsPerHost=32&followRedirects=false
   [junit4]   2> 722458 T2203 oejs.Server.doStart jetty-8.1.10.v20130312
   [junit4]   2> 722460 T2203 oejs.AbstractConnector.doStart Started SelectChannelConnector@127.0.0.1:52506
   [junit4]   2> 722461 T2203 oass.SolrDispatchFilter.init SolrDispatchFilter.init()
   [junit4]   2> 722461 T2203 oasc.SolrResourceLoader.locateSolrHome JNDI not configured for solr (NoInitialContextEx)
   [junit4]   2> 722461 T2203 oasc.SolrResourceLoader.locateSolrHome using system property solr.solr.home: /mnt/ssd/jenkins/workspace/Lucene-Solr-4.x-Linux/solr/build/solr-core/test/J1/./org.apache.solr.cloud.CollectionsAPIDistributedZkTest-jetty4-1375522694455
   [junit4]   2> 722462 T2203 oasc.SolrResourceLoader.<init> new SolrResourceLoader for directory: '/mnt/ssd/jenkins/workspace/Lucene-Solr-4.x-Linux/solr/build/solr-core/test/J1/./org.apache.solr.cloud.CollectionsAPIDistributedZkTest-jetty4-1375522694455/'
   [junit4]   2> 722471 T2203 oasc.ConfigSolr.fromFile Loading container configuration from /mnt/ssd/jenkins/workspace/Lucene-Solr-4.x-Linux/solr/build/solr-core/test/J1/./org.apache.solr.cloud.CollectionsAPIDistributedZkTest-jetty4-1375522694455/solr.xml
   [junit4]   2> 722500 T2203 oasc.ConfigSolrXml.<init> Config-defined core root directory: 
   [junit4]   2> 722500 T2203 oasc.CoreContainer.<init> New CoreContainer 357031185
   [junit4]   2> 722500 T2203 oasc.CoreContainer.load Loading cores into CoreContainer [instanceDir=/mnt/ssd/jenkins/workspace/Lucene-Solr-4.x-Linux/solr/build/solr-core/test/J1/./org.apache.solr.cloud.CollectionsAPIDistributedZkTest-jetty4-1375522694455/]
   [junit4]   2> 722501 T2203 oashc.HttpShardHandlerFactory.getParameter Setting socketTimeout to: 120000
   [junit4]   2> 722501 T2203 oashc.HttpShardHandlerFactory.getParameter Setting urlScheme to: http://
   [junit4]   2> 722502 T2203 oashc.HttpShardHandlerFactory.getParameter Setting connTimeout to: 15000
   [junit4]   2> 722502 T2203 oashc.HttpShardHandlerFactory.getParameter Setting maxConnectionsPerHost to: 20
   [junit4]   2> 722502 T2203 oashc.HttpShardHandlerFactory.getParameter Setting corePoolSize to: 0
   [junit4]   2> 722502 T2203 oashc.HttpShardHandlerFactory.getParameter Setting maximumPoolSize to: 2147483647
   [junit4]   2> 722503 T2203 oashc.HttpShardHandlerFactory.getParameter Setting maxThreadIdleTime to: 5
   [junit4]   2> 722503 T2203 oashc.HttpShardHandlerFactory.getParameter Setting sizeOfQueue to: -1
   [junit4]   2> 722503 T2203 oashc.HttpShardHandlerFactory.getParameter Setting fairnessPolicy to: false
   [junit4]   2> 722503 T2203 oascsi.HttpClientUtil.createClient Creating new http client, config:maxConnectionsPerHost=20&maxConnections=10000&socketTimeout=120000&connTimeout=15000&retry=false
   [junit4]   2> 722506 T2203 oasc.ZkContainer.initZooKeeper Zookeeper client=127.0.0.1:39965/solr
   [junit4]   2> 722506 T2203 oasc.ZkController.checkChrootPath zkHost includes chroot
   [junit4]   2> 722507 T2203 oascc.ConnectionManager.waitForConnected Waiting for client to connect to ZooKeeper
   [junit4]   2> 722508 T2283 oascc.ConnectionManager.process Watcher org.apache.solr.common.cloud.ConnectionManager@49ad3eb0 name:ZooKeeperConnection Watcher:127.0.0.1:39965 got event WatchedEvent state:SyncConnected type:None path:null path:null type:None
   [junit4]   2> 722509 T2203 oascc.ConnectionManager.waitForConnected Client is connected to ZooKeeper
   [junit4]   2> 722510 T2203 oascsi.HttpClientUtil.createClient Creating new http client, config:maxConnections=500&maxConnectionsPerHost=16&socketTimeout=120000&connTimeout=15000
   [junit4]   2> 722513 T2203 oascc.ConnectionManager.waitForConnected Waiting for client to connect to ZooKeeper
   [junit4]   2> 722514 T2285 oascc.ConnectionManager.process Watcher org.apache.solr.common.cloud.ConnectionManager@5c4fb2b6 name:ZooKeeperConnection Watcher:127.0.0.1:39965/solr got event WatchedEvent state:SyncConnected type:None path:null path:null type:None
   [junit4]   2> 722514 T2203 oascc.ConnectionManager.waitForConnected Client is connected to ZooKeeper
   [junit4]   2> 722518 T2203 oascc.ZkStateReader.createClusterStateWatchersAndUpdate Updating cluster state from ZooKeeper... 
   [junit4]   2> 723520 T2203 oasc.ZkController.createEphemeralLiveNode Register node as live in ZooKeeper:/live_nodes/127.0.0.1:52506_
   [junit4]   2> 723523 T2203 oascc.SolrZkClient.makePath makePath: /live_nodes/127.0.0.1:52506_
   [junit4]   2> 723526 T2285 oascc.ZkStateReader$3.process Updating live nodes... (5)
   [junit4]   2> 723526 T2230 oascc.ZkStateReader$3.process Updating live nodes... (5)
   [junit4]   2> 723526 T2225 oascc.ZkStateReader$3.process Updating live nodes... (5)
   [junit4]   2> 723526 T2257 oascc.ZkStateReader$3.process Updating live nodes... (5)
   [junit4]   2> 723526 T2271 oascc.ZkStateReader$3.process Updating live nodes... (5)
   [junit4]   2> 723526 T2243 oascc.ZkStateReader$3.process Updating live nodes... (5)
   [junit4]   2> 723530 T2203 oasc.CorePropertiesLocator.discover Looking for core definitions underneath /mnt/ssd/jenkins/workspace/Lucene-Solr-4.x-Linux/solr/build/solr-core/test/J1/./org.apache.solr.cloud.CollectionsAPIDistributedZkTest-jetty4-1375522694455
   [junit4]   2> 723559 T2203 oasc.CorePropertiesLocator.discoverUnder Found core conf in /mnt/ssd/jenkins/workspace/Lucene-Solr-4.x-Linux/solr/build/solr-core/test/J1/./org.apache.solr.cloud.CollectionsAPIDistributedZkTest-jetty4-1375522694455/conf/
   [junit4]   2> 723559 T2203 oasc.CorePropertiesLocator.discover Found 1 core definitions
   [junit4]   2> 723560 T2203 oass.SolrDispatchFilter.init user.dir=/mnt/ssd/jenkins/workspace/Lucene-Solr-4.x-Linux/solr/build/solr-core/test/J1
   [junit4]   2> 723560 T2203 oass.SolrDispatchFilter.init SolrDispatchFilter.init() done
   [junit4]   2> 723560 T2203 oascsi.HttpClientUtil.createClient Creating new http client, config:maxConnections=128&maxConnectionsPerHost=32&followRedirects=false
   [junit4]   2> 723563 T2203 oascsi.HttpClientUtil.createClient Creating new http client, config:maxConnections=128&maxConnectionsPerHost=32&followRedirects=false
   [junit4]   2> 723566 T2236 oasha.CollectionsHandler.handleCreateAction Creating Collection : numShards=2&name=nodes_used_collection&replicationFactor=2&action=CREATE&wt=javabin&version=2
   [junit4]   2> 723567 T2225 oasc.DistributedQueue$LatchChildWatcher.process Watcher fired on path: /overseer/collection-queue-work state: SyncConnected type NodeChildrenChanged
   [junit4]   2> 723569 T2227 oasc.OverseerCollectionProcessor.run Overseer Collection Processor: Get the message id:/overseer/collection-queue-work/qn-0000000000 message:{
   [junit4]   2> 	  "operation":"createcollection",
   [junit4]   2> 	  "numShards":"2",
   [junit4]   2> 	  "name":"nodes_used_collection",
   [junit4]   2> 	  "replicationFactor":"2"}
   [junit4]   2> 723569 T2227 oasc.OverseerCollectionProcessor.processMessage WARN OverseerCollectionProcessor.processMessage : createcollection , {
   [junit4]   2> 	  "operation":"createcollection",
   [junit4]   2> 	  "numShards":"2",
   [junit4]   2> 	  "name":"nodes_used_collection",
   [junit4]   2> 	  "replicationFactor":"2"}
   [junit4]   2> 724838 T2226 oascc.ZkStateReader.updateClusterState Updating cloud state from ZooKeeper... 
   [junit4]   2> 724839 T2226 oasc.Overseer$ClusterStateUpdater.buildCollection building a new collection: nodes_used_collection
   [junit4]   2> 724839 T2226 oasc.Overseer$ClusterStateUpdater.createCollection Create collection nodes_used_collection with shards [shard1, shard2]
   [junit4]   2> 724842 T2285 oascc.ZkStateReader$2.process A cluster state change: WatchedEvent state:SyncConnected type:NodeDataChanged path:/clusterstate.json, has occurred - updating... (live nodes size: 5)
   [junit4]   2> 724842 T2271 oascc.ZkStateReader$2.process A cluster state change: WatchedEvent state:SyncConnected type:NodeDataChanged path:/clusterstate.json, has occurred - updating... (live nodes size: 5)
   [junit4]   2> 724842 T2225 oascc.ZkStateReader$2.process A cluster state change: WatchedEvent state:SyncConnected type:NodeDataChanged path:/clusterstate.json, has occurred - updating... (live nodes size: 5)
   [junit4]   2> 724842 T2243 oascc.ZkStateReader$2.process A cluster state change: WatchedEvent state:SyncConnected type:NodeDataChanged path:/clusterstate.json, has occurred - updating... (live nodes size: 5)
   [junit4]   2> 724842 T2230 oascc.ZkStateReader$2.process A cluster state change: WatchedEvent state:SyncConnected type:NodeDataChanged path:/clusterstate.json, has occurred - updating... (live nodes size: 5)
   [junit4]   2> 724842 T2257 oascc.ZkStateReader$2.process A cluster state change: WatchedEvent state:SyncConnected type:NodeDataChanged path:/clusterstate.json, has occurred - updating... (live nodes size: 5)
   [junit4]   2> 724873 T2227 oasc.OverseerCollectionProcessor.createCollection going to create cores replicas shardNames [shard1, shard2] , repFactor : 2
   [junit4]   2> 724873 T2227 oasc.OverseerCollectionProcessor.createCollection Creating shard nodes_used_collection_shard1_replica1 as part of slice shard1 of collection nodes_used_collection on 127.0.0.1:33471_
   [junit4]   2> 724874 T2227 oasc.OverseerCollectionProcessor.createCollection Creating shard nodes_used_collection_shard1_replica2 as part of slice shard1 of collection nodes_used_collection on 127.0.0.1:54833_
   [junit4]   2> 724875 T2227 oasc.OverseerCollectionProcessor.createCollection Creating shard nodes_used_collection_shard2_replica1 as part of slice shard2 of collection nodes_used_collection on 127.0.0.1:52506_
   [junit4]   2> 724875 T2227 oasc.OverseerCollectionProcessor.createCollection Creating shard nodes_used_collection_shard2_replica2 as part of slice shard2 of collection nodes_used_collection on 127.0.0.1:47852_
   [junit4]   2> 724876 T2238 oasc.ZkController.publish publishing core=nodes_used_collection_shard1_replica2 state=down
   [junit4]   2> 724876 T2218 oasc.ZkController.publish publishing core=nodes_used_collection_shard1_replica1 state=down
   [junit4]   2> 724877 T2264 oasc.ZkController.publish publishing core=nodes_used_collection_shard2_replica2 state=down
   [junit4]   2> 724877 T2238 oasc.ZkController.waitForCoreNodeName look for our core node name
   [junit4]   2> 724878 T2218 oasc.ZkController.waitForCoreNodeName look for our core node name
   [junit4]   2> 724877 T2281 oasc.ZkController.publish publishing core=nodes_used_collection_shard2_replica1 state=down
   [junit4]   2> 724878 T2264 oasc.ZkController.waitForCoreNodeName look for our core node name
   [junit4]   2> 724879 T2281 oasc.ZkController.waitForCoreNodeName look for our core node name
   [junit4]   2> 726347 T2226 oascc.ZkStateReader.updateClusterState Updating cloud state from ZooKeeper... 
   [junit4]   2> 726348 T2226 oasc.Overseer$ClusterStateUpdater.updateState WARN Could not find collection node for nodes_used_collection, skipping publish state
   [junit4]   2> 726348 T2226 oasc.Overseer$ClusterStateUpdater.updateState Update state numShards=2 message={
   [junit4]   2> 	  "operation":"state",
   [junit4]   2> 	  "core_node_name":"core_node1",
   [junit4]   2> 	  "numShards":"2",
   [junit4]   2> 	  "shard":"shard1",
   [junit4]   2> 	  "roles":null,
   [junit4]   2> 	  "state":"down",
   [junit4]   2> 	  "shard_state":"active",
   [junit4]   2> 	  "core":"nodes_used_collection_shard1_replica2",
   [junit4]   2> 	  "collection":"nodes_used_collection",
   [junit4]   2> 	  "shard_range":null,
   [junit4]   2> 	  "node_name":"127.0.0.1:54833_",
   [junit4]   2> 	  "base_url":"http://127.0.0.1:54833"}
   [junit4]   2> 726353 T2226 oasc.Overseer$ClusterStateUpdater.updateState WARN Could not find collection node for nodes_used_collection, skipping publish state
   [junit4]   2> 726353 T2226 oasc.Overseer$ClusterStateUpdater.updateState Update state numShards=2 message={
   [junit4]   2> 	  "operation":"state",
   [junit4]   2> 	  "core_node_name":"core_node2",
   [junit4]   2> 	  "numShards":"2",
   [junit4]   2> 	  "shard":"shard1",
   [junit4]   2> 	  "roles":null,
   [junit4]   2> 	  "state":"down",
   [junit4]   2> 	  "shard_state":"active",
   [junit4]   2> 	  "core":"nodes_used_collection_shard1_replica1",
   [junit4]   2> 	  "collection":"nodes_used_collection",
   [junit4]   2> 	  "shard_range":null,
   [junit4]   2> 	  "node_name":"127.0.0.1:33471_",
   [junit4]   2> 	  "base_url":"http://127.0.0.1:33471"}
   [junit4]   2> 726358 T2226 oasc.Overseer$ClusterStateUpdater.updateState WARN Could not find collection node for nodes_used_collection, skipping publish state
   [junit4]   2> 726359 T2226 oasc.Overseer$ClusterStateUpdater.updateState Update state numShards=2 message={
   [junit4]   2> 	  "operation":"state",
   [junit4]   2> 	  "core_node_name":"core_node3",
   [junit4]   2> 	  "numShards":"2",
   [junit4]   2> 	  "shard":"shard2",
   [junit4]   2> 	  "roles":null,
   [junit4]   2> 	  "state":"down",
   [junit4]   2> 	  "shard_state":"active",
   [junit4]   2> 	  "core":"nodes_used_collection_shard2_replica2",
   [junit4]   2> 	  "collection":"nodes_used_collection",
   [junit4]   2> 	  "shard_range":null,
   [junit4]   2> 	  "node_name":"127.0.0.1:47852_",
   [junit4]   2> 	  "base_url":"http://127.0.0.1:47852"}
   [junit4]   2> 726364 T2226 oasc.Overseer$ClusterStateUpdater.updateState WARN Could not find collection node for nodes_used_collection, skipping publish state
   [junit4]   2> 726364 T2226 oasc.Overseer$ClusterStateUpdater.updateState Update state numShards=2 message={
   [junit4]   2> 	  "operation":"state",
   [junit4]   2> 	  "core_node_name":"core_node4",
   [junit4]   2> 	  "numShards":"2",
   [junit4]   2> 	  "shard":"shard2",
   [junit4]   2> 	  "roles":null,
   [junit4]   2> 	  "state":"down",
   [junit4]   2> 	  "shard_state":"active",
   [junit4]   2> 	  "core":"nodes_used_collection_shard2_replica1",
   [junit4]   2> 	  "collection":"nodes_used_collection",
   [junit4]   2> 	  "shard_range":null,
   [junit4]   2> 	  "node_name":"127.0.0.1:52506_",
   [junit4]   2> 	  "base_url":"http://127.0.0.1:52506"}
   [junit4]   2> 726369 T2230 oascc.ZkStateReader$2.process A cluster state change: WatchedEvent state:SyncConnected type:NodeDataChanged path:/clusterstate.json, has occurred - updating... (live nodes size: 5)
   [junit4]   2> 726369 T2271 oascc.ZkStateReader$2.process A cluster state change: WatchedEvent state:SyncConnected type:NodeDataChanged path:/clusterstate.json, has occurred - updating... (live nodes size: 5)
   [junit4]   2> 726369 T2285 oascc.ZkStateReader$2.process A cluster state change: WatchedEvent state:SyncConnected type:NodeDataChanged path:/clusterstate.json, has occurred - updating... (live nodes size: 5)
   [junit4]   2> 726369 T2225 oascc.ZkStateReader$2.process A cluster state change: WatchedEvent state:SyncConnected type:NodeDataChanged path:/clusterstate.json, has occurred - updating... (live nodes size: 5)
   [junit4]   2> 726369 T2243 oascc.ZkStateReader$2.process A cluster state change: WatchedEvent state:SyncConnected type:NodeDataChanged path:/clusterstate.json, has occurred - updating... (live nodes size: 5)
   [junit4]   2> 726369 T2257 oascc.ZkStateReader$2.process A cluster state change: WatchedEvent state:SyncConnected type:NodeDataChanged path:/clusterstate.json, has occurred - updating... (live nodes size: 5)
   [junit4]   2> 726878 T2238 oasc.ZkController.waitForShardId waiting to find shard id in clusterstate for nodes_used_collection_shard1_replica2
   [junit4]   2> 726878 T2218 oasc.ZkController.waitForShardId waiting to find shard id in clusterstate for nodes_used_collection_shard1_replica1
   [junit4]   2> 726879 T2264 oasc.ZkController.waitForShardId waiting to find shard id in clusterstate for nodes_used_collection_shard2_replica2
   [junit4]   2> 726879 T2218 oasc.CorePropertiesLocator.writePropertiesFile ERROR Couldn't persist core properties to /mnt/ssd/jenkins/workspace/Lucene-Solr-4.x-Linux/solr/build/solr-core/test/J1/./org.apache.solr.cloud.CollectionsAPIDistributedZkTest-controljetty-1375522690726/nodes_used_collection_shard1_replica1/core.properties: java.io.FileNotFoundException: /mnt/ssd/jenkins/workspace/Lucene-Solr-4.x-Linux/solr/build/solr-core/test/J1/./org.apache.solr.cloud.CollectionsAPIDistributedZkTest-controljetty-1375522690726/nodes_used_collection_shard1_replica1/core.properties (No such file or directory)
   [junit4]   2> 726879 T2264 oasc.CorePropertiesLocator.writePropertiesFile ERROR Couldn't persist core properties to /mnt/ssd/jenkins/workspace/Lucene-Solr-4.x-Linux/solr/build/solr-core/test/J1/./org.apache.solr.cloud.CollectionsAPIDistributedZkTest-jetty3-1375522693254/nodes_used_collection_shard2_replica2/core.properties: java.io.FileNotFoundException: /mnt/ssd/jenkins/workspace/Lucene-Solr-4.x-Linux/solr/build/solr-core/test/J1/./org.apache.solr.cloud.CollectionsAPIDistributedZkTest-jetty3-1375522693254/nodes_used_collection_shard2_replica2/core.properties (No such file or directory)
   [junit4]   2> 726879 T2281 oasc.ZkController.waitForShardId waiting to find shard id in clusterstate for nodes_used_collection_shard2_replica1
   [junit4]   2> 726879 T2218 oasc.CoreContainer.create Creating SolrCore 'nodes_used_collection_shard1_replica1' using instanceDir: /mnt/ssd/jenkins/workspace/Lucene-Solr-4.x-Linux/solr/build/solr-core/test/J1/./org.apache.solr.cloud.CollectionsAPIDistributedZkTest-controljetty-1375522690726/nodes_used_collection_shard1_replica1
   [junit4]   2> 726880 T2218 oasc.ZkController.createCollectionZkNode Check for collection zkNode:nodes_used_collection
   [junit4]   2> 726879 T2238 oasc.CorePropertiesLocator.writePropertiesFile ERROR Couldn't persist core properties to /mnt/ssd/jenkins/workspace/Lucene-Solr-4.x-Linux/solr/build/solr-core/test/J1/./org.apache.solr.cloud.CollectionsAPIDistributedZkTest-jetty1-1375522690924/nodes_used_collection_shard1_replica2/core.properties: java.io.FileNotFoundException: /mnt/ssd/jenkins/workspace/Lucene-Solr-4.x-Linux/solr/build/solr-core/test/J1/./org.apache.solr.cloud.CollectionsAPIDistributedZkTest-jetty1-1375522690924/nodes_used_collection_shard1_replica2/core.properties (No such file or directory)
   [junit4]   2> 726881 T2238 oasc.CoreContainer.create Creating SolrCore 'nodes_used_collection_shard1_replica2' using instanceDir: /mnt/ssd/jenkins/workspace/Lucene-Solr-4.x-Linux/solr/build/solr-core/test/J1/./org.apache.solr.cloud.CollectionsAPIDistributedZkTest-jetty1-1375522690924/nodes_used_collection_shard1_replica2
   [junit4]   2> 726881 T2238 oasc.ZkController.createCollectionZkNode Check for collection zkNode:nodes_used_collection
   [junit4]   2> 726880 T2281 oasc.CorePropertiesLocator.writePropertiesFile ERROR Couldn't persist core properties to /mnt/ssd/jenkins/workspace/Lucene-Solr-4.x-Linux/solr/build/solr-core/test/J1/./org.apache.solr.cloud.CollectionsAPIDistributedZkTest-jetty4-1375522694455/nodes_used_collection_shard2_replica1/core.properties: java.io.FileNotFoundException: /mnt/ssd/jenkins/workspace/Lucene-Solr-4.x-Linux/solr/build/solr-core/test/J1/./org.apache.solr.cloud.CollectionsAPIDistributedZkTest-jetty4-1375522694455/nodes_used_collection_shard2_replica1/core.properties (No such file or directory)
   [junit4]   2> 726880 T2264 oasc.CoreContainer.create Creating SolrCore 'nodes_used_collection_shard2_replica2' using instanceDir: /mnt/ssd/jenkins/workspace/Lucene-Solr-4.x-Linux/solr/build/solr-core/test/J1/./org.apache.solr.cloud.CollectionsAPIDistributedZkTest-jetty3-1375522693254/nodes_used_collection_shard2_replica2
   [junit4]   2> 726882 T2238 oasc.ZkController.createCollectionZkNode Creating collection in ZooKeeper:nodes_used_collection
   [junit4]   2> 726882 T2281 oasc.CoreContainer.create Creating SolrCore 'nodes_used_collection_shard2_replica1' using instanceDir: /mnt/ssd/jenkins/workspace/Lucene-Solr-4.x-Linux/solr/build/solr-core/test/J1/./org.apache.solr.cloud.CollectionsAPIDistributedZkTest-jetty4-1375522694455/nodes_used_collection_shard2_replica1
   [junit4]   2> 726882 T2281 oasc.ZkController.createCollectionZkNode Check for collection zkNode:nodes_used_collection
   [junit4]   2> 726881 T2218 oasc.ZkController.createCollectionZkNode Creating collection in ZooKeeper:nodes_used_collection
   [junit4]   2> 726883 T2218 oasc.ZkController.getConfName Looking for collection configName
   [junit4]   2> 726882 T2238 oasc.ZkController.getConfName Looking for collection configName
   [junit4]   2> 726882 T2264 oasc.ZkController.createCollectionZkNode Check for collection zkNode:nodes_used_collection
   [junit4]   2> 726883 T2281 oasc.ZkController.createCollectionZkNode Creating collection in ZooKeeper:nodes_used_collection
   [junit4]   2> 726884 T2281 oasc.ZkController.getConfName Looking for collection configName
   [junit4]   2> 726884 T2264 oasc.ZkController.createCollectionZkNode Creating collection in ZooKeeper:nodes_used_collection
   [junit4]   2> 726885 T2238 oasc.ZkController.getConfName Only one config set found in zk - using it:conf1
   [junit4]   2> 726885 T2238 oascc.SolrZkClient.makePath makePath: /collections/nodes_used_collection
   [junit4]   2> 726885 T2218 oasc.ZkController.getConfName Only one config set found in zk - using it:conf1
   [junit4]   2> 726885 T2281 oasc.ZkController.getConfName Only one config set found in zk - using it:conf1
   [junit4]   2> 726885 T2264 oasc.ZkController.getConfName Looking for collection configName
   [junit4]   2> 726886 T2281 oascc.SolrZkClient.makePath makePath: /collections/nodes_used_collection
   [junit4]   2> 726886 T2218 oascc.SolrZkClient.makePath makePath: /collections/nodes_used_collection
   [junit4]   2> 726888 T2264 oasc.ZkController.getConfName Only one config set found in zk - using it:conf1
   [junit4]   2> 726888 T2264 oascc.SolrZkClient.makePath makePath: /collections/nodes_used_collection
   [junit4]   2> 726889 T2281 oasc.ZkController.readConfigName Load collection config from:/collections/nodes_used_collection
   [junit4]   2> 726890 T2281 oasc.SolrResourceLoader.<init> new SolrResourceLoader for directory: '/mnt/ssd/jenkins/workspace/Lucene-Solr-4.x-Linux/solr/build/solr-core/test/J1/./org.apache.solr.cloud.CollectionsAPIDistributedZkTest-jetty4-1375522694455/nodes_used_collection_shard2_replica1/'
   [junit4]   2> 726891 T2238 oasc.ZkController.readConfigName Load collection config from:/collections/nodes_used_collection
   [junit4]   2> 726900 T2264 oasc.ZkController.readConfigName Load collection config from:/collections/nodes_used_collection
   [junit4]   2> 726900 T2218 oasc.ZkController.readConfigName Load collection config from:/collections/nodes_used_collection
   [junit4]   2> 726900 T2238 oasc.SolrResourceLoader.<init> new SolrResourceLoader for directory: '/mnt/ssd/jenkins/workspace/Lucene-Solr-4.x-Linux/solr/build/solr-core/test/J1/./org.apache.solr.cloud.CollectionsAPIDistributedZkTest-jetty1-1375522690924/nodes_used_collection_shard1_replica2/'
   [junit4]   2> 726907 T2218 oasc.SolrResourceLoader.<init> new SolrResourceLoader for directory: '/mnt/ssd/jenkins/workspace/Lucene-Solr-4.x-Linux/solr/build/solr-core/test/J1/./org.apache.solr.cloud.CollectionsAPIDistributedZkTest-controljetty-1375522690726/nodes_used_collection_shard1_replica1/'
   [junit4]   2> 726918 T2264 oasc.SolrResourceLoader.<init> new SolrResourceLoader for directory: '/mnt/ssd/jenkins/workspace/Lucene-Solr-4.x-Linux/solr/build/solr-core/test/J1/./org.apache.solr.cloud.CollectionsAPIDistributedZkTest-jetty3-1375522693254/nodes_used_collection_shard2_replica2/'
   [junit4]   2> 726976 T2218 oasc.SolrConfig.<init> Using Lucene MatchVersion: LUCENE_45
   [junit4]   2> 726984 T2238 oasc.SolrConfig.<init> Using Lucene MatchVersion: LUCENE_45
   [junit4]   2> 726985 T2264 oasc.SolrConfig.<init> Using Lucene MatchVersion: LUCENE_45
   [junit4]   2> 726990 T2281 oasc.SolrConfig.<init> Using Lucene MatchVersion: LUCENE_45
   [junit4]   2> 727045 T2218 oasc.SolrConfig.<init> Loaded SolrConfig: solrconfig.xml
   [junit4]   2> 727048 T2218 oass.IndexSchema.readSchema Reading Solr Schema from schema.xml
   [junit4]   2> 727076 T2264 oasc.SolrConfig.<init> Loaded SolrConfig: solrconfig.xml
   [junit4]   2> 727080 T2218 oass.IndexSchema.readSchema [nodes_used_collection_shard1_replica1] Schema name=test
   [junit4]   2> 727084 T2264 oass.IndexSchema.readSchema Reading Solr Schema from schema.xml
   [junit4]   2> 727097 T2264 oass.IndexSchema.readSchema [nodes_used_collection_shard2_replica2] Schema name=test
   [junit4]   2> 727102 T2238 oasc.SolrConfig.<init> Loaded SolrConfig: solrconfig.xml
   [junit4]   2> 727104 T2238 oass.IndexSchema.readSchema Reading Solr Schema from schema.xml
   [junit4]   2> 727122 T2281 oasc.SolrConfig.<init> Loaded SolrConfig: solrconfig.xml
   [junit4]   2> 727124 T2281 oass.IndexSchema.readSchema Reading Solr Schema from schema.xml
   [junit4]   2> 727126 T2238 oass.IndexSchema.readSchema [nodes_used_collection_shard1_replica2] Schema name=test
   [junit4]   2> 727135 T2281 oass.IndexSchema.readSchema [nodes_used_collection_shard2_replica1] Schema name=test
   [junit4]   2> 727605 T2218 oass.ByteField.init WARN ByteField is deprecated and will be removed in 5.0. You should use TrieIntField instead.
   [junit4]   2> 727606 T2218 oass.ShortField.init WARN ShortField is deprecated and will be removed in 5.0. You should use TrieIntField instead.
   [junit4]   2> 727607 T2218 oass.OpenExchangeRatesOrgProvider.init Initialized with rates=open-exchange-rates.json, refreshInterval=1440.
   [junit4]   2> 727620 T2218 oass.IndexSchema.readSchema default search field in schema is text
   [junit4]   2> 727623 T2218 oass.IndexSchema.readSchema unique key field: id
   [junit4]   2> 727646 T2264 oass.ByteField.init WARN ByteField is deprecated and will be removed in 5.0. You should use TrieIntField instead.
   [junit4]   2> 727646 T2264 oass.ShortField.init WARN ShortField is deprecated and will be removed in 5.0. You should use TrieIntField instead.
   [junit4]   2> 727647 T2264 oass.OpenExchangeRatesOrgProvider.init Initialized with rates=open-exchange-rates.json, refreshInterval=1440.
   [junit4]   2> 727648 T2218 oass.FileExchangeRateProvider.reload Reloading exchange rates from file currency.xml
   [junit4]   2> 727652 T2264 oass.IndexSchema.readSchema default search field in schema is text
   [junit4]   2> 727653 T2218 oass.FileExchangeRateProvider.reload Reloading exchange rates from file currency.xml
   [junit4]   2> 727654 T2264 oass.IndexSchema.readSchema unique key field: id
   [junit4]   2> 727658 T2218 oass.OpenExchangeRatesOrgProvider.reload Reloading exchange rates from open-exchange-rates.json
   [junit4]   2> 727660 T2218 oass.OpenExchangeRatesOrgProvider$OpenExchangeRates.<init> WARN Unknown key IMPORTANT NOTE
   [junit4]   2> 727660 T2218 oass.OpenExchangeRatesOrgProvider$OpenExchangeRates.<init> WARN Expected key, got STRING
   [junit4]   2> 727660 T2218 oass.OpenExchangeRatesOrgProvider.reload Reloading exchange rates from open-exchange-rates.json
   [junit4]   2> 727662 T2218 oass.OpenExchangeRatesOrgProvider$OpenExchangeRates.<init> WARN Unknown key IMPORTANT NOTE
   [junit4]   2> 727662 T2218 oass.OpenExchangeRatesOrgProvider$OpenExchangeRates.<init> WARN Expected key, got STRING
   [junit4]   2> 727662 T2218 oasc.SolrCore.initDirectoryFactory org.apache.solr.core.MockDirectoryFactory
   [junit4]   2> 727663 T2218 oasc.SolrCore.<init> [nodes_used_collection_shard1_replica1] Opening new SolrCore at /mnt/ssd/jenkins/workspace/Lucene-Solr-4.x-Linux/solr/build/solr-core/test/J1/./org.apache.solr.cloud.CollectionsAPIDistributedZkTest-controljetty-1375522690726/nodes_used_collection_shard1_replica1/, dataDir=/mnt/ssd/jenkins/workspace/Lucene-Solr-4.x-Linux/solr/build/solr-core/test/J1/./org.apache.solr.cloud.CollectionsAPIDistributedZkTest-controljetty-1375522690726//nodes_used_collection_shard1_replica1/data/
   [junit4]   2> 727663 T2218 oasc.JmxMonitoredMap.<init> JMX monitoring is enabled. Adding Solr mbeans to JMX Server: com.sun.jmx.mbeanserver.JmxMBeanServer@116e73e3
   [junit4]   2> 727664 T2218 oasc.CachingDirectoryFactory.get return new directory for /mnt/ssd/jenkins/workspace/Lucene-Solr-4.x-Linux/solr/build/solr-core/test/J1/./org.apache.solr.cloud.CollectionsAPIDistributedZkTest-controljetty-1375522690726//nodes_used_collection_shard1_replica1/data
   [junit4]   2> 727665 T2218 oasc.SolrCore.getNewIndexDir New index directory detected: old=null new=/mnt/ssd/jenkins/workspace/Lucene-Solr-4.x-Linux/solr/build/solr-core/test/J1/./org.apache.solr.cloud.CollectionsAPIDistributedZkTest-controljetty-1375522690726//nodes_used_collection_shard1_replica1/data/index/
   [junit4]   2> 727665 T2218 oasc.SolrCore.initIndex WARN [nodes_used_collection_shard1_replica1] Solr index directory '/mnt/ssd/jenkins/workspace/Lucene-Solr-4.x-Linux/solr/build/solr-core/test/J1/./org.apache.solr.cloud.CollectionsAPIDistributedZkTest-controljetty-1375522690726/nodes_used_collection_shard1_replica1/data/index' doesn't exist. Creating new index...
   [junit4]   2> 727666 T2264 oass.FileExchangeRateProvider.reload Reloading exchange rates from file currency.xml
   [junit4]   2> 727666 T2218 oasc.CachingDirectoryFactory.get return new directory for /mnt/ssd/jenkins/workspace/Lucene-Solr-4.x-Linux/solr/build/solr-core/test/J1/./org.apache.solr.cloud.CollectionsAPIDistributedZkTest-controljetty-1375522690726//nodes_used_collection_shard1_replica1/data/index
   [junit4]   2> 727669 T2264 oass.FileExchangeRateProvider.reload Reloading exchange rates from file currency.xml
   [junit4]   2> 727669 T2218 oasc.SolrDeletionPolicy.onCommit SolrDeletionPolicy.onCommit: commits: num=1
   [junit4]   2> 		commit{dir=MockDirWrapper(org.apache.lucene.store.RAMDirectory@7221c71e lockFactory=org.apache.lucene.store.NativeFSLockFactory@5d190c2e),segFN=segments_1,generation=1}
   [junit4]   2> 727669 T2218 oasc.SolrDeletionPolicy.updateCommits newest commit generation = 1
   [junit4]   2> 727673 T2264 oass.OpenExchangeRatesOrgProvider.reload Reloading exchange rates from open-exchange-rates.json
   [junit4]   2> 727674 T2264 oass.OpenExchangeRatesOrgProvider$OpenExchangeRates.<init> WARN Unknown key IMPORTANT NOTE
   [junit4]   2> 727674 T2264 oass.OpenExchangeRatesOrgProvider$OpenExchangeRates.<init> WARN Expected key, got STRING
   [junit4]   2> 727675 T2264 oass.OpenExchangeRatesOrgProvider.reload Reloading exchange rates from open-exchange-rates.json
   [junit4]   2> 727675 T2218 oasup.UpdateRequestProcessorChain.init inserting DistributedUpdateProcessorFactory into updateRequestProcessorChain "dedupe"
   [junit4]   2> 727675 T2218 oasup.UpdateRequestProcessorChain.init inserting DistributedUpdateProcessorFactory into updateRequestProcessorChain "stored_sig"
   [junit4]   2> 727676 T2264 oass.OpenExchangeRatesOrgProvider$OpenExchangeRates.<init> WARN Unknown key IMPORTANT NOTE
   [junit4]   2> 727676 T2264 oass.OpenExchangeRatesOrgProvider$OpenExchangeRates.<init> WARN Expected key, got STRING
   [junit4]   2> 727676 T2264 oasc.SolrCore.initDirectoryFactory org.apache.solr.core.MockDirectoryFactory
   [junit4]   2> 727676 T2218 oasup.UpdateRequestProcessorChain.init inserting DistributedUpdateProcessorFactory into updateRequestProcessorChain "distrib-dup-test-chain-implicit"
   [junit4]   2> 727676 T2264 oasc.SolrCore.<init> [nodes_used_collection_shard2_replica2] Opening new SolrCore at /mnt/ssd/jenkins/workspace/Lucene-Solr-4.x-Linux/solr/build/solr-core/test/J1/./org.apache.solr.cloud.CollectionsAPIDistributedZkTest-jetty3-1375522693254/nodes_used_collection_shard2_replica2/, dataDir=/mnt/ssd/jenkins/workspace/Lucene-Solr-4.x-Linux/solr/build/solr-core/test/J1/./org.apache.solr.cloud.CollectionsAPIDistributedZkTest-jetty3-1375522693254//nodes_used_collection_shard2_replica2/data/
   [junit4]   2> 727677 T2264 oasc.JmxMonitoredMap.<init> JMX monitoring is enabled. Adding Solr mbeans to JMX Server: com.sun.jmx.mbeanserver.JmxMBeanServer@116e73e3
   [junit4]   2> 727677 T2218 oasc.RequestHandlers.initHandlersFromConfig created standard: solr.StandardRequestHandler
   [junit4]   2> 727678 T2264 oasc.CachingDirectoryFactory.get return new directory for /mnt/ssd/jenkins/workspace/Lucene-Solr-4.x-Linux/solr/build/solr-core/test/J1/./org.apache.solr.cloud.CollectionsAPIDistributedZkTest-jetty3-1375522693254//nodes_used_collection_shard2_replica2/data
   [junit4]   2> 727678 T2218 oasc.RequestHandlers.initHandlersFromConfig created /get: solr.RealTimeGetHandler
   [junit4]   2> 727678 T2264 oasc.SolrCore.getNewIndexDir New index directory detected: old=null new=/mnt/ssd/jenkins/workspace/Lucene-Solr-4.x-Linux/solr/build/solr-core/test/J1/./org.apache.solr.cloud.CollectionsAPIDistributedZkTest-jetty3-1375522693254//nodes_used_collection_shard2_replica2/data/index/
   [junit4]   2> 727678 T2218 oasc.RequestHandlers.initHandlersFromConfig adding lazy requestHandler: solr.ReplicationHandler
   [junit4]   2> 727678 T2264 oasc.SolrCore.initIndex WARN [nodes_used_collection_shard2_replica2] Solr index directory '/mnt/ssd/jenkins/workspace/Lucene-Solr-4.x-Linux/solr/build/solr-core/test/J1/./org.apache.solr.cloud.CollectionsAPIDistributedZkTest-jetty3-1375522693254/nodes_used_collection_shard2_replica2/data/index' doesn't exist. Creating new index...
   [junit4]   2> 727679 T2218 oasc.RequestHandlers.initHandlersFromConfig created /replication: solr.ReplicationHandler
   [junit4]   2> 727679 T2264 oasc.CachingDirectoryFactory.get return new directory for /mnt/ssd/jenkins/workspace/Lucene-Solr-4.x-Linux/solr/build/solr-core/test/J1/./org.apache.solr.cloud.CollectionsAPIDistributedZkTest-jetty3-1375522693254//nodes_used_collection_shard2_replica2/data/index
   [junit4]   2> 727680 T2218 oasc.RequestHandlers.initHandlersFromConfig created /update: solr.UpdateRequestHandler
   [junit4]   2> 727680 T2218 oasc.RequestHandlers.initHandlersFromConfig created /admin/: org.apache.solr.handler.admin.AdminHandlers
   [junit4]   2> 727681 T2264 oasc.SolrDeletionPolicy.onCommit SolrDeletionPolicy.onCommit: commits: num=1
   [junit4]   2> 		commit{dir=MockDirWrapper(org.apache.lucene.store.RAMDirectory@72a054ee lockFactory=org.apache.lucene.store.NativeFSLockFactory@2fb6a174),segFN=segments_1,generation=1}
   [junit4]   2> 727687 T2264 oasc.SolrDeletionPolicy.updateCommits newest commit generation = 1
   [junit4]   2> 727690 T2218 oashl.XMLLoader.init xsltCacheLifetimeSeconds=60
   [junit4]   2> 727692 T2264 oasup.UpdateRequestProcessorChain.init inserting DistributedUpdateProcessorFactory into updateRequestProcessorChain "dedupe"
   [junit4]   2> 727692 T2264 oasup.UpdateRequestProcessorChain.init inserting DistributedUpdateProcessorFactory into updateRequestProcessorChain "stored_sig"
   [junit4]   2> 727693 T2264 oasup.UpdateRequestProcessorChain.init inserting DistributedUpdateProcessorFactory into updateRequestProcessorChain "distrib-dup-test-chain-implicit"
   [junit4]   2> 727694 T2218 oass.SolrIndexSearcher.<init> Opening Searcher@3780cac8 main
   [junit4]   2> 727694 T2264 oasc.RequestHandlers.initHandlersFromConfig created standard: solr.StandardRequestHandler
   [junit4]   2> 727695 T2264 oasc.RequestHandlers.initHandlersFromConfig created /get: solr.RealTimeGetHandler
   [junit4]   2> 727695 T2218 oasu.CommitTracker.<init> Hard AutoCommit: disabled
   [junit4]   2> 727695 T2264 oasc.RequestHandlers.initHandlersFromConfig adding lazy requestHandler: solr.ReplicationHandler
   [junit4]   2> 727695 T2218 oasu.CommitTracker.<init> Soft AutoCommit: disabled
   [junit4]   2> 727696 T2264 oasc.RequestHandlers.initHandlersFromConfig created /replication: solr.ReplicationHandler
   [junit4]   2> 727697 T2264 oasc.RequestHandlers.initHandlersFromConfig created /update: solr.UpdateRequestHandler
   [junit4]   2> 727697 T2264 oasc.RequestHandlers.initHandlersFromConfig created /admin/: org.apache.solr.handler.admin.AdminHandlers
   [junit4]   2> 727699 T2264 oashl.XMLLoader.init xsltCacheLifetimeSeconds=60
   [junit4]   2> 727701 T2291 oasc.SolrCore.registerSearcher [nodes_used_collection_shard1_replica1] Registered new searcher Searcher@3780cac8 main{StandardDirectoryReader(segments_1:1)}
   [junit4]   2> 727702 T2264 oass.SolrIndexSearcher.<init> Opening Searcher@790e9e4e main
   [junit4]   2> 727703 T2264 oasu.CommitTracker.<init> Hard AutoCommit: disabled
   [junit4]   2> 727703 T2264 oasu.CommitTracker.<init> Soft AutoCommit: disabled
   [junit4]   2> 727704 T2218 oasc.CoreContainer.registerCore registering core: nodes_used_collection_shard1_replica1
   [junit4]   2> 727704 T2218 oasc.ZkController.register Register replica - core:nodes_used_collection_shard1_replica1 address:http://127.0.0.1:33471 collection:nodes_used_collection shard:shard1
   [junit4]   2> 727705 T2218 oascsi.HttpClientUtil.createClient Creating new http client, config:maxConnections=10000&maxConnectionsPerHost=20&connTimeout=15000&socketTimeout=30000&retry=false
   [junit4]   2> 727707 T2292 oasc.SolrCore.registerSearcher [nodes_used_collection_shard2_replica2] Registered new searcher Searcher@790e9e4e main{StandardDirectoryReader(segments_1:1)}
   [junit4]   2> 727708 T2264 oasc.CoreContainer.registerCore registering core: nodes_used_collection_shard2_replica2
   [junit4]   2> 727708 T2264 oasc.ZkController.register Register replica - core:nodes_used_collection_shard2_replica2 address:http://127.0.0.1:47852 collection:nodes_used_collection shard:shard2
   [junit4]   2> 727709 T2264 oascsi.HttpClientUtil.createClient Creating new http client, config:maxConnections=10000&maxConnectionsPerHost=20&connTimeout=15000&socketTimeout=30000&retry=false
   [junit4]   2> 727710 T2218 oascc.SolrZkClient.makePath makePath: /collections/nodes_used_collection/leader_elect/shard1/election
   [junit4]   2> 727716 T2264 oascc.SolrZkClient.makePath makePath: /collections/nodes_used_collection/leader_elect/shard2/election
   [junit4]   2> 727718 T2281 oass.ByteField.init WARN ByteField is deprecated and will be removed in 5.0. You should use TrieIntField instead.
   [junit4]   2> 727719 T2281 oass.ShortField.init WARN ShortField is deprecated and will be removed in 5.0. You should use TrieIntField instead.
   [junit4]   2> 727719 T2218 oasc.ShardLeaderElectionContext.runLeaderProcess Running the leader process for shard shard1
   [junit4]   2> 727719 T2281 oass.OpenExchangeRatesOrgProvider.init Initialized with rates=open-exchange-rates.json, refreshInterval=1440.
   [junit4]   2> 727723 T2218 oasc.ShardLeaderElectionContext.waitForReplicasToComeUp Waiting until we see more replicas up for shard shard1: total=2 found=1 timeoutin=179999
   [junit4]   2> 727731 T2264 oasc.ShardLeaderElectionContext.runLeaderProcess Running the leader process for shard shard2
   [junit4]   2> 727733 T2281 oass.IndexSchema.readSchema default search field in schema is text
   [junit4]   2> 727734 T2264 oasc.ShardLeaderElectionContext.waitForReplicasToComeUp Waiting until we see more replicas up for shard shard2: total=2 found=1 timeoutin=180000
   [junit4]   2> 727735 T2281 oass.IndexSchema.readSchema unique key field: id
   [junit4]   2> 727747 T2281 oass.FileExchangeRateProvider.reload Reloading exchange rates from file currency.xml
   [junit4]   2> 727747 T2238 oass.ByteField.init WARN ByteField is deprecated and will be removed in 5.0. You should use TrieIntField instead.
   [junit4]   2> 727748 T2238 oass.ShortField.init WARN ShortField is deprecated and will be removed in 5.0. You should use TrieIntField instead.
   [junit4]   2> 727748 T2238 oass.OpenExchangeRatesOrgProvider.init Initialized with rates=open-exchange-rates.json, refreshInterval=1440.
   [junit4]   2> 727751 T2281 oass.FileExchangeRateProvider.reload Reloading exchange rates from file currency.xml
   [junit4]   2> 727753 T2238 oass.IndexSchema.readSchema default search field in schema is text
   [junit4]   2> 727755 T2281 oass.OpenExchangeRatesOrgProvider.reload Reloading exchange rates from open-exchange-rates.json
   [junit4]   2> 727755 T2238 oass.IndexSchema.readSchema unique key field: id
   [junit4]   2> 727757 T2281 oass.OpenExchangeRatesOrgProvider$OpenExchangeRates.<init> WARN Unknown key IMPORTANT NOTE
   [junit4]   2> 727757 T2281 oass.OpenExchangeRatesOrgProvider$OpenExchangeRates.<init> WARN Expected key, got STRING
   [junit4]   2> 727758 T2281 oass.OpenExchangeRatesOrgProvider.reload Reloading exchange rates from open-exchange-rates.json
   [junit4]   2> 727758 T2281 oass.OpenExchangeRatesOrgProvider$OpenExchangeRates.<init> WARN Unknown key IMPORTANT NOTE
   [junit4]   2> 727759 T2281 oass.OpenExchangeRatesOrgProvider$OpenExchangeRates.<init> WARN Expected key, got STRING
   [junit4]   2> 727759 T2281 oasc.SolrCore.initDirectoryFactory org.apache.solr.core.MockDirectoryFactory
   [junit4]   2> 727759 T2281 oasc.SolrCore.<init> [nodes_used_collection_shard2_replica1] Opening new SolrCore at /mnt/ssd/jenkins/workspace/Lucene-Solr-4.x-Linux/solr/build/solr-core/test/J1/./org.apache.solr.cloud.CollectionsAPIDistributedZkTest-jetty4-1375522694455/nodes_used_collection_shard2_replica1/, dataDir=/mnt/ssd/jenkins/workspace/Lucene-Solr-4.x-Linux/solr/build/solr-core/test/J1/./org.apache.solr.cloud.CollectionsAPIDistributedZkTest-jetty4-1375522694455//nodes_used_collection_shard2_replica1/data/
   [junit4]   2> 727759 T2281 oasc.JmxMonitoredMap.<init> JMX monitoring is enabled. Adding Solr mbeans to JMX Server: com.sun.jmx.mbeanserver.JmxMBeanServer@116e73e3
   [junit4]   2> 727760 T2281 oasc.CachingDirectoryFactory.get return new directory for /mnt/ssd/jenkins/workspace/Lucene-Solr-4.x-Linux/solr/build/solr-core/test/J1/./org.apache.solr.cloud.CollectionsAPIDistributedZkTest-jetty4-1375522694455//nodes_used_collection_shard2_replica1/data
   [junit4]   2> 727761 T2281 oasc.SolrCore.getNewIndexDir New index directory detected: old=null new=/mnt/ssd/jenkins/workspace/Lucene-Solr-4.x-Linux/solr/build/solr-core/test/J1/./org.apache.solr.cloud.CollectionsAPIDistributedZkTest-jetty4-1375522694455//nodes_used_collection_shard2_replica1/data/index/
   [junit4]   2> 727761 T2281 oasc.SolrCore.initIndex WARN [nodes_used_collection_shard2_replica1] Solr index directory '/mnt/ssd/jenkins/workspace/Lucene-Solr-4.x-Linux/solr/build/solr-core/test/J1/./org.apache.solr.cloud.CollectionsAPIDistributedZkTest-jetty4-1375522694455/nodes_used_collection_shard2_replica1/data/index' doesn't exist. Creating new index...
   [junit4]   2> 727761 T2281 oasc.CachingDirectoryFactory.get return new directory for /mnt/ssd/jenkins/workspace/Lucene-Solr-4.x-Linux/solr/build/solr-core/test/J1/./org.apache.solr.cloud.CollectionsAPIDistributedZkTest-jetty4-1375522694455//nodes_used_collection_shard2_replica1/data/index
   [junit4]   2> 727763 T2281 oasc.SolrDeletionPolicy.onCommit SolrDeletionPolicy.onCommit: commits: num=1
   [junit4]   2> 		commit{dir=MockDirWrapper(org.apache.lucene.store.RAMDirectory@4a632001 lockFactory=org.apache.lucene.store.NativeFSLockFactory@2072e305),segFN=segments_1,generation=1}
   [junit4]   2> 727763 T2281 oasc.SolrDeletionPolicy.updateCommits newest commit generation = 1
   [junit4]   2> 727766 T2281 oasup.UpdateRequestProcessorChain.init inserting DistributedUpdateProcessorFactory into updateRequestProcessorChain "dedupe"
   [junit4]   2> 727767 T2281 oasup.UpdateRequestProcessorChain.init inserting DistributedUpdateProcessorFactory into updateRequestProcessorChain "stored_sig"
   [junit4]   2> 727767 T2238 oass.FileExchangeRateProvider.reload Reloading exchange rates from file currency.xml
   [junit4]   2> 727767 T2281 oasup.UpdateRequestProcessorChain.init inserting DistributedUpdateProcessorFactory into updateRequestProcessorChain "distrib-dup-test-chain-implicit"
   [junit4]   2> 727768 T2281 oasc.RequestHandlers.initHandlersFromConfig created standard: solr.StandardRequestHandler
   [junit4]   2> 727768 T2281 oasc.RequestHandlers.initHandlersFromConfig created /get: solr.RealTimeGetHandler
   [junit4]   2> 727768 T2281 oasc.RequestHandlers.initHandlersFromConfig adding lazy requestHandler: solr.ReplicationHandler
   [junit4]   2> 727769 T2281 oasc.RequestHandlers.initHandlersFromConfig created /replication: solr.ReplicationHandler
   [junit4]   2> 727769 T2281 oasc.RequestHandlers.initHandlersFromConfig created /update: solr.UpdateRequestHandler
   [junit4]   2> 727769 T2281 oasc.RequestHandlers.initHandlersFromConfig created /admin/: org.apache.solr.handler.admin.AdminHandlers
   [junit4]   2> 727771 T2281 oashl.XMLLoader.init xsltCacheLifetimeSeconds=60
   [junit4]   2> 727772 T2238 oass.FileExchangeRateProvider.reload Reloading exchange rates from file currency.xml
   [junit4]   2> 727773 T2281 oass.SolrIndexSearcher.<init> Opening Searcher@7a2dabe8 main
   [junit4]   2> 727774 T2281 oasu.CommitTracker.<init> Hard AutoCommit: disabled
   [junit4]   2> 727774 T2281 oasu.CommitTracker.<init> Soft AutoCommit: disabled
   [junit4]   2> 727775 T2238 oass.OpenExchangeRatesOrgProvider.reload Reloading exchange rates from open-exchange-rates.json
   [junit4]   2> 727776 T2238 oass.OpenExchangeRatesOrgProvider$OpenExchangeRates.<init> WARN Unknown key IMPORTANT NOTE
   [junit4]   2> 727776 T2238 oass.OpenExchangeRatesOrgProvider$OpenExchangeRates.<init> WARN Expected key, got STRING
   [junit4]   2> 727776 T2238 oass.OpenExchangeRatesOrgProvider.reload Reloading exchange rates from open-exchange-rates.json
   [junit4]   2> 727777 T2293 oasc.SolrCore.registerSearcher [nodes_used_collection_shard2_replica1] Registered new searcher Searcher@7a2dabe8 main{StandardDirectoryReader(segments_1:1)}
   [junit4]   2> 727777 T2238 oass.OpenExchangeRatesOrgProvider$OpenExchangeRates.<init> WARN Unknown key IMPORTANT NOTE
   [junit4]   2> 727778 T2238 oass.OpenExchangeRatesOrgProvider$OpenExchangeRates.<init> WARN Expected key, got STRING
   [junit4]   2> 727778 T2238 oasc.SolrCore.initDirectoryFactory org.apache.solr.core.MockDirectoryFactory
   [junit4]   2> 727779 T2238 oasc.SolrCore.<init> [nodes_used_collection_shard1_replica2] Opening new SolrCore at /mnt/ssd/jenkins/workspace/Lucene-Solr-4.x-Linux/solr/build/solr-core/test/J1/./org.apache.solr.cloud.CollectionsAPIDistributedZkTest-jetty1-1375522690924/nodes_used_collection_shard1_replica2/, dataDir=/mnt/ssd/jenkins/workspace/Lucene-Solr-4.x-Linux/solr/build/solr-core/test/J1/./org.apache.solr.cloud.CollectionsAPIDistributedZkTest-jetty1-1375522690924//nodes_used_collection_shard1_replica2/data/
   [junit4]   2> 727779 T2281 oasc.CoreContainer.registerCore registering core: nodes_used_collection_shard2_replica1
   [junit4]   2> 727779 T2238 oasc.JmxMonitoredMap.<init> JMX monitoring is enabled. Adding Solr mbeans to JMX Server: com.sun.jmx.mbeanserver.JmxMBeanServer@116e73e3
   [junit4]   2> 727779 T2281 oasc.ZkController.register Register replica - core:nodes_used_collection_shard2_replica1 address:http://127.0.0.1:52506 collection:nodes_used_collection shard:shard2
   [junit4]   2> 727780 T2281 oascsi.HttpClientUtil.createClient Creating new http client, config:maxConnections=10000&maxConnectionsPerHost=20&connTimeout=15000&socketTimeout=30000&retry=false
   [junit4]   2> 727780 T2238 oasc.CachingDirectoryFactory.get return new directory for /mnt/ssd/jenkins/workspace/Lucene-Solr-4.x-Linux/solr/build/solr-core/test/J1/./org.apache.solr.cloud.CollectionsAPIDistributedZkTest-jetty1-1375522690924//nodes_used_collection_shard1_replica2/data
   [junit4]   2> 727780 T2238 oasc.SolrCore.getNewIndexDir New index directory detected: old=null new=/mnt/ssd/jenkins/workspace/Lucene-Solr-4.x-Linux/solr/build/solr-core/test/J1/./org.apache.solr.cloud.CollectionsAPIDistributedZkTest-jetty1-1375522690924//nodes_used_collection_shard1_replica2/data/index/
   [junit4]   2> 727781 T2238 oasc.SolrCore.initIndex WARN [nodes_used_collection_shard1_replica2] Solr index directory '/mnt/ssd/jenkins/workspace/Lucene-Solr-4.x-Linux/solr/build/solr-core/test/J1/./org.apache.solr.cloud.CollectionsAPIDistributedZkTest-jetty1-1375522690924/nodes_used_collection_shard1_replica2/data/index' doesn't exist. Creating new index...
   [junit4]   2> 727781 T2238 oasc.CachingDirectoryFactory.get return new directory for /mnt/ssd/jenkins/workspace/Lucene-Solr-4.x-Linux/solr/build/solr-core/test/J1/./org.apache.solr.cloud.CollectionsAPIDistributedZkTest-jetty1-1375522690924//nodes_used_collection_shard1_replica2/data/index
   [junit4]   2> 727784 T2238 oasc.SolrDeletionPolicy.onCommit SolrDeletionPolicy.onCommit: commits: num=1
   [junit4]   2> 		commit{dir=MockDirWrapper(org.apache.lucene.store.RAMDirectory@187a909a lockFactory=org.apache.lucene.store.NativeFSLockFactory@49a11746),segFN=segments_1,generation=1}
   [junit4]   2> 727784 T2238 oasc.SolrDeletionPolicy.updateCommits newest commit generation = 1
   [junit4]   2> 727789 T2238 oasup.UpdateRequestProcessorChain.init inserting DistributedUpdateProcessorFactory into updateRequestProcessorChain "dedupe"
   [junit4]   2> 727789 T2238 oasup.UpdateRequestProcessorChain.init inserting DistributedUpdateProcessorFactory into updateRequestProcessorChain "stored_sig"
   [junit4]   2> 727790 T2238 oasup.UpdateRequestProcessorChain.init inserting DistributedUpdateProcessorFactory into updateRequestProcessorChain "distrib-dup-test-chain-implicit"
   [junit4]   2> 727791 T2238 oasc.RequestHandlers.initHandlersFromConfig created standard: solr.StandardRequestHandler
   [junit4]   2> 727791 T2238 oasc.RequestHandlers.initHandlersFromConfig created /get: solr.RealTimeGetHandler
   [junit4]   2> 727792 T2238 oasc.RequestHandlers.initHandlersFromConfig adding lazy requestHandler: solr.ReplicationHandler
   [junit4]   2> 727792 T2238 oasc.RequestHandlers.initHandlersFromConfig created /replication: solr.ReplicationHandler
   [junit4]   2> 727793 T2238 oasc.RequestHandlers.initHandlersFromConfig created /update: solr.UpdateRequestHandler
   [junit4]   2> 727793 T2238 oasc.RequestHandlers.initHandlersFromConfig created /admin/: org.apache.solr.handler.admin.AdminHandlers
   [junit4]   2> 727797 T2238 oashl.XMLLoader.init xsltCacheLifetimeSeconds=60
   [junit4]   2> 727800 T2238 oass.SolrIndexSearcher.<init> Opening Searcher@363e8350 main
   [junit4]   2> 727801 T2238 oasu.CommitTracker.<init> Hard AutoCommit: disabled
   [junit4]   2> 727801 T2238 oasu.CommitTracker.<init> Soft AutoCommit: disabled
   [junit4]   2> 727805 T2294 oasc.SolrCore.registerSearcher [nodes_used_collection_shard1_replica2] Registered new searcher Searcher@363e8350 main{StandardDirectoryReader(segments_1:1)}
   [junit4]   2> 727808 T2238 oasc.CoreContainer.registerCore registering core: nodes_used_collection_shard1_replica2
   [junit4]   2> 727808 T2238 oasc.ZkController.register Register replica - core:nodes_used_collection_shard1_replica2 address:http://127.0.0.1:54833 collection:nodes_used_collection shard:shard1
   [junit4]   2> 727808 T2238 oascsi.HttpClientUtil.createClient Creating new http client, config:maxConnections=10000&maxConnectionsPerHost=20&connTimeout=15000&socketTimeout=30000&retry=false
   [junit4]   2> 727881 T2226 oascc.ZkStateReader.updateClusterState Updating cloud state from ZooKeeper... 
   [junit4]   2> 727888 T2230 oascc.ZkStateReader$2.process A cluster state change: WatchedEvent state:SyncConnected type:NodeDataChanged path:/clusterstate.json, has occurred - updating... (live nodes size: 5)
   [junit4]   2> 727888 T2285 oascc.ZkStateReader$2.process A cluster state change: WatchedEvent state:SyncConnected type:NodeDataChanged path:/clusterstate.json, has occurred - updating... (live nodes size: 5)
   [junit4]   2> 727888 T2243 oascc.ZkStateReader$2.process A cluster state change: WatchedEvent state:SyncConnected type:NodeDataChanged path:/clusterstate.json, has occurred - updating... (live nodes size: 5)
   [junit4]   2> 727888 T2257 oascc.ZkStateReader$2.process A cluster state change: WatchedEvent state:SyncConnected type:NodeDataChanged path:/clusterstate.json, has occurred - updating... (live nodes size: 5)
   [junit4]   2> 727888 T2271 oascc.ZkStateReader$2.process A cluster state change: WatchedEvent state:SyncConnected type:NodeDataChanged path:/clusterstate.json, has occurred - updating... (live nodes size: 5)
   [junit4]   2> 727888 T2225 oascc.ZkStateReader$2.process A cluster state change: WatchedEvent state:SyncConnected type:NodeDataChanged path:/clusterstate.json, has occurred - updating... (live nodes size: 5)
   [junit4]   2> 728231 T2218 oasc.ShardLeaderElectionContext.waitForReplicasToComeUp Enough replicas found to continue.
   [junit4]   2> 728232 T2218 oasc.ShardLeaderElectionContext.runLeaderProcess I may be the new leader - try and sync
   [junit4]   2> 728232 T2218 oasc.SyncStrategy.sync Sync replicas to http://127.0.0.1:33471/nodes_used_collection_shard1_replica1/
   [junit4]   2> 728232 T2218 oasu.PeerSync.sync PeerSync: core=nodes_used_collection_shard1_replica1 url=http://127.0.0.1:33471 START replicas=[http://127.0.0.1:54833/nodes_used_collection_shard1_replica2/] nUpdates=100
   [junit4]   2> 728233 T2218 oasu.PeerSync.sync PeerSync: core=nodes_used_collection_shard1_replica1 url=http://127.0.0.1:33471 DONE.  We have no versions.  sync failed.
   [junit4]   2> 728233 T2218 oasc.SyncStrategy.syncReplicas Leader's attempt to sync with shard failed, moving to the next candidate
   [junit4]   2> 728234 T2218 oasc.ShardLeaderElectionContext.runLeaderProcess We failed sync, but we have no versions - we can't sync in that case - we were active before, so become leader anyway
   [junit4]   2> 728235 T2218 oasc.ShardLeaderElectionContext.runLeaderProcess I am the new leader: http://127.0.0.1:33471/nodes_used_collection_shard1_replica1/ shard1
   [junit4]   2> 728235 T2218 oascc.SolrZkClient.makePath makePath: /collections/nodes_used_collect

[...truncated too long message...]

45976 T2203 oasc.CachingDirectoryFactory.closeCacheValue looking to close /mnt/ssd/jenkins/workspace/Lucene-Solr-4.x-Linux/solr/build/solr-core/test/J1/./org.apache.solr.cloud.CollectionsAPIDistributedZkTest-jetty4-1375522694455//new_implicit_coll_0_b_replica3/data [CachedDir<<refCount=0;path=/mnt/ssd/jenkins/workspace/Lucene-Solr-4.x-Linux/solr/build/solr-core/test/J1/./org.apache.solr.cloud.CollectionsAPIDistributedZkTest-jetty4-1375522694455//new_implicit_coll_0_b_replica3/data;done=false>>]
   [junit4]   2> 845976 T2203 oasc.CachingDirectoryFactory.close Closing directory: /mnt/ssd/jenkins/workspace/Lucene-Solr-4.x-Linux/solr/build/solr-core/test/J1/./org.apache.solr.cloud.CollectionsAPIDistributedZkTest-jetty4-1375522694455//new_implicit_coll_0_b_replica3/data
   [junit4]   2> 845976 T2203 oasc.CachingDirectoryFactory.closeCacheValue looking to close /mnt/ssd/jenkins/workspace/Lucene-Solr-4.x-Linux/solr/build/solr-core/test/J1/./org.apache.solr.cloud.CollectionsAPIDistributedZkTest-jetty4-1375522694455//new_implicit_coll_0_b_replica3/data/index [CachedDir<<refCount=0;path=/mnt/ssd/jenkins/workspace/Lucene-Solr-4.x-Linux/solr/build/solr-core/test/J1/./org.apache.solr.cloud.CollectionsAPIDistributedZkTest-jetty4-1375522694455//new_implicit_coll_0_b_replica3/data/index;done=false>>]
   [junit4]   2> 845976 T2203 oasc.CachingDirectoryFactory.close Closing directory: /mnt/ssd/jenkins/workspace/Lucene-Solr-4.x-Linux/solr/build/solr-core/test/J1/./org.apache.solr.cloud.CollectionsAPIDistributedZkTest-jetty4-1375522694455//new_implicit_coll_0_b_replica3/data/index
   [junit4]   2> 845977 T2568 oasc.Overseer$ClusterStateUpdater.amILeader According to ZK I (id=90146255035695116-127.0.0.1:52506_-n_0000000004) am no longer a leader.
   [junit4]   2> 845990 T2203 oejsh.ContextHandler.doStop stopped o.e.j.s.ServletContextHandler{/,null}
   [junit4]   2> 846043 T2203 oas.SolrTestCaseJ4.tearDown ###Ending testDistribSearch
   [junit4]   2> 846044 T2203 oasc.ZkTestServer.send4LetterWord connecting to 127.0.0.1:39965 39965
   [junit4]   1> client port:0.0.0.0/0.0.0.0:0
   [junit4]   2> NOTE: reproduce with: ant test  -Dtestcase=CollectionsAPIDistributedZkTest -Dtests.method=testDistribSearch -Dtests.seed=2A8B4DEFBEEA59F4 -Dtests.multiplier=3 -Dtests.slow=true -Dtests.locale=ja_JP_JP_#u-ca-japanese -Dtests.timezone=Australia/Tasmania -Dtests.file.encoding=UTF-8
   [junit4] ERROR    128s J1 | CollectionsAPIDistributedZkTest.testDistribSearch <<<
   [junit4]    > Throwable #1: org.apache.solr.client.solrj.SolrServerException: Server refused connection at: http://127.0.0.1:54833
   [junit4]    > 	at __randomizedtesting.SeedInfo.seed([2A8B4DEFBEEA59F4:AB6DC3F7C9B539C8]:0)
   [junit4]    > 	at org.apache.solr.client.solrj.impl.HttpSolrServer.request(HttpSolrServer.java:428)
   [junit4]    > 	at org.apache.solr.client.solrj.impl.HttpSolrServer.request(HttpSolrServer.java:180)
   [junit4]    > 	at org.apache.solr.cloud.CollectionsAPIDistributedZkTest.testCustomCollectionsAPI(CollectionsAPIDistributedZkTest.java:764)
   [junit4]    > 	at org.apache.solr.cloud.CollectionsAPIDistributedZkTest.doTest(CollectionsAPIDistributedZkTest.java:159)
   [junit4]    > 	at org.apache.solr.BaseDistributedSearchTestCase.testDistribSearch(BaseDistributedSearchTestCase.java:835)
   [junit4]    > 	at java.lang.Thread.run(Thread.java:724)
   [junit4]    > Caused by: org.apache.http.conn.HttpHostConnectException: Connection to http://127.0.0.1:54833 refused
   [junit4]    > 	at org.apache.http.impl.conn.DefaultClientConnectionOperator.openConnection(DefaultClientConnectionOperator.java:190)
   [junit4]    > 	at org.apache.http.impl.conn.ManagedClientConnectionImpl.open(ManagedClientConnectionImpl.java:294)
   [junit4]    > 	at org.apache.http.impl.client.DefaultRequestDirector.tryConnect(DefaultRequestDirector.java:645)
   [junit4]    > 	at org.apache.http.impl.client.DefaultRequestDirector.execute(DefaultRequestDirector.java:480)
   [junit4]    > 	at org.apache.http.impl.client.AbstractHttpClient.execute(AbstractHttpClient.java:906)
   [junit4]    > 	at org.apache.http.impl.client.AbstractHttpClient.execute(AbstractHttpClient.java:805)
   [junit4]    > 	at org.apache.http.impl.client.AbstractHttpClient.execute(AbstractHttpClient.java:784)
   [junit4]    > 	at org.apache.solr.client.solrj.impl.HttpSolrServer.request(HttpSolrServer.java:365)
   [junit4]    > 	... 44 more
   [junit4]    > Caused by: java.net.ConnectException: Connection refused
   [junit4]    > 	at java.net.PlainSocketImpl.socketConnect(Native Method)
   [junit4]    > 	at java.net.AbstractPlainSocketImpl.doConnect(AbstractPlainSocketImpl.java:339)
   [junit4]    > 	at java.net.AbstractPlainSocketImpl.connectToAddress(AbstractPlainSocketImpl.java:200)
   [junit4]    > 	at java.net.AbstractPlainSocketImpl.connect(AbstractPlainSocketImpl.java:182)
   [junit4]    > 	at java.net.SocksSocketImpl.connect(SocksSocketImpl.java:392)
   [junit4]    > 	at java.net.Socket.connect(Socket.java:579)
   [junit4]    > 	at org.apache.http.conn.scheme.PlainSocketFactory.connectSocket(PlainSocketFactory.java:127)
   [junit4]    > 	at org.apache.http.impl.conn.DefaultClientConnectionOperator.openConnection(DefaultClientConnectionOperator.java:180)
   [junit4]    > 	... 51 more
   [junit4]   2> 846462 T2203 oas.SolrTestCaseJ4.deleteCore ###deleteCore
   [junit4]   2> 128169 T2202 ccr.ThreadLeakControl.checkThreadLeaks WARNING Will linger awaiting termination of 2 leaked thread(s).
   [junit4]   2> 847278 T2285 oascc.ZkStateReader$3.process WARN ZooKeeper watch triggered, but Solr cannot talk to ZK
   [junit4]   2> 847278 T2285 oascc.ZkStateReader$2.process A cluster state change: WatchedEvent state:SyncConnected type:NodeChildrenChanged path:/live_nodes, has occurred - updating... (live nodes size: 1)
   [junit4]   2> 847279 T2285 oascc.ZkStateReader$2.process WARN ZooKeeper watch triggered, but Solr cannot talk to ZK
   [junit4]   2> NOTE: test params are: codec=Lucene42: {_route_=Pulsing41(freqCutoff=16 minBlockSize=71 maxBlockSize=183), range_facet_l=PostingsFormat(name=Lucene41WithOrds), text=Pulsing41(freqCutoff=16 minBlockSize=71 maxBlockSize=183), _version_=PostingsFormat(name=Lucene41WithOrds), intDefault=PostingsFormat(name=Lucene41WithOrds), id=PostingsFormat(name=SimpleText), timestamp=PostingsFormat(name=Lucene41WithOrds), a_t=PostingsFormat(name=Lucene41WithOrds), range_facet_sl=Pulsing41(freqCutoff=16 minBlockSize=71 maxBlockSize=183), range_facet_si=Lucene41(blocksize=128), other_tl1=PostingsFormat(name=Lucene41WithOrds), multiDefault=Lucene41(blocksize=128), a_si=Lucene41(blocksize=128)}, docValues:{}, sim=DefaultSimilarity, locale=ja_JP_JP_#u-ca-japanese, timezone=Australia/Tasmania
   [junit4]   2> NOTE: Linux 3.2.0-51-generic amd64/Oracle Corporation 1.7.0_25 (64-bit)/cpus=8,threads=2,free=118770408,total=248487936
   [junit4]   2> NOTE: All tests run in this JVM: [TestHashPartitioner, TestFastOutputStream, TestOmitPositions, HdfsSyncSliceTest, TestSchemaVersionResource, TestDefaultSimilarityFactory, RequiredFieldsTest, TermVectorComponentDistributedTest, TestIndexingPerformance, TestBinaryResponseWriter, TestSchemaSimilarityResource, TestManagedSchema, CopyFieldTest, TestReloadAndDeleteDocs, OutputWriterTest, NotRequiredUniqueKeyTest, DocumentAnalysisRequestHandlerTest, IndexSchemaRuntimeFieldTest, ShardSplitTest, TestSolr4Spatial, PreAnalyzedUpdateProcessorTest, XsltUpdateRequestHandlerTest, FileUtilsTest, DirectSolrSpellCheckerTest, TestBinaryField, TestSystemIdResolver, ClusterStateTest, TestCollationKeyRangeQueries, ShardRoutingCustomTest, SuggesterWFSTTest, RequestHandlersTest, TestDistributedGrouping, TestCodecSupport, CurrencyFieldOpenExchangeTest, TestComponentsName, TestBM25SimilarityFactory, TestLazyCores, TestPostingsSolrHighlighter, TestAnalyzedSuggestions, ZkSolrClientTest, TestElisionMultitermQuery, TestStressReorder, DistanceFunctionTest, BadCopyFieldTest, TestUtils, SampleTest, SolrIndexConfigTest, PingRequestHandlerTest, BasicZkTest, TestRTGBase, TestWordDelimiterFilterFactory, TestCopyFieldCollectionResource, HighlighterConfigTest, TimeZoneUtilsTest, DOMUtilTest, XmlUpdateRequestHandlerTest, HardAutoCommitTest, TestAtomicUpdateErrorCases, SolrCmdDistributorTest, TestDynamicFieldResource, TestIndexSearcher, IndexBasedSpellCheckerTest, TestSolrXMLSerializer, NoCacheHeaderTest, TestCoreDiscovery, UpdateParamsTest, SortByFunctionTest, TestLMJelinekMercerSimilarityFactory, OpenCloseCoreStressTest, TestClassNameShortening, TestFieldCollectionResource, TestDFRSimilarityFactory, StandardRequestHandlerTest, TestUpdate, ChaosMonkeySafeLeaderTest, BasicDistributedZk2Test, CollectionsAPIDistributedZkTest]
   [junit4] Completed on J1 in 129.22s, 1 test, 1 error <<< FAILURES!

[...truncated 476 lines...]
BUILD FAILED
/mnt/ssd/jenkins/workspace/Lucene-Solr-4.x-Linux/build.xml:395: The following error occurred while executing this line:
/mnt/ssd/jenkins/workspace/Lucene-Solr-4.x-Linux/build.xml:375: The following error occurred while executing this line:
/mnt/ssd/jenkins/workspace/Lucene-Solr-4.x-Linux/build.xml:39: The following error occurred while executing this line:
/mnt/ssd/jenkins/workspace/Lucene-Solr-4.x-Linux/solr/build.xml:181: The following error occurred while executing this line:
/mnt/ssd/jenkins/workspace/Lucene-Solr-4.x-Linux/solr/common-build.xml:449: The following error occurred while executing this line:
/mnt/ssd/jenkins/workspace/Lucene-Solr-4.x-Linux/lucene/common-build.xml:1233: The following error occurred while executing this line:
/mnt/ssd/jenkins/workspace/Lucene-Solr-4.x-Linux/lucene/common-build.xml:876: There were test failures: 321 suites, 1352 tests, 1 error, 34 ignored (6 assumptions)

Total time: 41 minutes 44 seconds
Build step 'Invoke Ant' marked build as failure
Description set: Java: 64bit/jdk1.7.0_25 -XX:-UseCompressedOops -XX:+UseSerialGC
Archiving artifacts
Recording test results
Email was triggered for: Failure
Sending email for trigger: Failure



Mime
View raw message