lucene-dev mailing list archives

Site index · List index
Message view « Date » · « Thread »
Top « Date » · « Thread »
From Policeman Jenkins Server <jenk...@thetaphi.de>
Subject [JENKINS] Lucene-Solr-4.x-Windows (64bit/jdk1.7.0_25) - Build # 3044 - Still Failing!
Date Fri, 02 Aug 2013 23:06:58 GMT
Build: http://jenkins.thetaphi.de/job/Lucene-Solr-4.x-Windows/3044/
Java: 64bit/jdk1.7.0_25 -XX:+UseCompressedOops -XX:+UseConcMarkSweepGC

1 tests failed.
FAILED:  org.apache.solr.cloud.CollectionsAPIDistributedZkTest.testDistribSearch

Error Message:
Server refused connection at: http://127.0.0.1:60999/jzit

Stack Trace:
org.apache.solr.client.solrj.SolrServerException: Server refused connection at: http://127.0.0.1:60999/jzit
	at __randomizedtesting.SeedInfo.seed([7A25E5704A757642:FBC36B683D2A167E]:0)
	at org.apache.solr.client.solrj.impl.HttpSolrServer.request(HttpSolrServer.java:428)
	at org.apache.solr.client.solrj.impl.HttpSolrServer.request(HttpSolrServer.java:180)
	at org.apache.solr.cloud.AbstractFullDistribZkTestBase.createCollection(AbstractFullDistribZkTestBase.java:1535)
	at org.apache.solr.cloud.CollectionsAPIDistributedZkTest.testCustomCollectionsAPI(CollectionsAPIDistributedZkTest.java:677)
	at org.apache.solr.cloud.CollectionsAPIDistributedZkTest.doTest(CollectionsAPIDistributedZkTest.java:159)
	at org.apache.solr.BaseDistributedSearchTestCase.testDistribSearch(BaseDistributedSearchTestCase.java:835)
	at sun.reflect.NativeMethodAccessorImpl.invoke0(Native Method)
	at sun.reflect.NativeMethodAccessorImpl.invoke(NativeMethodAccessorImpl.java:57)
	at sun.reflect.DelegatingMethodAccessorImpl.invoke(DelegatingMethodAccessorImpl.java:43)
	at java.lang.reflect.Method.invoke(Method.java:606)
	at com.carrotsearch.randomizedtesting.RandomizedRunner.invoke(RandomizedRunner.java:1559)
	at com.carrotsearch.randomizedtesting.RandomizedRunner.access$600(RandomizedRunner.java:79)
	at com.carrotsearch.randomizedtesting.RandomizedRunner$6.evaluate(RandomizedRunner.java:737)
	at com.carrotsearch.randomizedtesting.RandomizedRunner$7.evaluate(RandomizedRunner.java:773)
	at com.carrotsearch.randomizedtesting.RandomizedRunner$8.evaluate(RandomizedRunner.java:787)
	at com.carrotsearch.randomizedtesting.rules.SystemPropertiesRestoreRule$1.evaluate(SystemPropertiesRestoreRule.java:53)
	at org.apache.lucene.util.TestRuleSetupTeardownChained$1.evaluate(TestRuleSetupTeardownChained.java:50)
	at org.apache.lucene.util.TestRuleFieldCacheSanity$1.evaluate(TestRuleFieldCacheSanity.java:51)
	at org.apache.lucene.util.AbstractBeforeAfterRule$1.evaluate(AbstractBeforeAfterRule.java:46)
	at com.carrotsearch.randomizedtesting.rules.SystemPropertiesInvariantRule$1.evaluate(SystemPropertiesInvariantRule.java:55)
	at org.apache.lucene.util.TestRuleThreadAndTestName$1.evaluate(TestRuleThreadAndTestName.java:49)
	at org.apache.lucene.util.TestRuleIgnoreAfterMaxFailures$1.evaluate(TestRuleIgnoreAfterMaxFailures.java:70)
	at org.apache.lucene.util.TestRuleMarkFailure$1.evaluate(TestRuleMarkFailure.java:48)
	at com.carrotsearch.randomizedtesting.rules.StatementAdapter.evaluate(StatementAdapter.java:36)
	at com.carrotsearch.randomizedtesting.ThreadLeakControl$StatementRunner.run(ThreadLeakControl.java:358)
	at com.carrotsearch.randomizedtesting.ThreadLeakControl.forkTimeoutingTask(ThreadLeakControl.java:782)
	at com.carrotsearch.randomizedtesting.ThreadLeakControl$3.evaluate(ThreadLeakControl.java:442)
	at com.carrotsearch.randomizedtesting.RandomizedRunner.runSingleTest(RandomizedRunner.java:746)
	at com.carrotsearch.randomizedtesting.RandomizedRunner$3.evaluate(RandomizedRunner.java:648)
	at com.carrotsearch.randomizedtesting.RandomizedRunner$4.evaluate(RandomizedRunner.java:682)
	at com.carrotsearch.randomizedtesting.RandomizedRunner$5.evaluate(RandomizedRunner.java:693)
	at com.carrotsearch.randomizedtesting.rules.StatementAdapter.evaluate(StatementAdapter.java:36)
	at com.carrotsearch.randomizedtesting.rules.SystemPropertiesRestoreRule$1.evaluate(SystemPropertiesRestoreRule.java:53)
	at org.apache.lucene.util.AbstractBeforeAfterRule$1.evaluate(AbstractBeforeAfterRule.java:46)
	at org.apache.lucene.util.TestRuleStoreClassName$1.evaluate(TestRuleStoreClassName.java:42)
	at com.carrotsearch.randomizedtesting.rules.SystemPropertiesInvariantRule$1.evaluate(SystemPropertiesInvariantRule.java:55)
	at com.carrotsearch.randomizedtesting.rules.NoShadowingOrOverridesOnMethodsRule$1.evaluate(NoShadowingOrOverridesOnMethodsRule.java:39)
	at com.carrotsearch.randomizedtesting.rules.NoShadowingOrOverridesOnMethodsRule$1.evaluate(NoShadowingOrOverridesOnMethodsRule.java:39)
	at com.carrotsearch.randomizedtesting.rules.StatementAdapter.evaluate(StatementAdapter.java:36)
	at org.apache.lucene.util.TestRuleAssertionsRequired$1.evaluate(TestRuleAssertionsRequired.java:43)
	at org.apache.lucene.util.TestRuleMarkFailure$1.evaluate(TestRuleMarkFailure.java:48)
	at org.apache.lucene.util.TestRuleIgnoreAfterMaxFailures$1.evaluate(TestRuleIgnoreAfterMaxFailures.java:70)
	at org.apache.lucene.util.TestRuleIgnoreTestSuites$1.evaluate(TestRuleIgnoreTestSuites.java:55)
	at com.carrotsearch.randomizedtesting.rules.StatementAdapter.evaluate(StatementAdapter.java:36)
	at com.carrotsearch.randomizedtesting.ThreadLeakControl$StatementRunner.run(ThreadLeakControl.java:358)
	at java.lang.Thread.run(Thread.java:724)
Caused by: org.apache.http.conn.HttpHostConnectException: Connection to http://127.0.0.1:60999 refused
	at org.apache.http.impl.conn.DefaultClientConnectionOperator.openConnection(DefaultClientConnectionOperator.java:190)
	at org.apache.http.impl.conn.ManagedClientConnectionImpl.open(ManagedClientConnectionImpl.java:294)
	at org.apache.http.impl.client.DefaultRequestDirector.tryConnect(DefaultRequestDirector.java:645)
	at org.apache.http.impl.client.DefaultRequestDirector.execute(DefaultRequestDirector.java:480)
	at org.apache.http.impl.client.AbstractHttpClient.execute(AbstractHttpClient.java:906)
	at org.apache.http.impl.client.AbstractHttpClient.execute(AbstractHttpClient.java:805)
	at org.apache.http.impl.client.AbstractHttpClient.execute(AbstractHttpClient.java:784)
	at org.apache.solr.client.solrj.impl.HttpSolrServer.request(HttpSolrServer.java:365)
	... 45 more
Caused by: java.net.ConnectException: Connection refused: connect
	at java.net.DualStackPlainSocketImpl.waitForConnect(Native Method)
	at java.net.DualStackPlainSocketImpl.socketConnect(DualStackPlainSocketImpl.java:85)
	at java.net.AbstractPlainSocketImpl.doConnect(AbstractPlainSocketImpl.java:339)
	at java.net.AbstractPlainSocketImpl.connectToAddress(AbstractPlainSocketImpl.java:200)
	at java.net.AbstractPlainSocketImpl.connect(AbstractPlainSocketImpl.java:182)
	at java.net.PlainSocketImpl.connect(PlainSocketImpl.java:172)
	at java.net.SocksSocketImpl.connect(SocksSocketImpl.java:392)
	at java.net.Socket.connect(Socket.java:579)
	at org.apache.http.conn.scheme.PlainSocketFactory.connectSocket(PlainSocketFactory.java:127)
	at org.apache.http.impl.conn.DefaultClientConnectionOperator.openConnection(DefaultClientConnectionOperator.java:180)
	... 52 more




Build Log:
[...truncated 9726 lines...]
   [junit4] Suite: org.apache.solr.cloud.CollectionsAPIDistributedZkTest
   [junit4]   2> 1464108 T2780 oas.BaseDistributedSearchTestCase.initHostContext Setting hostContext system property: /jzit/
   [junit4]   2> 1464111 T2780 oas.SolrTestCaseJ4.setUp ###Starting testDistribSearch
   [junit4]   2> Creating dataDir: C:\Users\JenkinsSlave\workspace\Lucene-Solr-4.x-Windows\solr\build\solr-core\test\J0\.\solrtest-CollectionsAPIDistributedZkTest-1375482812932
   [junit4]   2> 1464114 T2780 oasc.ZkTestServer.run STARTING ZK TEST SERVER
   [junit4]   2> 1464114 T2781 oasc.ZkTestServer$ZKServerMain.runFromConfig Starting server
   [junit4]   2> 1464195 T2780 oasc.ZkTestServer.run start zk server on port:60980
   [junit4]   2> 1464196 T2780 oascc.ConnectionManager.waitForConnected Waiting for client to connect to ZooKeeper
   [junit4]   2> 1464202 T2787 oascc.ConnectionManager.process Watcher org.apache.solr.common.cloud.ConnectionManager@6b0070d9 name:ZooKeeperConnection Watcher:127.0.0.1:60980 got event WatchedEvent state:SyncConnected type:None path:null path:null type:None
   [junit4]   2> 1464202 T2780 oascc.ConnectionManager.waitForConnected Client is connected to ZooKeeper
   [junit4]   2> 1464203 T2780 oascc.SolrZkClient.makePath makePath: /solr
   [junit4]   2> 1464207 T2782 oazs.NIOServerCnxn.doIO WARN caught end of stream exception EndOfStreamException: Unable to read additional data from client sessionid 0x140412a1a0b0000, likely client has closed socket
   [junit4]   2> 	at org.apache.zookeeper.server.NIOServerCnxn.doIO(NIOServerCnxn.java:220)
   [junit4]   2> 	at org.apache.zookeeper.server.NIOServerCnxnFactory.run(NIOServerCnxnFactory.java:208)
   [junit4]   2> 	at java.lang.Thread.run(Thread.java:724)
   [junit4]   2> 
   [junit4]   2> 1464208 T2780 oascc.ConnectionManager.waitForConnected Waiting for client to connect to ZooKeeper
   [junit4]   2> 1464218 T2789 oascc.ConnectionManager.process Watcher org.apache.solr.common.cloud.ConnectionManager@74486919 name:ZooKeeperConnection Watcher:127.0.0.1:60980/solr got event WatchedEvent state:SyncConnected type:None path:null path:null type:None
   [junit4]   2> 1464218 T2780 oascc.ConnectionManager.waitForConnected Client is connected to ZooKeeper
   [junit4]   2> 1464218 T2780 oascc.SolrZkClient.makePath makePath: /collections/collection1
   [junit4]   2> 1464229 T2780 oascc.SolrZkClient.makePath makePath: /collections/collection1/shards
   [junit4]   2> 1464233 T2780 oascc.SolrZkClient.makePath makePath: /collections/control_collection
   [junit4]   2> 1464237 T2780 oascc.SolrZkClient.makePath makePath: /collections/control_collection/shards
   [junit4]   2> 1464240 T2780 oasc.AbstractZkTestCase.putConfig put C:\Users\JenkinsSlave\workspace\Lucene-Solr-4.x-Windows\solr\build\solr-core\test-files\solr\collection1\conf\solrconfig-tlog.xml to /configs/conf1/solrconfig.xml
   [junit4]   2> 1464241 T2780 oascc.SolrZkClient.makePath makePath: /configs/conf1/solrconfig.xml
   [junit4]   2> 1464247 T2780 oasc.AbstractZkTestCase.putConfig put C:\Users\JenkinsSlave\workspace\Lucene-Solr-4.x-Windows\solr\build\solr-core\test-files\solr\collection1\conf\schema.xml to /configs/conf1/schema.xml
   [junit4]   2> 1464248 T2780 oascc.SolrZkClient.makePath makePath: /configs/conf1/schema.xml
   [junit4]   2> 1464252 T2780 oasc.AbstractZkTestCase.putConfig put C:\Users\JenkinsSlave\workspace\Lucene-Solr-4.x-Windows\solr\build\solr-core\test-files\solr\collection1\conf\stopwords.txt to /configs/conf1/stopwords.txt
   [junit4]   2> 1464252 T2780 oascc.SolrZkClient.makePath makePath: /configs/conf1/stopwords.txt
   [junit4]   2> 1464255 T2780 oasc.AbstractZkTestCase.putConfig put C:\Users\JenkinsSlave\workspace\Lucene-Solr-4.x-Windows\solr\build\solr-core\test-files\solr\collection1\conf\protwords.txt to /configs/conf1/protwords.txt
   [junit4]   2> 1464255 T2780 oascc.SolrZkClient.makePath makePath: /configs/conf1/protwords.txt
   [junit4]   2> 1464259 T2780 oasc.AbstractZkTestCase.putConfig put C:\Users\JenkinsSlave\workspace\Lucene-Solr-4.x-Windows\solr\build\solr-core\test-files\solr\collection1\conf\currency.xml to /configs/conf1/currency.xml
   [junit4]   2> 1464259 T2780 oascc.SolrZkClient.makePath makePath: /configs/conf1/currency.xml
   [junit4]   2> 1464263 T2780 oasc.AbstractZkTestCase.putConfig put C:\Users\JenkinsSlave\workspace\Lucene-Solr-4.x-Windows\solr\build\solr-core\test-files\solr\collection1\conf\open-exchange-rates.json to /configs/conf1/open-exchange-rates.json
   [junit4]   2> 1464263 T2780 oascc.SolrZkClient.makePath makePath: /configs/conf1/open-exchange-rates.json
   [junit4]   2> 1464267 T2780 oasc.AbstractZkTestCase.putConfig put C:\Users\JenkinsSlave\workspace\Lucene-Solr-4.x-Windows\solr\build\solr-core\test-files\solr\collection1\conf\mapping-ISOLatin1Accent.txt to /configs/conf1/mapping-ISOLatin1Accent.txt
   [junit4]   2> 1464267 T2780 oascc.SolrZkClient.makePath makePath: /configs/conf1/mapping-ISOLatin1Accent.txt
   [junit4]   2> 1464270 T2780 oasc.AbstractZkTestCase.putConfig put C:\Users\JenkinsSlave\workspace\Lucene-Solr-4.x-Windows\solr\build\solr-core\test-files\solr\collection1\conf\old_synonyms.txt to /configs/conf1/old_synonyms.txt
   [junit4]   2> 1464270 T2780 oascc.SolrZkClient.makePath makePath: /configs/conf1/old_synonyms.txt
   [junit4]   2> 1464274 T2780 oasc.AbstractZkTestCase.putConfig put C:\Users\JenkinsSlave\workspace\Lucene-Solr-4.x-Windows\solr\build\solr-core\test-files\solr\collection1\conf\synonyms.txt to /configs/conf1/synonyms.txt
   [junit4]   2> 1464275 T2780 oascc.SolrZkClient.makePath makePath: /configs/conf1/synonyms.txt
   [junit4]   2> 1464281 T2782 oazs.NIOServerCnxn.doIO WARN caught end of stream exception EndOfStreamException: Unable to read additional data from client sessionid 0x140412a1a0b0001, likely client has closed socket
   [junit4]   2> 	at org.apache.zookeeper.server.NIOServerCnxn.doIO(NIOServerCnxn.java:220)
   [junit4]   2> 	at org.apache.zookeeper.server.NIOServerCnxnFactory.run(NIOServerCnxnFactory.java:208)
   [junit4]   2> 	at java.lang.Thread.run(Thread.java:724)
   [junit4]   2> 
   [junit4]   2> 1464626 T2780 oejs.Server.doStart jetty-8.1.10.v20130312
   [junit4]   2> 1464629 T2780 oejs.AbstractConnector.doStart Started SelectChannelConnector@127.0.0.1:60987
   [junit4]   2> 1464629 T2780 oass.SolrDispatchFilter.init SolrDispatchFilter.init()
   [junit4]   2> 1464631 T2780 oasc.SolrResourceLoader.locateSolrHome JNDI not configured for solr (NoInitialContextEx)
   [junit4]   2> 1464631 T2780 oasc.SolrResourceLoader.locateSolrHome using system property solr.solr.home: C:\Users\JenkinsSlave\workspace\Lucene-Solr-4.x-Windows\solr\build\solr-core\test\J0\.\org.apache.solr.cloud.CollectionsAPIDistributedZkTest-controljetty-1375482813101
   [junit4]   2> 1464631 T2780 oasc.SolrResourceLoader.<init> new SolrResourceLoader for directory: 'C:\Users\JenkinsSlave\workspace\Lucene-Solr-4.x-Windows\solr\build\solr-core\test\J0\.\org.apache.solr.cloud.CollectionsAPIDistributedZkTest-controljetty-1375482813101\'
   [junit4]   2> 1464655 T2780 oasc.ConfigSolr.fromFile Loading container configuration from C:\Users\JenkinsSlave\workspace\Lucene-Solr-4.x-Windows\solr\build\solr-core\test\J0\.\org.apache.solr.cloud.CollectionsAPIDistributedZkTest-controljetty-1375482813101\solr.xml
   [junit4]   2> 1464719 T2780 oasc.ConfigSolrXml.<init> Config-defined core root directory: 
   [junit4]   2> 1464720 T2780 oasc.CoreContainer.<init> New CoreContainer 2140673616
   [junit4]   2> 1464720 T2780 oasc.CoreContainer.load Loading cores into CoreContainer [instanceDir=C:\Users\JenkinsSlave\workspace\Lucene-Solr-4.x-Windows\solr\build\solr-core\test\J0\.\org.apache.solr.cloud.CollectionsAPIDistributedZkTest-controljetty-1375482813101\]
   [junit4]   2> 1464721 T2780 oashc.HttpShardHandlerFactory.getParameter Setting socketTimeout to: 120000
   [junit4]   2> 1464722 T2780 oashc.HttpShardHandlerFactory.getParameter Setting urlScheme to: http://
   [junit4]   2> 1464722 T2780 oashc.HttpShardHandlerFactory.getParameter Setting connTimeout to: 15000
   [junit4]   2> 1464722 T2780 oashc.HttpShardHandlerFactory.getParameter Setting maxConnectionsPerHost to: 20
   [junit4]   2> 1464723 T2780 oashc.HttpShardHandlerFactory.getParameter Setting corePoolSize to: 0
   [junit4]   2> 1464723 T2780 oashc.HttpShardHandlerFactory.getParameter Setting maximumPoolSize to: 2147483647
   [junit4]   2> 1464723 T2780 oashc.HttpShardHandlerFactory.getParameter Setting maxThreadIdleTime to: 5
   [junit4]   2> 1464723 T2780 oashc.HttpShardHandlerFactory.getParameter Setting sizeOfQueue to: -1
   [junit4]   2> 1464724 T2780 oashc.HttpShardHandlerFactory.getParameter Setting fairnessPolicy to: false
   [junit4]   2> 1464724 T2780 oascsi.HttpClientUtil.createClient Creating new http client, config:maxConnectionsPerHost=20&maxConnections=10000&socketTimeout=120000&connTimeout=15000&retry=false
   [junit4]   2> 1464730 T2780 oasc.ZkContainer.initZooKeeper Zookeeper client=127.0.0.1:60980/solr
   [junit4]   2> 1464730 T2780 oasc.ZkController.checkChrootPath zkHost includes chroot
   [junit4]   2> 1464731 T2780 oascc.ConnectionManager.waitForConnected Waiting for client to connect to ZooKeeper
   [junit4]   2> 1464746 T2800 oascc.ConnectionManager.process Watcher org.apache.solr.common.cloud.ConnectionManager@2a81d249 name:ZooKeeperConnection Watcher:127.0.0.1:60980 got event WatchedEvent state:SyncConnected type:None path:null path:null type:None
   [junit4]   2> 1464746 T2780 oascc.ConnectionManager.waitForConnected Client is connected to ZooKeeper
   [junit4]   2> 1464749 T2780 oascsi.HttpClientUtil.createClient Creating new http client, config:maxConnections=500&maxConnectionsPerHost=16&socketTimeout=120000&connTimeout=15000
   [junit4]   2> 1464754 T2780 oascc.ConnectionManager.waitForConnected Waiting for client to connect to ZooKeeper
   [junit4]   2> 1464757 T2802 oascc.ConnectionManager.process Watcher org.apache.solr.common.cloud.ConnectionManager@6d8366d4 name:ZooKeeperConnection Watcher:127.0.0.1:60980/solr got event WatchedEvent state:SyncConnected type:None path:null path:null type:None
   [junit4]   2> 1464757 T2780 oascc.ConnectionManager.waitForConnected Client is connected to ZooKeeper
   [junit4]   2> 1464759 T2780 oascc.SolrZkClient.makePath makePath: /overseer/queue
   [junit4]   2> 1464764 T2780 oascc.SolrZkClient.makePath makePath: /overseer/collection-queue-work
   [junit4]   2> 1464768 T2780 oascc.SolrZkClient.makePath makePath: /live_nodes
   [junit4]   2> 1464770 T2780 oasc.ZkController.createEphemeralLiveNode Register node as live in ZooKeeper:/live_nodes/127.0.0.1:60987_jzit
   [junit4]   2> 1464772 T2780 oascc.SolrZkClient.makePath makePath: /live_nodes/127.0.0.1:60987_jzit
   [junit4]   2> 1464775 T2780 oascc.SolrZkClient.makePath makePath: /overseer_elect/election
   [junit4]   2> 1464782 T2780 oascc.SolrZkClient.makePath makePath: /overseer_elect/leader
   [junit4]   2> 1464785 T2780 oasc.Overseer.start Overseer (id=90143641628770307-127.0.0.1:60987_jzit-n_0000000000) starting
   [junit4]   2> 1464790 T2780 oascc.SolrZkClient.makePath makePath: /overseer/queue-work
   [junit4]   2> 1464795 T2804 oasc.OverseerCollectionProcessor.run Process current queue of collection creations
   [junit4]   2> 1464796 T2780 oascc.SolrZkClient.makePath makePath: /clusterstate.json
   [junit4]   2> 1464798 T2780 oascc.SolrZkClient.makePath makePath: /aliases.json
   [junit4]   2> 1464801 T2780 oascc.ZkStateReader.createClusterStateWatchersAndUpdate Updating cluster state from ZooKeeper... 
   [junit4]   2> 1464805 T2803 oasc.Overseer$ClusterStateUpdater.run Starting to work on the main queue
   [junit4]   2> 1464807 T2780 oasc.CorePropertiesLocator.discover Looking for core definitions underneath C:\Users\JenkinsSlave\workspace\Lucene-Solr-4.x-Windows\solr\build\solr-core\test\J0\.\org.apache.solr.cloud.CollectionsAPIDistributedZkTest-controljetty-1375482813101
   [junit4]   2> 1465002 T2780 oasc.CorePropertiesLocator.discoverUnder Found core conf in C:\Users\JenkinsSlave\workspace\Lucene-Solr-4.x-Windows\solr\build\solr-core\test\J0\.\org.apache.solr.cloud.CollectionsAPIDistributedZkTest-controljetty-1375482813101\conf\
   [junit4]   2> 1465012 T2780 oasc.CorePropertiesLocator.discover Found 1 core definitions
   [junit4]   2> 1465013 T2780 oass.SolrDispatchFilter.init user.dir=C:\Users\JenkinsSlave\workspace\Lucene-Solr-4.x-Windows\solr\build\solr-core\test\J0
   [junit4]   2> 1465013 T2780 oass.SolrDispatchFilter.init SolrDispatchFilter.init() done
   [junit4]   2> 1465014 T2780 oascsi.HttpClientUtil.createClient Creating new http client, config:maxConnections=128&maxConnectionsPerHost=32&followRedirects=false
   [junit4]   2> 1465019 T2780 oascsi.HttpClientUtil.createClient Creating new http client, config:
   [junit4]   2> 1465021 T2780 oascc.ConnectionManager.waitForConnected Waiting for client to connect to ZooKeeper
   [junit4]   2> 1465023 T2807 oascc.ConnectionManager.process Watcher org.apache.solr.common.cloud.ConnectionManager@185a2480 name:ZooKeeperConnection Watcher:127.0.0.1:60980/solr got event WatchedEvent state:SyncConnected type:None path:null path:null type:None
   [junit4]   2> 1465024 T2780 oascc.ConnectionManager.waitForConnected Client is connected to ZooKeeper
   [junit4]   2> 1465025 T2780 oascc.ZkStateReader.createClusterStateWatchersAndUpdate Updating cluster state from ZooKeeper... 
   [junit4]   2> 1465027 T2780 oasc.ChaosMonkey.monkeyLog monkey: init - expire sessions:true cause connection loss:true
   [junit4]   2> 1465382 T2780 oejs.Server.doStart jetty-8.1.10.v20130312
   [junit4]   2> 1465385 T2780 oejs.AbstractConnector.doStart Started SelectChannelConnector@127.0.0.1:60999
   [junit4]   2> 1465387 T2780 oass.SolrDispatchFilter.init SolrDispatchFilter.init()
   [junit4]   2> 1465387 T2780 oasc.SolrResourceLoader.locateSolrHome JNDI not configured for solr (NoInitialContextEx)
   [junit4]   2> 1465388 T2780 oasc.SolrResourceLoader.locateSolrHome using system property solr.solr.home: C:\Users\JenkinsSlave\workspace\Lucene-Solr-4.x-Windows\solr\build\solr-core\test\J0\.\org.apache.solr.cloud.CollectionsAPIDistributedZkTest-jetty1-1375482813847
   [junit4]   2> 1465388 T2780 oasc.SolrResourceLoader.<init> new SolrResourceLoader for directory: 'C:\Users\JenkinsSlave\workspace\Lucene-Solr-4.x-Windows\solr\build\solr-core\test\J0\.\org.apache.solr.cloud.CollectionsAPIDistributedZkTest-jetty1-1375482813847\'
   [junit4]   2> 1465411 T2780 oasc.ConfigSolr.fromFile Loading container configuration from C:\Users\JenkinsSlave\workspace\Lucene-Solr-4.x-Windows\solr\build\solr-core\test\J0\.\org.apache.solr.cloud.CollectionsAPIDistributedZkTest-jetty1-1375482813847\solr.xml
   [junit4]   2> 1465468 T2780 oasc.ConfigSolrXml.<init> Config-defined core root directory: 
   [junit4]   2> 1465469 T2780 oasc.CoreContainer.<init> New CoreContainer 344159960
   [junit4]   2> 1465469 T2780 oasc.CoreContainer.load Loading cores into CoreContainer [instanceDir=C:\Users\JenkinsSlave\workspace\Lucene-Solr-4.x-Windows\solr\build\solr-core\test\J0\.\org.apache.solr.cloud.CollectionsAPIDistributedZkTest-jetty1-1375482813847\]
   [junit4]   2> 1465470 T2780 oashc.HttpShardHandlerFactory.getParameter Setting socketTimeout to: 120000
   [junit4]   2> 1465470 T2780 oashc.HttpShardHandlerFactory.getParameter Setting urlScheme to: http://
   [junit4]   2> 1465470 T2780 oashc.HttpShardHandlerFactory.getParameter Setting connTimeout to: 15000
   [junit4]   2> 1465471 T2780 oashc.HttpShardHandlerFactory.getParameter Setting maxConnectionsPerHost to: 20
   [junit4]   2> 1465471 T2780 oashc.HttpShardHandlerFactory.getParameter Setting corePoolSize to: 0
   [junit4]   2> 1465471 T2780 oashc.HttpShardHandlerFactory.getParameter Setting maximumPoolSize to: 2147483647
   [junit4]   2> 1465472 T2780 oashc.HttpShardHandlerFactory.getParameter Setting maxThreadIdleTime to: 5
   [junit4]   2> 1465472 T2780 oashc.HttpShardHandlerFactory.getParameter Setting sizeOfQueue to: -1
   [junit4]   2> 1465472 T2780 oashc.HttpShardHandlerFactory.getParameter Setting fairnessPolicy to: false
   [junit4]   2> 1465472 T2780 oascsi.HttpClientUtil.createClient Creating new http client, config:maxConnectionsPerHost=20&maxConnections=10000&socketTimeout=120000&connTimeout=15000&retry=false
   [junit4]   2> 1465478 T2780 oasc.ZkContainer.initZooKeeper Zookeeper client=127.0.0.1:60980/solr
   [junit4]   2> 1465478 T2780 oasc.ZkController.checkChrootPath zkHost includes chroot
   [junit4]   2> 1465480 T2780 oascc.ConnectionManager.waitForConnected Waiting for client to connect to ZooKeeper
   [junit4]   2> 1465494 T2818 oascc.ConnectionManager.process Watcher org.apache.solr.common.cloud.ConnectionManager@3b30e5e1 name:ZooKeeperConnection Watcher:127.0.0.1:60980 got event WatchedEvent state:SyncConnected type:None path:null path:null type:None
   [junit4]   2> 1465495 T2780 oascc.ConnectionManager.waitForConnected Client is connected to ZooKeeper
   [junit4]   2> 1465498 T2780 oascsi.HttpClientUtil.createClient Creating new http client, config:maxConnections=500&maxConnectionsPerHost=16&socketTimeout=120000&connTimeout=15000
   [junit4]   2> 1465502 T2780 oascc.ConnectionManager.waitForConnected Waiting for client to connect to ZooKeeper
   [junit4]   2> 1465505 T2820 oascc.ConnectionManager.process Watcher org.apache.solr.common.cloud.ConnectionManager@168f4090 name:ZooKeeperConnection Watcher:127.0.0.1:60980/solr got event WatchedEvent state:SyncConnected type:None path:null path:null type:None
   [junit4]   2> 1465506 T2780 oascc.ConnectionManager.waitForConnected Client is connected to ZooKeeper
   [junit4]   2> 1465510 T2780 oascc.ZkStateReader.createClusterStateWatchersAndUpdate Updating cluster state from ZooKeeper... 
   [junit4]   2> 1466320 T2780 oasc.ZkController.createEphemeralLiveNode Register node as live in ZooKeeper:/live_nodes/127.0.0.1:60999_jzit
   [junit4]   2> 1466321 T2780 oascc.SolrZkClient.makePath makePath: /live_nodes/127.0.0.1:60999_jzit
   [junit4]   2> 1466326 T2807 oascc.ZkStateReader$3.process Updating live nodes... (2)
   [junit4]   2> 1466327 T2820 oascc.ZkStateReader$3.process Updating live nodes... (2)
   [junit4]   2> 1466327 T2802 oascc.ZkStateReader$3.process Updating live nodes... (2)
   [junit4]   2> 1466335 T2780 oasc.CorePropertiesLocator.discover Looking for core definitions underneath C:\Users\JenkinsSlave\workspace\Lucene-Solr-4.x-Windows\solr\build\solr-core\test\J0\.\org.apache.solr.cloud.CollectionsAPIDistributedZkTest-jetty1-1375482813847
   [junit4]   2> 1466537 T2780 oasc.CorePropertiesLocator.discoverUnder Found core conf in C:\Users\JenkinsSlave\workspace\Lucene-Solr-4.x-Windows\solr\build\solr-core\test\J0\.\org.apache.solr.cloud.CollectionsAPIDistributedZkTest-jetty1-1375482813847\conf\
   [junit4]   2> 1466547 T2780 oasc.CorePropertiesLocator.discover Found 1 core definitions
   [junit4]   2> 1466548 T2780 oass.SolrDispatchFilter.init user.dir=C:\Users\JenkinsSlave\workspace\Lucene-Solr-4.x-Windows\solr\build\solr-core\test\J0
   [junit4]   2> 1466548 T2780 oass.SolrDispatchFilter.init SolrDispatchFilter.init() done
   [junit4]   2> 1466548 T2780 oascsi.HttpClientUtil.createClient Creating new http client, config:maxConnections=128&maxConnectionsPerHost=32&followRedirects=false
   [junit4]   2> 1466926 T2780 oejs.Server.doStart jetty-8.1.10.v20130312
   [junit4]   2> 1466930 T2780 oejs.AbstractConnector.doStart Started SelectChannelConnector@127.0.0.1:61008
   [junit4]   2> 1466932 T2780 oass.SolrDispatchFilter.init SolrDispatchFilter.init()
   [junit4]   2> 1466932 T2780 oasc.SolrResourceLoader.locateSolrHome JNDI not configured for solr (NoInitialContextEx)
   [junit4]   2> 1466933 T2780 oasc.SolrResourceLoader.locateSolrHome using system property solr.solr.home: C:\Users\JenkinsSlave\workspace\Lucene-Solr-4.x-Windows\solr\build\solr-core\test\J0\.\org.apache.solr.cloud.CollectionsAPIDistributedZkTest-jetty2-1375482815373
   [junit4]   2> 1466933 T2780 oasc.SolrResourceLoader.<init> new SolrResourceLoader for directory: 'C:\Users\JenkinsSlave\workspace\Lucene-Solr-4.x-Windows\solr\build\solr-core\test\J0\.\org.apache.solr.cloud.CollectionsAPIDistributedZkTest-jetty2-1375482815373\'
   [junit4]   2> 1466956 T2780 oasc.ConfigSolr.fromFile Loading container configuration from C:\Users\JenkinsSlave\workspace\Lucene-Solr-4.x-Windows\solr\build\solr-core\test\J0\.\org.apache.solr.cloud.CollectionsAPIDistributedZkTest-jetty2-1375482815373\solr.xml
   [junit4]   2> 1467021 T2780 oasc.ConfigSolrXml.<init> Config-defined core root directory: 
   [junit4]   2> 1467021 T2780 oasc.CoreContainer.<init> New CoreContainer 310611468
   [junit4]   2> 1467021 T2780 oasc.CoreContainer.load Loading cores into CoreContainer [instanceDir=C:\Users\JenkinsSlave\workspace\Lucene-Solr-4.x-Windows\solr\build\solr-core\test\J0\.\org.apache.solr.cloud.CollectionsAPIDistributedZkTest-jetty2-1375482815373\]
   [junit4]   2> 1467024 T2780 oashc.HttpShardHandlerFactory.getParameter Setting socketTimeout to: 120000
   [junit4]   2> 1467024 T2780 oashc.HttpShardHandlerFactory.getParameter Setting urlScheme to: http://
   [junit4]   2> 1467024 T2780 oashc.HttpShardHandlerFactory.getParameter Setting connTimeout to: 15000
   [junit4]   2> 1467024 T2780 oashc.HttpShardHandlerFactory.getParameter Setting maxConnectionsPerHost to: 20
   [junit4]   2> 1467025 T2780 oashc.HttpShardHandlerFactory.getParameter Setting corePoolSize to: 0
   [junit4]   2> 1467025 T2780 oashc.HttpShardHandlerFactory.getParameter Setting maximumPoolSize to: 2147483647
   [junit4]   2> 1467025 T2780 oashc.HttpShardHandlerFactory.getParameter Setting maxThreadIdleTime to: 5
   [junit4]   2> 1467025 T2780 oashc.HttpShardHandlerFactory.getParameter Setting sizeOfQueue to: -1
   [junit4]   2> 1467025 T2780 oashc.HttpShardHandlerFactory.getParameter Setting fairnessPolicy to: false
   [junit4]   2> 1467026 T2780 oascsi.HttpClientUtil.createClient Creating new http client, config:maxConnectionsPerHost=20&maxConnections=10000&socketTimeout=120000&connTimeout=15000&retry=false
   [junit4]   2> 1467032 T2780 oasc.ZkContainer.initZooKeeper Zookeeper client=127.0.0.1:60980/solr
   [junit4]   2> 1467032 T2780 oasc.ZkController.checkChrootPath zkHost includes chroot
   [junit4]   2> 1467035 T2780 oascc.ConnectionManager.waitForConnected Waiting for client to connect to ZooKeeper
   [junit4]   2> 1467048 T2832 oascc.ConnectionManager.process Watcher org.apache.solr.common.cloud.ConnectionManager@2d84b3ca name:ZooKeeperConnection Watcher:127.0.0.1:60980 got event WatchedEvent state:SyncConnected type:None path:null path:null type:None
   [junit4]   2> 1467048 T2780 oascc.ConnectionManager.waitForConnected Client is connected to ZooKeeper
   [junit4]   2> 1467051 T2782 oazs.NIOServerCnxn.doIO WARN caught end of stream exception EndOfStreamException: Unable to read additional data from client sessionid 0x140412a1a0b0007, likely client has closed socket
   [junit4]   2> 	at org.apache.zookeeper.server.NIOServerCnxn.doIO(NIOServerCnxn.java:220)
   [junit4]   2> 	at org.apache.zookeeper.server.NIOServerCnxnFactory.run(NIOServerCnxnFactory.java:208)
   [junit4]   2> 	at java.lang.Thread.run(Thread.java:724)
   [junit4]   2> 
   [junit4]   2> 1467051 T2780 oascsi.HttpClientUtil.createClient Creating new http client, config:maxConnections=500&maxConnectionsPerHost=16&socketTimeout=120000&connTimeout=15000
   [junit4]   2> 1467058 T2780 oascc.ConnectionManager.waitForConnected Waiting for client to connect to ZooKeeper
   [junit4]   2> 1467061 T2834 oascc.ConnectionManager.process Watcher org.apache.solr.common.cloud.ConnectionManager@78afa4c8 name:ZooKeeperConnection Watcher:127.0.0.1:60980/solr got event WatchedEvent state:SyncConnected type:None path:null path:null type:None
   [junit4]   2> 1467061 T2780 oascc.ConnectionManager.waitForConnected Client is connected to ZooKeeper
   [junit4]   2> 1467066 T2780 oascc.ZkStateReader.createClusterStateWatchersAndUpdate Updating cluster state from ZooKeeper... 
   [junit4]   2> 1467875 T2780 oasc.ZkController.createEphemeralLiveNode Register node as live in ZooKeeper:/live_nodes/127.0.0.1:61008_jzit
   [junit4]   2> 1467881 T2780 oascc.SolrZkClient.makePath makePath: /live_nodes/127.0.0.1:61008_jzit
   [junit4]   2> 1467886 T2807 oascc.ZkStateReader$3.process Updating live nodes... (3)
   [junit4]   2> 1467886 T2834 oascc.ZkStateReader$3.process Updating live nodes... (3)
   [junit4]   2> 1467887 T2820 oascc.ZkStateReader$3.process Updating live nodes... (3)
   [junit4]   2> 1467888 T2802 oascc.ZkStateReader$3.process Updating live nodes... (3)
   [junit4]   2> 1467895 T2780 oasc.CorePropertiesLocator.discover Looking for core definitions underneath C:\Users\JenkinsSlave\workspace\Lucene-Solr-4.x-Windows\solr\build\solr-core\test\J0\.\org.apache.solr.cloud.CollectionsAPIDistributedZkTest-jetty2-1375482815373
   [junit4]   2> 1468098 T2780 oasc.CorePropertiesLocator.discoverUnder Found core conf in C:\Users\JenkinsSlave\workspace\Lucene-Solr-4.x-Windows\solr\build\solr-core\test\J0\.\org.apache.solr.cloud.CollectionsAPIDistributedZkTest-jetty2-1375482815373\conf\
   [junit4]   2> 1468109 T2780 oasc.CorePropertiesLocator.discover Found 1 core definitions
   [junit4]   2> 1468110 T2780 oass.SolrDispatchFilter.init user.dir=C:\Users\JenkinsSlave\workspace\Lucene-Solr-4.x-Windows\solr\build\solr-core\test\J0
   [junit4]   2> 1468110 T2780 oass.SolrDispatchFilter.init SolrDispatchFilter.init() done
   [junit4]   2> 1468111 T2780 oascsi.HttpClientUtil.createClient Creating new http client, config:maxConnections=128&maxConnectionsPerHost=32&followRedirects=false
   [junit4]   2> 1468478 T2780 oejs.Server.doStart jetty-8.1.10.v20130312
   [junit4]   2> 1468482 T2780 oejs.AbstractConnector.doStart Started SelectChannelConnector@127.0.0.1:61017
   [junit4]   2> 1468483 T2780 oass.SolrDispatchFilter.init SolrDispatchFilter.init()
   [junit4]   2> 1468484 T2780 oasc.SolrResourceLoader.locateSolrHome JNDI not configured for solr (NoInitialContextEx)
   [junit4]   2> 1468484 T2780 oasc.SolrResourceLoader.locateSolrHome using system property solr.solr.home: C:\Users\JenkinsSlave\workspace\Lucene-Solr-4.x-Windows\solr\build\solr-core\test\J0\.\org.apache.solr.cloud.CollectionsAPIDistributedZkTest-jetty3-1375482816937
   [junit4]   2> 1468485 T2780 oasc.SolrResourceLoader.<init> new SolrResourceLoader for directory: 'C:\Users\JenkinsSlave\workspace\Lucene-Solr-4.x-Windows\solr\build\solr-core\test\J0\.\org.apache.solr.cloud.CollectionsAPIDistributedZkTest-jetty3-1375482816937\'
   [junit4]   2> 1468509 T2780 oasc.ConfigSolr.fromFile Loading container configuration from C:\Users\JenkinsSlave\workspace\Lucene-Solr-4.x-Windows\solr\build\solr-core\test\J0\.\org.apache.solr.cloud.CollectionsAPIDistributedZkTest-jetty3-1375482816937\solr.xml
   [junit4]   2> 1468570 T2780 oasc.ConfigSolrXml.<init> Config-defined core root directory: 
   [junit4]   2> 1468570 T2780 oasc.CoreContainer.<init> New CoreContainer 601950723
   [junit4]   2> 1468570 T2780 oasc.CoreContainer.load Loading cores into CoreContainer [instanceDir=C:\Users\JenkinsSlave\workspace\Lucene-Solr-4.x-Windows\solr\build\solr-core\test\J0\.\org.apache.solr.cloud.CollectionsAPIDistributedZkTest-jetty3-1375482816937\]
   [junit4]   2> 1468572 T2780 oashc.HttpShardHandlerFactory.getParameter Setting socketTimeout to: 120000
   [junit4]   2> 1468572 T2780 oashc.HttpShardHandlerFactory.getParameter Setting urlScheme to: http://
   [junit4]   2> 1468573 T2780 oashc.HttpShardHandlerFactory.getParameter Setting connTimeout to: 15000
   [junit4]   2> 1468573 T2780 oashc.HttpShardHandlerFactory.getParameter Setting maxConnectionsPerHost to: 20
   [junit4]   2> 1468573 T2780 oashc.HttpShardHandlerFactory.getParameter Setting corePoolSize to: 0
   [junit4]   2> 1468574 T2780 oashc.HttpShardHandlerFactory.getParameter Setting maximumPoolSize to: 2147483647
   [junit4]   2> 1468574 T2780 oashc.HttpShardHandlerFactory.getParameter Setting maxThreadIdleTime to: 5
   [junit4]   2> 1468574 T2780 oashc.HttpShardHandlerFactory.getParameter Setting sizeOfQueue to: -1
   [junit4]   2> 1468574 T2780 oashc.HttpShardHandlerFactory.getParameter Setting fairnessPolicy to: false
   [junit4]   2> 1468574 T2780 oascsi.HttpClientUtil.createClient Creating new http client, config:maxConnectionsPerHost=20&maxConnections=10000&socketTimeout=120000&connTimeout=15000&retry=false
   [junit4]   2> 1468581 T2780 oasc.ZkContainer.initZooKeeper Zookeeper client=127.0.0.1:60980/solr
   [junit4]   2> 1468581 T2780 oasc.ZkController.checkChrootPath zkHost includes chroot
   [junit4]   2> 1468582 T2780 oascc.ConnectionManager.waitForConnected Waiting for client to connect to ZooKeeper
   [junit4]   2> 1468595 T2846 oascc.ConnectionManager.process Watcher org.apache.solr.common.cloud.ConnectionManager@7fbcc43c name:ZooKeeperConnection Watcher:127.0.0.1:60980 got event WatchedEvent state:SyncConnected type:None path:null path:null type:None
   [junit4]   2> 1468596 T2780 oascc.ConnectionManager.waitForConnected Client is connected to ZooKeeper
   [junit4]   2> 1468598 T2780 oascsi.HttpClientUtil.createClient Creating new http client, config:maxConnections=500&maxConnectionsPerHost=16&socketTimeout=120000&connTimeout=15000
   [junit4]   2> 1468604 T2780 oascc.ConnectionManager.waitForConnected Waiting for client to connect to ZooKeeper
   [junit4]   2> 1468607 T2848 oascc.ConnectionManager.process Watcher org.apache.solr.common.cloud.ConnectionManager@2cf8bcfb name:ZooKeeperConnection Watcher:127.0.0.1:60980/solr got event WatchedEvent state:SyncConnected type:None path:null path:null type:None
   [junit4]   2> 1468608 T2780 oascc.ConnectionManager.waitForConnected Client is connected to ZooKeeper
   [junit4]   2> 1468615 T2780 oascc.ZkStateReader.createClusterStateWatchersAndUpdate Updating cluster state from ZooKeeper... 
   [junit4]   2> 1469442 T2780 oasc.ZkController.createEphemeralLiveNode Register node as live in ZooKeeper:/live_nodes/127.0.0.1:61017_jzit
   [junit4]   2> 1469448 T2780 oascc.SolrZkClient.makePath makePath: /live_nodes/127.0.0.1:61017_jzit
   [junit4]   2> 1469453 T2807 oascc.ZkStateReader$3.process Updating live nodes... (4)
   [junit4]   2> 1469454 T2848 oascc.ZkStateReader$3.process Updating live nodes... (4)
   [junit4]   2> 1469454 T2834 oascc.ZkStateReader$3.process Updating live nodes... (4)
   [junit4]   2> 1469454 T2802 oascc.ZkStateReader$3.process Updating live nodes... (4)
   [junit4]   2> 1469454 T2820 oascc.ZkStateReader$3.process Updating live nodes... (4)
   [junit4]   2> 1469464 T2780 oasc.CorePropertiesLocator.discover Looking for core definitions underneath C:\Users\JenkinsSlave\workspace\Lucene-Solr-4.x-Windows\solr\build\solr-core\test\J0\.\org.apache.solr.cloud.CollectionsAPIDistributedZkTest-jetty3-1375482816937
   [junit4]   2> 1469666 T2780 oasc.CorePropertiesLocator.discoverUnder Found core conf in C:\Users\JenkinsSlave\workspace\Lucene-Solr-4.x-Windows\solr\build\solr-core\test\J0\.\org.apache.solr.cloud.CollectionsAPIDistributedZkTest-jetty3-1375482816937\conf\
   [junit4]   2> 1469676 T2780 oasc.CorePropertiesLocator.discover Found 1 core definitions
   [junit4]   2> 1469677 T2780 oass.SolrDispatchFilter.init user.dir=C:\Users\JenkinsSlave\workspace\Lucene-Solr-4.x-Windows\solr\build\solr-core\test\J0
   [junit4]   2> 1469678 T2780 oass.SolrDispatchFilter.init SolrDispatchFilter.init() done
   [junit4]   2> 1469678 T2780 oascsi.HttpClientUtil.createClient Creating new http client, config:maxConnections=128&maxConnectionsPerHost=32&followRedirects=false
   [junit4]   2> 1470090 T2780 oejs.Server.doStart jetty-8.1.10.v20130312
   [junit4]   2> 1470095 T2780 oejs.AbstractConnector.doStart Started SelectChannelConnector@127.0.0.1:61026
   [junit4]   2> 1470097 T2780 oass.SolrDispatchFilter.init SolrDispatchFilter.init()
   [junit4]   2> 1470097 T2780 oasc.SolrResourceLoader.locateSolrHome JNDI not configured for solr (NoInitialContextEx)
   [junit4]   2> 1470098 T2780 oasc.SolrResourceLoader.locateSolrHome using system property solr.solr.home: C:\Users\JenkinsSlave\workspace\Lucene-Solr-4.x-Windows\solr\build\solr-core\test\J0\.\org.apache.solr.cloud.CollectionsAPIDistributedZkTest-jetty4-1375482818506
   [junit4]   2> 1470098 T2780 oasc.SolrResourceLoader.<init> new SolrResourceLoader for directory: 'C:\Users\JenkinsSlave\workspace\Lucene-Solr-4.x-Windows\solr\build\solr-core\test\J0\.\org.apache.solr.cloud.CollectionsAPIDistributedZkTest-jetty4-1375482818506\'
   [junit4]   2> 1470125 T2780 oasc.ConfigSolr.fromFile Loading container configuration from C:\Users\JenkinsSlave\workspace\Lucene-Solr-4.x-Windows\solr\build\solr-core\test\J0\.\org.apache.solr.cloud.CollectionsAPIDistributedZkTest-jetty4-1375482818506\solr.xml
   [junit4]   2> 1470200 T2780 oasc.ConfigSolrXml.<init> Config-defined core root directory: 
   [junit4]   2> 1470200 T2780 oasc.CoreContainer.<init> New CoreContainer 1067052219
   [junit4]   2> 1470201 T2780 oasc.CoreContainer.load Loading cores into CoreContainer [instanceDir=C:\Users\JenkinsSlave\workspace\Lucene-Solr-4.x-Windows\solr\build\solr-core\test\J0\.\org.apache.solr.cloud.CollectionsAPIDistributedZkTest-jetty4-1375482818506\]
   [junit4]   2> 1470203 T2780 oashc.HttpShardHandlerFactory.getParameter Setting socketTimeout to: 120000
   [junit4]   2> 1470204 T2780 oashc.HttpShardHandlerFactory.getParameter Setting urlScheme to: http://
   [junit4]   2> 1470204 T2780 oashc.HttpShardHandlerFactory.getParameter Setting connTimeout to: 15000
   [junit4]   2> 1470204 T2780 oashc.HttpShardHandlerFactory.getParameter Setting maxConnectionsPerHost to: 20
   [junit4]   2> 1470204 T2780 oashc.HttpShardHandlerFactory.getParameter Setting corePoolSize to: 0
   [junit4]   2> 1470204 T2780 oashc.HttpShardHandlerFactory.getParameter Setting maximumPoolSize to: 2147483647
   [junit4]   2> 1470205 T2780 oashc.HttpShardHandlerFactory.getParameter Setting maxThreadIdleTime to: 5
   [junit4]   2> 1470205 T2780 oashc.HttpShardHandlerFactory.getParameter Setting sizeOfQueue to: -1
   [junit4]   2> 1470206 T2780 oashc.HttpShardHandlerFactory.getParameter Setting fairnessPolicy to: false
   [junit4]   2> 1470206 T2780 oascsi.HttpClientUtil.createClient Creating new http client, config:maxConnectionsPerHost=20&maxConnections=10000&socketTimeout=120000&connTimeout=15000&retry=false
   [junit4]   2> 1470212 T2780 oasc.ZkContainer.initZooKeeper Zookeeper client=127.0.0.1:60980/solr
   [junit4]   2> 1470212 T2780 oasc.ZkController.checkChrootPath zkHost includes chroot
   [junit4]   2> 1470214 T2780 oascc.ConnectionManager.waitForConnected Waiting for client to connect to ZooKeeper
   [junit4]   2> 1470234 T2860 oascc.ConnectionManager.process Watcher org.apache.solr.common.cloud.ConnectionManager@5e430402 name:ZooKeeperConnection Watcher:127.0.0.1:60980 got event WatchedEvent state:SyncConnected type:None path:null path:null type:None
   [junit4]   2> 1470235 T2780 oascc.ConnectionManager.waitForConnected Client is connected to ZooKeeper
   [junit4]   2> 1470238 T2780 oascsi.HttpClientUtil.createClient Creating new http client, config:maxConnections=500&maxConnectionsPerHost=16&socketTimeout=120000&connTimeout=15000
   [junit4]   2> 1470243 T2780 oascc.ConnectionManager.waitForConnected Waiting for client to connect to ZooKeeper
   [junit4]   2> 1470246 T2862 oascc.ConnectionManager.process Watcher org.apache.solr.common.cloud.ConnectionManager@271ed815 name:ZooKeeperConnection Watcher:127.0.0.1:60980/solr got event WatchedEvent state:SyncConnected type:None path:null path:null type:None
   [junit4]   2> 1470247 T2780 oascc.ConnectionManager.waitForConnected Client is connected to ZooKeeper
   [junit4]   2> 1470254 T2780 oascc.ZkStateReader.createClusterStateWatchersAndUpdate Updating cluster state from ZooKeeper... 
   [junit4]   2> 1471144 T2780 oasc.ZkController.createEphemeralLiveNode Register node as live in ZooKeeper:/live_nodes/127.0.0.1:61026_jzit
   [junit4]   2> 1471153 T2780 oascc.SolrZkClient.makePath makePath: /live_nodes/127.0.0.1:61026_jzit
   [junit4]   2> 1471158 T2848 oascc.ZkStateReader$3.process Updating live nodes... (5)
   [junit4]   2> 1471158 T2807 oascc.ZkStateReader$3.process Updating live nodes... (5)
   [junit4]   2> 1471158 T2862 oascc.ZkStateReader$3.process Updating live nodes... (5)
   [junit4]   2> 1471159 T2802 oascc.ZkStateReader$3.process Updating live nodes... (5)
   [junit4]   2> 1471159 T2834 oascc.ZkStateReader$3.process Updating live nodes... (5)
   [junit4]   2> 1471160 T2820 oascc.ZkStateReader$3.process Updating live nodes... (5)
   [junit4]   2> 1471167 T2780 oasc.CorePropertiesLocator.discover Looking for core definitions underneath C:\Users\JenkinsSlave\workspace\Lucene-Solr-4.x-Windows\solr\build\solr-core\test\J0\.\org.apache.solr.cloud.CollectionsAPIDistributedZkTest-jetty4-1375482818506
   [junit4]   2> 1471360 T2780 oasc.CorePropertiesLocator.discoverUnder Found core conf in C:\Users\JenkinsSlave\workspace\Lucene-Solr-4.x-Windows\solr\build\solr-core\test\J0\.\org.apache.solr.cloud.CollectionsAPIDistributedZkTest-jetty4-1375482818506\conf\
   [junit4]   2> 1471369 T2780 oasc.CorePropertiesLocator.discover Found 1 core definitions
   [junit4]   2> 1471370 T2780 oass.SolrDispatchFilter.init user.dir=C:\Users\JenkinsSlave\workspace\Lucene-Solr-4.x-Windows\solr\build\solr-core\test\J0
   [junit4]   2> 1471371 T2780 oass.SolrDispatchFilter.init SolrDispatchFilter.init() done
   [junit4]   2> 1471371 T2780 oascsi.HttpClientUtil.createClient Creating new http client, config:maxConnections=128&maxConnectionsPerHost=32&followRedirects=false
   [junit4]   2> 1471378 T2780 oascsi.HttpClientUtil.createClient Creating new http client, config:maxConnections=128&maxConnectionsPerHost=32&followRedirects=false
   [junit4]   2> 1471383 T2814 oasha.CollectionsHandler.handleCreateAction Creating Collection : numShards=2&name=nodes_used_collection&replicationFactor=2&action=CREATE&wt=javabin&version=2
   [junit4]   2> 1471386 T2802 oasc.DistributedQueue$LatchChildWatcher.process Watcher fired on path: /overseer/collection-queue-work state: SyncConnected type NodeChildrenChanged
   [junit4]   2> 1471388 T2802 oasc.DistributedQueue$LatchChildWatcher.process Watcher fired on path: /overseer/collection-queue-work state: SyncConnected type NodeChildrenChanged
   [junit4]   2> 1471389 T2804 oasc.OverseerCollectionProcessor.run Overseer Collection Processor: Get the message id:/overseer/collection-queue-work/qn-0000000000 message:{
   [junit4]   2> 	  "operation":"createcollection",
   [junit4]   2> 	  "numShards":"2",
   [junit4]   2> 	  "name":"nodes_used_collection",
   [junit4]   2> 	  "replicationFactor":"2"}
   [junit4]   2> 1471389 T2804 oasc.OverseerCollectionProcessor.processMessage WARN OverseerCollectionProcessor.processMessage : createcollection , {
   [junit4]   2> 	  "operation":"createcollection",
   [junit4]   2> 	  "numShards":"2",
   [junit4]   2> 	  "name":"nodes_used_collection",
   [junit4]   2> 	  "replicationFactor":"2"}
   [junit4]   2> 1472347 T2803 oascc.ZkStateReader.updateClusterState Updating cloud state from ZooKeeper... 
   [junit4]   2> 1472348 T2803 oasc.Overseer$ClusterStateUpdater.buildCollection building a new collection: nodes_used_collection
   [junit4]   2> 1472348 T2803 oasc.Overseer$ClusterStateUpdater.createCollection Create collection nodes_used_collection with shards [shard1, shard2]
   [junit4]   2> 1472355 T2848 oascc.ZkStateReader$2.process A cluster state change: WatchedEvent state:SyncConnected type:NodeDataChanged path:/clusterstate.json, has occurred - updating... (live nodes size: 5)
   [junit4]   2> 1472356 T2862 oascc.ZkStateReader$2.process A cluster state change: WatchedEvent state:SyncConnected type:NodeDataChanged path:/clusterstate.json, has occurred - updating... (live nodes size: 5)
   [junit4]   2> 1472356 T2807 oascc.ZkStateReader$2.process A cluster state change: WatchedEvent state:SyncConnected type:NodeDataChanged path:/clusterstate.json, has occurred - updating... (live nodes size: 5)
   [junit4]   2> 1472356 T2820 oascc.ZkStateReader$2.process A cluster state change: WatchedEvent state:SyncConnected type:NodeDataChanged path:/clusterstate.json, has occurred - updating... (live nodes size: 5)
   [junit4]   2> 1472356 T2834 oascc.ZkStateReader$2.process A cluster state change: WatchedEvent state:SyncConnected type:NodeDataChanged path:/clusterstate.json, has occurred - updating... (live nodes size: 5)
   [junit4]   2> 1472356 T2802 oascc.ZkStateReader$2.process A cluster state change: WatchedEvent state:SyncConnected type:NodeDataChanged path:/clusterstate.json, has occurred - updating... (live nodes size: 5)
   [junit4]   2> 1472375 T2804 oasc.OverseerCollectionProcessor.createCollection going to create cores replicas shardNames [shard1, shard2] , repFactor : 2
   [junit4]   2> 1472375 T2804 oasc.OverseerCollectionProcessor.createCollection Creating shard nodes_used_collection_shard1_replica1 as part of slice shard1 of collection nodes_used_collection on 127.0.0.1:61026_jzit
   [junit4]   2> 1472376 T2804 oasc.OverseerCollectionProcessor.createCollection Creating shard nodes_used_collection_shard1_replica2 as part of slice shard1 of collection nodes_used_collection on 127.0.0.1:61008_jzit
   [junit4]   2> 1472376 T2804 oasc.OverseerCollectionProcessor.createCollection Creating shard nodes_used_collection_shard2_replica1 as part of slice shard2 of collection nodes_used_collection on 127.0.0.1:60987_jzit
   [junit4]   2> 1472378 T2804 oasc.OverseerCollectionProcessor.createCollection Creating shard nodes_used_collection_shard2_replica2 as part of slice shard2 of collection nodes_used_collection on 127.0.0.1:60999_jzit
   [junit4]   2> 1472381 T2827 oasc.ZkController.publish publishing core=nodes_used_collection_shard1_replica2 state=down
   [junit4]   2> 1472381 T2856 oasc.ZkController.publish publishing core=nodes_used_collection_shard1_replica1 state=down
   [junit4]   2> 1472383 T2816 oasc.ZkController.publish publishing core=nodes_used_collection_shard2_replica2 state=down
   [junit4]   2> 1472384 T2856 oasc.ZkController.waitForCoreNodeName look for our core node name
   [junit4]   2> 1472384 T2798 oasc.ZkController.publish publishing core=nodes_used_collection_shard2_replica1 state=down
   [junit4]   2> 1472385 T2827 oasc.ZkController.waitForCoreNodeName look for our core node name
   [junit4]   2> 1472386 T2816 oasc.ZkController.waitForCoreNodeName look for our core node name
   [junit4]   2> 1472387 T2798 oasc.ZkController.waitForCoreNodeName look for our core node name
   [junit4]   2> 1473693 T2803 oascc.ZkStateReader.updateClusterState Updating cloud state from ZooKeeper... 
   [junit4]   2> 1473694 T2803 oasc.Overseer$ClusterStateUpdater.updateState WARN Could not find collection node for nodes_used_collection, skipping publish state
   [junit4]   2> 1473694 T2803 oasc.Overseer$ClusterStateUpdater.updateState Update state numShards=2 message={
   [junit4]   2> 	  "operation":"state",
   [junit4]   2> 	  "core_node_name":"core_node1",
   [junit4]   2> 	  "numShards":"2",
   [junit4]   2> 	  "shard":"shard1",
   [junit4]   2> 	  "roles":null,
   [junit4]   2> 	  "state":"down",
   [junit4]   2> 	  "shard_state":"active",
   [junit4]   2> 	  "core":"nodes_used_collection_shard1_replica1",
   [junit4]   2> 	  "collection":"nodes_used_collection",
   [junit4]   2> 	  "shard_range":null,
   [junit4]   2> 	  "node_name":"127.0.0.1:61026_jzit",
   [junit4]   2> 	  "base_url":"http://127.0.0.1:61026/jzit"}
   [junit4]   2> 1473707 T2803 oasc.Overseer$ClusterStateUpdater.updateState WARN Could not find collection node for nodes_used_collection, skipping publish state
   [junit4]   2> 1473707 T2803 oasc.Overseer$ClusterStateUpdater.updateState Update state numShards=2 message={
   [junit4]   2> 	  "operation":"state",
   [junit4]   2> 	  "core_node_name":"core_node2",
   [junit4]   2> 	  "numShards":"2",
   [junit4]   2> 	  "shard":"shard1",
   [junit4]   2> 	  "roles":null,
   [junit4]   2> 	  "state":"down",
   [junit4]   2> 	  "shard_state":"active",
   [junit4]   2> 	  "core":"nodes_used_collection_shard1_replica2",
   [junit4]   2> 	  "collection":"nodes_used_collection",
   [junit4]   2> 	  "shard_range":null,
   [junit4]   2> 	  "node_name":"127.0.0.1:61008_jzit",
   [junit4]   2> 	  "base_url":"http://127.0.0.1:61008/jzit"}
   [junit4]   2> 1473713 T2803 oasc.Overseer$ClusterStateUpdater.updateState WARN Could not find collection node for nodes_used_collection, skipping publish state
   [junit4]   2> 1473713 T2803 oasc.Overseer$ClusterStateUpdater.updateState Update state numShards=2 message={
   [junit4]   2> 	  "operation":"state",
   [junit4]   2> 	  "core_node_name":"core_node3",
   [junit4]   2> 	  "numShards":"2",
   [junit4]   2> 	  "shard":"shard2",
   [junit4]   2> 	  "roles":null,
   [junit4]   2> 	  "state":"down",
   [junit4]   2> 	  "shard_state":"active",
   [junit4]   2> 	  "core":"nodes_used_collection_shard2_replica2",
   [junit4]   2> 	  "collection":"nodes_used_collection",
   [junit4]   2> 	  "shard_range":null,
   [junit4]   2> 	  "node_name":"127.0.0.1:60999_jzit",
   [junit4]   2> 	  "base_url":"http://127.0.0.1:60999/jzit"}
   [junit4]   2> 1473719 T2803 oasc.Overseer$ClusterStateUpdater.updateState WARN Could not find collection node for nodes_used_collection, skipping publish state
   [junit4]   2> 1473719 T2803 oasc.Overseer$ClusterStateUpdater.updateState Update state numShards=2 message={
   [junit4]   2> 	  "operation":"state",
   [junit4]   2> 	  "core_node_name":"core_node4",
   [junit4]   2> 	  "numShards":"2",
   [junit4]   2> 	  "shard":"shard2",
   [junit4]   2> 	  "roles":null,
   [junit4]   2> 	  "state":"down",
   [junit4]   2> 	  "shard_state":"active",
   [junit4]   2> 	  "core":"nodes_used_collection_shard2_replica1",
   [junit4]   2> 	  "collection":"nodes_used_collection",
   [junit4]   2> 	  "shard_range":null,
   [junit4]   2> 	  "node_name":"127.0.0.1:60987_jzit",
   [junit4]   2> 	  "base_url":"http://127.0.0.1:60987/jzit"}
   [junit4]   2> 1473726 T2848 oascc.ZkStateReader$2.process A cluster state change: WatchedEvent state:SyncConnected type:NodeDataChanged path:/clusterstate.json, has occurred - updating... (live nodes size: 5)
   [junit4]   2> 1473726 T2802 oascc.ZkStateReader$2.process A cluster state change: WatchedEvent state:SyncConnected type:NodeDataChanged path:/clusterstate.json, has occurred - updating... (live nodes size: 5)
   [junit4]   2> 1473726 T2862 oascc.ZkStateReader$2.process A cluster state change: WatchedEvent state:SyncConnected type:NodeDataChanged path:/clusterstate.json, has occurred - updating... (live nodes size: 5)
   [junit4]   2> 1473726 T2807 oascc.ZkStateReader$2.process A cluster state change: WatchedEvent state:SyncConnected type:NodeDataChanged path:/clusterstate.json, has occurred - updating... (live nodes size: 5)
   [junit4]   2> 1473726 T2820 oascc.ZkStateReader$2.process A cluster state change: WatchedEvent state:SyncConnected type:NodeDataChanged path:/clusterstate.json, has occurred - updating... (live nodes size: 5)
   [junit4]   2> 1473726 T2834 oascc.ZkStateReader$2.process A cluster state change: WatchedEvent state:SyncConnected type:NodeDataChanged path:/clusterstate.json, has occurred - updating... (live nodes size: 5)
   [junit4]   2> 1474156 T2856 oasc.ZkController.waitForShardId waiting to find shard id in clusterstate for nodes_used_collection_shard1_replica1
   [junit4]   2> 1474157 T2827 oasc.ZkController.waitForShardId waiting to find shard id in clusterstate for nodes_used_collection_shard1_replica2
   [junit4]   2> 1474157 T2856 oasc.CorePropertiesLocator.writePropertiesFile ERROR Couldn't persist core properties to C:\Users\JenkinsSlave\workspace\Lucene-Solr-4.x-Windows\solr\build\solr-core\test\J0\.\org.apache.solr.cloud.CollectionsAPIDistributedZkTest-jetty4-1375482818506\nodes_used_collection_shard1_replica1\core.properties: java.io.FileNotFoundException: C:\Users\JenkinsSlave\workspace\Lucene-Solr-4.x-Windows\solr\build\solr-core\test\J0\.\org.apache.solr.cloud.CollectionsAPIDistributedZkTest-jetty4-1375482818506\nodes_used_collection_shard1_replica1\core.properties (The system cannot find the path specified)
   [junit4]   2> 1474158 T2856 oasc.CoreContainer.create Creating SolrCore 'nodes_used_collection_shard1_replica1' using instanceDir: C:\Users\JenkinsSlave\workspace\Lucene-Solr-4.x-Windows\solr\build\solr-core\test\J0\.\org.apache.solr.cloud.CollectionsAPIDistributedZkTest-jetty4-1375482818506\nodes_used_collection_shard1_replica1
   [junit4]   2> 1474159 T2856 oasc.ZkController.createCollectionZkNode Check for collection zkNode:nodes_used_collection
   [junit4]   2> 1474159 T2798 oasc.ZkController.waitForShardId waiting to find shard id in clusterstate for nodes_used_collection_shard2_replica1
   [junit4]   2> 1474160 T2856 oasc.ZkController.createCollectionZkNode Creating collection in ZooKeeper:nodes_used_collection
   [junit4]   2> 1474160 T2856 oasc.ZkController.getConfName Looking for collection configName
   [junit4]   2> 1474161 T2798 oasc.CorePropertiesLocator.writePropertiesFile ERROR Couldn't persist core properties to C:\Users\JenkinsSlave\workspace\Lucene-Solr-4.x-Windows\solr\build\solr-core\test\J0\.\org.apache.solr.cloud.CollectionsAPIDistributedZkTest-controljetty-1375482813101\nodes_used_collection_shard2_replica1\core.properties: java.io.FileNotFoundException: C:\Users\JenkinsSlave\workspace\Lucene-Solr-4.x-Windows\solr\build\solr-core\test\J0\.\org.apache.solr.cloud.CollectionsAPIDistributedZkTest-controljetty-1375482813101\nodes_used_collection_shard2_replica1\core.properties (The system cannot find the path specified)
   [junit4]   2> 1474159 T2816 oasc.ZkController.waitForShardId waiting to find shard id in clusterstate for nodes_used_collection_shard2_replica2
   [junit4]   2> 1474158 T2827 oasc.CorePropertiesLocator.writePropertiesFile ERROR Couldn't persist core properties to C:\Users\JenkinsSlave\workspace\Lucene-Solr-4.x-Windows\solr\build\solr-core\test\J0\.\org.apache.solr.cloud.CollectionsAPIDistributedZkTest-jetty2-1375482815373\nodes_used_collection_shard1_replica2\core.properties: java.io.FileNotFoundException: C:\Users\JenkinsSlave\workspace\Lucene-Solr-4.x-Windows\solr\build\solr-core\test\J0\.\org.apache.solr.cloud.CollectionsAPIDistributedZkTest-jetty2-1375482815373\nodes_used_collection_shard1_replica2\core.properties (The system cannot find the path specified)
   [junit4]   2> 1474162 T2856 oasc.ZkController.getConfName Only one config set found in zk - using it:conf1
   [junit4]   2> 1474162 T2856 oascc.SolrZkClient.makePath makePath: /collections/nodes_used_collection
   [junit4]   2> 1474162 T2798 oasc.CoreContainer.create Creating SolrCore 'nodes_used_collection_shard2_replica1' using instanceDir: C:\Users\JenkinsSlave\workspace\Lucene-Solr-4.x-Windows\solr\build\solr-core\test\J0\.\org.apache.solr.cloud.CollectionsAPIDistributedZkTest-controljetty-1375482813101\nodes_used_collection_shard2_replica1
   [junit4]   2> 1474163 T2798 oasc.ZkController.createCollectionZkNode Check for collection zkNode:nodes_used_collection
   [junit4]   2> 1474163 T2816 oasc.CorePropertiesLocator.writePropertiesFile ERROR Couldn't persist core properties to C:\Users\JenkinsSlave\workspace\Lucene-Solr-4.x-Windows\solr\build\solr-core\test\J0\.\org.apache.solr.cloud.CollectionsAPIDistributedZkTest-jetty1-1375482813847\nodes_used_collection_shard2_replica2\core.properties: java.io.FileNotFoundException: C:\Users\JenkinsSlave\workspace\Lucene-Solr-4.x-Windows\solr\build\solr-core\test\J0\.\org.apache.solr.cloud.CollectionsAPIDistributedZkTest-jetty1-1375482813847\nodes_used_collection_shard2_replica2\core.properties (The system cannot find the path specified)
   [junit4]   2> 1474164 T2816 oasc.CoreContainer.create Creating SolrCore 'nodes_used_collection_shard2_replica2' using instanceDir: C:\Users\JenkinsSlave\workspace\Lucene-Solr-4.x-Windows\solr\build\solr-core\test\J0\.\org.apache.solr.cloud.CollectionsAPIDistributedZkTest-jetty1-1375482813847\nodes_used_collection_shard2_replica2
   [junit4]   2> 1474162 T2827 oasc.CoreContainer.create Creating SolrCore 'nodes_used_collection_shard1_replica2' using instanceDir: C:\Users\JenkinsSlave\workspace\Lucene-Solr-4.x-Windows\solr\build\solr-core\test\J0\.\org.apache.solr.cloud.CollectionsAPIDistributedZkTest-jetty2-1375482815373\nodes_used_collection_shard1_replica2
   [junit4]   2> 1474164 T2798 oasc.ZkController.createCollectionZkNode Creating collection in ZooKeeper:nodes_used_collection
   [junit4]   2> 1474164 T2816 oasc.ZkController.createCollectionZkNode Check for collection zkNode:nodes_used_collection
   [junit4]   2> 1474165 T2798 oasc.ZkController.getConfName Looking for collection configName
   [junit4]   2> 1474165 T2827 oasc.ZkController.createCollectionZkNode Check for collection zkNode:nodes_used_collection
   [junit4]   2> 1474169 T2816 oasc.ZkController.createCollectionZkNode Collection zkNode exists
   [junit4]   2> 1474169 T2816 oasc.ZkController.readConfigName Load collection config from:/collections/nodes_used_collection
   [junit4]   2> 1474170 T2827 oasc.ZkController.createCollectionZkNode Collection zkNode exists
   [junit4]   2> 1474170 T2856 oasc.ZkController.readConfigName Load collection config from:/collections/nodes_used_collection
   [junit4]   2> 1474170 T2827 oasc.ZkController.readConfigName Load collection config from:/collections/nodes_used_collection
   [junit4]   2> 1474170 T2798 oascc.SolrZkClient.makePath makePath: /collections/nodes_used_collection
   [junit4]   2> 1474171 T2816 oasc.SolrResourceLoader.<init> new SolrResourceLoader for directory: 'C:\Users\JenkinsSlave\workspace\Lucene-Solr-4.x-Windows\solr\build\solr-core\test\J0\.\org.apache.solr.cloud.CollectionsAPIDistributedZkTest-jetty1-1375482813847\nodes_used_collection_shard2_replica2\'
   [junit4]   2> 1474172 T2856 oasc.SolrResourceLoader.<init> new SolrResourceLoader for directory: 'C:\Users\JenkinsSlave\workspace\Lucene-Solr-4.x-Windows\solr\build\solr-core\test\J0\.\org.apache.solr.cloud.CollectionsAPIDistributedZkTest-jetty4-1375482818506\nodes_used_collection_shard1_replica1\'
   [junit4]   2> 1474173 T2827 oasc.SolrResourceLoader.<init> new SolrResourceLoader for directory: 'C:\Users\JenkinsSlave\workspace\Lucene-Solr-4.x-Windows\solr\build\solr-core\test\J0\.\org.apache.solr.cloud.CollectionsAPIDistributedZkTest-jetty2-1375482815373\nodes_used_collection_shard1_replica2\'
   [junit4]   2> 1474177 T2798 oasc.ZkController.readConfigName Load collection config from:/collections/nodes_used_collection
   [junit4]   2> 1474186 T2798 oasc.SolrResourceLoader.<init> new SolrResourceLoader for directory: 'C:\Users\JenkinsSlave\workspace\Lucene-Solr-4.x-Windows\solr\build\solr-core\test\J0\.\org.apache.solr.cloud.CollectionsAPIDistributedZkTest-controljetty-1375482813101\nodes_used_collection_shard2_replica1\'
   [junit4]   2> 1474253 T2827 oasc.SolrConfig.<init> Using Lucene MatchVersion: LUCENE_45
   [junit4]   2> 1474254 T2816 oasc.SolrConfig.<init> Using Lucene MatchVersion: LUCENE_45
   [junit4]   2> 1474300 T2798 oasc.SolrConfig.<init> Using Lucene MatchVersion: LUCENE_45
   [junit4]   2> 1474340 T2816 oasc.SolrConfig.<init> Loaded SolrConfig: solrconfig.xml
   [junit4]   2> 1474351 T2798 oasc.SolrConfig.<init> Loaded SolrConfig: solrconfig.xml
   [junit4]   2> 1474361 T2827 oasc.SolrConfig.<init> Loaded SolrConfig: solrconfig.xml
   [junit4]   2> 1474376 T2798 oass.IndexSchema.readSchema Reading Solr Schema from schema.xml
   [junit4]   2> 1474384 T2798 oass.IndexSchema.readSchema [nodes_used_collection_shard2_replica1] Schema name=test
   [junit4]   2> 1474387 T2827 oass.IndexSchema.readSchema Reading Solr Schema from schema.xml
   [junit4]   2> 1474388 T2856 oasc.SolrConfig.<init> Using Lucene MatchVersion: LUCENE_45
   [junit4]   2> 1474391 T2816 oass.IndexSchema.readSchema Reading Solr Schema from schema.xml
   [junit4]   2> 1474395 T2827 oass.IndexSchema.readSchema [nodes_used_collection_shard1_replica2] Schema name=test
   [junit4]   2> 1474400 T2816 oass.IndexSchema.readSchema [nodes_used_collection_shard2_replica2] Schema name=test
   [junit4]   2> 1474466 T2856 oasc.SolrConfig.<init> Loaded SolrConfig: solrconfig.xml
   [junit4]   2> 1474751 T2856 oass.IndexSchema.readSchema Reading Solr Schema from schema.xml
   [junit4]   2> 1474760 T2856 oass.IndexSchema.readSchema [nodes_used_collection_shard1_replica1] Schema name=test
   [junit4]   2> 1475151 T2827 oass.ByteField.init WARN ByteField is deprecated and will be removed in 5.0. You should use TrieIntField instead.
   [junit4]   2> 1475152 T2827 oass.ShortField.init WARN ShortField is deprecated and will be removed in 5.0. You should use TrieIntField instead.
   [junit4]   2> 1475152 T2827 oass.OpenExchangeRatesOrgProvider.init Initialized with rates=open-exchange-rates.json, refreshInterval=1440.
   [junit4]   2> 1475160 T2827 oass.IndexSchema.readSchema default search field in schema is text
   [junit4]   2> 1475164 T2827 oass.IndexSchema.readSchema unique key field: id
   [junit4]   2> 1475390 T2816 oass.ByteField.init WARN ByteField is deprecated and will be removed in 5.0. You should use TrieIntField instead.
   [junit4]   2> 1475390 T2816 oass.ShortField.init WARN ShortField is deprecated and will be removed in 5.0. You should use TrieIntField instead.
   [junit4]   2> 1475391 T2816 oass.OpenExchangeRatesOrgProvider.init Initialized with rates=open-exchange-rates.json, refreshInterval=1440.
   [junit4]   2> 1475397 T2816 oass.IndexSchema.readSchema default search field in schema is text
   [junit4]   2> 1475400 T2816 oass.IndexSchema.readSchema unique key field: id
   [junit4]   2> 1475510 T2827 oass.FileExchangeRateProvider.reload Reloading exchange rates from file currency.xml
   [junit4]   2> 1475516 T2827 oass.FileExchangeRateProvider.reload Reloading exchange rates from file currency.xml
   [junit4]   2> 1475572 T2827 oass.OpenExchangeRatesOrgProvider.reload Reloading exchange rates from open-exchange-rates.json
   [junit4]   2> 1475595 T2856 oass.ByteField.init WARN ByteField is deprecated and will be removed in 5.0. You should use TrieIntField instead.
   [junit4]   2> 1475595 T2856 oass.ShortField.init WARN ShortField is deprecated and will be removed in 5.0. You should use TrieIntField instead.
   [junit4]   2> 1475596 T2856 oass.OpenExchangeRatesOrgProvider.init Initialized with rates=open-exchange-rates.json, refreshInterval=1440.
   [junit4]   2> 1475602 T2856 oass.IndexSchema.readSchema default search field in schema is text
   [junit4]   2> 1475605 T2856 oass.IndexSchema.readSchema unique key field: id
   [junit4]   2> 1475608 T2827 oass.OpenExchangeRatesOrgProvider$OpenExchangeRates.<init> WARN Unknown key IMPORTANT NOTE
   [junit4]   2> 1475608 T2827 oass.OpenExchangeRatesOrgProvider$OpenExchangeRates.<init> WARN Expected key, got STRING
   [junit4]   2> 1475609 T2827 oass.OpenExchangeRatesOrgProvider.reload Reloading exchange rates from open-exchange-rates.json
   [junit4]   2> 1475611 T2827 oass.OpenExchangeRatesOrgProvider$OpenExchangeRates.<init> WARN Unknown key IMPORTANT NOTE
   [junit4]   2> 1475611 T2827 oass.OpenExchangeRatesOrgProvider$OpenExchangeRates.<init> WARN Expected key, got STRING
   [junit4]   2> 1475611 T2827 oasc.SolrCore.initDirectoryFactory org.apache.solr.core.MockDirectoryFactory
   [junit4]   2> 1475612 T2827 oasc.SolrCore.<init> [nodes_used_collection_shard1_replica2] Opening new SolrCore at C:\Users\JenkinsSlave\workspace\Lucene-Solr-4.x-Windows\solr\build\solr-core\test\J0\.\org.apache.solr.cloud.CollectionsAPIDistributedZkTest-jetty2-1375482815373\nodes_used_collection_shard1_replica2\, dataDir=C:\Users\JenkinsSlave\workspace\Lucene-Solr-4.x-Windows\solr\build\solr-core\test\J0\.\org.apache.solr.cloud.CollectionsAPIDistributedZkTest-jetty2-1375482815373\\nodes_used_collection_shard1_replica2\data\
   [junit4]   2> 1475612 T2827 oasc.JmxMonitoredMap.<init> JMX monitoring is enabled. Adding Solr mbeans to JMX Server: com.sun.jmx.mbeanserver.JmxMBeanServer@19f7f0f0
   [junit4]   2> 1475613 T2827 oasc.CachingDirectoryFactory.get return new directory for C:\Users\JenkinsSlave\workspace\Lucene-Solr-4.x-Windows\solr\build\solr-core\test\J0\.\org.apache.solr.cloud.CollectionsAPIDistributedZkTest-jetty2-1375482815373\\nodes_used_collection_shard1_replica2\data\
   [junit4]   2> 1475613 T2827 oasc.SolrCore.getNewIndexDir New index directory detected: old=null new=C:\Users\JenkinsSlave\workspace\Lucene-Solr-4.x-Windows\solr\build\solr-core\test\J0\.\org.apache.solr.cloud.CollectionsAPIDistributedZkTest-jetty2-1375482815373\\nodes_used_collection_shard1_replica2\data\index/
   [junit4]   2> 1475614 T2827 oasc.SolrCore.initIndex WARN [nodes_used_collection_shard1_replica2] Solr index directory 'C:\Users\JenkinsSlave\workspace\Lucene-Solr-4.x-Windows\solr\build\solr-core\test\J0\.\org.apache.solr.cloud.CollectionsAPIDistributedZkTest-jetty2-1375482815373\nodes_used_collection_shard1_replica2\data\index' doesn't exist. Creating new index...
   [junit4]   2> 1475614 T2827 oasc.CachingDirectoryFactory.get return new directory for C:\Users\JenkinsSlave\workspace\Lucene-Solr-4.x-Windows\solr\build\solr-core\test\J0\.\org.apache.solr.cloud.CollectionsAPIDistributedZkTest-jetty2-1375482815373\\nodes_used_collection_shard1_replica2\data\index
   [junit4]   2> 1475620 T2816 oass.FileExchangeRateProvider.reload Reloading exchange rates from file currency.xml
   [junit4]   2> 1475626 T2816 oass.FileExchangeRateProvider.reload Reloading exchange rates from file currency.xml
   [junit4]   2> 1475632 T2816 oass.OpenExchangeRatesOrgProvider.reload Reloading exchange rates from open-exchange-rates.json
   [junit4]   2> 1475634 T2798 oass.ByteField.init WARN ByteField is deprecated and will be removed in 5.0. You should use TrieIntField instead.
   [junit4]   2> 1475634 T2798 oass.ShortField.init WARN ShortField is deprecated and will be removed in 5.0. You should use TrieIntField instead.
   [junit4]   2> 1475634 T2816 oass.OpenExchangeRatesOrgProvider$OpenExchangeRates.<init> WARN Unknown key IMPORTANT NOTE
   [junit4]   2> 1475634 T2798 oass.OpenExchangeRatesOrgProvider.init Initialized with rates=open-exchange-rates.json, refreshInterval=1440.
   [junit4]   2> 1475634 T2816 oass.OpenExchangeRatesOrgProvider$OpenExchangeRates.<init> WARN Expected key, got STRING
   [junit4]   2> 1475635 T2816 oass.OpenExchangeRatesOrgProvider.reload Reloading exchange rates from open-exchange-rates.json
   [junit4]   2> 1475638 T2816 oass.OpenExchangeRatesOrgProvider$OpenExchangeRates.<init> WARN Unknown key IMPORTANT NOTE
   [junit4]   2> 1475638 T2816 oass.OpenExchangeRatesOrgProvider$OpenExchangeRates.<init> WARN Expected key, got STRING
   [junit4]   2> 1475638 T2816 oasc.SolrCore.initDirectoryFactory org.apache.solr.core.MockDirectoryFactory
   [junit4]   2> 1475639 T2816 oasc.SolrCore.<init> [nodes_used_collection_shard2_replica2] Opening new SolrCore at C:\Users\JenkinsSlave\workspace\Lucene-Solr-4.x-Windows\solr\build\solr-core\test\J0\.\org.apache.solr.cloud.CollectionsAPIDistributedZkTest-jetty1-1375482813847\nodes_used_collection_shard2_replica2\, dataDir=C:\Users\JenkinsSlave\workspace\Lucene-Solr-4.x-Windows\solr\build\solr-core\test\J0\.\org.apache.solr.cloud.CollectionsAPIDistributedZkTest-jetty1-1375482813847\\nodes_used_collection_shard2_replica2\data\
   [junit4]   2> 1475640 T2816 oasc.JmxMonitoredMap.<init> JMX monitoring is enabled. Adding Solr mbeans to JMX Server: com.sun.jmx.mbeanserver.JmxMBeanServer@19f7f0f0
   [junit4]   2> 1475640 T2816 oasc.CachingDirectoryFactory.get return new directory for C:\Users\JenkinsSlave\workspace\Lucene-Solr-4.x-Windows\solr\build\solr-core\test\J0\.\org.apache.solr.cloud.CollectionsAPIDistributedZkTest-jetty1-1375482813847\\nodes_used_collection_shard2_replica2\data\
   [junit4]   2> 1475641 T2816 oasc.SolrCore.getNewIndexDir New index directory detected: old=null new=C:\Users\JenkinsSlave\workspace\Lucene-Solr-4.x-Windows\solr\build\solr-core\test\J0\.\org.apache.solr.cloud.CollectionsAPIDistributedZkTest-jetty1-1375482813847\\nodes_used_collection_shard2_replica2\data\index/
   [junit4]   2> 1475641 T2816 oasc.SolrCore.initIndex WARN [nodes_used_collection_shard2_replica2] Solr index directory 'C:\Users\JenkinsSlave\workspace\Lucene-Solr-4.x-Windows\solr\build\solr-core\test\J0\.\org.apache.solr.cloud.CollectionsAPIDistributedZkTest-jetty1-1375482813847\nodes_used_collection_shard2_replica2\data\index' doesn't exist. Creating new index...
   [junit4]   2> 1475641 T2816 oasc.CachingDirectoryFactory.get return new directory for C:\Users\JenkinsSlave\workspace\Lucene-Solr-4.x-Windows\solr\build\solr-core\test\J0\.\org.apache.solr.cloud.CollectionsAPIDistributedZkTest-jetty1-1375482813847\\nodes_used_collection_shard2_replica2\data\index
   [junit4]   2> 1475641 T2798 oass.IndexSchema.readSchema default search field in schema is text
   [junit4]   2> 1475644 T2798 oass.IndexSchema.readSchema unique key field: id
   [junit4]   2> 1475645 T2816 oasc.SolrDeletionPolicy.onCommit SolrDeletionPolicy.onCommit: commits: num=1
   [junit4]   2> 		commit{dir=MockDirWrapper(org.apache.lucene.store.RAMDirectory@16bebb84 lockFactory=org.apache.lucene.store.NativeFSLockFactory@a3552ee),segFN=segments_1,generation=1}
   [junit4]   2> 1475645 T2816 oasc.SolrDeletionPolicy.updateCommits newest commit generation = 1
   [junit4]   2> 1475650 T2816 oasup.UpdateRequestProcessorChain.init inserting DistributedUpdateProcessorFactory into updateRequestProcessorChain "dedupe"
   [junit4]   2> 1475651 T2816 oasup.UpdateRequestProcessorChain.init inserting DistributedUpdateProcessorFactory into updateRequestProcessorChain "stored_sig"
   [junit4]   2> 1475651 T2816 oasup.UpdateRequestProcessorChain.init inserting DistributedUpdateProcessorFactory into updateRequestProcessorChain "distrib-dup-test-chain-implicit"
   [junit4]   2> 1475652 T2816 oasc.RequestHandlers.initHandlersFromConfig created standard: solr.StandardRequestHandler
   [junit4]   2> 1475652 T2816 oasc.RequestHandlers.initHandlersFromConfig created /get: solr.RealTimeGetHandler
   [junit4]   2> 1475652 T2816 oasc.RequestHandlers.initHandlersFromConfig adding lazy requestHandler: solr.ReplicationHandler
   [junit4]   2> 1475653 T2816 oasc.RequestHandlers.initHandlersFromConfig created /replication: solr.ReplicationHandler
   [junit4]   2> 1475653 T2827 oasc.SolrDeletionPolicy.onCommit SolrDeletionPolicy.onCommit: commits: num=1
   [junit4]   2> 		commit{dir=MockDirWrapper(org.apache.lucene.store.RAMDirectory@120cf050 lockFactory=org.apache.lucene.store.NativeFSLockFactory@55410eeb),segFN=segments_1,generation=1}
   [junit4]   2> 1475654 T2827 oasc.SolrDeletionPolicy.updateCommits newest commit generation = 1
   [junit4]   2> 1475654 T2816 oasc.RequestHandlers.initHandlersFromConfig created /update: solr.UpdateRequestHandler
   [junit4]   2> 1475655 T2816 oasc.RequestHandlers.initHandlersFromConfig created /admin/: org.apache.solr.handler.admin.AdminHandlers
   [junit4]   2> 1475659 T2827 oasup.UpdateRequestProcessorChain.init inserting DistributedUpdateProcessorFactory into updateRequestProcessorChain "dedupe"
   [junit4]   2> 1475659 T2827 oasup.UpdateRequestProcessorChain.init inserting DistributedUpdateProcessorFactory into updateRequestProcessorChain "stored_sig"
   [junit4]   2> 1475660 T2827 oasup.UpdateRequestProcessorChain.init inserting DistributedUpdateProcessorFactory into updateRequestProcessorChain "distrib-dup-test-chain-implicit"
   [junit4]   2> 1475660 T2827 oasc.RequestHandlers.initHandlersFromConfig created standard: solr.StandardRequestHandler
   [junit4]   2> 1475660 T2827 oasc.RequestHandlers.initHandlersFromConfig created /get: solr.RealTimeGetHandler
   [junit4]   2> 1475660 T2827 oasc.RequestHandlers.initHandlersFromConfig adding lazy requestHandler: solr.ReplicationHandler
   [junit4]   2> 1475661 T2827 oasc.RequestHandlers.initHandlersFromConfig created /replication: solr.ReplicationHandler
   [junit4]   2> 1475661 T2827 oasc.RequestHandlers.initHandlersFromConfig created /update: solr.UpdateRequestHandler
   [junit4]   2> 1475662 T2827 oasc.RequestHandlers.initHandlersFromConfig created /admin/: org.apache.solr.handler.admin.AdminHandlers
   [junit4]   2> 1475664 T2827 oashl.XMLLoader.init xsltCacheLifetimeSeconds=60
   [junit4]   2> 1475665 T2816 oashl.XMLLoader.init xsltCacheLifetimeSeconds=60
   [junit4]   2> 1475671 T2827 oass.SolrIndexSearcher.<init> Opening Searcher@68b1d48d main
   [junit4]   2> 1475671 T2816 oass.SolrIndexSearcher.<init> Opening Searcher@6cd924db main
   [junit4]   2> 1475673 T2827 oasu.CommitTracker.<init> Hard AutoCommit: disabled
   [junit4]   2> 1475673 T2827 oasu.CommitTracker.<init> Soft AutoCommit: disabled
   [junit4]   2> 1475673 T2816 oasu.CommitTracker.<init> Hard AutoCommit: disabled
   [junit4]   2> 1475673 T2816 oasu.CommitTracker.<init> Soft AutoCommit: disabled
   [junit4]   2> 1475675 T2856 oass.FileExchangeRateProvider.reload Reloading exchange rates from file currency.xml
   [junit4]   2> 1475685 T2869 oasc.SolrCore.registerSearcher [nodes_used_collection_shard1_replica2] Registered new searcher Searcher@68b1d48d main{StandardDirectoryReader(segments_1:1)}
   [junit4]   2> 1475686 T2816 oasc.CoreContainer.registerCore registering core: nodes_used_collection_shard2_replica2
   [junit4]   2> 1475686 T2816 oasc.ZkController.register Register replica - core:nodes_used_collection_shard2_replica2 address:http://127.0.0.1:60999/jzit collection:nodes_used_collection shard:shard2
   [junit4]   2> 1475687 T2816 oascsi.HttpClientUtil.createClient Creating new http client, config:maxConnections=10000&maxConnectionsPerHost=20&connTimeout=15000&socketTimeout=30000&retry=false
   [junit4]   2> 1475691 T2856 oass.FileExchangeRateProvider.reload Reloading exchange rates from file currency.xml
   [junit4]   2> 1475692 T2868 oasc.SolrCore.registerSearcher [nodes_used_collection_shard2_replica2] Registered new searcher Searcher@6cd924db main{StandardDirectoryReader(segments_1:1)}
   [junit4]   2> 1475694 T2827 oasc.CoreContainer.registerCore registering core: nodes_used_collection_shard1_replica2
   [junit4]   2> 1475694 T2827 oasc.ZkController.register Register replica - core:nodes_used_collection_shard1_replica2 address:http://127.0.0.1:61008/jzit collection:nodes_used_collection shard:shard1
   [junit4]   2> 1475695 T2827 oascsi.HttpClientUtil.createClient Creating new http client, config:maxConnections=10000&maxConnectionsPerHost=20&connTimeout=15000&socketTimeout=30000&retry=false
   [junit4]   2> 1475698 T2856 oass.OpenExchangeRatesOrgProvider.reload Reloading exchange rates from open-exchange-rates.json
   [junit4]   2> 1475699 T2816 oascc.SolrZkClient.makePath makePath: /collections/nodes_used_collection/leader_elect/shard2/election
   [junit4]   2> 1475700 T2827 oascc.SolrZkClient.makePath makePath: /collections/nodes_used_collection/leader_elect/shard1/election
   [junit4]   2> 1475701 T2798 oass.FileExchangeRateProvider.reload Reloading exchange rates from file currency.xml
   [junit4]   2> 1475701 T2856 oass.OpenExchangeRatesOrgProvider$OpenExchangeRates.<init> WARN Unknown key IMPORTANT NOTE
   [junit4]   2> 1475701 T2856 oass.OpenExchangeRatesOrgProvider$OpenExchangeRates.<init> WARN Expected key, got STRING
   [junit4]   2> 1475701 T2856 oass.OpenExchangeRatesOrgProvider.reload Reloading exchange rates from open-exchange-rates.json
   [junit4]   2> 1475705 T2856 oass.OpenExchangeRatesOrgProvider$OpenExchangeRates.<init> WARN Unknown key IMPORTANT NOTE
   [junit4]   2> 1475705 T2856 oass.OpenExchangeRatesOrgProvider$OpenExchangeRates.<init> WARN Expected key, got STRING
   [junit4]   2> 1475705 T2856 oasc.SolrCore.initDirectoryFactory org.apache.solr.core.MockDirectoryFactory
   [junit4]   2> 1475705 T2856 oasc.SolrCore.<init> [nodes_used_collection_shard1_replica1] Opening new SolrCore at C:\Users\JenkinsSlave\workspace\Lucene-Solr-4.x-Windows\solr\build\solr-core\test\J0\.\org.apache.solr.cloud.CollectionsAPIDistributedZkTest-jetty4-1375482818506\nodes_used_collection_shard1_replica1\, dataDir=C:\Users\JenkinsSlave\workspace\Lucene-Solr-4.x-Windows\solr\build\solr-core\test\J0\.\org.apache.solr.cloud.CollectionsAPIDistributedZkTest-jetty4-1375482818506\\nodes_used_collection_shard1_replica1\data\
   [junit4]   2> 1475705 T2856 oasc.JmxMonitoredMap.<init> JMX monitoring is enabled. Adding Solr mbeans to JMX Server: com.sun.jmx.mbeanserver.JmxMBeanServer@19f7f0f0
   [junit4]   2> 1475706 T2856 oasc.CachingDirectoryFactory.get return new directory for C:\Users\JenkinsSlave\workspace\Lucene-Solr-4.x-Windows\solr\build\solr-core\test\J0\.\org.apache.solr.cloud.CollectionsAPIDistributedZkTest-jetty4-1375482818506\\nodes_used_collection_shard1_replica1\data\
   [junit4]   2> 1475707 T2856 oasc.SolrCore.getNewIndexDir New index directory detected: old=null new=C:\Users\JenkinsSlave\workspace\Lucene-Solr-4.x-Windows\solr\build\solr-core\test\J0\.\org.apache.solr.cloud.CollectionsAPIDistributedZkTest-jetty4-1375482818506\\nodes_used_collection_shard1_replica1\data\index/
   [junit4]   2> 1475707 T2856 oasc.SolrCore.initIndex WARN [nodes_used_collection_shard1_replica1] Solr index directory 'C:\Users\JenkinsSlave\workspace\Lucene-Solr-4.x-Windows\solr\build\solr-core\test\J0\.\org.apache.solr.cloud.CollectionsAPIDistributedZkTest-jetty4-1375482818506\nodes_used_collection_shard1_replica1\data\index' doesn't exist. Creating new index...
   [junit4]   2> 1475706 T2798 oass.FileExchangeRateProvider.reload Reloading exchange rates from file currency.xml
   [junit4]   2> 1475707 T2856 oasc.CachingDirectoryFactory.get return new directory for C:\Users\JenkinsSlave\workspace\Lucene-Solr-4.x-Windows\solr\build\solr-core\test\J0\.\org.apache.solr.cloud.CollectionsAPIDistributedZkTest-jetty4-1375482818506\\nodes_used_collection_shard1_replica1\data\index
   [junit4]   2> 1475714 T2856 oasc.SolrDeletionPolicy.onCommit SolrDeletionPolicy.onCommit: commits: num=1
   [junit4]   2> 		commit{dir=MockDirWrapper(org.apache.lucene.store.RAMDirectory@73870135 lockFactory=org.apache.lucene.store.NativeFSLockFactory@366da9da),segFN=segments_1,generation=1}
   [junit4]   2> 1475715 T2856 oasc.SolrDeletionPolicy.updateCommits newest commit generation = 1
   [junit4]   2> 1475718 T2798 oass.OpenExchangeRatesOrgProvider.reload Reloading exchange rates from open-exchange-rates.json
   [junit4]   2> 1475720 T2856 oasup.UpdateRequestProcessorChain.init inserting DistributedUpdateProcessorFactory into updateRequestProcessorChain "dedupe"
   [junit4]   2> 1475720 T2856 oasup.UpdateRequestProcessorChain.init inserting DistributedUpdateProcessorFactory into updateRequestProcessorChain "stored_sig"
   [junit4]   2> 1475722 T2856 oasup.UpdateRequestProcessorChain.init inserting DistributedUpdateProcessorFactory into updateRequestProcessorChain "distrib-dup-test-chain-implicit"
   [junit4]   2> 1475723 T2798 oass.OpenExchangeRatesOrgProvider$OpenExchangeRates.<init> WARN Unknown key IMPORTANT NOTE
   [junit4]   2> 1475723 T2856 oasc.RequestHandlers.initHandlersFromConfig created standard: solr.StandardRequestHandler
   [junit4]   2> 1475724 T2856 oasc.RequestHandlers.initHandlersFromConfig created /get: solr.RealTimeGetHandler
   [junit4]   2> 1475724 T2856 oasc.RequestHandlers.initHandlersFromConfig adding lazy requestHandler: solr.ReplicationHandler
   [junit4]   2> 1475723 T2798 oass.OpenExchangeRatesOrgProvider$OpenExchangeRates.<init> WARN Expected key, got STRING
   [junit4]   2> 1475725 T2798 oass.OpenExchangeRatesOrgProvider.reload Reloading exchange rates from open-exchange-rates.json
   [junit4]   2> 1475724 T2856 oasc.RequestHandlers.initHandlersFromConfig created /replication: solr.ReplicationHandler
   [junit4]   2> 1475726 T2856 oasc.RequestHandlers.initHandlersFromConfig created /update: solr.UpdateRequestHandler
   [junit4]   2> 1475726 T2856 oasc.RequestHandlers.initHandlersFromConfig created /admin/: org.apache.solr.handler.admin.AdminHandlers
   [junit4]   2> 1475730 T2798 oass.OpenExchangeRatesOrgProvider$OpenExchangeRates.<init> WARN Unknown key IMPORTANT NOTE
   [junit4]   2> 1475730 T2798 oass.OpenExchangeRatesOrgProvider$OpenExchangeRates.<init> WARN Expected key, got STRING
   [junit4]   2> 1475731 T2798 oasc.SolrCore.initDirectoryFactory org.apache.solr.core.MockDirectoryFactory
   [junit4]   2> 1475731 T2798 oasc.SolrCore.<init> [nodes_used_collection_shard2_replica1] Opening new SolrCore at C:\Users\JenkinsSlave\workspace\Lucene-Solr-4.x-Windows\solr\build\solr-core\test\J0\.\org.apache.solr.cloud.CollectionsAPIDistributedZkTest-controljetty-1375482813101\nodes_used_collection_shard2_replica1\, dataDir=C:\Users\JenkinsSlave\workspace\Lucene-Solr-4.x-Windows\solr\build\solr-core\test\J0\.\org.apache.solr.cloud.CollectionsAPIDistributedZkTest-controljetty-1375482813101\\nodes_used_collection_shard2_replica1\data\
   [junit4]   2> 1475731 T2798 oasc.JmxMonitoredMap.<init> JMX monitoring is enabled. Adding Solr mbeans to JMX Server: com.sun.jmx.mbeanserver.JmxMBeanServer@19f7f0f0
   [junit4]   2> 1475731 T2798 oasc.CachingDirectoryFactory.get return new directory for C:\Users\JenkinsSlave\workspace\Lucene-Solr-4.x-Windows\solr\build\solr-core\test\J0\.\org.apache.solr.cloud.CollectionsAPIDistributedZkTest-controljetty-1375482813101\\nodes_used_collection_shard2_replica1\data\
   [junit4]   2> 1475731 T2798 oasc.SolrCore.getNewIndexDir New index directory detected: old=null new=C:\Users\JenkinsSlave\workspace\Lucene-Solr-4.x-Windows\solr\build\solr-core\test\J0\.\org.apache.solr.cloud.CollectionsAPIDistributedZkTest-controljetty-1375482813101\\nodes_used_collection_shard2_replica1\data\index/
   [junit4]   2> 1475732 T2798 oasc.SolrCore.initIndex WARN [nodes_used_collection_shard2_replica1] Solr index directory 'C:\Users\JenkinsSlave\workspace\Lucene-Solr-4.x-Windows\solr\build\solr-core\test\J0\.\org.apache.solr.cloud.CollectionsAPIDistributedZkTest-controljetty-1375482813101\nodes_used_collection_shard2_replica1\data\index' doesn't exist. Creating new index...
   [junit4]   2> 1475732 T2798 oasc.CachingDirectoryFactory.get return new directory for C:\Users\JenkinsSlave\workspace\Lucene-Solr-4.x-Windows\solr\build\solr-core\test\J0\.\org.apache.solr.cloud.CollectionsAPIDistributedZkTest-controljetty-1375482813101\\nodes_used_collection_shard2_replica1\data\index
   [junit4]   2> 1475737 T2856 oashl.XMLLoader.init xsltCacheLifetimeSeconds=60
   [junit4]   2> 1475737 T2798 oasc.SolrDeletionPolicy.onCommit SolrDeletionPolicy.onCommit: commits: num=1
   [junit4]   2> 		commit{dir=MockDirWrapper(org.apache.lucene.store.RAMDirectory@286be50b lockFactory=org.apache.lucene.store.NativeFSLockFactory@3ac076f2),segFN=segments_1,generation=1}
   [junit4]   2> 1475737 T2798 oasc.SolrDeletionPolicy.updateCommits newest commit generation = 1
   [junit4]   2> 1475743 T2798 oasup.UpdateRequestProcessorChain.init inserting DistributedUpdateProcessorFactory into updateRequestProcessorChain "dedupe"
   [junit4]   2> 1475743 T2798 oasup.UpdateRequestProcessorChain.init inserting DistributedUpdateProcessorFactory into updateRequestProcessorChain "stored_sig"
   [junit4]   2> 1475743 T2856 oass.SolrIndexSearcher.<init> Opening Searcher@11d47e54 main
   [junit4]   2> 1475743 T2798 oasup.UpdateRequestProcessorChain.init inserting DistributedUpdateProcessorFactory into updateRequestProcessorChain "distrib-dup-test-chain-implicit"
   [junit4]   2> 1475744 T2798 oasc.RequestHandlers.initHandlersFromConfig created standard: solr.StandardRequestHandler
   [junit4]   2> 1475744 T2798 oasc.RequestHandlers.initHandlersFromConfig created /get: solr.RealTimeGetHandler
   [junit4]   2> 1475745 T2798 oasc.RequestHandlers.initHandlersFromConfig adding lazy requestHandler: solr.ReplicationHandler
   [junit4]   2> 1475745 T2798 oasc.RequestHandlers.initHandlersFromConfig created /replication: solr.ReplicationHandler
   [junit4]   2> 1475745 T2856 oasu.CommitTracker.<init> Hard AutoCommit: disabled
   [junit4]   2> 1475746 T2798 oasc.RequestHandlers.initHandlersFromConfig created /update: solr.UpdateRequestHandler
   [junit4]   2> 1475746 T2798 oasc.RequestHandlers.initHandlersFromConfig created /admin/: org.apache.solr.handler.admin.AdminHandlers
   [junit4]   2> 1475746 T2856 oasu.CommitTracker.<init> Soft AutoCommit: disabled
   [junit4]   2> 1475746 T2827 oasc.ShardLeaderElectionContext.runLeaderProcess Running the leader process for shard shard1
   [junit4]   2> 1475753 T2856 oasc.CoreContainer.registerCore registering core: nodes_used_collection_shard1_replica1
   [junit4]   2> 1475753 T2856 oasc.ZkController.register Register replica - core:nodes_used_collection_shard1_replica1 address:http://127.0.0.1:61026/jzit collection:nodes_used_collection shard:shard1
   [junit4]   2> 1475753 T2856 oascsi.HttpClientUtil.createClient Creating new http client, config:maxConnections=10000&maxConnectionsPerHost=20&connTimeout=15000&socketTimeout=30000&retry=false
   [junit4]   2> 1475756 T2798 oashl.XMLLoader.init xsltCacheLifetimeSeconds=60
   [junit4]   2> 1475759 T2870 oasc.SolrCore.registerSearcher [nodes_used_collection_shard1_replica1] Registered new searcher Searcher@11d47e54 main{StandardDirectoryReader(segments_1:1)}
   [junit4]   2> 1475760 T2816 oasc.ShardLeaderElectionContext.runLeaderProcess Running the leader process for shard shard2
   [junit4]   2> 1475762 T2798 oass.SolrIndexSearcher.<init> Opening Searcher@24e7e618 main
   [junit4]   2> 1475766 T2827 oasc.ShardLeaderElectionContext.waitForReplicasToComeUp Waiting until we see more replicas up for shard shard1: total=2 found=1 timeoutin=179999
   [junit4]   2> 1475768 T2816 oasc.ShardLeaderElectionContext.waitForReplicasToComeUp Waiting until we see more replicas up for shard shard2: total=2 found=1 timeoutin=179999
   [junit4]   2> 1475768 T2798 oasu.CommitTracker.<init> Hard AutoCommit: disabled
   [junit4]   2> 1475768 T2798 oasu.CommitTracker.<init> Soft AutoCommit: disabled
   [junit4]   2> 1475772 T2871 oasc.SolrCore.registerSearcher [nodes_used_collection_shard2_replica1] Registered new searcher Searcher@24e7e618 main{StandardDirectoryReader(segments_1:1)}
   [junit4]   2> 1475774 T2798 oasc.CoreContainer.registerCore registering core: nodes_used_collection_shard2_replica1
   [junit4]   2> 1475774 T2798 oasc.ZkController.register Register replica

[...truncated too long message...]

ava:127)
   [junit4]   2> 	at org.apache.zookeeper.KeeperException.create(KeeperException.java:51)
   [junit4]   2> 	at org.apache.zookeeper.ZooKeeper.getChildren(ZooKeeper.java:1468)
   [junit4]   2> 	at org.apache.solr.common.cloud.SolrZkClient$6.execute(SolrZkClient.java:235)
   [junit4]   2> 	at org.apache.solr.common.cloud.SolrZkClient$6.execute(SolrZkClient.java:232)
   [junit4]   2> 	at org.apache.solr.common.cloud.ZkCmdExecutor.retryOperation(ZkCmdExecutor.java:65)
   [junit4]   2> 	at org.apache.solr.common.cloud.SolrZkClient.getChildren(SolrZkClient.java:232)
   [junit4]   2> 	at org.apache.solr.cloud.LeaderElector.checkIfIamLeader(LeaderElector.java:84)
   [junit4]   2> 	at org.apache.solr.cloud.LeaderElector.access$000(LeaderElector.java:55)
   [junit4]   2> 	at org.apache.solr.cloud.LeaderElector$1.process(LeaderElector.java:129)
   [junit4]   2> 	at org.apache.zookeeper.ClientCnxn$EventThread.processEvent(ClientCnxn.java:519)
   [junit4]   2> 	at org.apache.zookeeper.ClientCnxn$EventThread.run(ClientCnxn.java:495)
   [junit4]   2> 
   [junit4]   2> 1626589 T2862 oascc.ZkStateReader$3.process WARN ZooKeeper watch triggered, but Solr cannot talk to ZK
   [junit4]   2> 1626589 T2862 oascc.ZkStateReader$2.process A cluster state change: WatchedEvent state:SyncConnected type:NodeChildrenChanged path:/live_nodes, has occurred - updating... (live nodes size: 1)
   [junit4]   2> 1626589 T2862 oascc.ZkStateReader$2.process WARN ZooKeeper watch triggered, but Solr cannot talk to ZK
   [junit4]   1> client port:0.0.0.0/0.0.0.0:0
   [junit4]   2> NOTE: reproduce with: ant test  -Dtestcase=CollectionsAPIDistributedZkTest -Dtests.method=testDistribSearch -Dtests.seed=7A25E5704A757642 -Dtests.slow=true -Dtests.locale=ar_QA -Dtests.timezone=America/Dominica -Dtests.file.encoding=ISO-8859-1
   [junit4] ERROR    163s | CollectionsAPIDistributedZkTest.testDistribSearch <<<
   [junit4]    > Throwable #1: org.apache.solr.client.solrj.SolrServerException: Server refused connection at: http://127.0.0.1:60999/jzit
   [junit4]    > 	at __randomizedtesting.SeedInfo.seed([7A25E5704A757642:FBC36B683D2A167E]:0)
   [junit4]    > 	at org.apache.solr.client.solrj.impl.HttpSolrServer.request(HttpSolrServer.java:428)
   [junit4]    > 	at org.apache.solr.client.solrj.impl.HttpSolrServer.request(HttpSolrServer.java:180)
   [junit4]    > 	at org.apache.solr.cloud.AbstractFullDistribZkTestBase.createCollection(AbstractFullDistribZkTestBase.java:1535)
   [junit4]    > 	at org.apache.solr.cloud.CollectionsAPIDistributedZkTest.testCustomCollectionsAPI(CollectionsAPIDistributedZkTest.java:677)
   [junit4]    > 	at org.apache.solr.cloud.CollectionsAPIDistributedZkTest.doTest(CollectionsAPIDistributedZkTest.java:159)
   [junit4]    > 	at org.apache.solr.BaseDistributedSearchTestCase.testDistribSearch(BaseDistributedSearchTestCase.java:835)
   [junit4]    > 	at java.lang.Thread.run(Thread.java:724)
   [junit4]    > Caused by: org.apache.http.conn.HttpHostConnectException: Connection to http://127.0.0.1:60999 refused
   [junit4]    > 	at org.apache.http.impl.conn.DefaultClientConnectionOperator.openConnection(DefaultClientConnectionOperator.java:190)
   [junit4]    > 	at org.apache.http.impl.conn.ManagedClientConnectionImpl.open(ManagedClientConnectionImpl.java:294)
   [junit4]    > 	at org.apache.http.impl.client.DefaultRequestDirector.tryConnect(DefaultRequestDirector.java:645)
   [junit4]    > 	at org.apache.http.impl.client.DefaultRequestDirector.execute(DefaultRequestDirector.java:480)
   [junit4]    > 	at org.apache.http.impl.client.AbstractHttpClient.execute(AbstractHttpClient.java:906)
   [junit4]    > 	at org.apache.http.impl.client.AbstractHttpClient.execute(AbstractHttpClient.java:805)
   [junit4]    > 	at org.apache.http.impl.client.AbstractHttpClient.execute(AbstractHttpClient.java:784)
   [junit4]    > 	at org.apache.solr.client.solrj.impl.HttpSolrServer.request(HttpSolrServer.java:365)
   [junit4]    > 	... 45 more
   [junit4]    > Caused by: java.net.ConnectException: Connection refused: connect
   [junit4]    > 	at java.net.DualStackPlainSocketImpl.waitForConnect(Native Method)
   [junit4]    > 	at java.net.DualStackPlainSocketImpl.socketConnect(DualStackPlainSocketImpl.java:85)
   [junit4]    > 	at java.net.AbstractPlainSocketImpl.doConnect(AbstractPlainSocketImpl.java:339)
   [junit4]    > 	at java.net.AbstractPlainSocketImpl.connectToAddress(AbstractPlainSocketImpl.java:200)
   [junit4]    > 	at java.net.AbstractPlainSocketImpl.connect(AbstractPlainSocketImpl.java:182)
   [junit4]    > 	at java.net.PlainSocketImpl.connect(PlainSocketImpl.java:172)
   [junit4]    > 	at java.net.SocksSocketImpl.connect(SocksSocketImpl.java:392)
   [junit4]    > 	at java.net.Socket.connect(Socket.java:579)
   [junit4]    > 	at org.apache.http.conn.scheme.PlainSocketFactory.connectSocket(PlainSocketFactory.java:127)
   [junit4]    > 	at org.apache.http.impl.conn.DefaultClientConnectionOperator.openConnection(DefaultClientConnectionOperator.java:180)
   [junit4]    > 	... 52 more
   [junit4]   2> 1626613 T2780 oas.SolrTestCaseJ4.deleteCore ###deleteCore
   [junit4]   2> NOTE: test params are: codec=Lucene42: {timestamp=PostingsFormat(name=Memory doPackFST= true), range_facet_l=PostingsFormat(name=Memory doPackFST= true), id=PostingsFormat(name=NestedPulsing), range_facet_sl=PostingsFormat(name=Asserting), a_t=PostingsFormat(name=Memory doPackFST= true), text=PostingsFormat(name=Asserting), range_facet_si=MockVariableIntBlock(baseBlockSize=123), _version_=PostingsFormat(name=Memory doPackFST= true), other_tl1=PostingsFormat(name=Memory doPackFST= true), multiDefault=MockVariableIntBlock(baseBlockSize=123), a_si=MockVariableIntBlock(baseBlockSize=123), intDefault=PostingsFormat(name=Memory doPackFST= true)}, docValues:{}, sim=DefaultSimilarity, locale=ar_QA, timezone=America/Dominica
   [junit4]   2> NOTE: Windows 7 6.1 amd64/Oracle Corporation 1.7.0_25 (64-bit)/cpus=2,threads=2,free=79168144,total=294277120
   [junit4]   2> NOTE: All tests run in this JVM: [UpdateParamsTest, TestIndexSearcher, URLClassifyProcessorTest, TestCloudManagedSchemaAddField, SolrCoreTest, RequestHandlersTest, OverseerTest, TestStressReorder, SuggesterTSTTest, TestCollationField, SimplePostToolTest, TestManagedSchema, TestSolrQueryParserDefaultOperatorResource, HighlighterTest, SuggesterTest, AnalysisAfterCoreReloadTest, BasicDistributedZkTest, TestFuzzyAnalyzedSuggestions, TestCopyFieldCollectionResource, AddSchemaFieldsUpdateProcessorFactoryTest, TestSort, SignatureUpdateProcessorFactoryTest, BasicZkTest, TestValueSourceCache, DisMaxRequestHandlerTest, HardAutoCommitTest, TestOmitPositions, NoCacheHeaderTest, SpatialFilterTest, TestDefaultSearchFieldResource, BadComponentTest, TestAtomicUpdateErrorCases, TestWordDelimiterFilterFactory, MBeansHandlerTest, SolrTestCaseJ4Test, SuggesterWFSTTest, QueryResultKeyTest, TestSweetSpotSimilarityFactory, RecoveryZkTest, TestFieldTypeCollectionResource, NotRequiredUniqueKeyTest, MinimalSchemaTest, CopyFieldTest, UpdateRequestProcessorFactoryTest, PreAnalyzedFieldTest, PluginInfoTest, TestBM25SimilarityFactory, FieldAnalysisRequestHandlerTest, IndexSchemaTest, TestLuceneMatchVersion, TestShardHandlerFactory, TestFieldCollectionResource, CurrencyFieldOpenExchangeTest, SearchHandlerTest, ShardSplitTest, SimpleFacetsTest, PingRequestHandlerTest, ReturnFieldsTest, TestCSVLoader, ResponseLogComponentTest, DistributedSpellCheckComponentTest, TestAddFieldRealTimeGet, SolrCmdDistributorTest, UniqFieldsUpdateProcessorFactoryTest, TestPHPSerializedResponseWriter, TestFastWriter, TestPropInject, TestRemoteStreaming, OpenExchangeRatesOrgProviderTest, LegacyHTMLStripCharFilterTest, OutputWriterTest, AssignTest, TestQueryTypes, HighlighterConfigTest, TestReloadAndDeleteDocs, OpenCloseCoreStressTest, TestDynamicFieldCollectionResource, TermsComponentTest, TestCoreDiscovery, TestRecovery, TestMultiCoreConfBootstrap, ClusterStateTest, IndexBasedSpellCheckerTest, TestClassNameShortening, HdfsDirectoryTest, TestSchemaVersionResource, TestRandomFaceting, TestLMDirichletSimilarityFactory, TestAnalyzedSuggestions, PrimUtilsTest, SchemaVersionSpecificBehaviorTest, PreAnalyzedUpdateProcessorTest, TestSolrJ, TestMaxScoreQueryParser, TestPseudoReturnFields, BlockCacheTest, TestIndexingPerformance, TestDynamicFieldResource, SliceStateTest, TestLRUCache, MultiTermTest, ClusterStateUpdateTest, ExternalFileFieldSortTest, HdfsBasicDistributedZk2Test, SOLR749Test, TestExtendedDismaxParser, DocumentAnalysisRequestHandlerTest, DOMUtilTest, CollectionsAPIDistributedZkTest]
   [junit4] Completed in 162.56s, 1 test, 1 error <<< FAILURES!

[...truncated 643 lines...]
BUILD FAILED
C:\Users\JenkinsSlave\workspace\Lucene-Solr-4.x-Windows\build.xml:395: The following error occurred while executing this line:
C:\Users\JenkinsSlave\workspace\Lucene-Solr-4.x-Windows\build.xml:375: The following error occurred while executing this line:
C:\Users\JenkinsSlave\workspace\Lucene-Solr-4.x-Windows\build.xml:39: The following error occurred while executing this line:
C:\Users\JenkinsSlave\workspace\Lucene-Solr-4.x-Windows\solr\build.xml:181: The following error occurred while executing this line:
C:\Users\JenkinsSlave\workspace\Lucene-Solr-4.x-Windows\solr\common-build.xml:449: The following error occurred while executing this line:
C:\Users\JenkinsSlave\workspace\Lucene-Solr-4.x-Windows\lucene\common-build.xml:1233: The following error occurred while executing this line:
C:\Users\JenkinsSlave\workspace\Lucene-Solr-4.x-Windows\lucene\common-build.xml:876: There were test failures: 321 suites, 1352 tests, 1 error, 39 ignored (11 assumptions)

Total time: 81 minutes 7 seconds
Build step 'Invoke Ant' marked build as failure
Description set: Java: 64bit/jdk1.7.0_25 -XX:+UseCompressedOops -XX:+UseConcMarkSweepGC
Archiving artifacts
Recording test results
Email was triggered for: Failure
Sending email for trigger: Failure



Mime
View raw message