lucene-dev mailing list archives

Site index · List index
Message view « Date » · « Thread »
Top « Date » · « Thread »
From Apache Jenkins Server <jenk...@builds.apache.org>
Subject [JENKINS] Lucene-Solr-Tests-trunk-Java7 - Build # 4200 - Still Failing
Date Thu, 01 Aug 2013 16:52:38 GMT
Build: https://builds.apache.org/job/Lucene-Solr-Tests-trunk-Java7/4200/

1 tests failed.
FAILED:  org.apache.solr.cloud.CollectionsAPIDistributedZkTest.testDistribSearch

Error Message:
IOException occured when talking to server at: http://127.0.0.1:38553

Stack Trace:
org.apache.solr.client.solrj.SolrServerException: IOException occured when talking to server at: http://127.0.0.1:38553
	at __randomizedtesting.SeedInfo.seed([A7A5A9E6756B5823:264327FE0234381F]:0)
	at org.apache.solr.client.solrj.impl.HttpSolrServer.request(HttpSolrServer.java:435)
	at org.apache.solr.client.solrj.impl.HttpSolrServer.request(HttpSolrServer.java:180)
	at org.apache.solr.cloud.AbstractFullDistribZkTestBase.createCollection(AbstractFullDistribZkTestBase.java:1535)
	at org.apache.solr.cloud.CollectionsAPIDistributedZkTest.testCustomCollectionsAPI(CollectionsAPIDistributedZkTest.java:677)
	at org.apache.solr.cloud.CollectionsAPIDistributedZkTest.doTest(CollectionsAPIDistributedZkTest.java:159)
	at org.apache.solr.BaseDistributedSearchTestCase.testDistribSearch(BaseDistributedSearchTestCase.java:835)
	at sun.reflect.NativeMethodAccessorImpl.invoke0(Native Method)
	at sun.reflect.NativeMethodAccessorImpl.invoke(NativeMethodAccessorImpl.java:57)
	at sun.reflect.DelegatingMethodAccessorImpl.invoke(DelegatingMethodAccessorImpl.java:43)
	at java.lang.reflect.Method.invoke(Method.java:606)
	at com.carrotsearch.randomizedtesting.RandomizedRunner.invoke(RandomizedRunner.java:1559)
	at com.carrotsearch.randomizedtesting.RandomizedRunner.access$600(RandomizedRunner.java:79)
	at com.carrotsearch.randomizedtesting.RandomizedRunner$6.evaluate(RandomizedRunner.java:737)
	at com.carrotsearch.randomizedtesting.RandomizedRunner$7.evaluate(RandomizedRunner.java:773)
	at com.carrotsearch.randomizedtesting.RandomizedRunner$8.evaluate(RandomizedRunner.java:787)
	at com.carrotsearch.randomizedtesting.rules.SystemPropertiesRestoreRule$1.evaluate(SystemPropertiesRestoreRule.java:53)
	at org.apache.lucene.util.TestRuleSetupTeardownChained$1.evaluate(TestRuleSetupTeardownChained.java:50)
	at org.apache.lucene.util.TestRuleFieldCacheSanity$1.evaluate(TestRuleFieldCacheSanity.java:51)
	at org.apache.lucene.util.AbstractBeforeAfterRule$1.evaluate(AbstractBeforeAfterRule.java:46)
	at com.carrotsearch.randomizedtesting.rules.SystemPropertiesInvariantRule$1.evaluate(SystemPropertiesInvariantRule.java:55)
	at org.apache.lucene.util.TestRuleThreadAndTestName$1.evaluate(TestRuleThreadAndTestName.java:49)
	at org.apache.lucene.util.TestRuleIgnoreAfterMaxFailures$1.evaluate(TestRuleIgnoreAfterMaxFailures.java:70)
	at org.apache.lucene.util.TestRuleMarkFailure$1.evaluate(TestRuleMarkFailure.java:48)
	at com.carrotsearch.randomizedtesting.rules.StatementAdapter.evaluate(StatementAdapter.java:36)
	at com.carrotsearch.randomizedtesting.ThreadLeakControl$StatementRunner.run(ThreadLeakControl.java:358)
	at com.carrotsearch.randomizedtesting.ThreadLeakControl.forkTimeoutingTask(ThreadLeakControl.java:782)
	at com.carrotsearch.randomizedtesting.ThreadLeakControl$3.evaluate(ThreadLeakControl.java:442)
	at com.carrotsearch.randomizedtesting.RandomizedRunner.runSingleTest(RandomizedRunner.java:746)
	at com.carrotsearch.randomizedtesting.RandomizedRunner$3.evaluate(RandomizedRunner.java:648)
	at com.carrotsearch.randomizedtesting.RandomizedRunner$4.evaluate(RandomizedRunner.java:682)
	at com.carrotsearch.randomizedtesting.RandomizedRunner$5.evaluate(RandomizedRunner.java:693)
	at com.carrotsearch.randomizedtesting.rules.StatementAdapter.evaluate(StatementAdapter.java:36)
	at com.carrotsearch.randomizedtesting.rules.SystemPropertiesRestoreRule$1.evaluate(SystemPropertiesRestoreRule.java:53)
	at org.apache.lucene.util.AbstractBeforeAfterRule$1.evaluate(AbstractBeforeAfterRule.java:46)
	at org.apache.lucene.util.TestRuleStoreClassName$1.evaluate(TestRuleStoreClassName.java:42)
	at com.carrotsearch.randomizedtesting.rules.SystemPropertiesInvariantRule$1.evaluate(SystemPropertiesInvariantRule.java:55)
	at com.carrotsearch.randomizedtesting.rules.NoShadowingOrOverridesOnMethodsRule$1.evaluate(NoShadowingOrOverridesOnMethodsRule.java:39)
	at com.carrotsearch.randomizedtesting.rules.NoShadowingOrOverridesOnMethodsRule$1.evaluate(NoShadowingOrOverridesOnMethodsRule.java:39)
	at com.carrotsearch.randomizedtesting.rules.StatementAdapter.evaluate(StatementAdapter.java:36)
	at org.apache.lucene.util.TestRuleAssertionsRequired$1.evaluate(TestRuleAssertionsRequired.java:43)
	at org.apache.lucene.util.TestRuleMarkFailure$1.evaluate(TestRuleMarkFailure.java:48)
	at org.apache.lucene.util.TestRuleIgnoreAfterMaxFailures$1.evaluate(TestRuleIgnoreAfterMaxFailures.java:70)
	at org.apache.lucene.util.TestRuleIgnoreTestSuites$1.evaluate(TestRuleIgnoreTestSuites.java:55)
	at com.carrotsearch.randomizedtesting.rules.StatementAdapter.evaluate(StatementAdapter.java:36)
	at com.carrotsearch.randomizedtesting.ThreadLeakControl$StatementRunner.run(ThreadLeakControl.java:358)
	at java.lang.Thread.run(Thread.java:724)
Caused by: org.apache.http.conn.ConnectTimeoutException: Connect to 127.0.0.1:38553 timed out
	at org.apache.http.conn.scheme.PlainSocketFactory.connectSocket(PlainSocketFactory.java:129)
	at org.apache.http.impl.conn.DefaultClientConnectionOperator.openConnection(DefaultClientConnectionOperator.java:180)
	at org.apache.http.impl.conn.ManagedClientConnectionImpl.open(ManagedClientConnectionImpl.java:294)
	at org.apache.http.impl.client.DefaultRequestDirector.tryConnect(DefaultRequestDirector.java:645)
	at org.apache.http.impl.client.DefaultRequestDirector.execute(DefaultRequestDirector.java:480)
	at org.apache.http.impl.client.AbstractHttpClient.execute(AbstractHttpClient.java:906)
	at org.apache.http.impl.client.AbstractHttpClient.execute(AbstractHttpClient.java:805)
	at org.apache.http.impl.client.AbstractHttpClient.execute(AbstractHttpClient.java:784)
	at org.apache.solr.client.solrj.impl.HttpSolrServer.request(HttpSolrServer.java:365)
	... 45 more




Build Log:
[...truncated 9833 lines...]
   [junit4] Suite: org.apache.solr.cloud.CollectionsAPIDistributedZkTest
   [junit4]   2> 1176783 T2800 oas.BaseDistributedSearchTestCase.initHostContext Setting hostContext system property: /
   [junit4]   2> 1176789 T2800 oas.SolrTestCaseJ4.setUp ###Starting testDistribSearch
   [junit4]   2> Creating dataDir: /usr/home/hudson/hudson-slave/workspace/Lucene-Solr-Tests-trunk-Java7/solr/build/solr-core/test/J0/./solrtest-CollectionsAPIDistributedZkTest-1375375092408
   [junit4]   2> 1176791 T2800 oasc.ZkTestServer.run STARTING ZK TEST SERVER
   [junit4]   2> 1176791 T2801 oasc.ZkTestServer$ZKServerMain.runFromConfig Starting server
   [junit4]   2> 1176892 T2800 oasc.ZkTestServer.run start zk server on port:38543
   [junit4]   2> 1176893 T2800 oascc.ConnectionManager.waitForConnected Waiting for client to connect to ZooKeeper
   [junit4]   2> 1176897 T2807 oascc.ConnectionManager.process Watcher org.apache.solr.common.cloud.ConnectionManager@3623d615 name:ZooKeeperConnection Watcher:127.0.0.1:38543 got event WatchedEvent state:SyncConnected type:None path:null path:null type:None
   [junit4]   2> 1176897 T2800 oascc.ConnectionManager.waitForConnected Client is connected to ZooKeeper
   [junit4]   2> 1176898 T2800 oascc.SolrZkClient.makePath makePath: /solr
   [junit4]   2> 1176902 T2800 oascc.ConnectionManager.waitForConnected Waiting for client to connect to ZooKeeper
   [junit4]   2> 1176915 T2809 oascc.ConnectionManager.process Watcher org.apache.solr.common.cloud.ConnectionManager@185e0798 name:ZooKeeperConnection Watcher:127.0.0.1:38543/solr got event WatchedEvent state:SyncConnected type:None path:null path:null type:None
   [junit4]   2> 1176916 T2800 oascc.ConnectionManager.waitForConnected Client is connected to ZooKeeper
   [junit4]   2> 1176916 T2800 oascc.SolrZkClient.makePath makePath: /collections/collection1
   [junit4]   2> 1176920 T2800 oascc.SolrZkClient.makePath makePath: /collections/collection1/shards
   [junit4]   2> 1176923 T2800 oascc.SolrZkClient.makePath makePath: /collections/control_collection
   [junit4]   2> 1176933 T2800 oascc.SolrZkClient.makePath makePath: /collections/control_collection/shards
   [junit4]   2> 1176936 T2800 oasc.AbstractZkTestCase.putConfig put /usr/home/hudson/hudson-slave/workspace/Lucene-Solr-Tests-trunk-Java7/solr/build/solr-core/test-files/solr/collection1/conf/solrconfig-tlog.xml to /configs/conf1/solrconfig.xml
   [junit4]   2> 1176937 T2800 oascc.SolrZkClient.makePath makePath: /configs/conf1/solrconfig.xml
   [junit4]   2> 1176943 T2800 oasc.AbstractZkTestCase.putConfig put /usr/home/hudson/hudson-slave/workspace/Lucene-Solr-Tests-trunk-Java7/solr/build/solr-core/test-files/solr/collection1/conf/schema.xml to /configs/conf1/schema.xml
   [junit4]   2> 1176943 T2800 oascc.SolrZkClient.makePath makePath: /configs/conf1/schema.xml
   [junit4]   2> 1177053 T2800 oasc.AbstractZkTestCase.putConfig put /usr/home/hudson/hudson-slave/workspace/Lucene-Solr-Tests-trunk-Java7/solr/build/solr-core/test-files/solr/collection1/conf/stopwords.txt to /configs/conf1/stopwords.txt
   [junit4]   2> 1177054 T2800 oascc.SolrZkClient.makePath makePath: /configs/conf1/stopwords.txt
   [junit4]   2> 1177090 T2800 oasc.AbstractZkTestCase.putConfig put /usr/home/hudson/hudson-slave/workspace/Lucene-Solr-Tests-trunk-Java7/solr/build/solr-core/test-files/solr/collection1/conf/protwords.txt to /configs/conf1/protwords.txt
   [junit4]   2> 1177090 T2800 oascc.SolrZkClient.makePath makePath: /configs/conf1/protwords.txt
   [junit4]   2> 1177095 T2800 oasc.AbstractZkTestCase.putConfig put /usr/home/hudson/hudson-slave/workspace/Lucene-Solr-Tests-trunk-Java7/solr/build/solr-core/test-files/solr/collection1/conf/currency.xml to /configs/conf1/currency.xml
   [junit4]   2> 1177096 T2800 oascc.SolrZkClient.makePath makePath: /configs/conf1/currency.xml
   [junit4]   2> 1177104 T2800 oasc.AbstractZkTestCase.putConfig put /usr/home/hudson/hudson-slave/workspace/Lucene-Solr-Tests-trunk-Java7/solr/build/solr-core/test-files/solr/collection1/conf/open-exchange-rates.json to /configs/conf1/open-exchange-rates.json
   [junit4]   2> 1177105 T2800 oascc.SolrZkClient.makePath makePath: /configs/conf1/open-exchange-rates.json
   [junit4]   2> 1177108 T2800 oasc.AbstractZkTestCase.putConfig put /usr/home/hudson/hudson-slave/workspace/Lucene-Solr-Tests-trunk-Java7/solr/build/solr-core/test-files/solr/collection1/conf/mapping-ISOLatin1Accent.txt to /configs/conf1/mapping-ISOLatin1Accent.txt
   [junit4]   2> 1177109 T2800 oascc.SolrZkClient.makePath makePath: /configs/conf1/mapping-ISOLatin1Accent.txt
   [junit4]   2> 1177112 T2800 oasc.AbstractZkTestCase.putConfig put /usr/home/hudson/hudson-slave/workspace/Lucene-Solr-Tests-trunk-Java7/solr/build/solr-core/test-files/solr/collection1/conf/old_synonyms.txt to /configs/conf1/old_synonyms.txt
   [junit4]   2> 1177113 T2800 oascc.SolrZkClient.makePath makePath: /configs/conf1/old_synonyms.txt
   [junit4]   2> 1177116 T2800 oasc.AbstractZkTestCase.putConfig put /usr/home/hudson/hudson-slave/workspace/Lucene-Solr-Tests-trunk-Java7/solr/build/solr-core/test-files/solr/collection1/conf/synonyms.txt to /configs/conf1/synonyms.txt
   [junit4]   2> 1177117 T2800 oascc.SolrZkClient.makePath makePath: /configs/conf1/synonyms.txt
   [junit4]   2> 1177408 T2800 oejs.Server.doStart jetty-8.1.10.v20130312
   [junit4]   2> 1177412 T2800 oejs.AbstractConnector.doStart Started SocketConnector@127.0.0.1:38546
   [junit4]   2> 1177413 T2800 oass.SolrDispatchFilter.init SolrDispatchFilter.init()
   [junit4]   2> 1177413 T2800 oasc.SolrResourceLoader.locateSolrHome JNDI not configured for solr (NoInitialContextEx)
   [junit4]   2> 1177414 T2800 oasc.SolrResourceLoader.locateSolrHome using system property solr.solr.home: /usr/home/hudson/hudson-slave/workspace/Lucene-Solr-Tests-trunk-Java7/solr/build/solr-core/test/J0/./org.apache.solr.cloud.CollectionsAPIDistributedZkTest-controljetty-1375375092744
   [junit4]   2> 1177414 T2800 oasc.SolrResourceLoader.<init> new SolrResourceLoader for directory: '/usr/home/hudson/hudson-slave/workspace/Lucene-Solr-Tests-trunk-Java7/solr/build/solr-core/test/J0/./org.apache.solr.cloud.CollectionsAPIDistributedZkTest-controljetty-1375375092744/'
   [junit4]   2> 1177454 T2800 oasc.ConfigSolr.fromFile Loading container configuration from /usr/home/hudson/hudson-slave/workspace/Lucene-Solr-Tests-trunk-Java7/solr/build/solr-core/test/J0/./org.apache.solr.cloud.CollectionsAPIDistributedZkTest-controljetty-1375375092744/solr.xml
   [junit4]   2> 1177543 T2800 oasc.ConfigSolrXml.<init> Config-defined core root directory: 
   [junit4]   2> 1177545 T2800 oasc.CoreContainer.<init> New CoreContainer 234188404
   [junit4]   2> 1177545 T2800 oasc.CoreContainer.load Loading cores into CoreContainer [instanceDir=/usr/home/hudson/hudson-slave/workspace/Lucene-Solr-Tests-trunk-Java7/solr/build/solr-core/test/J0/./org.apache.solr.cloud.CollectionsAPIDistributedZkTest-controljetty-1375375092744/]
   [junit4]   2> 1177547 T2800 oashc.HttpShardHandlerFactory.getParameter Setting socketTimeout to: 120000
   [junit4]   2> 1177548 T2800 oashc.HttpShardHandlerFactory.getParameter Setting urlScheme to: http://
   [junit4]   2> 1177548 T2800 oashc.HttpShardHandlerFactory.getParameter Setting connTimeout to: 15000
   [junit4]   2> 1177549 T2800 oashc.HttpShardHandlerFactory.getParameter Setting maxConnectionsPerHost to: 20
   [junit4]   2> 1177549 T2800 oashc.HttpShardHandlerFactory.getParameter Setting corePoolSize to: 0
   [junit4]   2> 1177550 T2800 oashc.HttpShardHandlerFactory.getParameter Setting maximumPoolSize to: 2147483647
   [junit4]   2> 1177550 T2800 oashc.HttpShardHandlerFactory.getParameter Setting maxThreadIdleTime to: 5
   [junit4]   2> 1177551 T2800 oashc.HttpShardHandlerFactory.getParameter Setting sizeOfQueue to: -1
   [junit4]   2> 1177551 T2800 oashc.HttpShardHandlerFactory.getParameter Setting fairnessPolicy to: false
   [junit4]   2> 1177552 T2800 oascsi.HttpClientUtil.createClient Creating new http client, config:maxConnectionsPerHost=20&maxConnections=10000&socketTimeout=120000&connTimeout=15000&retry=false
   [junit4]   2> 1177568 T2800 oasc.ZkContainer.initZooKeeper Zookeeper client=127.0.0.1:38543/solr
   [junit4]   2> 1177568 T2800 oasc.ZkController.checkChrootPath zkHost includes chroot
   [junit4]   2> 1177569 T2800 oascc.ConnectionManager.waitForConnected Waiting for client to connect to ZooKeeper
   [junit4]   2> 1177572 T2820 oascc.ConnectionManager.process Watcher org.apache.solr.common.cloud.ConnectionManager@3ab8aae8 name:ZooKeeperConnection Watcher:127.0.0.1:38543 got event WatchedEvent state:SyncConnected type:None path:null path:null type:None
   [junit4]   2> 1177573 T2800 oascc.ConnectionManager.waitForConnected Client is connected to ZooKeeper
   [junit4]   2> 1177590 T2800 oascsi.HttpClientUtil.createClient Creating new http client, config:maxConnections=500&maxConnectionsPerHost=16&socketTimeout=120000&connTimeout=15000
   [junit4]   2> 1177601 T2800 oascc.ConnectionManager.waitForConnected Waiting for client to connect to ZooKeeper
   [junit4]   2> 1177603 T2822 oascc.ConnectionManager.process Watcher org.apache.solr.common.cloud.ConnectionManager@17b9f540 name:ZooKeeperConnection Watcher:127.0.0.1:38543/solr got event WatchedEvent state:SyncConnected type:None path:null path:null type:None
   [junit4]   2> 1177603 T2800 oascc.ConnectionManager.waitForConnected Client is connected to ZooKeeper
   [junit4]   2> 1177606 T2800 oascc.SolrZkClient.makePath makePath: /overseer/queue
   [junit4]   2> 1177615 T2800 oascc.SolrZkClient.makePath makePath: /overseer/collection-queue-work
   [junit4]   2> 1177619 T2800 oascc.SolrZkClient.makePath makePath: /live_nodes
   [junit4]   2> 1177626 T2800 oasc.ZkController.createEphemeralLiveNode Register node as live in ZooKeeper:/live_nodes/127.0.0.1:38546_
   [junit4]   2> 1177627 T2800 oascc.SolrZkClient.makePath makePath: /live_nodes/127.0.0.1:38546_
   [junit4]   2> 1177631 T2800 oascc.SolrZkClient.makePath makePath: /overseer_elect/election
   [junit4]   2> 1177647 T2800 oascc.SolrZkClient.makePath makePath: /overseer_elect/leader
   [junit4]   2> 1177650 T2800 oasc.Overseer.start Overseer (id=90136582056574979-127.0.0.1:38546_-n_0000000000) starting
   [junit4]   2> 1177664 T2800 oascc.SolrZkClient.makePath makePath: /overseer/queue-work
   [junit4]   2> 1177668 T2824 oasc.OverseerCollectionProcessor.run Process current queue of collection creations
   [junit4]   2> 1177669 T2800 oascc.SolrZkClient.makePath makePath: /clusterstate.json
   [junit4]   2> 1177671 T2800 oascc.SolrZkClient.makePath makePath: /aliases.json
   [junit4]   2> 1177673 T2800 oascc.ZkStateReader.createClusterStateWatchersAndUpdate Updating cluster state from ZooKeeper... 
   [junit4]   2> 1177676 T2823 oasc.Overseer$ClusterStateUpdater.run Starting to work on the main queue
   [junit4]   2> 1177679 T2800 oasc.CorePropertiesLocator.discover Looking for core definitions underneath /usr/home/hudson/hudson-slave/workspace/Lucene-Solr-Tests-trunk-Java7/solr/build/solr-core/test/J0/./org.apache.solr.cloud.CollectionsAPIDistributedZkTest-controljetty-1375375092744
   [junit4]   2> 1177850 T2800 oasc.CorePropertiesLocator.discoverUnder Found core conf in /usr/home/hudson/hudson-slave/workspace/Lucene-Solr-Tests-trunk-Java7/solr/build/solr-core/test/J0/./org.apache.solr.cloud.CollectionsAPIDistributedZkTest-controljetty-1375375092744/conf/
   [junit4]   2> 1177853 T2800 oasc.CorePropertiesLocator.discover Found 1 core definitions
   [junit4]   2> 1177854 T2800 oass.SolrDispatchFilter.init user.dir=/usr/home/hudson/hudson-slave/workspace/Lucene-Solr-Tests-trunk-Java7/solr/build/solr-core/test/J0
   [junit4]   2> 1177854 T2800 oass.SolrDispatchFilter.init SolrDispatchFilter.init() done
   [junit4]   2> 1177855 T2800 oascsi.HttpClientUtil.createClient Creating new http client, config:maxConnections=128&maxConnectionsPerHost=32&followRedirects=false
   [junit4]   2> 1177870 T2800 oascsi.HttpClientUtil.createClient Creating new http client, config:
   [junit4]   2> 1177872 T2800 oascc.ConnectionManager.waitForConnected Waiting for client to connect to ZooKeeper
   [junit4]   2> 1177874 T2827 oascc.ConnectionManager.process Watcher org.apache.solr.common.cloud.ConnectionManager@5b09b837 name:ZooKeeperConnection Watcher:127.0.0.1:38543/solr got event WatchedEvent state:SyncConnected type:None path:null path:null type:None
   [junit4]   2> 1177875 T2800 oascc.ConnectionManager.waitForConnected Client is connected to ZooKeeper
   [junit4]   2> 1177876 T2800 oascc.ZkStateReader.createClusterStateWatchersAndUpdate Updating cluster state from ZooKeeper... 
   [junit4]   2> 1177878 T2800 oasc.ChaosMonkey.monkeyLog monkey: init - expire sessions:true cause connection loss:true
   [junit4]   2> 1178158 T2800 oejs.Server.doStart jetty-8.1.10.v20130312
   [junit4]   2> 1178162 T2800 oejs.AbstractConnector.doStart Started SocketConnector@127.0.0.1:38550
   [junit4]   2> 1178163 T2800 oass.SolrDispatchFilter.init SolrDispatchFilter.init()
   [junit4]   2> 1178163 T2800 oasc.SolrResourceLoader.locateSolrHome JNDI not configured for solr (NoInitialContextEx)
   [junit4]   2> 1178164 T2800 oasc.SolrResourceLoader.locateSolrHome using system property solr.solr.home: /usr/home/hudson/hudson-slave/workspace/Lucene-Solr-Tests-trunk-Java7/solr/build/solr-core/test/J0/./org.apache.solr.cloud.CollectionsAPIDistributedZkTest-jetty1-1375375093497
   [junit4]   2> 1178164 T2800 oasc.SolrResourceLoader.<init> new SolrResourceLoader for directory: '/usr/home/hudson/hudson-slave/workspace/Lucene-Solr-Tests-trunk-Java7/solr/build/solr-core/test/J0/./org.apache.solr.cloud.CollectionsAPIDistributedZkTest-jetty1-1375375093497/'
   [junit4]   2> 1178204 T2800 oasc.ConfigSolr.fromFile Loading container configuration from /usr/home/hudson/hudson-slave/workspace/Lucene-Solr-Tests-trunk-Java7/solr/build/solr-core/test/J0/./org.apache.solr.cloud.CollectionsAPIDistributedZkTest-jetty1-1375375093497/solr.xml
   [junit4]   2> 1178293 T2800 oasc.ConfigSolrXml.<init> Config-defined core root directory: 
   [junit4]   2> 1178294 T2800 oasc.CoreContainer.<init> New CoreContainer 751974296
   [junit4]   2> 1178295 T2800 oasc.CoreContainer.load Loading cores into CoreContainer [instanceDir=/usr/home/hudson/hudson-slave/workspace/Lucene-Solr-Tests-trunk-Java7/solr/build/solr-core/test/J0/./org.apache.solr.cloud.CollectionsAPIDistributedZkTest-jetty1-1375375093497/]
   [junit4]   2> 1178297 T2800 oashc.HttpShardHandlerFactory.getParameter Setting socketTimeout to: 120000
   [junit4]   2> 1178297 T2800 oashc.HttpShardHandlerFactory.getParameter Setting urlScheme to: http://
   [junit4]   2> 1178298 T2800 oashc.HttpShardHandlerFactory.getParameter Setting connTimeout to: 15000
   [junit4]   2> 1178298 T2800 oashc.HttpShardHandlerFactory.getParameter Setting maxConnectionsPerHost to: 20
   [junit4]   2> 1178299 T2800 oashc.HttpShardHandlerFactory.getParameter Setting corePoolSize to: 0
   [junit4]   2> 1178299 T2800 oashc.HttpShardHandlerFactory.getParameter Setting maximumPoolSize to: 2147483647
   [junit4]   2> 1178300 T2800 oashc.HttpShardHandlerFactory.getParameter Setting maxThreadIdleTime to: 5
   [junit4]   2> 1178300 T2800 oashc.HttpShardHandlerFactory.getParameter Setting sizeOfQueue to: -1
   [junit4]   2> 1178301 T2800 oashc.HttpShardHandlerFactory.getParameter Setting fairnessPolicy to: false
   [junit4]   2> 1178301 T2800 oascsi.HttpClientUtil.createClient Creating new http client, config:maxConnectionsPerHost=20&maxConnections=10000&socketTimeout=120000&connTimeout=15000&retry=false
   [junit4]   2> 1178317 T2800 oasc.ZkContainer.initZooKeeper Zookeeper client=127.0.0.1:38543/solr
   [junit4]   2> 1178318 T2800 oasc.ZkController.checkChrootPath zkHost includes chroot
   [junit4]   2> 1178319 T2800 oascc.ConnectionManager.waitForConnected Waiting for client to connect to ZooKeeper
   [junit4]   2> 1178322 T2838 oascc.ConnectionManager.process Watcher org.apache.solr.common.cloud.ConnectionManager@1b113a9c name:ZooKeeperConnection Watcher:127.0.0.1:38543 got event WatchedEvent state:SyncConnected type:None path:null path:null type:None
   [junit4]   2> 1178322 T2800 oascc.ConnectionManager.waitForConnected Client is connected to ZooKeeper
   [junit4]   2> 1178335 T2800 oascsi.HttpClientUtil.createClient Creating new http client, config:maxConnections=500&maxConnectionsPerHost=16&socketTimeout=120000&connTimeout=15000
   [junit4]   2> 1178346 T2800 oascc.ConnectionManager.waitForConnected Waiting for client to connect to ZooKeeper
   [junit4]   2> 1178348 T2840 oascc.ConnectionManager.process Watcher org.apache.solr.common.cloud.ConnectionManager@1255c465 name:ZooKeeperConnection Watcher:127.0.0.1:38543/solr got event WatchedEvent state:SyncConnected type:None path:null path:null type:None
   [junit4]   2> 1178349 T2800 oascc.ConnectionManager.waitForConnected Client is connected to ZooKeeper
   [junit4]   2> 1178359 T2800 oascc.ZkStateReader.createClusterStateWatchersAndUpdate Updating cluster state from ZooKeeper... 
   [junit4]   2> 1179363 T2800 oasc.ZkController.createEphemeralLiveNode Register node as live in ZooKeeper:/live_nodes/127.0.0.1:38550_
   [junit4]   2> 1179370 T2800 oascc.SolrZkClient.makePath makePath: /live_nodes/127.0.0.1:38550_
   [junit4]   2> 1179374 T2822 oascc.ZkStateReader$3.process Updating live nodes... (2)
   [junit4]   2> 1179374 T2827 oascc.ZkStateReader$3.process Updating live nodes... (2)
   [junit4]   2> 1179374 T2840 oascc.ZkStateReader$3.process Updating live nodes... (2)
   [junit4]   2> 1179389 T2800 oasc.CorePropertiesLocator.discover Looking for core definitions underneath /usr/home/hudson/hudson-slave/workspace/Lucene-Solr-Tests-trunk-Java7/solr/build/solr-core/test/J0/./org.apache.solr.cloud.CollectionsAPIDistributedZkTest-jetty1-1375375093497
   [junit4]   2> 1179555 T2800 oasc.CorePropertiesLocator.discoverUnder Found core conf in /usr/home/hudson/hudson-slave/workspace/Lucene-Solr-Tests-trunk-Java7/solr/build/solr-core/test/J0/./org.apache.solr.cloud.CollectionsAPIDistributedZkTest-jetty1-1375375093497/conf/
   [junit4]   2> 1179561 T2800 oasc.CorePropertiesLocator.discover Found 1 core definitions
   [junit4]   2> 1179561 T2800 oass.SolrDispatchFilter.init user.dir=/usr/home/hudson/hudson-slave/workspace/Lucene-Solr-Tests-trunk-Java7/solr/build/solr-core/test/J0
   [junit4]   2> 1179562 T2800 oass.SolrDispatchFilter.init SolrDispatchFilter.init() done
   [junit4]   2> 1179562 T2800 oascsi.HttpClientUtil.createClient Creating new http client, config:maxConnections=128&maxConnectionsPerHost=32&followRedirects=false
   [junit4]   2> 1179854 T2800 oejs.Server.doStart jetty-8.1.10.v20130312
   [junit4]   2> 1179857 T2800 oejs.AbstractConnector.doStart Started SocketConnector@127.0.0.1:38553
   [junit4]   2> 1179858 T2800 oass.SolrDispatchFilter.init SolrDispatchFilter.init()
   [junit4]   2> 1179859 T2800 oasc.SolrResourceLoader.locateSolrHome JNDI not configured for solr (NoInitialContextEx)
   [junit4]   2> 1179859 T2800 oasc.SolrResourceLoader.locateSolrHome using system property solr.solr.home: /usr/home/hudson/hudson-slave/workspace/Lucene-Solr-Tests-trunk-Java7/solr/build/solr-core/test/J0/./org.apache.solr.cloud.CollectionsAPIDistributedZkTest-jetty2-1375375095196
   [junit4]   2> 1179860 T2800 oasc.SolrResourceLoader.<init> new SolrResourceLoader for directory: '/usr/home/hudson/hudson-slave/workspace/Lucene-Solr-Tests-trunk-Java7/solr/build/solr-core/test/J0/./org.apache.solr.cloud.CollectionsAPIDistributedZkTest-jetty2-1375375095196/'
   [junit4]   2> 1179899 T2800 oasc.ConfigSolr.fromFile Loading container configuration from /usr/home/hudson/hudson-slave/workspace/Lucene-Solr-Tests-trunk-Java7/solr/build/solr-core/test/J0/./org.apache.solr.cloud.CollectionsAPIDistributedZkTest-jetty2-1375375095196/solr.xml
   [junit4]   2> 1179989 T2800 oasc.ConfigSolrXml.<init> Config-defined core root directory: 
   [junit4]   2> 1179990 T2800 oasc.CoreContainer.<init> New CoreContainer 926259359
   [junit4]   2> 1179991 T2800 oasc.CoreContainer.load Loading cores into CoreContainer [instanceDir=/usr/home/hudson/hudson-slave/workspace/Lucene-Solr-Tests-trunk-Java7/solr/build/solr-core/test/J0/./org.apache.solr.cloud.CollectionsAPIDistributedZkTest-jetty2-1375375095196/]
   [junit4]   2> 1179993 T2800 oashc.HttpShardHandlerFactory.getParameter Setting socketTimeout to: 120000
   [junit4]   2> 1179993 T2800 oashc.HttpShardHandlerFactory.getParameter Setting urlScheme to: http://
   [junit4]   2> 1179994 T2800 oashc.HttpShardHandlerFactory.getParameter Setting connTimeout to: 15000
   [junit4]   2> 1179994 T2800 oashc.HttpShardHandlerFactory.getParameter Setting maxConnectionsPerHost to: 20
   [junit4]   2> 1179995 T2800 oashc.HttpShardHandlerFactory.getParameter Setting corePoolSize to: 0
   [junit4]   2> 1179995 T2800 oashc.HttpShardHandlerFactory.getParameter Setting maximumPoolSize to: 2147483647
   [junit4]   2> 1179996 T2800 oashc.HttpShardHandlerFactory.getParameter Setting maxThreadIdleTime to: 5
   [junit4]   2> 1179996 T2800 oashc.HttpShardHandlerFactory.getParameter Setting sizeOfQueue to: -1
   [junit4]   2> 1179997 T2800 oashc.HttpShardHandlerFactory.getParameter Setting fairnessPolicy to: false
   [junit4]   2> 1179997 T2800 oascsi.HttpClientUtil.createClient Creating new http client, config:maxConnectionsPerHost=20&maxConnections=10000&socketTimeout=120000&connTimeout=15000&retry=false
   [junit4]   2> 1180015 T2800 oasc.ZkContainer.initZooKeeper Zookeeper client=127.0.0.1:38543/solr
   [junit4]   2> 1180016 T2800 oasc.ZkController.checkChrootPath zkHost includes chroot
   [junit4]   2> 1180017 T2800 oascc.ConnectionManager.waitForConnected Waiting for client to connect to ZooKeeper
   [junit4]   2> 1180035 T2852 oascc.ConnectionManager.process Watcher org.apache.solr.common.cloud.ConnectionManager@32599e6c name:ZooKeeperConnection Watcher:127.0.0.1:38543 got event WatchedEvent state:SyncConnected type:None path:null path:null type:None
   [junit4]   2> 1180035 T2800 oascc.ConnectionManager.waitForConnected Client is connected to ZooKeeper
   [junit4]   2> 1180038 T2800 oascsi.HttpClientUtil.createClient Creating new http client, config:maxConnections=500&maxConnectionsPerHost=16&socketTimeout=120000&connTimeout=15000
   [junit4]   2> 1180050 T2800 oascc.ConnectionManager.waitForConnected Waiting for client to connect to ZooKeeper
   [junit4]   2> 1180052 T2854 oascc.ConnectionManager.process Watcher org.apache.solr.common.cloud.ConnectionManager@6bae2c48 name:ZooKeeperConnection Watcher:127.0.0.1:38543/solr got event WatchedEvent state:SyncConnected type:None path:null path:null type:None
   [junit4]   2> 1180053 T2800 oascc.ConnectionManager.waitForConnected Client is connected to ZooKeeper
   [junit4]   2> 1180064 T2800 oascc.ZkStateReader.createClusterStateWatchersAndUpdate Updating cluster state from ZooKeeper... 
   [junit4]   2> 1181068 T2800 oasc.ZkController.createEphemeralLiveNode Register node as live in ZooKeeper:/live_nodes/127.0.0.1:38553_
   [junit4]   2> 1181073 T2800 oascc.SolrZkClient.makePath makePath: /live_nodes/127.0.0.1:38553_
   [junit4]   2> 1181077 T2822 oascc.ZkStateReader$3.process Updating live nodes... (3)
   [junit4]   2> 1181078 T2854 oascc.ZkStateReader$3.process Updating live nodes... (3)
   [junit4]   2> 1181077 T2840 oascc.ZkStateReader$3.process Updating live nodes... (3)
   [junit4]   2> 1181077 T2827 oascc.ZkStateReader$3.process Updating live nodes... (3)
   [junit4]   2> 1181094 T2800 oasc.CorePropertiesLocator.discover Looking for core definitions underneath /usr/home/hudson/hudson-slave/workspace/Lucene-Solr-Tests-trunk-Java7/solr/build/solr-core/test/J0/./org.apache.solr.cloud.CollectionsAPIDistributedZkTest-jetty2-1375375095196
   [junit4]   2> 1181265 T2800 oasc.CorePropertiesLocator.discoverUnder Found core conf in /usr/home/hudson/hudson-slave/workspace/Lucene-Solr-Tests-trunk-Java7/solr/build/solr-core/test/J0/./org.apache.solr.cloud.CollectionsAPIDistributedZkTest-jetty2-1375375095196/conf/
   [junit4]   2> 1181270 T2800 oasc.CorePropertiesLocator.discover Found 1 core definitions
   [junit4]   2> 1181270 T2800 oass.SolrDispatchFilter.init user.dir=/usr/home/hudson/hudson-slave/workspace/Lucene-Solr-Tests-trunk-Java7/solr/build/solr-core/test/J0
   [junit4]   2> 1181271 T2800 oass.SolrDispatchFilter.init SolrDispatchFilter.init() done
   [junit4]   2> 1181271 T2800 oascsi.HttpClientUtil.createClient Creating new http client, config:maxConnections=128&maxConnectionsPerHost=32&followRedirects=false
   [junit4]   2> 1181579 T2800 oejs.Server.doStart jetty-8.1.10.v20130312
   [junit4]   2> 1181583 T2800 oejs.AbstractConnector.doStart Started SocketConnector@127.0.0.1:38557
   [junit4]   2> 1181584 T2800 oass.SolrDispatchFilter.init SolrDispatchFilter.init()
   [junit4]   2> 1181584 T2800 oasc.SolrResourceLoader.locateSolrHome JNDI not configured for solr (NoInitialContextEx)
   [junit4]   2> 1181585 T2800 oasc.SolrResourceLoader.locateSolrHome using system property solr.solr.home: /usr/home/hudson/hudson-slave/workspace/Lucene-Solr-Tests-trunk-Java7/solr/build/solr-core/test/J0/./org.apache.solr.cloud.CollectionsAPIDistributedZkTest-jetty3-1375375096905
   [junit4]   2> 1181585 T2800 oasc.SolrResourceLoader.<init> new SolrResourceLoader for directory: '/usr/home/hudson/hudson-slave/workspace/Lucene-Solr-Tests-trunk-Java7/solr/build/solr-core/test/J0/./org.apache.solr.cloud.CollectionsAPIDistributedZkTest-jetty3-1375375096905/'
   [junit4]   2> 1181626 T2800 oasc.ConfigSolr.fromFile Loading container configuration from /usr/home/hudson/hudson-slave/workspace/Lucene-Solr-Tests-trunk-Java7/solr/build/solr-core/test/J0/./org.apache.solr.cloud.CollectionsAPIDistributedZkTest-jetty3-1375375096905/solr.xml
   [junit4]   2> 1181716 T2800 oasc.ConfigSolrXml.<init> Config-defined core root directory: 
   [junit4]   2> 1181718 T2800 oasc.CoreContainer.<init> New CoreContainer 1397855470
   [junit4]   2> 1181718 T2800 oasc.CoreContainer.load Loading cores into CoreContainer [instanceDir=/usr/home/hudson/hudson-slave/workspace/Lucene-Solr-Tests-trunk-Java7/solr/build/solr-core/test/J0/./org.apache.solr.cloud.CollectionsAPIDistributedZkTest-jetty3-1375375096905/]
   [junit4]   2> 1181720 T2800 oashc.HttpShardHandlerFactory.getParameter Setting socketTimeout to: 120000
   [junit4]   2> 1181721 T2800 oashc.HttpShardHandlerFactory.getParameter Setting urlScheme to: http://
   [junit4]   2> 1181721 T2800 oashc.HttpShardHandlerFactory.getParameter Setting connTimeout to: 15000
   [junit4]   2> 1181722 T2800 oashc.HttpShardHandlerFactory.getParameter Setting maxConnectionsPerHost to: 20
   [junit4]   2> 1181722 T2800 oashc.HttpShardHandlerFactory.getParameter Setting corePoolSize to: 0
   [junit4]   2> 1181723 T2800 oashc.HttpShardHandlerFactory.getParameter Setting maximumPoolSize to: 2147483647
   [junit4]   2> 1181723 T2800 oashc.HttpShardHandlerFactory.getParameter Setting maxThreadIdleTime to: 5
   [junit4]   2> 1181724 T2800 oashc.HttpShardHandlerFactory.getParameter Setting sizeOfQueue to: -1
   [junit4]   2> 1181724 T2800 oashc.HttpShardHandlerFactory.getParameter Setting fairnessPolicy to: false
   [junit4]   2> 1181725 T2800 oascsi.HttpClientUtil.createClient Creating new http client, config:maxConnectionsPerHost=20&maxConnections=10000&socketTimeout=120000&connTimeout=15000&retry=false
   [junit4]   2> 1181741 T2800 oasc.ZkContainer.initZooKeeper Zookeeper client=127.0.0.1:38543/solr
   [junit4]   2> 1181741 T2800 oasc.ZkController.checkChrootPath zkHost includes chroot
   [junit4]   2> 1181742 T2800 oascc.ConnectionManager.waitForConnected Waiting for client to connect to ZooKeeper
   [junit4]   2> 1181745 T2866 oascc.ConnectionManager.process Watcher org.apache.solr.common.cloud.ConnectionManager@654de496 name:ZooKeeperConnection Watcher:127.0.0.1:38543 got event WatchedEvent state:SyncConnected type:None path:null path:null type:None
   [junit4]   2> 1181745 T2800 oascc.ConnectionManager.waitForConnected Client is connected to ZooKeeper
   [junit4]   2> 1181805 T2800 oascsi.HttpClientUtil.createClient Creating new http client, config:maxConnections=500&maxConnectionsPerHost=16&socketTimeout=120000&connTimeout=15000
   [junit4]   2> 1181815 T2800 oascc.ConnectionManager.waitForConnected Waiting for client to connect to ZooKeeper
   [junit4]   2> 1181817 T2868 oascc.ConnectionManager.process Watcher org.apache.solr.common.cloud.ConnectionManager@38c852d6 name:ZooKeeperConnection Watcher:127.0.0.1:38543/solr got event WatchedEvent state:SyncConnected type:None path:null path:null type:None
   [junit4]   2> 1181818 T2800 oascc.ConnectionManager.waitForConnected Client is connected to ZooKeeper
   [junit4]   2> 1181866 T2800 oascc.ZkStateReader.createClusterStateWatchersAndUpdate Updating cluster state from ZooKeeper... 
   [junit4]   2> 1182870 T2800 oasc.ZkController.createEphemeralLiveNode Register node as live in ZooKeeper:/live_nodes/127.0.0.1:38557_
   [junit4]   2> 1182880 T2800 oascc.SolrZkClient.makePath makePath: /live_nodes/127.0.0.1:38557_
   [junit4]   2> 1182884 T2827 oascc.ZkStateReader$3.process Updating live nodes... (4)
   [junit4]   2> 1182884 T2868 oascc.ZkStateReader$3.process Updating live nodes... (4)
   [junit4]   2> 1182884 T2822 oascc.ZkStateReader$3.process Updating live nodes... (4)
   [junit4]   2> 1182884 T2840 oascc.ZkStateReader$3.process Updating live nodes... (4)
   [junit4]   2> 1182884 T2854 oascc.ZkStateReader$3.process Updating live nodes... (4)
   [junit4]   2> 1182903 T2800 oasc.CorePropertiesLocator.discover Looking for core definitions underneath /usr/home/hudson/hudson-slave/workspace/Lucene-Solr-Tests-trunk-Java7/solr/build/solr-core/test/J0/./org.apache.solr.cloud.CollectionsAPIDistributedZkTest-jetty3-1375375096905
   [junit4]   2> 1183076 T2800 oasc.CorePropertiesLocator.discoverUnder Found core conf in /usr/home/hudson/hudson-slave/workspace/Lucene-Solr-Tests-trunk-Java7/solr/build/solr-core/test/J0/./org.apache.solr.cloud.CollectionsAPIDistributedZkTest-jetty3-1375375096905/conf/
   [junit4]   2> 1183078 T2800 oasc.CorePropertiesLocator.discover Found 1 core definitions
   [junit4]   2> 1183079 T2800 oass.SolrDispatchFilter.init user.dir=/usr/home/hudson/hudson-slave/workspace/Lucene-Solr-Tests-trunk-Java7/solr/build/solr-core/test/J0
   [junit4]   2> 1183079 T2800 oass.SolrDispatchFilter.init SolrDispatchFilter.init() done
   [junit4]   2> 1183080 T2800 oascsi.HttpClientUtil.createClient Creating new http client, config:maxConnections=128&maxConnectionsPerHost=32&followRedirects=false
   [junit4]   2> 1183372 T2800 oejs.Server.doStart jetty-8.1.10.v20130312
   [junit4]   2> 1183375 T2800 oejs.AbstractConnector.doStart Started SocketConnector@127.0.0.1:38560
   [junit4]   2> 1183376 T2800 oass.SolrDispatchFilter.init SolrDispatchFilter.init()
   [junit4]   2> 1183377 T2800 oasc.SolrResourceLoader.locateSolrHome JNDI not configured for solr (NoInitialContextEx)
   [junit4]   2> 1183377 T2800 oasc.SolrResourceLoader.locateSolrHome using system property solr.solr.home: /usr/home/hudson/hudson-slave/workspace/Lucene-Solr-Tests-trunk-Java7/solr/build/solr-core/test/J0/./org.apache.solr.cloud.CollectionsAPIDistributedZkTest-jetty4-1375375098713
   [junit4]   2> 1183378 T2800 oasc.SolrResourceLoader.<init> new SolrResourceLoader for directory: '/usr/home/hudson/hudson-slave/workspace/Lucene-Solr-Tests-trunk-Java7/solr/build/solr-core/test/J0/./org.apache.solr.cloud.CollectionsAPIDistributedZkTest-jetty4-1375375098713/'
   [junit4]   2> 1183417 T2800 oasc.ConfigSolr.fromFile Loading container configuration from /usr/home/hudson/hudson-slave/workspace/Lucene-Solr-Tests-trunk-Java7/solr/build/solr-core/test/J0/./org.apache.solr.cloud.CollectionsAPIDistributedZkTest-jetty4-1375375098713/solr.xml
   [junit4]   2> 1183507 T2800 oasc.ConfigSolrXml.<init> Config-defined core root directory: 
   [junit4]   2> 1183508 T2800 oasc.CoreContainer.<init> New CoreContainer 689447363
   [junit4]   2> 1183508 T2800 oasc.CoreContainer.load Loading cores into CoreContainer [instanceDir=/usr/home/hudson/hudson-slave/workspace/Lucene-Solr-Tests-trunk-Java7/solr/build/solr-core/test/J0/./org.apache.solr.cloud.CollectionsAPIDistributedZkTest-jetty4-1375375098713/]
   [junit4]   2> 1183510 T2800 oashc.HttpShardHandlerFactory.getParameter Setting socketTimeout to: 120000
   [junit4]   2> 1183511 T2800 oashc.HttpShardHandlerFactory.getParameter Setting urlScheme to: http://
   [junit4]   2> 1183511 T2800 oashc.HttpShardHandlerFactory.getParameter Setting connTimeout to: 15000
   [junit4]   2> 1183512 T2800 oashc.HttpShardHandlerFactory.getParameter Setting maxConnectionsPerHost to: 20
   [junit4]   2> 1183512 T2800 oashc.HttpShardHandlerFactory.getParameter Setting corePoolSize to: 0
   [junit4]   2> 1183513 T2800 oashc.HttpShardHandlerFactory.getParameter Setting maximumPoolSize to: 2147483647
   [junit4]   2> 1183513 T2800 oashc.HttpShardHandlerFactory.getParameter Setting maxThreadIdleTime to: 5
   [junit4]   2> 1183514 T2800 oashc.HttpShardHandlerFactory.getParameter Setting sizeOfQueue to: -1
   [junit4]   2> 1183514 T2800 oashc.HttpShardHandlerFactory.getParameter Setting fairnessPolicy to: false
   [junit4]   2> 1183515 T2800 oascsi.HttpClientUtil.createClient Creating new http client, config:maxConnectionsPerHost=20&maxConnections=10000&socketTimeout=120000&connTimeout=15000&retry=false
   [junit4]   2> 1183531 T2800 oasc.ZkContainer.initZooKeeper Zookeeper client=127.0.0.1:38543/solr
   [junit4]   2> 1183531 T2800 oasc.ZkController.checkChrootPath zkHost includes chroot
   [junit4]   2> 1183532 T2800 oascc.ConnectionManager.waitForConnected Waiting for client to connect to ZooKeeper
   [junit4]   2> 1183560 T2880 oascc.ConnectionManager.process Watcher org.apache.solr.common.cloud.ConnectionManager@6d95b39b name:ZooKeeperConnection Watcher:127.0.0.1:38543 got event WatchedEvent state:SyncConnected type:None path:null path:null type:None
   [junit4]   2> 1183560 T2800 oascc.ConnectionManager.waitForConnected Client is connected to ZooKeeper
   [junit4]   2> 1183563 T2800 oascsi.HttpClientUtil.createClient Creating new http client, config:maxConnections=500&maxConnectionsPerHost=16&socketTimeout=120000&connTimeout=15000
   [junit4]   2> 1183574 T2800 oascc.ConnectionManager.waitForConnected Waiting for client to connect to ZooKeeper
   [junit4]   2> 1183576 T2882 oascc.ConnectionManager.process Watcher org.apache.solr.common.cloud.ConnectionManager@4f8f0a16 name:ZooKeeperConnection Watcher:127.0.0.1:38543/solr got event WatchedEvent state:SyncConnected type:None path:null path:null type:None
   [junit4]   2> 1183576 T2800 oascc.ConnectionManager.waitForConnected Client is connected to ZooKeeper
   [junit4]   2> 1183588 T2800 oascc.ZkStateReader.createClusterStateWatchersAndUpdate Updating cluster state from ZooKeeper... 
   [junit4]   2> 1184592 T2800 oasc.ZkController.createEphemeralLiveNode Register node as live in ZooKeeper:/live_nodes/127.0.0.1:38560_
   [junit4]   2> 1184597 T2800 oascc.SolrZkClient.makePath makePath: /live_nodes/127.0.0.1:38560_
   [junit4]   2> 1184601 T2868 oascc.ZkStateReader$3.process Updating live nodes... (5)
   [junit4]   2> 1184601 T2840 oascc.ZkStateReader$3.process Updating live nodes... (5)
   [junit4]   2> 1184601 T2854 oascc.ZkStateReader$3.process Updating live nodes... (5)
   [junit4]   2> 1184601 T2827 oascc.ZkStateReader$3.process Updating live nodes... (5)
   [junit4]   2> 1184601 T2882 oascc.ZkStateReader$3.process Updating live nodes... (5)
   [junit4]   2> 1184601 T2822 oascc.ZkStateReader$3.process Updating live nodes... (5)
   [junit4]   2> 1184614 T2800 oasc.CorePropertiesLocator.discover Looking for core definitions underneath /usr/home/hudson/hudson-slave/workspace/Lucene-Solr-Tests-trunk-Java7/solr/build/solr-core/test/J0/./org.apache.solr.cloud.CollectionsAPIDistributedZkTest-jetty4-1375375098713
   [junit4]   2> 1184616 T2800 oasc.CorePropertiesLocator.discoverUnder Found core conf in /usr/home/hudson/hudson-slave/workspace/Lucene-Solr-Tests-trunk-Java7/solr/build/solr-core/test/J0/./org.apache.solr.cloud.CollectionsAPIDistributedZkTest-jetty4-1375375098713/conf/
   [junit4]   2> 1184786 T2800 oasc.CorePropertiesLocator.discover Found 1 core definitions
   [junit4]   2> 1184787 T2800 oass.SolrDispatchFilter.init user.dir=/usr/home/hudson/hudson-slave/workspace/Lucene-Solr-Tests-trunk-Java7/solr/build/solr-core/test/J0
   [junit4]   2> 1184788 T2800 oass.SolrDispatchFilter.init SolrDispatchFilter.init() done
   [junit4]   2> 1184788 T2800 oascsi.HttpClientUtil.createClient Creating new http client, config:maxConnections=128&maxConnectionsPerHost=32&followRedirects=false
   [junit4]   2> 1184804 T2800 oascsi.HttpClientUtil.createClient Creating new http client, config:maxConnections=128&maxConnectionsPerHost=32&followRedirects=false
   [junit4]   2> 1184817 T2830 oasha.CollectionsHandler.handleCreateAction Creating Collection : numShards=2&name=nodes_used_collection&replicationFactor=2&action=CREATE&wt=javabin&version=2
   [junit4]   2> 1184819 T2822 oasc.DistributedQueue$LatchChildWatcher.process Watcher fired on path: /overseer/collection-queue-work state: SyncConnected type NodeChildrenChanged
   [junit4]   2> 1184821 T2824 oasc.OverseerCollectionProcessor.run Overseer Collection Processor: Get the message id:/overseer/collection-queue-work/qn-0000000000 message:{
   [junit4]   2> 	  "operation":"createcollection",
   [junit4]   2> 	  "numShards":"2",
   [junit4]   2> 	  "name":"nodes_used_collection",
   [junit4]   2> 	  "replicationFactor":"2"}
   [junit4]   2> 1184821 T2824 oasc.OverseerCollectionProcessor.processMessage WARN OverseerCollectionProcessor.processMessage : createcollection , {
   [junit4]   2> 	  "operation":"createcollection",
   [junit4]   2> 	  "numShards":"2",
   [junit4]   2> 	  "name":"nodes_used_collection",
   [junit4]   2> 	  "replicationFactor":"2"}
   [junit4]   2> 1185187 T2823 oascc.ZkStateReader.updateClusterState Updating cloud state from ZooKeeper... 
   [junit4]   2> 1185188 T2823 oasc.Overseer$ClusterStateUpdater.buildCollection building a new collection: nodes_used_collection
   [junit4]   2> 1185189 T2823 oasc.Overseer$ClusterStateUpdater.createCollection Create collection nodes_used_collection with shards [shard1, shard2]
   [junit4]   2> 1185203 T2882 oascc.ZkStateReader$2.process A cluster state change: WatchedEvent state:SyncConnected type:NodeDataChanged path:/clusterstate.json, has occurred - updating... (live nodes size: 5)
   [junit4]   2> 1185203 T2840 oascc.ZkStateReader$2.process A cluster state change: WatchedEvent state:SyncConnected type:NodeDataChanged path:/clusterstate.json, has occurred - updating... (live nodes size: 5)
   [junit4]   2> 1185203 T2827 oascc.ZkStateReader$2.process A cluster state change: WatchedEvent state:SyncConnected type:NodeDataChanged path:/clusterstate.json, has occurred - updating... (live nodes size: 5)
   [junit4]   2> 1185203 T2854 oascc.ZkStateReader$2.process A cluster state change: WatchedEvent state:SyncConnected type:NodeDataChanged path:/clusterstate.json, has occurred - updating... (live nodes size: 5)
   [junit4]   2> 1185203 T2822 oascc.ZkStateReader$2.process A cluster state change: WatchedEvent state:SyncConnected type:NodeDataChanged path:/clusterstate.json, has occurred - updating... (live nodes size: 5)
   [junit4]   2> 1185203 T2868 oascc.ZkStateReader$2.process A cluster state change: WatchedEvent state:SyncConnected type:NodeDataChanged path:/clusterstate.json, has occurred - updating... (live nodes size: 5)
   [junit4]   2> 1185237 T2824 oasc.OverseerCollectionProcessor.createCollection going to create cores replicas shardNames [shard1, shard2] , repFactor : 2
   [junit4]   2> 1185237 T2824 oasc.OverseerCollectionProcessor.createCollection Creating shard nodes_used_collection_shard1_replica1 as part of slice shard1 of collection nodes_used_collection on 127.0.0.1:38557_
   [junit4]   2> 1185237 T2824 oasc.OverseerCollectionProcessor.createCollection Creating shard nodes_used_collection_shard1_replica2 as part of slice shard1 of collection nodes_used_collection on 127.0.0.1:38546_
   [junit4]   2> 1185239 T2824 oasc.OverseerCollectionProcessor.createCollection Creating shard nodes_used_collection_shard2_replica1 as part of slice shard2 of collection nodes_used_collection on 127.0.0.1:38553_
   [junit4]   2> 1185239 T2824 oasc.OverseerCollectionProcessor.createCollection Creating shard nodes_used_collection_shard2_replica2 as part of slice shard2 of collection nodes_used_collection on 127.0.0.1:38560_
   [junit4]   2> 1185243 T2858 oasc.ZkController.publish publishing core=nodes_used_collection_shard1_replica1 state=down
   [junit4]   2> 1185243 T2844 oasc.ZkController.publish publishing core=nodes_used_collection_shard2_replica1 state=down
   [junit4]   2> 1185243 T2872 oasc.ZkController.publish publishing core=nodes_used_collection_shard2_replica2 state=down
   [junit4]   2> 1185243 T2812 oasc.ZkController.publish publishing core=nodes_used_collection_shard1_replica2 state=down
   [junit4]   2> 1185245 T2858 oasc.ZkController.waitForCoreNodeName look for our core node name
   [junit4]   2> 1185246 T2844 oasc.ZkController.waitForCoreNodeName look for our core node name
   [junit4]   2> 1185246 T2872 oasc.ZkController.waitForCoreNodeName look for our core node name
   [junit4]   2> 1185256 T2812 oasc.ZkController.waitForCoreNodeName look for our core node name
   [junit4]   2> 1186708 T2823 oascc.ZkStateReader.updateClusterState Updating cloud state from ZooKeeper... 
   [junit4]   2> 1186709 T2823 oasc.Overseer$ClusterStateUpdater.updateState WARN Could not find collection node for nodes_used_collection, skipping publish state
   [junit4]   2> 1186709 T2823 oasc.Overseer$ClusterStateUpdater.updateState Update state numShards=2 message={
   [junit4]   2> 	  "operation":"state",
   [junit4]   2> 	  "core_node_name":"core_node1",
   [junit4]   2> 	  "numShards":"2",
   [junit4]   2> 	  "shard":"shard1",
   [junit4]   2> 	  "roles":null,
   [junit4]   2> 	  "state":"down",
   [junit4]   2> 	  "shard_state":"active",
   [junit4]   2> 	  "core":"nodes_used_collection_shard1_replica1",
   [junit4]   2> 	  "collection":"nodes_used_collection",
   [junit4]   2> 	  "shard_range":null,
   [junit4]   2> 	  "node_name":"127.0.0.1:38557_",
   [junit4]   2> 	  "base_url":"http://127.0.0.1:38557"}
   [junit4]   2> 1186714 T2823 oasc.Overseer$ClusterStateUpdater.updateState WARN Could not find collection node for nodes_used_collection, skipping publish state
   [junit4]   2> 1186714 T2823 oasc.Overseer$ClusterStateUpdater.updateState Update state numShards=2 message={
   [junit4]   2> 	  "operation":"state",
   [junit4]   2> 	  "core_node_name":"core_node2",
   [junit4]   2> 	  "numShards":"2",
   [junit4]   2> 	  "shard":"shard2",
   [junit4]   2> 	  "roles":null,
   [junit4]   2> 	  "state":"down",
   [junit4]   2> 	  "shard_state":"active",
   [junit4]   2> 	  "core":"nodes_used_collection_shard2_replica1",
   [junit4]   2> 	  "collection":"nodes_used_collection",
   [junit4]   2> 	  "shard_range":null,
   [junit4]   2> 	  "node_name":"127.0.0.1:38553_",
   [junit4]   2> 	  "base_url":"http://127.0.0.1:38553"}
   [junit4]   2> 1186798 T2823 oasc.Overseer$ClusterStateUpdater.updateState WARN Could not find collection node for nodes_used_collection, skipping publish state
   [junit4]   2> 1186798 T2823 oasc.Overseer$ClusterStateUpdater.updateState Update state numShards=2 message={
   [junit4]   2> 	  "operation":"state",
   [junit4]   2> 	  "core_node_name":"core_node3",
   [junit4]   2> 	  "numShards":"2",
   [junit4]   2> 	  "shard":"shard2",
   [junit4]   2> 	  "roles":null,
   [junit4]   2> 	  "state":"down",
   [junit4]   2> 	  "shard_state":"active",
   [junit4]   2> 	  "core":"nodes_used_collection_shard2_replica2",
   [junit4]   2> 	  "collection":"nodes_used_collection",
   [junit4]   2> 	  "shard_range":null,
   [junit4]   2> 	  "node_name":"127.0.0.1:38560_",
   [junit4]   2> 	  "base_url":"http://127.0.0.1:38560"}
   [junit4]   2> 1186812 T2823 oasc.Overseer$ClusterStateUpdater.updateState WARN Could not find collection node for nodes_used_collection, skipping publish state
   [junit4]   2> 1186813 T2823 oasc.Overseer$ClusterStateUpdater.updateState Update state numShards=2 message={
   [junit4]   2> 	  "operation":"state",
   [junit4]   2> 	  "core_node_name":"core_node4",
   [junit4]   2> 	  "numShards":"2",
   [junit4]   2> 	  "shard":"shard1",
   [junit4]   2> 	  "roles":null,
   [junit4]   2> 	  "state":"down",
   [junit4]   2> 	  "shard_state":"active",
   [junit4]   2> 	  "core":"nodes_used_collection_shard1_replica2",
   [junit4]   2> 	  "collection":"nodes_used_collection",
   [junit4]   2> 	  "shard_range":null,
   [junit4]   2> 	  "node_name":"127.0.0.1:38546_",
   [junit4]   2> 	  "base_url":"http://127.0.0.1:38546"}
   [junit4]   2> 1186817 T2868 oascc.ZkStateReader$2.process A cluster state change: WatchedEvent state:SyncConnected type:NodeDataChanged path:/clusterstate.json, has occurred - updating... (live nodes size: 5)
   [junit4]   2> 1186817 T2854 oascc.ZkStateReader$2.process A cluster state change: WatchedEvent state:SyncConnected type:NodeDataChanged path:/clusterstate.json, has occurred - updating... (live nodes size: 5)
   [junit4]   2> 1186817 T2827 oascc.ZkStateReader$2.process A cluster state change: WatchedEvent state:SyncConnected type:NodeDataChanged path:/clusterstate.json, has occurred - updating... (live nodes size: 5)
   [junit4]   2> 1186817 T2840 oascc.ZkStateReader$2.process A cluster state change: WatchedEvent state:SyncConnected type:NodeDataChanged path:/clusterstate.json, has occurred - updating... (live nodes size: 5)
   [junit4]   2> 1186817 T2822 oascc.ZkStateReader$2.process A cluster state change: WatchedEvent state:SyncConnected type:NodeDataChanged path:/clusterstate.json, has occurred - updating... (live nodes size: 5)
   [junit4]   2> 1186817 T2882 oascc.ZkStateReader$2.process A cluster state change: WatchedEvent state:SyncConnected type:NodeDataChanged path:/clusterstate.json, has occurred - updating... (live nodes size: 5)
   [junit4]   2> 1187247 T2858 oasc.ZkController.waitForShardId waiting to find shard id in clusterstate for nodes_used_collection_shard1_replica1
   [junit4]   2> 1187248 T2844 oasc.ZkController.waitForShardId waiting to find shard id in clusterstate for nodes_used_collection_shard2_replica1
   [junit4]   2> 1187248 T2858 oasc.CorePropertiesLocator.writePropertiesFile ERROR Couldn't persist core properties to /usr/home/hudson/hudson-slave/workspace/Lucene-Solr-Tests-trunk-Java7/solr/build/solr-core/test/J0/./org.apache.solr.cloud.CollectionsAPIDistributedZkTest-jetty3-1375375096905/nodes_used_collection_shard1_replica1/core.properties: java.io.FileNotFoundException: /usr/home/hudson/hudson-slave/workspace/Lucene-Solr-Tests-trunk-Java7/solr/build/solr-core/test/J0/./org.apache.solr.cloud.CollectionsAPIDistributedZkTest-jetty3-1375375096905/nodes_used_collection_shard1_replica1/core.properties (No such file or directory)
   [junit4]   2> 1187249 T2872 oasc.ZkController.waitForShardId waiting to find shard id in clusterstate for nodes_used_collection_shard2_replica2
   [junit4]   2> 1187249 T2844 oasc.CorePropertiesLocator.writePropertiesFile ERROR Couldn't persist core properties to /usr/home/hudson/hudson-slave/workspace/Lucene-Solr-Tests-trunk-Java7/solr/build/solr-core/test/J0/./org.apache.solr.cloud.CollectionsAPIDistributedZkTest-jetty2-1375375095196/nodes_used_collection_shard2_replica1/core.properties: java.io.FileNotFoundException: /usr/home/hudson/hudson-slave/workspace/Lucene-Solr-Tests-trunk-Java7/solr/build/solr-core/test/J0/./org.apache.solr.cloud.CollectionsAPIDistributedZkTest-jetty2-1375375095196/nodes_used_collection_shard2_replica1/core.properties (No such file or directory)
   [junit4]   2> 1187249 T2858 oasc.CoreContainer.create Creating SolrCore 'nodes_used_collection_shard1_replica1' using instanceDir: /usr/home/hudson/hudson-slave/workspace/Lucene-Solr-Tests-trunk-Java7/solr/build/solr-core/test/J0/./org.apache.solr.cloud.CollectionsAPIDistributedZkTest-jetty3-1375375096905/nodes_used_collection_shard1_replica1
   [junit4]   2> 1187250 T2872 oasc.CorePropertiesLocator.writePropertiesFile ERROR Couldn't persist core properties to /usr/home/hudson/hudson-slave/workspace/Lucene-Solr-Tests-trunk-Java7/solr/build/solr-core/test/J0/./org.apache.solr.cloud.CollectionsAPIDistributedZkTest-jetty4-1375375098713/nodes_used_collection_shard2_replica2/core.properties: java.io.FileNotFoundException: /usr/home/hudson/hudson-slave/workspace/Lucene-Solr-Tests-trunk-Java7/solr/build/solr-core/test/J0/./org.apache.solr.cloud.CollectionsAPIDistributedZkTest-jetty4-1375375098713/nodes_used_collection_shard2_replica2/core.properties (No such file or directory)
   [junit4]   2> 1187250 T2844 oasc.CoreContainer.create Creating SolrCore 'nodes_used_collection_shard2_replica1' using instanceDir: /usr/home/hudson/hudson-slave/workspace/Lucene-Solr-Tests-trunk-Java7/solr/build/solr-core/test/J0/./org.apache.solr.cloud.CollectionsAPIDistributedZkTest-jetty2-1375375095196/nodes_used_collection_shard2_replica1
   [junit4]   2> 1187251 T2872 oasc.CoreContainer.create Creating SolrCore 'nodes_used_collection_shard2_replica2' using instanceDir: /usr/home/hudson/hudson-slave/workspace/Lucene-Solr-Tests-trunk-Java7/solr/build/solr-core/test/J0/./org.apache.solr.cloud.CollectionsAPIDistributedZkTest-jetty4-1375375098713/nodes_used_collection_shard2_replica2
   [junit4]   2> 1187251 T2872 oasc.ZkController.createCollectionZkNode Check for collection zkNode:nodes_used_collection
   [junit4]   2> 1187250 T2858 oasc.ZkController.createCollectionZkNode Check for collection zkNode:nodes_used_collection
   [junit4]   2> 1187251 T2844 oasc.ZkController.createCollectionZkNode Check for collection zkNode:nodes_used_collection
   [junit4]   2> 1187252 T2872 oasc.ZkController.createCollectionZkNode Creating collection in ZooKeeper:nodes_used_collection
   [junit4]   2> 1187253 T2858 oasc.ZkController.createCollectionZkNode Creating collection in ZooKeeper:nodes_used_collection
   [junit4]   2> 1187253 T2872 oasc.ZkController.getConfName Looking for collection configName
   [junit4]   2> 1187253 T2844 oasc.ZkController.createCollectionZkNode Creating collection in ZooKeeper:nodes_used_collection
   [junit4]   2> 1187254 T2858 oasc.ZkController.getConfName Looking for collection configName
   [junit4]   2> 1187254 T2844 oasc.ZkController.getConfName Looking for collection configName
   [junit4]   2> 1187255 T2872 oasc.ZkController.getConfName Only one config set found in zk - using it:conf1
   [junit4]   2> 1187255 T2872 oascc.SolrZkClient.makePath makePath: /collections/nodes_used_collection
   [junit4]   2> 1187256 T2858 oasc.ZkController.getConfName Only one config set found in zk - using it:conf1
   [junit4]   2> 1187256 T2844 oasc.ZkController.getConfName Only one config set found in zk - using it:conf1
   [junit4]   2> 1187256 T2858 oascc.SolrZkClient.makePath makePath: /collections/nodes_used_collection
   [junit4]   2> 1187257 T2844 oascc.SolrZkClient.makePath makePath: /collections/nodes_used_collection
   [junit4]   2> 1187258 T2812 oasc.ZkController.waitForShardId waiting to find shard id in clusterstate for nodes_used_collection_shard1_replica2
   [junit4]   2> 1187259 T2812 oasc.CorePropertiesLocator.writePropertiesFile ERROR Couldn't persist core properties to /usr/home/hudson/hudson-slave/workspace/Lucene-Solr-Tests-trunk-Java7/solr/build/solr-core/test/J0/./org.apache.solr.cloud.CollectionsAPIDistributedZkTest-controljetty-1375375092744/nodes_used_collection_shard1_replica2/core.properties: java.io.FileNotFoundException: /usr/home/hudson/hudson-slave/workspace/Lucene-Solr-Tests-trunk-Java7/solr/build/solr-core/test/J0/./org.apache.solr.cloud.CollectionsAPIDistributedZkTest-controljetty-1375375092744/nodes_used_collection_shard1_replica2/core.properties (No such file or directory)
   [junit4]   2> 1187259 T2872 oasc.ZkController.readConfigName Load collection config from:/collections/nodes_used_collection
   [junit4]   2> 1187259 T2812 oasc.CoreContainer.create Creating SolrCore 'nodes_used_collection_shard1_replica2' using instanceDir: /usr/home/hudson/hudson-slave/workspace/Lucene-Solr-Tests-trunk-Java7/solr/build/solr-core/test/J0/./org.apache.solr.cloud.CollectionsAPIDistributedZkTest-controljetty-1375375092744/nodes_used_collection_shard1_replica2
   [junit4]   2> 1187260 T2858 oasc.ZkController.readConfigName Load collection config from:/collections/nodes_used_collection
   [junit4]   2> 1187260 T2812 oasc.ZkController.createCollectionZkNode Check for collection zkNode:nodes_used_collection
   [junit4]   2> 1187274 T2844 oasc.ZkController.readConfigName Load collection config from:/collections/nodes_used_collection
   [junit4]   2> 1187274 T2812 oasc.ZkController.createCollectionZkNode Collection zkNode exists
   [junit4]   2> 1187274 T2858 oasc.SolrResourceLoader.<init> new SolrResourceLoader for directory: '/usr/home/hudson/hudson-slave/workspace/Lucene-Solr-Tests-trunk-Java7/solr/build/solr-core/test/J0/./org.apache.solr.cloud.CollectionsAPIDistributedZkTest-jetty3-1375375096905/nodes_used_collection_shard1_replica1/'
   [junit4]   2> 1187274 T2872 oasc.SolrResourceLoader.<init> new SolrResourceLoader for directory: '/usr/home/hudson/hudson-slave/workspace/Lucene-Solr-Tests-trunk-Java7/solr/build/solr-core/test/J0/./org.apache.solr.cloud.CollectionsAPIDistributedZkTest-jetty4-1375375098713/nodes_used_collection_shard2_replica2/'
   [junit4]   2> 1187275 T2844 oasc.SolrResourceLoader.<init> new SolrResourceLoader for directory: '/usr/home/hudson/hudson-slave/workspace/Lucene-Solr-Tests-trunk-Java7/solr/build/solr-core/test/J0/./org.apache.solr.cloud.CollectionsAPIDistributedZkTest-jetty2-1375375095196/nodes_used_collection_shard2_replica1/'
   [junit4]   2> 1187274 T2812 oasc.ZkController.readConfigName Load collection config from:/collections/nodes_used_collection
   [junit4]   2> 1187277 T2812 oasc.SolrResourceLoader.<init> new SolrResourceLoader for directory: '/usr/home/hudson/hudson-slave/workspace/Lucene-Solr-Tests-trunk-Java7/solr/build/solr-core/test/J0/./org.apache.solr.cloud.CollectionsAPIDistributedZkTest-controljetty-1375375092744/nodes_used_collection_shard1_replica2/'
   [junit4]   2> 1187456 T2872 oasc.SolrConfig.<init> Using Lucene MatchVersion: LUCENE_50
   [junit4]   2> 1187456 T2812 oasc.SolrConfig.<init> Using Lucene MatchVersion: LUCENE_50
   [junit4]   2> 1187456 T2858 oasc.SolrConfig.<init> Using Lucene MatchVersion: LUCENE_50
   [junit4]   2> 1187456 T2844 oasc.SolrConfig.<init> Using Lucene MatchVersion: LUCENE_50
   [junit4]   2> 1187535 T2872 oasc.SolrConfig.<init> Loaded SolrConfig: solrconfig.xml
   [junit4]   2> 1187536 T2858 oasc.SolrConfig.<init> Loaded SolrConfig: solrconfig.xml
   [junit4]   2> 1187536 T2844 oasc.SolrConfig.<init> Loaded SolrConfig: solrconfig.xml
   [junit4]   2> 1187536 T2812 oasc.SolrConfig.<init> Loaded SolrConfig: solrconfig.xml
   [junit4]   2> 1187637 T2872 oass.IndexSchema.readSchema Reading Solr Schema from schema.xml
   [junit4]   2> 1187638 T2844 oass.IndexSchema.readSchema Reading Solr Schema from schema.xml
   [junit4]   2> 1187638 T2812 oass.IndexSchema.readSchema Reading Solr Schema from schema.xml
   [junit4]   2> 1187638 T2858 oass.IndexSchema.readSchema Reading Solr Schema from schema.xml
   [junit4]   2> 1187649 T2872 oass.IndexSchema.readSchema [nodes_used_collection_shard2_replica2] Schema name=test
   [junit4]   2> 1187650 T2844 oass.IndexSchema.readSchema [nodes_used_collection_shard2_replica1] Schema name=test
   [junit4]   2> 1187651 T2858 oass.IndexSchema.readSchema [nodes_used_collection_shard1_replica1] Schema name=test
   [junit4]   2> 1187651 T2812 oass.IndexSchema.readSchema [nodes_used_collection_shard1_replica2] Schema name=test
   [junit4]   2> 1188462 T2872 oass.OpenExchangeRatesOrgProvider.init Initialized with rates=open-exchange-rates.json, refreshInterval=1440.
   [junit4]   2> 1188463 T2858 oass.OpenExchangeRatesOrgProvider.init Initialized with rates=open-exchange-rates.json, refreshInterval=1440.
   [junit4]   2> 1188468 T2844 oass.OpenExchangeRatesOrgProvider.init Initialized with rates=open-exchange-rates.json, refreshInterval=1440.
   [junit4]   2> 1188473 T2812 oass.OpenExchangeRatesOrgProvider.init Initialized with rates=open-exchange-rates.json, refreshInterval=1440.
   [junit4]   2> 1188476 T2872 oass.IndexSchema.readSchema default search field in schema is text
   [junit4]   2> 1188477 T2858 oass.IndexSchema.readSchema default search field in schema is text
   [junit4]   2> 1188477 T2844 oass.IndexSchema.readSchema default search field in schema is text
   [junit4]   2> 1188481 T2872 oass.IndexSchema.readSchema unique key field: id
   [junit4]   2> 1188482 T2858 oass.IndexSchema.readSchema unique key field: id
   [junit4]   2> 1188482 T2844 oass.IndexSchema.readSchema unique key field: id
   [junit4]   2> 1188483 T2812 oass.IndexSchema.readSchema default search field in schema is text
   [junit4]   2> 1188487 T2812 oass.IndexSchema.readSchema unique key field: id
   [junit4]   2> 1188498 T2872 oass.FileExchangeRateProvider.reload Reloading exchange rates from file currency.xml
   [junit4]   2> 1188498 T2844 oass.FileExchangeRateProvider.reload Reloading exchange rates from file currency.xml
   [junit4]   2> 1188498 T2858 oass.FileExchangeRateProvider.reload Reloading exchange rates from file currency.xml
   [junit4]   2> 1188503 T2812 oass.FileExchangeRateProvider.reload Reloading exchange rates from file currency.xml
   [junit4]   2> 1188504 T2872 oass.FileExchangeRateProvider.reload Reloading exchange rates from file currency.xml
   [junit4]   2> 1188504 T2844 oass.FileExchangeRateProvider.reload Reloading exchange rates from file currency.xml
   [junit4]   2> 1188505 T2858 oass.FileExchangeRateProvider.reload Reloading exchange rates from file currency.xml
   [junit4]   2> 1188508 T2812 oass.FileExchangeRateProvider.reload Reloading exchange rates from file currency.xml
   [junit4]   2> 1188510 T2872 oass.OpenExchangeRatesOrgProvider.reload Reloading exchange rates from open-exchange-rates.json
   [junit4]   2> 1188510 T2844 oass.OpenExchangeRatesOrgProvider.reload Reloading exchange rates from open-exchange-rates.json
   [junit4]   2> 1188511 T2858 oass.OpenExchangeRatesOrgProvider.reload Reloading exchange rates from open-exchange-rates.json
   [junit4]   2> 1188511 T2872 oass.OpenExchangeRatesOrgProvider$OpenExchangeRates.<init> WARN Unknown key IMPORTANT NOTE
   [junit4]   2> 1188512 T2872 oass.OpenExchangeRatesOrgProvider$OpenExchangeRates.<init> WARN Expected key, got STRING
   [junit4]   2> 1188512 T2858 oass.OpenExchangeRatesOrgProvider$OpenExchangeRates.<init> WARN Unknown key IMPORTANT NOTE
   [junit4]   2> 1188513 T2858 oass.OpenExchangeRatesOrgProvider$OpenExchangeRates.<init> WARN Expected key, got STRING
   [junit4]   2> 1188512 T2872 oass.OpenExchangeRatesOrgProvider.reload Reloading exchange rates from open-exchange-rates.json
   [junit4]   2> 1188512 T2844 oass.OpenExchangeRatesOrgProvider$OpenExchangeRates.<init> WARN Unknown key IMPORTANT NOTE
   [junit4]   2> 1188513 T2812 oass.OpenExchangeRatesOrgProvider.reload Reloading exchange rates from open-exchange-rates.json
   [junit4]   2> 1188513 T2858 oass.OpenExchangeRatesOrgProvider.reload Reloading exchange rates from open-exchange-rates.json
   [junit4]   2> 1188514 T2872 oass.OpenExchangeRatesOrgProvider$OpenExchangeRates.<init> WARN Unknown key IMPORTANT NOTE
   [junit4]   2> 1188515 T2812 oass.OpenExchangeRatesOrgProvider$OpenExchangeRates.<init> WARN Unknown key IMPORTANT NOTE
   [junit4]   2> 1188516 T2858 oass.OpenExchangeRatesOrgProvider$OpenExchangeRates.<init> WARN Unknown key IMPORTANT NOTE
   [junit4]   2> 1188514 T2844 oass.OpenExchangeRatesOrgProvider$OpenExchangeRates.<init> WARN Expected key, got STRING
   [junit4]   2> 1188516 T2858 oass.OpenExchangeRatesOrgProvider$OpenExchangeRates.<init> WARN Expected key, got STRING
   [junit4]   2> 1188516 T2812 oass.OpenExchangeRatesOrgProvider$OpenExchangeRates.<init> WARN Expected key, got STRING
   [junit4]   2> 1188515 T2872 oass.OpenExchangeRatesOrgProvider$OpenExchangeRates.<init> WARN Expected key, got STRING
   [junit4]   2> 1188517 T2812 oass.OpenExchangeRatesOrgProvider.reload Reloading exchange rates from open-exchange-rates.json
   [junit4]   2> 1188517 T2858 oasc.SolrCore.initDirectoryFactory org.apache.solr.core.MockDirectoryFactory
   [junit4]   2> 1188517 T2844 oass.OpenExchangeRatesOrgProvider.reload Reloading exchange rates from open-exchange-rates.json
   [junit4]   2> 1188519 T2858 oasc.SolrCore.<init> [nodes_used_collection_shard1_replica1] Opening new SolrCore at /usr/home/hudson/hudson-slave/workspace/Lucene-Solr-Tests-trunk-Java7/solr/build/solr-core/test/J0/./org.apache.solr.cloud.CollectionsAPIDistributedZkTest-jetty3-1375375096905/nodes_used_collection_shard1_replica1/, dataDir=/usr/home/hudson/hudson-slave/workspace/Lucene-Solr-Tests-trunk-Java7/solr/build/solr-core/test/J0/./org.apache.solr.cloud.CollectionsAPIDistributedZkTest-jetty3-1375375096905//nodes_used_collection_shard1_replica1/data/
   [junit4]   2> 1188518 T2872 oasc.SolrCore.initDirectoryFactory org.apache.solr.core.MockDirectoryFactory
   [junit4]   2> 1188520 T2844 oass.OpenExchangeRatesOrgProvider$OpenExchangeRates.<init> WARN Unknown key IMPORTANT NOTE
   [junit4]   2> 1188520 T2844 oass.OpenExchangeRatesOrgProvider$OpenExchangeRates.<init> WARN Expected key, got STRING
   [junit4]   2> 1188520 T2858 oasc.JmxMonitoredMap.<init> JMX monitoring is enabled. Adding Solr mbeans to JMX Server: com.sun.jmx.mbeanserver.JmxMBeanServer@78d6df62
   [junit4]   2> 1188519 T2812 oass.OpenExchangeRatesOrgProvider$OpenExchangeRates.<init> WARN Unknown key IMPORTANT NOTE
   [junit4]   2> 1188521 T2844 oasc.SolrCore.initDirectoryFactory org.apache.solr.core.MockDirectoryFactory
   [junit4]   2> 1188520 T2872 oasc.SolrCore.<init> [nodes_used_collection_shard2_replica2] Opening new SolrCore at /usr/home/hudson/hudson-slave/workspace/Lucene-Solr-Tests-trunk-Java7/solr/build/solr-core/test/J0/./org.apache.solr.cloud.CollectionsAPIDistributedZkTest-jetty4-1375375098713/nodes_used_collection_shard2_replica2/, dataDir=/usr/home/hudson/hudson-slave/workspace/Lucene-Solr-Tests-trunk-Java7/solr/build/solr-core/test/J0/./org.apache.solr.cloud.CollectionsAPIDistributedZkTest-jetty4-1375375098713//nodes_used_collection_shard2_replica2/data/
   [junit4]   2> 1188522 T2858 oasc.CachingDirectoryFactory.get return new directory for /usr/home/hudson/hudson-slave/workspace/Lucene-Solr-Tests-trunk-Java7/solr/build/solr-core/test/J0/./org.apache.solr.cloud.CollectionsAPIDistributedZkTest-jetty3-1375375096905//nodes_used_collection_shard1_replica1/data
   [junit4]   2> 1188522 T2844 oasc.SolrCore.<init> [nodes_used_collection_shard2_replica1] Opening new SolrCore at /usr/home/hudson/hudson-slave/workspace/Lucene-Solr-Tests-trunk-Java7/solr/build/solr-core/test/J0/./org.apache.solr.cloud.CollectionsAPIDistributedZkTest-jetty2-1375375095196/nodes_used_collection_shard2_replica1/, dataDir=/usr/home/hudson/hudson-slave/workspace/Lucene-Solr-Tests-trunk-Java7/solr/build/solr-core/test/J0/./org.apache.solr.cloud.CollectionsAPIDistributedZkTest-jetty2-1375375095196//nodes_used_collection_shard2_replica1/data/
   [junit4]   2> 1188522 T2812 oass.OpenExchangeRatesOrgProvider$OpenExchangeRates.<init> WARN Expected key, got STRING
   [junit4]   2> 1188523 T2844 oasc.JmxMonitoredMap.<init> JMX monitoring is enabled. Adding Solr mbeans to JMX Server: com.sun.jmx.mbeanserver.JmxMBeanServer@78d6df62
   [junit4]   2> 1188523 T2858 oasc.SolrCore.getNewIndexDir New index directory detected: old=null new=/usr/home/hudson/hudson-slave/workspace/Lucene-Solr-Tests-trunk-Java7/solr/build/solr-core/test/J0/./org.apache.solr.cloud.CollectionsAPIDistributedZkTest-jetty3-1375375096905//nodes_used_collection_shard1_replica1/data/index/
   [junit4]   2> 1188523 T2872 oasc.JmxMonitoredMap.<init> JMX monitoring is enabled. Adding Solr mbeans to JMX Server: com.sun.jmx.mbeanserver.JmxMBeanServer@78d6df62
   [junit4]   2> 1188525 T2858 oasc.SolrCore.initIndex WARN [nodes_used_collection_shard1_replica1] Solr index directory '/usr/home/hudson/hudson-slave/workspace/Lucene-Solr-Tests-trunk-Java7/solr/build/solr-core/test/J0/./org.apache.solr.cloud.CollectionsAPIDistributedZkTest-jetty3-1375375096905/nodes_used_collection_shard1_replica1/data/index' doesn't exist. Creating new index...
   [junit4]   2> 1188524 T2812 oasc.SolrCore.initDirectoryFactory org.apache.solr.core.MockDirectoryFactory
   [junit4]   2> 1188526 T2872 oasc.CachingDirectoryFactory.get return new directory for /usr/home/hudson/hudson-slave/workspace/Lucene-Solr-Tests-trunk-Java7/solr/build/solr-core/test/J0/./org.apache.solr.cloud.CollectionsAPIDistributedZkTest-jetty4-1375375098713//nodes_used_collection_shard2_replica2/data
   [junit4]   2> 1188525 T2844 oasc.CachingDirectoryFactory.get return new directory for /usr/home/hudson/hudson-slave/workspace/Lucene-Solr-Tests-trunk-Java7/solr/build/solr-core/test/J0/./org.apache.solr.cloud.CollectionsAPIDistributedZkTest-jetty2-1375375095196//nodes_used_collection_shard2_replica1/data
   [junit4]   2> 1188526 T2872 oasc.SolrCore.getNewIndexDir New index directory detected: old=null new=/usr/home/hudson/hudson-slave/workspace/Lucene-Solr-Tests-trunk-Java7/solr/build/solr-core/test/J0/./org.apache.solr.cloud.CollectionsAPIDistributedZkTest-jetty4-1375375098713//nodes_used_collection_shard2_replica2/data/index/
   [junit4]   2> 1188526 T2858 oasc.CachingDirectoryFactory.get return new directory for /usr/home/hudson/hudson-slave/workspace/Lucene-Solr-Tests-trunk-Java7/solr/build/solr-core/test/J0/./org.apache.solr.cloud.CollectionsAPIDistributedZkTest-jetty3-1375375096905//nodes_used_collection_shard1_replica1/data/index
   [junit4]   2> 1188526 T2812 oasc.SolrCore.<init> [nodes_used_collection_shard1_replica2] Opening new SolrCore at /usr/home/hudson/hudson-slave/workspace/Lucene-Solr-Tests-trunk-Java7/solr/build/solr-core/test/J0/./org.apache.solr.cloud.CollectionsAPIDistributedZkTest-controljetty-1375375092744/nodes_used_collection_shard1_replica2/, dataDir=/usr/home/hudson/hudson-slave/workspace/Lucene-Solr-Tests-trunk-Java7/solr/build/solr-core/test/J0/./org.apache.solr.cloud.CollectionsAPIDistributedZkTest-controljetty-1375375092744//nodes_used_collection_shard1_replica2/data/
   [junit4]   2> 1188527 T2872 oasc.SolrCore.initIndex WARN [nodes_used_collection_shard2_replica2] Solr index directory '/usr/home/hudson/hudson-slave/workspace/Lucene-Solr-Tests-trunk-Java7/solr/build/solr-core/test/J0/./org.apache.solr.cloud.CollectionsAPIDistributedZkTest-jetty4-1375375098713/nodes_used_collection_shard2_replica2/data/index' doesn't exist. Creating new index...
   [junit4]   2> 1188527 T2844 oasc.SolrCore.getNewIndexDir New index directory detected: old=null new=/usr/home/hudson/hudson-slave/workspace/Lucene-Solr-Tests-trunk-Java7/solr/build/solr-core/test/J0/./org.apache.solr.cloud.CollectionsAPIDistributedZkTest-jetty2-1375375095196//nodes_used_collection_shard2_replica1/data/index/
   [junit4]   2> 1188529 T2872 oasc.CachingDirectoryFactory.get return new directory for /usr/home/hudson/hudson-slave/workspace/Lucene-Solr-Tests-trunk-Java7/solr/build/solr-core/test/J0/./org.apache.solr.cloud.CollectionsAPIDistributedZkTest-jetty4-1375375098713//nodes_used_collection_shard2_replica2/data/index
   [junit4]   2> 1188528 T2812 oasc.JmxMonitoredMap.<init> JMX monitoring is enabled. Adding Solr mbeans to JMX Server: com.sun.jmx.mbeanserver.JmxMBeanServer@78d6df62
   [junit4]   2> 1188529 T2844 oasc.SolrCore.initIndex WARN [nodes_used_collection_shard2_replica1] Solr index directory '/usr/home/hudson/hudson-slave/workspace/Lucene-Solr-Tests-trunk-Java7/solr/build/solr-core/test/J0/./org.apache.solr.cloud.CollectionsAPIDistributedZkTest-jetty2-1375375095196/nodes_used_collection_shard2_replica1/data/index' doesn't exist. Creating new index...
   [junit4]   2> 1188531 T2844 oasc.CachingDirectoryFactory.get return new directory for /usr/home/hudson/hudson-slave/workspace/Lucene-Solr-Tests-trunk-Java7/solr/build/solr-core/test/J0/./org.apache.solr.cloud.CollectionsAPIDistributedZkTest-jetty2-1375375095196//nodes_used_collection_shard2_replica1/data/index
   [junit4]   2> 1188531 T2812 oasc.CachingDirectoryFactory.get return new directory for /usr/home/hudson/hudson-slave/workspace/Lucene-Solr-Tests-trunk-Java7/solr/build/solr-core/test/J0/./org.apache.solr.cloud.CollectionsAPIDistributedZkTest-controljetty-1375375092744//nodes_used_collection_shard1_replica2/data
   [junit4]   2> 1188531 T2812 oasc.SolrCore.getNewIndexDir New index directory detected: old=null new=/usr/home/hudson/hudson-slave/workspace/Lucene-Solr-Tests-trunk-Java7/solr/build/solr-core/test/J0/./org.apache.solr.cloud.CollectionsAPIDistributedZkTest-controljetty-1375375092744//nodes_used_collection_shard1_replica2/data/index/
   [junit4]   2> 1188532 T2812 oasc.SolrCore.initIndex WARN [nodes_used_collection_shard1_replica2] Solr index directory '/usr/home/hudson/hudson-slave/workspace/Lucene-Solr-Tests-trunk-Java7/solr/build/solr-core/test/J0/./org.apache.solr.cloud.CollectionsAPIDistributedZkTest-controljetty-1375375092744/nodes_used_collection_shard1_replica2/data/index' doesn't exist. Creating new index...
   [junit4]   2> 1188533 T2812 oasc.CachingDirectoryFactory.get return new directory for /usr/home/hudson/hudson-slave/workspace/Lucene-Solr-Tests-trunk-Java7/solr/build/solr-core/test/J0/./org.apache.solr.cloud.CollectionsAPIDistributedZkTest-controljetty-1375375092744//nodes_used_collection_shard1_replica2/data/index
   [junit4]   2> 1188534 T2858 oasc.SolrDeletionPolicy.onCommit SolrDeletionPolicy.onCommit: commits: num=1
   [junit4]   2> 		commit{dir=MockDirWrapper(org.apache.lucene.store.RAMDirectory@4e875fa6 lockFactory=org.apache.lucene.store.NativeFSLockFactory@357b354a),segFN=segments_1,generation=1}
   [junit4]   2> 1188534 T2858 oasc.SolrDeletionPolicy.updateCommits newest commit generation = 1
   [junit4]   2> 1188535 T2872 oasc.SolrDeletionPolicy.onCommit SolrDeletionPolicy.onCommit: commits: num=1
   [junit4]   2> 		commit{dir=MockDirWrapper(org.apache.lucene.store.RAMDirectory@1d8d0a10 lockFactory=org.apache.lucene.store.NativeFSLockFactory@171476a8),segFN=segments_1,generation=1}
   [junit4]   2> 1188536 T2872 oasc.SolrDeletionPolicy.updateCommits newest commit generation = 1
   [junit4]   2> 1188537 T2844 oasc.SolrDeletionPolicy.onCommit SolrDeletionPolicy.onCommit: commits: num=1
   [junit4]   2> 		commit{dir=MockDirWrapper(org.apache.lucene.store.RAMDirectory@3399ebd2 lockFactory=org.apache.lucene.store.NativeFSLockFactory@6d497f0f),segFN=segments_1,generation=1}
   [junit4]   2> 1188537 T2844 oasc.SolrDeletionPolicy.updateCommits newest commit generation = 1
   [junit4]   2> 1188538 T2812 oasc.SolrDeletionPolicy.onCommit SolrDeletionPolicy.onCommit: commits: num=1
   [junit4]   2> 		commit{dir=MockDirWrapper(org.apache.lucene.store.RAMDirectory@113ebcef lockFactory=org.apache.lucene.store.NativeFSLockFactory@ff8746),segFN=segments_1,generation=1}
   [junit4]   2> 1188539 T2812 oasc.SolrDeletionPolicy.updateCommits newest commit generation = 1
   [junit4]   2> 1188540 T2858 oasup.UpdateRequestProcessorChain.init inserting DistributedUpdateProcessorFactory into updateRequestProcessorChain "dedupe"
   [junit4]   2> 1188541 T2858 oasup.UpdateRequestProcessorChain.init inserting DistributedUpdateProcessorFactory into updateRequestProcessorChain "stored_sig"
   [junit4]   2> 1188542 T2872 oasup.UpdateRequestProcessorChain.init inserting DistributedUpdateProcessorFactory into updateRequestProcessorChain "dedupe"
   [junit4]   2> 1188542 T2858 oasup.UpdateRequestProcessorChain.init inserting DistributedUpdateProcessorFactory into updateRequestProcessorChain "distrib-dup-test-chain-implicit"
   [junit4]   2> 1188542 T2872 oasup.UpdateRequestProcessorChain.init inserting DistributedUpdateProcessorFactory into updateRequestProcessorChain "stored_sig"
   [junit4]   2> 1188543 T2844 oasup.UpdateRequestProcessorChain.init inserting DistributedUpdateProcessorFactory into updateRequestProcessorChain "dedupe"
   [junit4]   2> 1188543 T2858 oasc.RequestHandlers.initHandlersFromConfig created standard: solr.StandardRequestHandler
   [junit4]   2> 1188543 T2844 oasup.UpdateRequestProcessorChain.init inserting DistributedUpdateProcessorFactory into updateRequestProcessorChain "stored_sig"
   [junit4]   2> 1188543 T2872 oasup.UpdateRequestProcessorChain.init inserting DistributedUpdateProcessorFactory into updateRequestProcessorChain "distrib-dup-test-chain-implicit"
   [junit4]   2> 1188544 T2812 oasup.UpdateRequestProcessorChain.init inserting DistributedUpdateProcessorFactory into updateRequestProcessorChain "dedupe"
   [junit4]   2> 1188545 T2872 oasc.RequestHandlers.initHandlersFromConfig created standard: solr.StandardRequestHandler
   [junit4]   2> 1188544 T2858 oasc.RequestHandlers.initHandlersFromConfig created /get: solr.RealTimeGetHandler
   [junit4]   2> 1188546 T2858 oasc.RequestHandlers.initHandlersFromConfig adding lazy requestHandler: solr.ReplicationHandler
   [junit4]   2> 1188546 T2872 oasc.RequestHandlers.initHandlersFromConfig created /get: solr.RealTimeGetHandler
   [junit4]   2> 1188545 T2812 oasup.UpdateRequestProcessorChain.init inserting DistributedUpdateProcessorFactory into updateRequestProcessorChain "stored_sig"
   [junit4]   2> 1188545 T2844 oasup.UpdateRequestProcessorChain.init inserting DistributedUpdateProcessorFactory into updateRequestProcessorChain "distrib-dup-test-chain-implicit"
   [junit4]   2> 1188547 T2872 oasc.RequestHandlers.initHandlersFromConfig adding lazy requestHandler: solr.ReplicationHandler
   [junit4]   2> 1188548 T2844 oasc.RequestHandlers.initHandlersFromConfig created standard: solr.StandardRequestHandler
   [junit4]   2> 1188546 T2858 oasc.RequestHandlers.initHandlersFromConfig created /replication: solr.ReplicationHandler
   [junit4]   2> 1188549 T2844 oasc.RequestHandlers.initHandlersFromConfig created /get: solr.RealTimeGetHandler
   [junit4]   2> 1188549 T2858 oasc.RequestHandlers.initHandlersFromConfig created /update: solr.UpdateRequestHandler
   [junit4]   2> 1188548 T2872 oasc.RequestHandlers.initHandlersFromConfig created /replication: solr.ReplicationHandler
   [junit4]   2> 1188548 T2812 oasup.UpdateRequestProcessorChain.init inserting DistributedUpdateProcessorFactory into updateRequestProcessorChain "distrib-dup-test-chain-implicit"
   [junit4]   2> 1188550 T2872 oasc.RequestHandlers.initHandlersFromConfig created /update: solr.UpdateRequestHandler
   [junit4]   2> 1188551 T2812 oasc.RequestHandlers.initHandlersFromConfig created standard: solr.StandardRequestHandler
   [junit4]   2> 1188550 T2858 oasc.RequestHandlers.initHandlersFromConfig created /admin/: org.apache.solr.handler.admin.AdminHandlers
   [junit4]   2> 1188549 T2844 oasc.RequestHandlers.initHandlersFromConfig adding lazy requestHandler: solr.ReplicationHandler
   [junit4]   2> 1188551 T2812 oasc.RequestHandlers.initHandlersFromConfig created /get: solr.RealTimeGetHandler
   [junit4]   2> 1188552 T2812 oasc.RequestHandlers.initHandlersFromConfig adding lazy requestHandler: solr.ReplicationHandler
   [junit4]   2> 1188551 T2872 oasc.RequestHandlers.initHandlersFromConfig created /admin/: org.apache.solr.handler.admin.AdminHandlers
   [junit4]   2> 1188553 T2812 oasc.RequestHandlers.initHandlersFromConfig created /replication: solr.ReplicationHandler
   [junit4]   2> 1188552 T2844 oasc.RequestHandlers.initHandlersFromConfig created /replication: solr.ReplicationHandler
   [junit4]   2> 1188554 T2812 oasc.RequestHandlers.initHandlersFromConfig created /update: solr.UpdateRequestHandler
   [junit4]   2> 1188554 T2844 oasc.RequestHandlers.initHandlersFromConfig created /update: solr.UpdateRequestHandler
   [junit4]   2> 1188555 T2812 oasc.RequestHandlers.initHandlersFromConfig created /admin/: org.apache.solr.handler.admin.AdminHandlers
   [junit4]   2> 1188555 T2844 oasc.RequestHandlers.initHandlersFromConfig created /admin/: org.apache.solr.handler.admin.AdminHandlers
   [junit4]   2> 1188582 T2844 oashl.XMLLoader.init xsltCacheLifetimeSeconds=60
   [junit4]   2> 1188582 T2872 oashl.XMLLoader.init xsltCacheLifetimeSeconds=60
   [junit4]   2> 1188583 T2858 oashl.XMLLoader.init xsltCacheLifetimeSeconds=60
   [junit4]   2> 1188583 T2812 oashl.XMLLoader.init xsltCacheLifetimeSeconds=60
   [junit4]   2> 1188594 T2872 oass.SolrIndexSearcher.<init> Opening Searcher@302fda2c main
   [junit4]   2> 1188595 T2812 oass.SolrIndexSearcher.<init> Opening Searcher@555d322c main
   [junit4]   2> 1188595 T2858 oass.SolrIndexSearcher.<init> Opening Searcher@1038639d main
   [junit4]   2> 1188594 T2844 oass.SolrIndexSearcher.<init> Opening Searcher@19028869 main
   [junit4]   2> 1188596 T2872 oasu.CommitTracker.<init> Hard AutoCommit: disabled
   [junit4]   2> 1188597 T2812 oasu.CommitTracker.<init> Hard AutoCommit: disabled
   [junit4]   2> 1188597 T2858 oasu.CommitTracker.<init> Hard AutoCommit: disabled
   [junit4]   2> 1188597 T2872 oasu.CommitTracker.<init> Soft AutoCommit: disabled
   [junit4]   2> 1188598 T2858 oasu.CommitTracker.<init> Soft AutoCommit: disabled
   [junit4]   2> 1188597 T2844 oasu.CommitTracker.<init> Hard AutoCommit: disabled
   [junit4]   2> 1188597 T2812 oasu.CommitTracker.<init> Soft AutoCommit: disabled
   [junit4]   2> 1188599 T2844 oasu.CommitTracker.<init> Soft AutoCommit: disabled
   [junit4]   2> 1188603 T2888 oasc.SolrCore.registerSearcher [nodes_used_collection_shard2_replica2] Registered new searcher Searcher@302fda2c main{StandardDirectoryReader(segments_1:1)}
   [junit4]   2> 1188603 T2890 oasc.SolrCore.registerSearcher [nodes_used_collection_shard1_replica1] Registered new searcher Searcher@1038639d main{StandardDirectoryReader(segments_1:1)}
   [junit4]   2> 1188604 T2891 oasc.SolrCore.registerSearcher [nodes_used_collection_shard1_replica2] Registered new searcher Searcher@555d322c main{StandardDirectoryReader(segments_1:1)}
   [junit4]   2> 1188604 T2889 oasc.SolrCore.registerSearcher [nodes_used_collection_shard2_replica1] Registered new searcher Searcher@19028869 main{StandardDirectoryReader(segments_1:1)}
   [junit4]   2> 1188605 T2872 oasc.CoreContainer.registerCore registering core: nodes_used_collection_shard2_replica2
   [junit4]   2> 1188605 T2858 oasc.CoreContainer.registerCore registering core: nodes_used_collection_shard1_replica1
   [junit4]   2> 1188606 T2812 oasc.CoreContainer.registerCore registering core: nodes_used_collection_shard1_replica2
   [junit4]   2> 1188606 T2872 oasc.ZkController.register Register replica - core:nodes_used_collection_shard2_replica2 address:http://127.0.0.1:38560 collection:nodes_used_collection shard:shard2
   [junit4]   2> 1188606 T2844 oasc.CoreContainer.registerCore registering core: nodes_used_collection_shard2_replica1
   [junit4]   2> 1188606 T2812 oasc.ZkController.register Register replica - core:nodes_used_collection_shard1_replica2 address:http://127.0.0.1:38546 collection:nodes_used_collection shard:shard1
   [junit4]   2> 1188606 T2858 oasc.ZkController.register Register replica - core:nodes_used_collection_shard1_replica1 address:http://127.0.0.1:38557 collection:nodes_used_collection shard:shard1
   [junit4]   2> 1188608 T2812 oascsi.HttpClientUtil.createClient Creating new http client, config:maxConnections=10000&maxConnectionsPerHost=20&connTimeout=15000&socketTimeout=30000&retry=false
   [junit4]   2> 1188607 T2844 oasc.ZkController.register Register replica - core:nodes_used_collection_shard2_replica1 address:http://127.0.0.1:38553 collection:nodes_used_collection shard:shard2
   [junit4]   2> 1188607 T2872 oascsi.HttpClientUtil.createClient Creating new http client, config:maxConnections=10000&maxConnectionsPerHost=20&connTimeout=15000&socketTimeout=30000&retry=false
   [junit4]   2> 1188609 T2844 oascsi.HttpClientUtil.createClient Creating new http client, config:maxConnections=10000&maxConnectionsPerHost=20&connTimeout=15000&socketTimeout=30000&retry=false
   [junit4]   2> 1188608 T2858 oascsi.HttpClientUtil.createClient Creating new http client, config:maxConnections=10000&maxConnectionsPerHost=20&connTimeout=15000&socketTimeout=30000&retry=false
   [junit4]   2> 1188638 T2872 oascc.SolrZkClient.makePath makePath: /collections/nodes_used_collection/leader_elect/shard2/election
   [junit4]   2> 1188639 T2858 oascc.SolrZkClient.makePath makePath: /collections/nodes_used_collection/leader_elect/shard1/election
   [junit4]   2> 1188638 T2812 oascc.SolrZkClient.makePath makePath: /collections/nodes_used_collection/leader_elect/shard1/election
   [junit4]   2> 1188638 T2844 oascc.SolrZkClient.makePath makePath: /collections/nodes_used_collection/leader_elect/shard2/election
   [junit4]   2> 1188677 T2872 oasc.ShardLeaderElectionContext.runLeaderProcess Running the leader process for shard shard2
   [junit4]   2> 1188678 T2812 oasc.ShardLeaderElectionContext.runLeaderProcess Running the leader process for shard shard1
   [junit4]   2> 1188700 T2872 oasc.ShardLeaderElectionContext.waitForReplicasToComeUp Enough replicas found to continue.
   [junit4]   2> 1188700 T2812 oasc.ShardLeaderElectionContext.waitForReplicasToComeUp Enough replicas found to continue.
   [junit4]   2> 1188701 T2812 oasc.ShardLeaderElectionContext.runLeaderProcess I may be the new leader - try and sync
   [junit4]   2> 1188700 T2872 oasc.ShardLeaderElectionContext.runLeaderProcess I may be the new leader - try and sync
   [junit4]   2> 1188701 T2812 oasc.SyncStrategy.sync Sync replicas to http://127.0.0.1:38546/nodes_used_collection_shard1_replica2/
   [junit4]   2> 1188702 T2872 oasc.SyncStrategy.sync Sync replicas to http://127.0.0.1:38560/nodes_used_collection_shard2_replica2/
   [junit4]   2> 1188702 T2812 oasu.PeerSync.sync PeerSync: core=nodes_used_collection_shard1_replica2 url=http://127.0.0.1:38546 START replicas=[http://127.0.0.1:38557/nodes_used_collection_shard1_replica1/] nUpdates=100
   [junit4]   2> 1188703 T2872 oasu.PeerSync.sync PeerSync: core=nodes_used_collection_shard2_replica2 url=http://127.0.0.1:38560 START replicas=[http://127.0.0.1:38553/nodes_used_collection_shard2_replica1/] nUpdates=100
   [junit4]   2> 1188703 T2812 oasu.PeerSync.sync PeerSync: core=nodes_used_collection_shard1_replica2 url=http://127.0.0.1:38546 DONE.  We have no versions.  sync failed.
   [junit4]   2> 1188704 T2812 oasc.SyncStrategy.syncReplicas Leader's attempt to sync with shard failed, moving to the next candidate
   [junit4]   2> 1188704 T2872 oasu.PeerSync.sync PeerSync: core=nodes_used_collection_shard2_replica2 url=http://127.0.0.1:38560 DONE.  We have no versions.  sync failed.
   [junit4]   2> 1188705 T2872 oasc.SyncStrategy.syncReplicas Leader's attempt to sync with shard failed, moving to the next candidate
   [junit4]   2> 1188705 T2812 oasc.ShardLeaderElectionContext.runLeaderProcess We failed sync, but we have no versions - we can't sync in that case - we were active before, so become leader anyway
   [junit4]   2> 1188705 T2872 oasc.ShardLeaderElectionContext.runLeaderProcess We failed sync, but we have no versions - we can't sync in that case - we were active before, so become leader anyway
   [junit4]   2> 1188706 T2812 oasc.ShardLeaderElectionContext.runLeaderProcess I am the new leader: http://127.0.0.1:38546/nodes_used_collection_shard1_replica2/ shard1
   [junit4]   2> 1188706 T2872 oasc.ShardLeaderElectionContext.runLeaderProcess I am the new leader: http://127.0.0.1:38560/nodes_used_collection_shard2_replica2/ shard2
   [junit4]   2> 1188707 T2812 oascc.SolrZkCl

[...truncated too long message...]

1375375098713//new_implicit_coll_1_b_replica1/data
   [junit4]   2> 1329892 T3380 oasc.Overseer$ClusterStateUpdater.amILeader According to ZK I (id=90136582056574988-127.0.0.1:38560_-n_0000000004) am no longer a leader.
   [junit4]   2> 1329895 T2800 oejsh.ContextHandler.doStop stopped o.e.j.s.ServletContextHandler{/,null}
   [junit4]   2> 1329952 T2800 oas.SolrTestCaseJ4.tearDown ###Ending testDistribSearch
   [junit4]   2> 1329955 T2800 oasc.ZkTestServer.send4LetterWord connecting to 127.0.0.1:38543 38543
   [junit4]   1> client port:0.0.0.0/0.0.0.0:0
   [junit4]   2> NOTE: reproduce with: ant test  -Dtestcase=CollectionsAPIDistributedZkTest -Dtests.method=testDistribSearch -Dtests.seed=A7A5A9E6756B5823 -Dtests.multiplier=3 -Dtests.slow=true -Dtests.locale=ca_ES -Dtests.timezone=America/Port_of_Spain -Dtests.file.encoding=US-ASCII
   [junit4] ERROR    153s J0 | CollectionsAPIDistributedZkTest.testDistribSearch <<<
   [junit4]    > Throwable #1: org.apache.solr.client.solrj.SolrServerException: IOException occured when talking to server at: http://127.0.0.1:38553
   [junit4]    > 	at __randomizedtesting.SeedInfo.seed([A7A5A9E6756B5823:264327FE0234381F]:0)
   [junit4]    > 	at org.apache.solr.client.solrj.impl.HttpSolrServer.request(HttpSolrServer.java:435)
   [junit4]    > 	at org.apache.solr.client.solrj.impl.HttpSolrServer.request(HttpSolrServer.java:180)
   [junit4]    > 	at org.apache.solr.cloud.AbstractFullDistribZkTestBase.createCollection(AbstractFullDistribZkTestBase.java:1535)
   [junit4]    > 	at org.apache.solr.cloud.CollectionsAPIDistributedZkTest.testCustomCollectionsAPI(CollectionsAPIDistributedZkTest.java:677)
   [junit4]    > 	at org.apache.solr.cloud.CollectionsAPIDistributedZkTest.doTest(CollectionsAPIDistributedZkTest.java:159)
   [junit4]    > 	at org.apache.solr.BaseDistributedSearchTestCase.testDistribSearch(BaseDistributedSearchTestCase.java:835)
   [junit4]    > 	at java.lang.Thread.run(Thread.java:724)
   [junit4]    > Caused by: org.apache.http.conn.ConnectTimeoutException: Connect to 127.0.0.1:38553 timed out
   [junit4]    > 	at org.apache.http.conn.scheme.PlainSocketFactory.connectSocket(PlainSocketFactory.java:129)
   [junit4]    > 	at org.apache.http.impl.conn.DefaultClientConnectionOperator.openConnection(DefaultClientConnectionOperator.java:180)
   [junit4]    > 	at org.apache.http.impl.conn.ManagedClientConnectionImpl.open(ManagedClientConnectionImpl.java:294)
   [junit4]    > 	at org.apache.http.impl.client.DefaultRequestDirector.tryConnect(DefaultRequestDirector.java:645)
   [junit4]    > 	at org.apache.http.impl.client.DefaultRequestDirector.execute(DefaultRequestDirector.java:480)
   [junit4]    > 	at org.apache.http.impl.client.AbstractHttpClient.execute(AbstractHttpClient.java:906)
   [junit4]    > 	at org.apache.http.impl.client.AbstractHttpClient.execute(AbstractHttpClient.java:805)
   [junit4]    > 	at org.apache.http.impl.client.AbstractHttpClient.execute(AbstractHttpClient.java:784)
   [junit4]    > 	at org.apache.solr.client.solrj.impl.HttpSolrServer.request(HttpSolrServer.java:365)
   [junit4]    > 	... 45 more
   [junit4]   2> 1330108 T2800 oas.SolrTestCaseJ4.deleteCore ###deleteCore
   [junit4]   2> 153338 T2799 ccr.ThreadLeakControl.checkThreadLeaks WARNING Will linger awaiting termination of 2 leaked thread(s).
   [junit4]   2> 1331195 T2882 oascc.ZkStateReader$3.process WARN ZooKeeper watch triggered, but Solr cannot talk to ZK
   [junit4]   2> 1331195 T2882 oascc.ZkStateReader$2.process A cluster state change: WatchedEvent state:SyncConnected type:NodeChildrenChanged path:/live_nodes, has occurred - updating... (live nodes size: 1)
   [junit4]   2> 1331195 T2882 oascc.ZkStateReader$2.process WARN ZooKeeper watch triggered, but Solr cannot talk to ZK
   [junit4]   2> 1331196 T2882 oasc.LeaderElector$1.process WARN  org.apache.zookeeper.KeeperException$SessionExpiredException: KeeperErrorCode = Session expired for /collections/new_implicit_coll_0/leader_elect/b/election
   [junit4]   2> 	at org.apache.zookeeper.KeeperException.create(KeeperException.java:127)
   [junit4]   2> 	at org.apache.zookeeper.KeeperException.create(KeeperException.java:51)
   [junit4]   2> 	at org.apache.zookeeper.ZooKeeper.getChildren(ZooKeeper.java:1468)
   [junit4]   2> 	at org.apache.solr.common.cloud.SolrZkClient$6.execute(SolrZkClient.java:235)
   [junit4]   2> 	at org.apache.solr.common.cloud.SolrZkClient$6.execute(SolrZkClient.java:232)
   [junit4]   2> 	at org.apache.solr.common.cloud.ZkCmdExecutor.retryOperation(ZkCmdExecutor.java:65)
   [junit4]   2> 	at org.apache.solr.common.cloud.SolrZkClient.getChildren(SolrZkClient.java:232)
   [junit4]   2> 	at org.apache.solr.cloud.LeaderElector.checkIfIamLeader(LeaderElector.java:84)
   [junit4]   2> 	at org.apache.solr.cloud.LeaderElector.access$000(LeaderElector.java:55)
   [junit4]   2> 	at org.apache.solr.cloud.LeaderElector$1.process(LeaderElector.java:129)
   [junit4]   2> 	at org.apache.zookeeper.ClientCnxn$EventThread.processEvent(ClientCnxn.java:519)
   [junit4]   2> 	at org.apache.zookeeper.ClientCnxn$EventThread.run(ClientCnxn.java:495)
   [junit4]   2> 
   [junit4]   2> 1331196 T2882 oasc.LeaderElector$1.process WARN  org.apache.zookeeper.KeeperException$SessionExpiredException: KeeperErrorCode = Session expired for /collections/new_implicit_coll_0/leader_elect/c/election
   [junit4]   2> 	at org.apache.zookeeper.KeeperException.create(KeeperException.java:127)
   [junit4]   2> 	at org.apache.zookeeper.KeeperException.create(KeeperException.java:51)
   [junit4]   2> 	at org.apache.zookeeper.ZooKeeper.getChildren(ZooKeeper.java:1468)
   [junit4]   2> 	at org.apache.solr.common.cloud.SolrZkClient$6.execute(SolrZkClient.java:235)
   [junit4]   2> 	at org.apache.solr.common.cloud.SolrZkClient$6.execute(SolrZkClient.java:232)
   [junit4]   2> 	at org.apache.solr.common.cloud.ZkCmdExecutor.retryOperation(ZkCmdExecutor.java:65)
   [junit4]   2> 	at org.apache.solr.common.cloud.SolrZkClient.getChildren(SolrZkClient.java:232)
   [junit4]   2> 	at org.apache.solr.cloud.LeaderElector.checkIfIamLeader(LeaderElector.java:84)
   [junit4]   2> 	at org.apache.solr.cloud.LeaderElector.access$000(LeaderElector.java:55)
   [junit4]   2> 	at org.apache.solr.cloud.LeaderElector$1.process(LeaderElector.java:129)
   [junit4]   2> 	at org.apache.zookeeper.ClientCnxn$EventThread.processEvent(ClientCnxn.java:519)
   [junit4]   2> 	at org.apache.zookeeper.ClientCnxn$EventThread.run(ClientCnxn.java:495)
   [junit4]   2> 
   [junit4]   2> NOTE: test params are: codec=Lucene40, sim=RandomSimilarityProvider(queryNorm=true,coord=yes): {}, locale=ca_ES, timezone=America/Port_of_Spain
   [junit4]   2> NOTE: FreeBSD 9.1-RELEASE-p3 amd64/Oracle Corporation 1.7.0_25 (64-bit)/cpus=16,threads=6,free=297466056,total=536870912
   [junit4]   2> NOTE: All tests run in this JVM: [TestBadConfig, TestFieldTypeResource, SolrIndexSplitterTest, TestStressVersions, TestFieldTypeCollectionResource, DistributedTermsComponentTest, TestDocumentBuilder, LegacyHTMLStripCharFilterTest, TestStressRecovery, TestLRUCache, ResourceLoaderTest, OverseerCollectionProcessorTest, AlternateDirectoryTest, TestShardHandlerFactory, TestFieldResource, LoggingHandlerTest, TestExtendedDismaxParser, DocumentBuilderTest, TestPluginEnable, TestSolrQueryParserResource, SimpleFacetsTest, PolyFieldTest, PrimitiveFieldTypeTest, CSVRequestHandlerTest, JsonLoaderTest, TestReplicationHandler, LeaderElectionTest, TestSolrIndexConfig, QueryParsingTest, TestMaxScoreQueryParser, TestLFUCache, CachingDirectoryFactoryTest, TestSweetSpotSimilarityFactory, FileBasedSpellCheckerTest, TestGroupingSearch, TestCharFilters, ScriptEngineTest, DateFieldTest, BasicDistributedZkTest, PeerSyncTest, StatelessScriptUpdateProcessorFactoryTest, TestXIncludeConfig, CacheHeaderTest, AddSchemaFieldsUpdateProcessorFactoryTest, MinimalSchemaTest, TestFastLRUCache, ParsingFieldUpdateProcessorsTest, InfoHandlerTest, SyncSliceTest, BasicFunctionalityTest, TermVectorComponentTest, RAMDirectoryFactoryTest, TestDocSet, SystemInfoHandlerTest, TestDynamicFieldCollectionResource, TestFastWriter, TestPerFieldSimilarity, DirectSolrConnectionTest, SpatialFilterTest, SoftAutoCommitTest, TestCloudManagedSchemaAddField, TestCoreContainer, QueryElevationComponentTest, BinaryUpdateRequestHandlerTest, QueryEqualityTest, BadComponentTest, TestValueSourceCache, TestSolrQueryParserDefaultOperatorResource, PluginInfoTest, TestTrie, TestPseudoReturnFields, SOLR749Test, SearchHandlerTest, DocValuesTest, SpellingQueryConverterTest, TestSolrQueryParser, UnloadDistributedZkTest, CollectionsAPIDistributedZkTest]
   [junit4] Completed on J0 in 154.63s, 1 test, 1 error <<< FAILURES!

[...truncated 490 lines...]
BUILD FAILED
/usr/home/hudson/hudson-slave/workspace/Lucene-Solr-Tests-trunk-Java7/build.xml:389: The following error occurred while executing this line:
/usr/home/hudson/hudson-slave/workspace/Lucene-Solr-Tests-trunk-Java7/build.xml:369: The following error occurred while executing this line:
/usr/home/hudson/hudson-slave/workspace/Lucene-Solr-Tests-trunk-Java7/build.xml:39: The following error occurred while executing this line:
/usr/home/hudson/hudson-slave/workspace/Lucene-Solr-Tests-trunk-Java7/solr/build.xml:181: The following error occurred while executing this line:
/usr/home/hudson/hudson-slave/workspace/Lucene-Solr-Tests-trunk-Java7/solr/common-build.xml:449: The following error occurred while executing this line:
/usr/home/hudson/hudson-slave/workspace/Lucene-Solr-Tests-trunk-Java7/lucene/common-build.xml:1230: The following error occurred while executing this line:
/usr/home/hudson/hudson-slave/workspace/Lucene-Solr-Tests-trunk-Java7/lucene/common-build.xml:873: There were test failures: 320 suites, 1345 tests, 1 error, 34 ignored (6 assumptions)

Total time: 54 minutes 35 seconds
Build step 'Invoke Ant' marked build as failure
Archiving artifacts
Recording test results
Email was triggered for: Failure
Sending email for trigger: Failure



Mime
View raw message