lucene-dev mailing list archives

Site index · List index
Message view « Date » · « Thread »
Top « Date » · « Thread »
From Policeman Jenkins Server <jenk...@thetaphi.de>
Subject [JENKINS] Lucene-Solr-trunk-Linux (32bit/jdk1.7.0_25) - Build # 6859 - Failure!
Date Sat, 03 Aug 2013 10:33:39 GMT
Build: http://jenkins.thetaphi.de/job/Lucene-Solr-trunk-Linux/6859/
Java: 32bit/jdk1.7.0_25 -client -XX:+UseConcMarkSweepGC

1 tests failed.
FAILED:  org.apache.solr.cloud.CollectionsAPIDistributedZkTest.testDistribSearch

Error Message:
Server refused connection at: http://127.0.0.1:34842/xbhli/mt

Stack Trace:
org.apache.solr.client.solrj.SolrServerException: Server refused connection at: http://127.0.0.1:34842/xbhli/mt
	at __randomizedtesting.SeedInfo.seed([B5C97EC598F7BBC1:342FF0DDEFA8DBFD]:0)
	at org.apache.solr.client.solrj.impl.HttpSolrServer.request(HttpSolrServer.java:428)
	at org.apache.solr.client.solrj.impl.HttpSolrServer.request(HttpSolrServer.java:180)
	at org.apache.solr.cloud.CollectionsAPIDistributedZkTest.testCustomCollectionsAPI(CollectionsAPIDistributedZkTest.java:764)
	at org.apache.solr.cloud.CollectionsAPIDistributedZkTest.doTest(CollectionsAPIDistributedZkTest.java:159)
	at org.apache.solr.BaseDistributedSearchTestCase.testDistribSearch(BaseDistributedSearchTestCase.java:835)
	at sun.reflect.NativeMethodAccessorImpl.invoke0(Native Method)
	at sun.reflect.NativeMethodAccessorImpl.invoke(NativeMethodAccessorImpl.java:57)
	at sun.reflect.DelegatingMethodAccessorImpl.invoke(DelegatingMethodAccessorImpl.java:43)
	at java.lang.reflect.Method.invoke(Method.java:606)
	at com.carrotsearch.randomizedtesting.RandomizedRunner.invoke(RandomizedRunner.java:1559)
	at com.carrotsearch.randomizedtesting.RandomizedRunner.access$600(RandomizedRunner.java:79)
	at com.carrotsearch.randomizedtesting.RandomizedRunner$6.evaluate(RandomizedRunner.java:737)
	at com.carrotsearch.randomizedtesting.RandomizedRunner$7.evaluate(RandomizedRunner.java:773)
	at com.carrotsearch.randomizedtesting.RandomizedRunner$8.evaluate(RandomizedRunner.java:787)
	at com.carrotsearch.randomizedtesting.rules.SystemPropertiesRestoreRule$1.evaluate(SystemPropertiesRestoreRule.java:53)
	at org.apache.lucene.util.TestRuleSetupTeardownChained$1.evaluate(TestRuleSetupTeardownChained.java:50)
	at org.apache.lucene.util.TestRuleFieldCacheSanity$1.evaluate(TestRuleFieldCacheSanity.java:51)
	at org.apache.lucene.util.AbstractBeforeAfterRule$1.evaluate(AbstractBeforeAfterRule.java:46)
	at com.carrotsearch.randomizedtesting.rules.SystemPropertiesInvariantRule$1.evaluate(SystemPropertiesInvariantRule.java:55)
	at org.apache.lucene.util.TestRuleThreadAndTestName$1.evaluate(TestRuleThreadAndTestName.java:49)
	at org.apache.lucene.util.TestRuleIgnoreAfterMaxFailures$1.evaluate(TestRuleIgnoreAfterMaxFailures.java:70)
	at org.apache.lucene.util.TestRuleMarkFailure$1.evaluate(TestRuleMarkFailure.java:48)
	at com.carrotsearch.randomizedtesting.rules.StatementAdapter.evaluate(StatementAdapter.java:36)
	at com.carrotsearch.randomizedtesting.ThreadLeakControl$StatementRunner.run(ThreadLeakControl.java:358)
	at com.carrotsearch.randomizedtesting.ThreadLeakControl.forkTimeoutingTask(ThreadLeakControl.java:782)
	at com.carrotsearch.randomizedtesting.ThreadLeakControl$3.evaluate(ThreadLeakControl.java:442)
	at com.carrotsearch.randomizedtesting.RandomizedRunner.runSingleTest(RandomizedRunner.java:746)
	at com.carrotsearch.randomizedtesting.RandomizedRunner$3.evaluate(RandomizedRunner.java:648)
	at com.carrotsearch.randomizedtesting.RandomizedRunner$4.evaluate(RandomizedRunner.java:682)
	at com.carrotsearch.randomizedtesting.RandomizedRunner$5.evaluate(RandomizedRunner.java:693)
	at com.carrotsearch.randomizedtesting.rules.StatementAdapter.evaluate(StatementAdapter.java:36)
	at com.carrotsearch.randomizedtesting.rules.SystemPropertiesRestoreRule$1.evaluate(SystemPropertiesRestoreRule.java:53)
	at org.apache.lucene.util.AbstractBeforeAfterRule$1.evaluate(AbstractBeforeAfterRule.java:46)
	at org.apache.lucene.util.TestRuleStoreClassName$1.evaluate(TestRuleStoreClassName.java:42)
	at com.carrotsearch.randomizedtesting.rules.SystemPropertiesInvariantRule$1.evaluate(SystemPropertiesInvariantRule.java:55)
	at com.carrotsearch.randomizedtesting.rules.NoShadowingOrOverridesOnMethodsRule$1.evaluate(NoShadowingOrOverridesOnMethodsRule.java:39)
	at com.carrotsearch.randomizedtesting.rules.NoShadowingOrOverridesOnMethodsRule$1.evaluate(NoShadowingOrOverridesOnMethodsRule.java:39)
	at com.carrotsearch.randomizedtesting.rules.StatementAdapter.evaluate(StatementAdapter.java:36)
	at org.apache.lucene.util.TestRuleAssertionsRequired$1.evaluate(TestRuleAssertionsRequired.java:43)
	at org.apache.lucene.util.TestRuleMarkFailure$1.evaluate(TestRuleMarkFailure.java:48)
	at org.apache.lucene.util.TestRuleIgnoreAfterMaxFailures$1.evaluate(TestRuleIgnoreAfterMaxFailures.java:70)
	at org.apache.lucene.util.TestRuleIgnoreTestSuites$1.evaluate(TestRuleIgnoreTestSuites.java:55)
	at com.carrotsearch.randomizedtesting.rules.StatementAdapter.evaluate(StatementAdapter.java:36)
	at com.carrotsearch.randomizedtesting.ThreadLeakControl$StatementRunner.run(ThreadLeakControl.java:358)
	at java.lang.Thread.run(Thread.java:724)
Caused by: org.apache.http.conn.HttpHostConnectException: Connection to http://127.0.0.1:34842 refused
	at org.apache.http.impl.conn.DefaultClientConnectionOperator.openConnection(DefaultClientConnectionOperator.java:190)
	at org.apache.http.impl.conn.ManagedClientConnectionImpl.open(ManagedClientConnectionImpl.java:294)
	at org.apache.http.impl.client.DefaultRequestDirector.tryConnect(DefaultRequestDirector.java:645)
	at org.apache.http.impl.client.DefaultRequestDirector.execute(DefaultRequestDirector.java:480)
	at org.apache.http.impl.client.AbstractHttpClient.execute(AbstractHttpClient.java:906)
	at org.apache.http.impl.client.AbstractHttpClient.execute(AbstractHttpClient.java:805)
	at org.apache.http.impl.client.AbstractHttpClient.execute(AbstractHttpClient.java:784)
	at org.apache.solr.client.solrj.impl.HttpSolrServer.request(HttpSolrServer.java:365)
	... 44 more
Caused by: java.net.ConnectException: Connection refused
	at java.net.PlainSocketImpl.socketConnect(Native Method)
	at java.net.AbstractPlainSocketImpl.doConnect(AbstractPlainSocketImpl.java:339)
	at java.net.AbstractPlainSocketImpl.connectToAddress(AbstractPlainSocketImpl.java:200)
	at java.net.AbstractPlainSocketImpl.connect(AbstractPlainSocketImpl.java:182)
	at java.net.SocksSocketImpl.connect(SocksSocketImpl.java:392)
	at java.net.Socket.connect(Socket.java:579)
	at org.apache.http.conn.scheme.PlainSocketFactory.connectSocket(PlainSocketFactory.java:127)
	at org.apache.http.impl.conn.DefaultClientConnectionOperator.openConnection(DefaultClientConnectionOperator.java:180)
	... 51 more




Build Log:
[...truncated 9821 lines...]
   [junit4] Suite: org.apache.solr.cloud.CollectionsAPIDistributedZkTest
   [junit4]   2> 797286 T3209 oas.BaseDistributedSearchTestCase.initHostContext Setting hostContext system property: /xbhli/mt
   [junit4]   2> 797289 T3209 oas.SolrTestCaseJ4.setUp ###Starting testDistribSearch
   [junit4]   2> Creating dataDir: /mnt/ssd/jenkins/workspace/Lucene-Solr-trunk-Linux/solr/build/solr-core/test/J0/./solrtest-CollectionsAPIDistributedZkTest-1375525420788
   [junit4]   2> 797290 T3209 oasc.ZkTestServer.run STARTING ZK TEST SERVER
   [junit4]   2> 797290 T3210 oasc.ZkTestServer$ZKServerMain.runFromConfig Starting server
   [junit4]   2> 797390 T3209 oasc.ZkTestServer.run start zk server on port:47617
   [junit4]   2> 797391 T3209 oascc.ConnectionManager.waitForConnected Waiting for client to connect to ZooKeeper
   [junit4]   2> 797469 T3216 oascc.ConnectionManager.process Watcher org.apache.solr.common.cloud.ConnectionManager@c21fab name:ZooKeeperConnection Watcher:127.0.0.1:47617 got event WatchedEvent state:SyncConnected type:None path:null path:null type:None
   [junit4]   2> 797469 T3209 oascc.ConnectionManager.waitForConnected Client is connected to ZooKeeper
   [junit4]   2> 797469 T3209 oascc.SolrZkClient.makePath makePath: /solr
   [junit4]   2> 797473 T3209 oascc.ConnectionManager.waitForConnected Waiting for client to connect to ZooKeeper
   [junit4]   2> 797474 T3218 oascc.ConnectionManager.process Watcher org.apache.solr.common.cloud.ConnectionManager@6f8101 name:ZooKeeperConnection Watcher:127.0.0.1:47617/solr got event WatchedEvent state:SyncConnected type:None path:null path:null type:None
   [junit4]   2> 797474 T3209 oascc.ConnectionManager.waitForConnected Client is connected to ZooKeeper
   [junit4]   2> 797474 T3209 oascc.SolrZkClient.makePath makePath: /collections/collection1
   [junit4]   2> 797476 T3209 oascc.SolrZkClient.makePath makePath: /collections/collection1/shards
   [junit4]   2> 797478 T3209 oascc.SolrZkClient.makePath makePath: /collections/control_collection
   [junit4]   2> 797479 T3209 oascc.SolrZkClient.makePath makePath: /collections/control_collection/shards
   [junit4]   2> 797482 T3209 oasc.AbstractZkTestCase.putConfig put /mnt/ssd/jenkins/workspace/Lucene-Solr-trunk-Linux/solr/build/solr-core/test-files/solr/collection1/conf/solrconfig-tlog.xml to /configs/conf1/solrconfig.xml
   [junit4]   2> 797482 T3209 oascc.SolrZkClient.makePath makePath: /configs/conf1/solrconfig.xml
   [junit4]   2> 797485 T3209 oasc.AbstractZkTestCase.putConfig put /mnt/ssd/jenkins/workspace/Lucene-Solr-trunk-Linux/solr/build/solr-core/test-files/solr/collection1/conf/schema.xml to /configs/conf1/schema.xml
   [junit4]   2> 797485 T3209 oascc.SolrZkClient.makePath makePath: /configs/conf1/schema.xml
   [junit4]   2> 797488 T3209 oasc.AbstractZkTestCase.putConfig put /mnt/ssd/jenkins/workspace/Lucene-Solr-trunk-Linux/solr/build/solr-core/test-files/solr/collection1/conf/stopwords.txt to /configs/conf1/stopwords.txt
   [junit4]   2> 797488 T3209 oascc.SolrZkClient.makePath makePath: /configs/conf1/stopwords.txt
   [junit4]   2> 797490 T3209 oasc.AbstractZkTestCase.putConfig put /mnt/ssd/jenkins/workspace/Lucene-Solr-trunk-Linux/solr/build/solr-core/test-files/solr/collection1/conf/protwords.txt to /configs/conf1/protwords.txt
   [junit4]   2> 797491 T3209 oascc.SolrZkClient.makePath makePath: /configs/conf1/protwords.txt
   [junit4]   2> 797492 T3209 oasc.AbstractZkTestCase.putConfig put /mnt/ssd/jenkins/workspace/Lucene-Solr-trunk-Linux/solr/build/solr-core/test-files/solr/collection1/conf/currency.xml to /configs/conf1/currency.xml
   [junit4]   2> 797492 T3209 oascc.SolrZkClient.makePath makePath: /configs/conf1/currency.xml
   [junit4]   2> 797494 T3209 oasc.AbstractZkTestCase.putConfig put /mnt/ssd/jenkins/workspace/Lucene-Solr-trunk-Linux/solr/build/solr-core/test-files/solr/collection1/conf/open-exchange-rates.json to /configs/conf1/open-exchange-rates.json
   [junit4]   2> 797495 T3209 oascc.SolrZkClient.makePath makePath: /configs/conf1/open-exchange-rates.json
   [junit4]   2> 797496 T3209 oasc.AbstractZkTestCase.putConfig put /mnt/ssd/jenkins/workspace/Lucene-Solr-trunk-Linux/solr/build/solr-core/test-files/solr/collection1/conf/mapping-ISOLatin1Accent.txt to /configs/conf1/mapping-ISOLatin1Accent.txt
   [junit4]   2> 797497 T3209 oascc.SolrZkClient.makePath makePath: /configs/conf1/mapping-ISOLatin1Accent.txt
   [junit4]   2> 797498 T3209 oasc.AbstractZkTestCase.putConfig put /mnt/ssd/jenkins/workspace/Lucene-Solr-trunk-Linux/solr/build/solr-core/test-files/solr/collection1/conf/old_synonyms.txt to /configs/conf1/old_synonyms.txt
   [junit4]   2> 797499 T3209 oascc.SolrZkClient.makePath makePath: /configs/conf1/old_synonyms.txt
   [junit4]   2> 797500 T3209 oasc.AbstractZkTestCase.putConfig put /mnt/ssd/jenkins/workspace/Lucene-Solr-trunk-Linux/solr/build/solr-core/test-files/solr/collection1/conf/synonyms.txt to /configs/conf1/synonyms.txt
   [junit4]   2> 797501 T3209 oascc.SolrZkClient.makePath makePath: /configs/conf1/synonyms.txt
   [junit4]   2> 797566 T3209 oejs.Server.doStart jetty-8.1.10.v20130312
   [junit4]   2> 797569 T3209 oejs.AbstractConnector.doStart Started SelectChannelConnector@127.0.0.1:41741
   [junit4]   2> 797569 T3209 oass.SolrDispatchFilter.init SolrDispatchFilter.init()
   [junit4]   2> 797569 T3209 oasc.SolrResourceLoader.locateSolrHome JNDI not configured for solr (NoInitialContextEx)
   [junit4]   2> 797570 T3209 oasc.SolrResourceLoader.locateSolrHome using system property solr.solr.home: /mnt/ssd/jenkins/workspace/Lucene-Solr-trunk-Linux/solr/build/solr-core/test/J0/./org.apache.solr.cloud.CollectionsAPIDistributedZkTest-controljetty-1375525421001
   [junit4]   2> 797570 T3209 oasc.SolrResourceLoader.<init> new SolrResourceLoader for directory: '/mnt/ssd/jenkins/workspace/Lucene-Solr-trunk-Linux/solr/build/solr-core/test/J0/./org.apache.solr.cloud.CollectionsAPIDistributedZkTest-controljetty-1375525421001/'
   [junit4]   2> 797590 T3209 oasc.ConfigSolr.fromFile Loading container configuration from /mnt/ssd/jenkins/workspace/Lucene-Solr-trunk-Linux/solr/build/solr-core/test/J0/./org.apache.solr.cloud.CollectionsAPIDistributedZkTest-controljetty-1375525421001/solr.xml
   [junit4]   2> 797627 T3209 oasc.ConfigSolrXml.<init> Config-defined core root directory: 
   [junit4]   2> 797628 T3209 oasc.CoreContainer.<init> New CoreContainer 20794386
   [junit4]   2> 797628 T3209 oasc.CoreContainer.load Loading cores into CoreContainer [instanceDir=/mnt/ssd/jenkins/workspace/Lucene-Solr-trunk-Linux/solr/build/solr-core/test/J0/./org.apache.solr.cloud.CollectionsAPIDistributedZkTest-controljetty-1375525421001/]
   [junit4]   2> 797629 T3209 oashc.HttpShardHandlerFactory.getParameter Setting socketTimeout to: 120000
   [junit4]   2> 797629 T3209 oashc.HttpShardHandlerFactory.getParameter Setting urlScheme to: http://
   [junit4]   2> 797630 T3209 oashc.HttpShardHandlerFactory.getParameter Setting connTimeout to: 15000
   [junit4]   2> 797630 T3209 oashc.HttpShardHandlerFactory.getParameter Setting maxConnectionsPerHost to: 20
   [junit4]   2> 797630 T3209 oashc.HttpShardHandlerFactory.getParameter Setting corePoolSize to: 0
   [junit4]   2> 797631 T3209 oashc.HttpShardHandlerFactory.getParameter Setting maximumPoolSize to: 2147483647
   [junit4]   2> 797631 T3209 oashc.HttpShardHandlerFactory.getParameter Setting maxThreadIdleTime to: 5
   [junit4]   2> 797631 T3209 oashc.HttpShardHandlerFactory.getParameter Setting sizeOfQueue to: -1
   [junit4]   2> 797631 T3209 oashc.HttpShardHandlerFactory.getParameter Setting fairnessPolicy to: false
   [junit4]   2> 797632 T3209 oascsi.HttpClientUtil.createClient Creating new http client, config:maxConnectionsPerHost=20&maxConnections=10000&socketTimeout=120000&connTimeout=15000&retry=false
   [junit4]   2> 797635 T3209 oasc.ZkContainer.initZooKeeper Zookeeper client=127.0.0.1:47617/solr
   [junit4]   2> 797635 T3209 oasc.ZkController.checkChrootPath zkHost includes chroot
   [junit4]   2> 797636 T3209 oascc.ConnectionManager.waitForConnected Waiting for client to connect to ZooKeeper
   [junit4]   2> 797637 T3229 oascc.ConnectionManager.process Watcher org.apache.solr.common.cloud.ConnectionManager@1d4fe5a name:ZooKeeperConnection Watcher:127.0.0.1:47617 got event WatchedEvent state:SyncConnected type:None path:null path:null type:None
   [junit4]   2> 797637 T3209 oascc.ConnectionManager.waitForConnected Client is connected to ZooKeeper
   [junit4]   2> 797638 T3209 oascsi.HttpClientUtil.createClient Creating new http client, config:maxConnections=500&maxConnectionsPerHost=16&socketTimeout=120000&connTimeout=15000
   [junit4]   2> 797641 T3209 oascc.ConnectionManager.waitForConnected Waiting for client to connect to ZooKeeper
   [junit4]   2> 797642 T3231 oascc.ConnectionManager.process Watcher org.apache.solr.common.cloud.ConnectionManager@6c536e name:ZooKeeperConnection Watcher:127.0.0.1:47617/solr got event WatchedEvent state:SyncConnected type:None path:null path:null type:None
   [junit4]   2> 797642 T3209 oascc.ConnectionManager.waitForConnected Client is connected to ZooKeeper
   [junit4]   2> 797644 T3209 oascc.SolrZkClient.makePath makePath: /overseer/queue
   [junit4]   2> 797646 T3209 oascc.SolrZkClient.makePath makePath: /overseer/collection-queue-work
   [junit4]   2> 797648 T3209 oascc.SolrZkClient.makePath makePath: /live_nodes
   [junit4]   2> 797649 T3209 oasc.ZkController.createEphemeralLiveNode Register node as live in ZooKeeper:/live_nodes/127.0.0.1:41741_xbhli%2Fmt
   [junit4]   2> 797650 T3209 oascc.SolrZkClient.makePath makePath: /live_nodes/127.0.0.1:41741_xbhli%2Fmt
   [junit4]   2> 797653 T3209 oascc.SolrZkClient.makePath makePath: /overseer_elect/election
   [junit4]   2> 797657 T3209 oascc.SolrZkClient.makePath makePath: /overseer_elect/leader
   [junit4]   2> 797658 T3209 oasc.Overseer.start Overseer (id=90146433976893443-127.0.0.1:41741_xbhli%2Fmt-n_0000000000) starting
   [junit4]   2> 797660 T3209 oascc.SolrZkClient.makePath makePath: /overseer/queue-work
   [junit4]   2> 797663 T3233 oasc.OverseerCollectionProcessor.run Process current queue of collection creations
   [junit4]   2> 797663 T3209 oascc.SolrZkClient.makePath makePath: /clusterstate.json
   [junit4]   2> 797665 T3209 oascc.SolrZkClient.makePath makePath: /aliases.json
   [junit4]   2> 797666 T3209 oascc.ZkStateReader.createClusterStateWatchersAndUpdate Updating cluster state from ZooKeeper... 
   [junit4]   2> 797668 T3232 oasc.Overseer$ClusterStateUpdater.run Starting to work on the main queue
   [junit4]   2> 797669 T3209 oasc.CorePropertiesLocator.discover Looking for core definitions underneath /mnt/ssd/jenkins/workspace/Lucene-Solr-trunk-Linux/solr/build/solr-core/test/J0/./org.apache.solr.cloud.CollectionsAPIDistributedZkTest-controljetty-1375525421001
   [junit4]   2> 797698 T3209 oasc.CorePropertiesLocator.discoverUnder Found core conf in /mnt/ssd/jenkins/workspace/Lucene-Solr-trunk-Linux/solr/build/solr-core/test/J0/./org.apache.solr.cloud.CollectionsAPIDistributedZkTest-controljetty-1375525421001/conf/
   [junit4]   2> 797698 T3209 oasc.CorePropertiesLocator.discover Found 1 core definitions
   [junit4]   2> 797699 T3209 oass.SolrDispatchFilter.init user.dir=/mnt/ssd/jenkins/workspace/Lucene-Solr-trunk-Linux/solr/build/solr-core/test/J0
   [junit4]   2> 797699 T3209 oass.SolrDispatchFilter.init SolrDispatchFilter.init() done
   [junit4]   2> 797699 T3209 oascsi.HttpClientUtil.createClient Creating new http client, config:maxConnections=128&maxConnectionsPerHost=32&followRedirects=false
   [junit4]   2> 797702 T3209 oascsi.HttpClientUtil.createClient Creating new http client, config:
   [junit4]   2> 797703 T3209 oascc.ConnectionManager.waitForConnected Waiting for client to connect to ZooKeeper
   [junit4]   2> 797705 T3236 oascc.ConnectionManager.process Watcher org.apache.solr.common.cloud.ConnectionManager@1739c56 name:ZooKeeperConnection Watcher:127.0.0.1:47617/solr got event WatchedEvent state:SyncConnected type:None path:null path:null type:None
   [junit4]   2> 797705 T3209 oascc.ConnectionManager.waitForConnected Client is connected to ZooKeeper
   [junit4]   2> 797706 T3209 oascc.ZkStateReader.createClusterStateWatchersAndUpdate Updating cluster state from ZooKeeper... 
   [junit4]   2> 797708 T3209 oasc.ChaosMonkey.monkeyLog monkey: init - expire sessions:true cause connection loss:true
   [junit4]   2> 797769 T3209 oejs.Server.doStart jetty-8.1.10.v20130312
   [junit4]   2> 797771 T3209 oejs.AbstractConnector.doStart Started SelectChannelConnector@127.0.0.1:34842
   [junit4]   2> 797771 T3209 oass.SolrDispatchFilter.init SolrDispatchFilter.init()
   [junit4]   2> 797772 T3209 oasc.SolrResourceLoader.locateSolrHome JNDI not configured for solr (NoInitialContextEx)
   [junit4]   2> 797772 T3209 oasc.SolrResourceLoader.locateSolrHome using system property solr.solr.home: /mnt/ssd/jenkins/workspace/Lucene-Solr-trunk-Linux/solr/build/solr-core/test/J0/./org.apache.solr.cloud.CollectionsAPIDistributedZkTest-jetty1-1375525421206
   [junit4]   2> 797772 T3209 oasc.SolrResourceLoader.<init> new SolrResourceLoader for directory: '/mnt/ssd/jenkins/workspace/Lucene-Solr-trunk-Linux/solr/build/solr-core/test/J0/./org.apache.solr.cloud.CollectionsAPIDistributedZkTest-jetty1-1375525421206/'
   [junit4]   2> 797784 T3209 oasc.ConfigSolr.fromFile Loading container configuration from /mnt/ssd/jenkins/workspace/Lucene-Solr-trunk-Linux/solr/build/solr-core/test/J0/./org.apache.solr.cloud.CollectionsAPIDistributedZkTest-jetty1-1375525421206/solr.xml
   [junit4]   2> 797825 T3209 oasc.ConfigSolrXml.<init> Config-defined core root directory: 
   [junit4]   2> 797826 T3209 oasc.CoreContainer.<init> New CoreContainer 27019522
   [junit4]   2> 797826 T3209 oasc.CoreContainer.load Loading cores into CoreContainer [instanceDir=/mnt/ssd/jenkins/workspace/Lucene-Solr-trunk-Linux/solr/build/solr-core/test/J0/./org.apache.solr.cloud.CollectionsAPIDistributedZkTest-jetty1-1375525421206/]
   [junit4]   2> 797827 T3209 oashc.HttpShardHandlerFactory.getParameter Setting socketTimeout to: 120000
   [junit4]   2> 797828 T3209 oashc.HttpShardHandlerFactory.getParameter Setting urlScheme to: http://
   [junit4]   2> 797828 T3209 oashc.HttpShardHandlerFactory.getParameter Setting connTimeout to: 15000
   [junit4]   2> 797828 T3209 oashc.HttpShardHandlerFactory.getParameter Setting maxConnectionsPerHost to: 20
   [junit4]   2> 797828 T3209 oashc.HttpShardHandlerFactory.getParameter Setting corePoolSize to: 0
   [junit4]   2> 797829 T3209 oashc.HttpShardHandlerFactory.getParameter Setting maximumPoolSize to: 2147483647
   [junit4]   2> 797829 T3209 oashc.HttpShardHandlerFactory.getParameter Setting maxThreadIdleTime to: 5
   [junit4]   2> 797829 T3209 oashc.HttpShardHandlerFactory.getParameter Setting sizeOfQueue to: -1
   [junit4]   2> 797830 T3209 oashc.HttpShardHandlerFactory.getParameter Setting fairnessPolicy to: false
   [junit4]   2> 797830 T3209 oascsi.HttpClientUtil.createClient Creating new http client, config:maxConnectionsPerHost=20&maxConnections=10000&socketTimeout=120000&connTimeout=15000&retry=false
   [junit4]   2> 797833 T3209 oasc.ZkContainer.initZooKeeper Zookeeper client=127.0.0.1:47617/solr
   [junit4]   2> 797833 T3209 oasc.ZkController.checkChrootPath zkHost includes chroot
   [junit4]   2> 797834 T3209 oascc.ConnectionManager.waitForConnected Waiting for client to connect to ZooKeeper
   [junit4]   2> 797835 T3247 oascc.ConnectionManager.process Watcher org.apache.solr.common.cloud.ConnectionManager@662714 name:ZooKeeperConnection Watcher:127.0.0.1:47617 got event WatchedEvent state:SyncConnected type:None path:null path:null type:None
   [junit4]   2> 797835 T3209 oascc.ConnectionManager.waitForConnected Client is connected to ZooKeeper
   [junit4]   2> 797837 T3209 oascsi.HttpClientUtil.createClient Creating new http client, config:maxConnections=500&maxConnectionsPerHost=16&socketTimeout=120000&connTimeout=15000
   [junit4]   2> 797840 T3209 oascc.ConnectionManager.waitForConnected Waiting for client to connect to ZooKeeper
   [junit4]   2> 797841 T3249 oascc.ConnectionManager.process Watcher org.apache.solr.common.cloud.ConnectionManager@1a43179 name:ZooKeeperConnection Watcher:127.0.0.1:47617/solr got event WatchedEvent state:SyncConnected type:None path:null path:null type:None
   [junit4]   2> 797841 T3209 oascc.ConnectionManager.waitForConnected Client is connected to ZooKeeper
   [junit4]   2> 797844 T3209 oascc.ZkStateReader.createClusterStateWatchersAndUpdate Updating cluster state from ZooKeeper... 
   [junit4]   2> 798846 T3209 oasc.ZkController.createEphemeralLiveNode Register node as live in ZooKeeper:/live_nodes/127.0.0.1:34842_xbhli%2Fmt
   [junit4]   2> 798848 T3209 oascc.SolrZkClient.makePath makePath: /live_nodes/127.0.0.1:34842_xbhli%2Fmt
   [junit4]   2> 798851 T3236 oascc.ZkStateReader$3.process Updating live nodes... (2)
   [junit4]   2> 798851 T3249 oascc.ZkStateReader$3.process Updating live nodes... (2)
   [junit4]   2> 798851 T3231 oascc.ZkStateReader$3.process Updating live nodes... (2)
   [junit4]   2> 798857 T3209 oasc.CorePropertiesLocator.discover Looking for core definitions underneath /mnt/ssd/jenkins/workspace/Lucene-Solr-trunk-Linux/solr/build/solr-core/test/J0/./org.apache.solr.cloud.CollectionsAPIDistributedZkTest-jetty1-1375525421206
   [junit4]   2> 798882 T3209 oasc.CorePropertiesLocator.discoverUnder Found core conf in /mnt/ssd/jenkins/workspace/Lucene-Solr-trunk-Linux/solr/build/solr-core/test/J0/./org.apache.solr.cloud.CollectionsAPIDistributedZkTest-jetty1-1375525421206/conf/
   [junit4]   2> 798882 T3209 oasc.CorePropertiesLocator.discover Found 1 core definitions
   [junit4]   2> 798883 T3209 oass.SolrDispatchFilter.init user.dir=/mnt/ssd/jenkins/workspace/Lucene-Solr-trunk-Linux/solr/build/solr-core/test/J0
   [junit4]   2> 798883 T3209 oass.SolrDispatchFilter.init SolrDispatchFilter.init() done
   [junit4]   2> 798883 T3209 oascsi.HttpClientUtil.createClient Creating new http client, config:maxConnections=128&maxConnectionsPerHost=32&followRedirects=false
   [junit4]   2> 798961 T3209 oejs.Server.doStart jetty-8.1.10.v20130312
   [junit4]   2> 798963 T3209 oejs.AbstractConnector.doStart Started SelectChannelConnector@127.0.0.1:48120
   [junit4]   2> 798964 T3209 oass.SolrDispatchFilter.init SolrDispatchFilter.init()
   [junit4]   2> 798964 T3209 oasc.SolrResourceLoader.locateSolrHome JNDI not configured for solr (NoInitialContextEx)
   [junit4]   2> 798964 T3209 oasc.SolrResourceLoader.locateSolrHome using system property solr.solr.home: /mnt/ssd/jenkins/workspace/Lucene-Solr-trunk-Linux/solr/build/solr-core/test/J0/./org.apache.solr.cloud.CollectionsAPIDistributedZkTest-jetty2-1375525422384
   [junit4]   2> 798965 T3209 oasc.SolrResourceLoader.<init> new SolrResourceLoader for directory: '/mnt/ssd/jenkins/workspace/Lucene-Solr-trunk-Linux/solr/build/solr-core/test/J0/./org.apache.solr.cloud.CollectionsAPIDistributedZkTest-jetty2-1375525422384/'
   [junit4]   2> 798977 T3209 oasc.ConfigSolr.fromFile Loading container configuration from /mnt/ssd/jenkins/workspace/Lucene-Solr-trunk-Linux/solr/build/solr-core/test/J0/./org.apache.solr.cloud.CollectionsAPIDistributedZkTest-jetty2-1375525422384/solr.xml
   [junit4]   2> 799022 T3209 oasc.ConfigSolrXml.<init> Config-defined core root directory: 
   [junit4]   2> 799023 T3209 oasc.CoreContainer.<init> New CoreContainer 28320784
   [junit4]   2> 799023 T3209 oasc.CoreContainer.load Loading cores into CoreContainer [instanceDir=/mnt/ssd/jenkins/workspace/Lucene-Solr-trunk-Linux/solr/build/solr-core/test/J0/./org.apache.solr.cloud.CollectionsAPIDistributedZkTest-jetty2-1375525422384/]
   [junit4]   2> 799024 T3209 oashc.HttpShardHandlerFactory.getParameter Setting socketTimeout to: 120000
   [junit4]   2> 799024 T3209 oashc.HttpShardHandlerFactory.getParameter Setting urlScheme to: http://
   [junit4]   2> 799025 T3209 oashc.HttpShardHandlerFactory.getParameter Setting connTimeout to: 15000
   [junit4]   2> 799025 T3209 oashc.HttpShardHandlerFactory.getParameter Setting maxConnectionsPerHost to: 20
   [junit4]   2> 799025 T3209 oashc.HttpShardHandlerFactory.getParameter Setting corePoolSize to: 0
   [junit4]   2> 799026 T3209 oashc.HttpShardHandlerFactory.getParameter Setting maximumPoolSize to: 2147483647
   [junit4]   2> 799026 T3209 oashc.HttpShardHandlerFactory.getParameter Setting maxThreadIdleTime to: 5
   [junit4]   2> 799026 T3209 oashc.HttpShardHandlerFactory.getParameter Setting sizeOfQueue to: -1
   [junit4]   2> 799027 T3209 oashc.HttpShardHandlerFactory.getParameter Setting fairnessPolicy to: false
   [junit4]   2> 799027 T3209 oascsi.HttpClientUtil.createClient Creating new http client, config:maxConnectionsPerHost=20&maxConnections=10000&socketTimeout=120000&connTimeout=15000&retry=false
   [junit4]   2> 799030 T3209 oasc.ZkContainer.initZooKeeper Zookeeper client=127.0.0.1:47617/solr
   [junit4]   2> 799030 T3209 oasc.ZkController.checkChrootPath zkHost includes chroot
   [junit4]   2> 799031 T3209 oascc.ConnectionManager.waitForConnected Waiting for client to connect to ZooKeeper
   [junit4]   2> 799032 T3261 oascc.ConnectionManager.process Watcher org.apache.solr.common.cloud.ConnectionManager@1d51528 name:ZooKeeperConnection Watcher:127.0.0.1:47617 got event WatchedEvent state:SyncConnected type:None path:null path:null type:None
   [junit4]   2> 799032 T3209 oascc.ConnectionManager.waitForConnected Client is connected to ZooKeeper
   [junit4]   2> 799034 T3209 oascsi.HttpClientUtil.createClient Creating new http client, config:maxConnections=500&maxConnectionsPerHost=16&socketTimeout=120000&connTimeout=15000
   [junit4]   2> 799037 T3209 oascc.ConnectionManager.waitForConnected Waiting for client to connect to ZooKeeper
   [junit4]   2> 799038 T3263 oascc.ConnectionManager.process Watcher org.apache.solr.common.cloud.ConnectionManager@11cee5c name:ZooKeeperConnection Watcher:127.0.0.1:47617/solr got event WatchedEvent state:SyncConnected type:None path:null path:null type:None
   [junit4]   2> 799038 T3209 oascc.ConnectionManager.waitForConnected Client is connected to ZooKeeper
   [junit4]   2> 799041 T3209 oascc.ZkStateReader.createClusterStateWatchersAndUpdate Updating cluster state from ZooKeeper... 
   [junit4]   2> 800043 T3209 oasc.ZkController.createEphemeralLiveNode Register node as live in ZooKeeper:/live_nodes/127.0.0.1:48120_xbhli%2Fmt
   [junit4]   2> 800044 T3209 oascc.SolrZkClient.makePath makePath: /live_nodes/127.0.0.1:48120_xbhli%2Fmt
   [junit4]   2> 800047 T3249 oascc.ZkStateReader$3.process Updating live nodes... (3)
   [junit4]   2> 800047 T3231 oascc.ZkStateReader$3.process Updating live nodes... (3)
   [junit4]   2> 800047 T3263 oascc.ZkStateReader$3.process Updating live nodes... (3)
   [junit4]   2> 800048 T3236 oascc.ZkStateReader$3.process Updating live nodes... (3)
   [junit4]   2> 800052 T3209 oasc.CorePropertiesLocator.discover Looking for core definitions underneath /mnt/ssd/jenkins/workspace/Lucene-Solr-trunk-Linux/solr/build/solr-core/test/J0/./org.apache.solr.cloud.CollectionsAPIDistributedZkTest-jetty2-1375525422384
   [junit4]   2> 800079 T3209 oasc.CorePropertiesLocator.discoverUnder Found core conf in /mnt/ssd/jenkins/workspace/Lucene-Solr-trunk-Linux/solr/build/solr-core/test/J0/./org.apache.solr.cloud.CollectionsAPIDistributedZkTest-jetty2-1375525422384/conf/
   [junit4]   2> 800080 T3209 oasc.CorePropertiesLocator.discover Found 1 core definitions
   [junit4]   2> 800080 T3209 oass.SolrDispatchFilter.init user.dir=/mnt/ssd/jenkins/workspace/Lucene-Solr-trunk-Linux/solr/build/solr-core/test/J0
   [junit4]   2> 800081 T3209 oass.SolrDispatchFilter.init SolrDispatchFilter.init() done
   [junit4]   2> 800081 T3209 oascsi.HttpClientUtil.createClient Creating new http client, config:maxConnections=128&maxConnectionsPerHost=32&followRedirects=false
   [junit4]   2> 800150 T3209 oejs.Server.doStart jetty-8.1.10.v20130312
   [junit4]   2> 800152 T3209 oejs.AbstractConnector.doStart Started SelectChannelConnector@127.0.0.1:50033
   [junit4]   2> 800152 T3209 oass.SolrDispatchFilter.init SolrDispatchFilter.init()
   [junit4]   2> 800153 T3209 oasc.SolrResourceLoader.locateSolrHome JNDI not configured for solr (NoInitialContextEx)
   [junit4]   2> 800153 T3209 oasc.SolrResourceLoader.locateSolrHome using system property solr.solr.home: /mnt/ssd/jenkins/workspace/Lucene-Solr-trunk-Linux/solr/build/solr-core/test/J0/./org.apache.solr.cloud.CollectionsAPIDistributedZkTest-jetty3-1375525423582
   [junit4]   2> 800153 T3209 oasc.SolrResourceLoader.<init> new SolrResourceLoader for directory: '/mnt/ssd/jenkins/workspace/Lucene-Solr-trunk-Linux/solr/build/solr-core/test/J0/./org.apache.solr.cloud.CollectionsAPIDistributedZkTest-jetty3-1375525423582/'
   [junit4]   2> 800165 T3209 oasc.ConfigSolr.fromFile Loading container configuration from /mnt/ssd/jenkins/workspace/Lucene-Solr-trunk-Linux/solr/build/solr-core/test/J0/./org.apache.solr.cloud.CollectionsAPIDistributedZkTest-jetty3-1375525423582/solr.xml
   [junit4]   2> 800209 T3209 oasc.ConfigSolrXml.<init> Config-defined core root directory: 
   [junit4]   2> 800210 T3209 oasc.CoreContainer.<init> New CoreContainer 9249564
   [junit4]   2> 800210 T3209 oasc.CoreContainer.load Loading cores into CoreContainer [instanceDir=/mnt/ssd/jenkins/workspace/Lucene-Solr-trunk-Linux/solr/build/solr-core/test/J0/./org.apache.solr.cloud.CollectionsAPIDistributedZkTest-jetty3-1375525423582/]
   [junit4]   2> 800211 T3209 oashc.HttpShardHandlerFactory.getParameter Setting socketTimeout to: 120000
   [junit4]   2> 800211 T3209 oashc.HttpShardHandlerFactory.getParameter Setting urlScheme to: http://
   [junit4]   2> 800212 T3209 oashc.HttpShardHandlerFactory.getParameter Setting connTimeout to: 15000
   [junit4]   2> 800212 T3209 oashc.HttpShardHandlerFactory.getParameter Setting maxConnectionsPerHost to: 20
   [junit4]   2> 800212 T3209 oashc.HttpShardHandlerFactory.getParameter Setting corePoolSize to: 0
   [junit4]   2> 800213 T3209 oashc.HttpShardHandlerFactory.getParameter Setting maximumPoolSize to: 2147483647
   [junit4]   2> 800213 T3209 oashc.HttpShardHandlerFactory.getParameter Setting maxThreadIdleTime to: 5
   [junit4]   2> 800213 T3209 oashc.HttpShardHandlerFactory.getParameter Setting sizeOfQueue to: -1
   [junit4]   2> 800213 T3209 oashc.HttpShardHandlerFactory.getParameter Setting fairnessPolicy to: false
   [junit4]   2> 800214 T3209 oascsi.HttpClientUtil.createClient Creating new http client, config:maxConnectionsPerHost=20&maxConnections=10000&socketTimeout=120000&connTimeout=15000&retry=false
   [junit4]   2> 800217 T3209 oasc.ZkContainer.initZooKeeper Zookeeper client=127.0.0.1:47617/solr
   [junit4]   2> 800217 T3209 oasc.ZkController.checkChrootPath zkHost includes chroot
   [junit4]   2> 800218 T3209 oascc.ConnectionManager.waitForConnected Waiting for client to connect to ZooKeeper
   [junit4]   2> 800219 T3275 oascc.ConnectionManager.process Watcher org.apache.solr.common.cloud.ConnectionManager@d622ce name:ZooKeeperConnection Watcher:127.0.0.1:47617 got event WatchedEvent state:SyncConnected type:None path:null path:null type:None
   [junit4]   2> 800219 T3209 oascc.ConnectionManager.waitForConnected Client is connected to ZooKeeper
   [junit4]   2> 800220 T3209 oascsi.HttpClientUtil.createClient Creating new http client, config:maxConnections=500&maxConnectionsPerHost=16&socketTimeout=120000&connTimeout=15000
   [junit4]   2> 800223 T3209 oascc.ConnectionManager.waitForConnected Waiting for client to connect to ZooKeeper
   [junit4]   2> 800224 T3277 oascc.ConnectionManager.process Watcher org.apache.solr.common.cloud.ConnectionManager@43d61 name:ZooKeeperConnection Watcher:127.0.0.1:47617/solr got event WatchedEvent state:SyncConnected type:None path:null path:null type:None
   [junit4]   2> 800224 T3209 oascc.ConnectionManager.waitForConnected Client is connected to ZooKeeper
   [junit4]   2> 800226 T3209 oascc.ZkStateReader.createClusterStateWatchersAndUpdate Updating cluster state from ZooKeeper... 
   [junit4]   2> 801228 T3209 oasc.ZkController.createEphemeralLiveNode Register node as live in ZooKeeper:/live_nodes/127.0.0.1:50033_xbhli%2Fmt
   [junit4]   2> 801230 T3209 oascc.SolrZkClient.makePath makePath: /live_nodes/127.0.0.1:50033_xbhli%2Fmt
   [junit4]   2> 801233 T3249 oascc.ZkStateReader$3.process Updating live nodes... (4)
   [junit4]   2> 801234 T3236 oascc.ZkStateReader$3.process Updating live nodes... (4)
   [junit4]   2> 801234 T3263 oascc.ZkStateReader$3.process Updating live nodes... (4)
   [junit4]   2> 801234 T3231 oascc.ZkStateReader$3.process Updating live nodes... (4)
   [junit4]   2> 801234 T3277 oascc.ZkStateReader$3.process Updating live nodes... (4)
   [junit4]   2> 801238 T3209 oasc.CorePropertiesLocator.discover Looking for core definitions underneath /mnt/ssd/jenkins/workspace/Lucene-Solr-trunk-Linux/solr/build/solr-core/test/J0/./org.apache.solr.cloud.CollectionsAPIDistributedZkTest-jetty3-1375525423582
   [junit4]   2> 801264 T3209 oasc.CorePropertiesLocator.discoverUnder Found core conf in /mnt/ssd/jenkins/workspace/Lucene-Solr-trunk-Linux/solr/build/solr-core/test/J0/./org.apache.solr.cloud.CollectionsAPIDistributedZkTest-jetty3-1375525423582/conf/
   [junit4]   2> 801265 T3209 oasc.CorePropertiesLocator.discover Found 1 core definitions
   [junit4]   2> 801266 T3209 oass.SolrDispatchFilter.init user.dir=/mnt/ssd/jenkins/workspace/Lucene-Solr-trunk-Linux/solr/build/solr-core/test/J0
   [junit4]   2> 801266 T3209 oass.SolrDispatchFilter.init SolrDispatchFilter.init() done
   [junit4]   2> 801266 T3209 oascsi.HttpClientUtil.createClient Creating new http client, config:maxConnections=128&maxConnectionsPerHost=32&followRedirects=false
   [junit4]   2> 801333 T3209 oejs.Server.doStart jetty-8.1.10.v20130312
   [junit4]   2> 801335 T3209 oejs.AbstractConnector.doStart Started SelectChannelConnector@127.0.0.1:34487
   [junit4]   2> 801336 T3209 oass.SolrDispatchFilter.init SolrDispatchFilter.init()
   [junit4]   2> 801336 T3209 oasc.SolrResourceLoader.locateSolrHome JNDI not configured for solr (NoInitialContextEx)
   [junit4]   2> 801336 T3209 oasc.SolrResourceLoader.locateSolrHome using system property solr.solr.home: /mnt/ssd/jenkins/workspace/Lucene-Solr-trunk-Linux/solr/build/solr-core/test/J0/./org.apache.solr.cloud.CollectionsAPIDistributedZkTest-jetty4-1375525424767
   [junit4]   2> 801337 T3209 oasc.SolrResourceLoader.<init> new SolrResourceLoader for directory: '/mnt/ssd/jenkins/workspace/Lucene-Solr-trunk-Linux/solr/build/solr-core/test/J0/./org.apache.solr.cloud.CollectionsAPIDistributedZkTest-jetty4-1375525424767/'
   [junit4]   2> 801349 T3209 oasc.ConfigSolr.fromFile Loading container configuration from /mnt/ssd/jenkins/workspace/Lucene-Solr-trunk-Linux/solr/build/solr-core/test/J0/./org.apache.solr.cloud.CollectionsAPIDistributedZkTest-jetty4-1375525424767/solr.xml
   [junit4]   2> 801392 T3209 oasc.ConfigSolrXml.<init> Config-defined core root directory: 
   [junit4]   2> 801392 T3209 oasc.CoreContainer.<init> New CoreContainer 21539342
   [junit4]   2> 801393 T3209 oasc.CoreContainer.load Loading cores into CoreContainer [instanceDir=/mnt/ssd/jenkins/workspace/Lucene-Solr-trunk-Linux/solr/build/solr-core/test/J0/./org.apache.solr.cloud.CollectionsAPIDistributedZkTest-jetty4-1375525424767/]
   [junit4]   2> 801394 T3209 oashc.HttpShardHandlerFactory.getParameter Setting socketTimeout to: 120000
   [junit4]   2> 801394 T3209 oashc.HttpShardHandlerFactory.getParameter Setting urlScheme to: http://
   [junit4]   2> 801394 T3209 oashc.HttpShardHandlerFactory.getParameter Setting connTimeout to: 15000
   [junit4]   2> 801395 T3209 oashc.HttpShardHandlerFactory.getParameter Setting maxConnectionsPerHost to: 20
   [junit4]   2> 801395 T3209 oashc.HttpShardHandlerFactory.getParameter Setting corePoolSize to: 0
   [junit4]   2> 801395 T3209 oashc.HttpShardHandlerFactory.getParameter Setting maximumPoolSize to: 2147483647
   [junit4]   2> 801395 T3209 oashc.HttpShardHandlerFactory.getParameter Setting maxThreadIdleTime to: 5
   [junit4]   2> 801396 T3209 oashc.HttpShardHandlerFactory.getParameter Setting sizeOfQueue to: -1
   [junit4]   2> 801396 T3209 oashc.HttpShardHandlerFactory.getParameter Setting fairnessPolicy to: false
   [junit4]   2> 801396 T3209 oascsi.HttpClientUtil.createClient Creating new http client, config:maxConnectionsPerHost=20&maxConnections=10000&socketTimeout=120000&connTimeout=15000&retry=false
   [junit4]   2> 801399 T3209 oasc.ZkContainer.initZooKeeper Zookeeper client=127.0.0.1:47617/solr
   [junit4]   2> 801400 T3209 oasc.ZkController.checkChrootPath zkHost includes chroot
   [junit4]   2> 801400 T3209 oascc.ConnectionManager.waitForConnected Waiting for client to connect to ZooKeeper
   [junit4]   2> 801402 T3289 oascc.ConnectionManager.process Watcher org.apache.solr.common.cloud.ConnectionManager@1f65570 name:ZooKeeperConnection Watcher:127.0.0.1:47617 got event WatchedEvent state:SyncConnected type:None path:null path:null type:None
   [junit4]   2> 801402 T3209 oascc.ConnectionManager.waitForConnected Client is connected to ZooKeeper
   [junit4]   2> 801403 T3209 oascsi.HttpClientUtil.createClient Creating new http client, config:maxConnections=500&maxConnectionsPerHost=16&socketTimeout=120000&connTimeout=15000
   [junit4]   2> 801406 T3209 oascc.ConnectionManager.waitForConnected Waiting for client to connect to ZooKeeper
   [junit4]   2> 801407 T3291 oascc.ConnectionManager.process Watcher org.apache.solr.common.cloud.ConnectionManager@1be89d4 name:ZooKeeperConnection Watcher:127.0.0.1:47617/solr got event WatchedEvent state:SyncConnected type:None path:null path:null type:None
   [junit4]   2> 801407 T3209 oascc.ConnectionManager.waitForConnected Client is connected to ZooKeeper
   [junit4]   2> 801410 T3209 oascc.ZkStateReader.createClusterStateWatchersAndUpdate Updating cluster state from ZooKeeper... 
   [junit4]   2> 802413 T3209 oasc.ZkController.createEphemeralLiveNode Register node as live in ZooKeeper:/live_nodes/127.0.0.1:34487_xbhli%2Fmt
   [junit4]   2> 802414 T3209 oascc.SolrZkClient.makePath makePath: /live_nodes/127.0.0.1:34487_xbhli%2Fmt
   [junit4]   2> 802417 T3263 oascc.ZkStateReader$3.process Updating live nodes... (5)
   [junit4]   2> 802417 T3236 oascc.ZkStateReader$3.process Updating live nodes... (5)
   [junit4]   2> 802417 T3277 oascc.ZkStateReader$3.process Updating live nodes... (5)
   [junit4]   2> 802417 T3249 oascc.ZkStateReader$3.process Updating live nodes... (5)
   [junit4]   2> 802418 T3231 oascc.ZkStateReader$3.process Updating live nodes... (5)
   [junit4]   2> 802418 T3291 oascc.ZkStateReader$3.process Updating live nodes... (5)
   [junit4]   2> 802423 T3209 oasc.CorePropertiesLocator.discover Looking for core definitions underneath /mnt/ssd/jenkins/workspace/Lucene-Solr-trunk-Linux/solr/build/solr-core/test/J0/./org.apache.solr.cloud.CollectionsAPIDistributedZkTest-jetty4-1375525424767
   [junit4]   2> 802448 T3209 oasc.CorePropertiesLocator.discoverUnder Found core conf in /mnt/ssd/jenkins/workspace/Lucene-Solr-trunk-Linux/solr/build/solr-core/test/J0/./org.apache.solr.cloud.CollectionsAPIDistributedZkTest-jetty4-1375525424767/conf/
   [junit4]   2> 802448 T3209 oasc.CorePropertiesLocator.discover Found 1 core definitions
   [junit4]   2> 802449 T3209 oass.SolrDispatchFilter.init user.dir=/mnt/ssd/jenkins/workspace/Lucene-Solr-trunk-Linux/solr/build/solr-core/test/J0
   [junit4]   2> 802449 T3209 oass.SolrDispatchFilter.init SolrDispatchFilter.init() done
   [junit4]   2> 802450 T3209 oascsi.HttpClientUtil.createClient Creating new http client, config:maxConnections=128&maxConnectionsPerHost=32&followRedirects=false
   [junit4]   2> 802453 T3209 oascsi.HttpClientUtil.createClient Creating new http client, config:maxConnections=128&maxConnectionsPerHost=32&followRedirects=false
   [junit4]   2> 802456 T3243 oasha.CollectionsHandler.handleCreateAction Creating Collection : numShards=2&name=nodes_used_collection&replicationFactor=2&action=CREATE&wt=javabin&version=2
   [junit4]   2> 802458 T3231 oasc.DistributedQueue$LatchChildWatcher.process Watcher fired on path: /overseer/collection-queue-work state: SyncConnected type NodeChildrenChanged
   [junit4]   2> 802459 T3233 oasc.OverseerCollectionProcessor.run Overseer Collection Processor: Get the message id:/overseer/collection-queue-work/qn-0000000000 message:{
   [junit4]   2> 	  "operation":"createcollection",
   [junit4]   2> 	  "numShards":"2",
   [junit4]   2> 	  "name":"nodes_used_collection",
   [junit4]   2> 	  "replicationFactor":"2"}
   [junit4]   2> 802459 T3233 oasc.OverseerCollectionProcessor.processMessage WARN OverseerCollectionProcessor.processMessage : createcollection , {
   [junit4]   2> 	  "operation":"createcollection",
   [junit4]   2> 	  "numShards":"2",
   [junit4]   2> 	  "name":"nodes_used_collection",
   [junit4]   2> 	  "replicationFactor":"2"}
   [junit4]   2> 803675 T3232 oascc.ZkStateReader.updateClusterState Updating cloud state from ZooKeeper... 
   [junit4]   2> 803675 T3232 oasc.Overseer$ClusterStateUpdater.buildCollection building a new collection: nodes_used_collection
   [junit4]   2> 803675 T3232 oasc.Overseer$ClusterStateUpdater.createCollection Create collection nodes_used_collection with shards [shard1, shard2]
   [junit4]   2> 803679 T3291 oascc.ZkStateReader$2.process A cluster state change: WatchedEvent state:SyncConnected type:NodeDataChanged path:/clusterstate.json, has occurred - updating... (live nodes size: 5)
   [junit4]   2> 803679 T3277 oascc.ZkStateReader$2.process A cluster state change: WatchedEvent state:SyncConnected type:NodeDataChanged path:/clusterstate.json, has occurred - updating... (live nodes size: 5)
   [junit4]   2> 803679 T3231 oascc.ZkStateReader$2.process A cluster state change: WatchedEvent state:SyncConnected type:NodeDataChanged path:/clusterstate.json, has occurred - updating... (live nodes size: 5)
   [junit4]   2> 803679 T3236 oascc.ZkStateReader$2.process A cluster state change: WatchedEvent state:SyncConnected type:NodeDataChanged path:/clusterstate.json, has occurred - updating... (live nodes size: 5)
   [junit4]   2> 803679 T3263 oascc.ZkStateReader$2.process A cluster state change: WatchedEvent state:SyncConnected type:NodeDataChanged path:/clusterstate.json, has occurred - updating... (live nodes size: 5)
   [junit4]   2> 803679 T3249 oascc.ZkStateReader$2.process A cluster state change: WatchedEvent state:SyncConnected type:NodeDataChanged path:/clusterstate.json, has occurred - updating... (live nodes size: 5)
   [junit4]   2> 803763 T3233 oasc.OverseerCollectionProcessor.createCollection going to create cores replicas shardNames [shard1, shard2] , repFactor : 2
   [junit4]   2> 803763 T3233 oasc.OverseerCollectionProcessor.createCollection Creating shard nodes_used_collection_shard1_replica1 as part of slice shard1 of collection nodes_used_collection on 127.0.0.1:34487_xbhli%2Fmt
   [junit4]   2> 803763 T3233 oasc.OverseerCollectionProcessor.createCollection Creating shard nodes_used_collection_shard1_replica2 as part of slice shard1 of collection nodes_used_collection on 127.0.0.1:41741_xbhli%2Fmt
   [junit4]   2> 803764 T3233 oasc.OverseerCollectionProcessor.createCollection Creating shard nodes_used_collection_shard2_replica1 as part of slice shard2 of collection nodes_used_collection on 127.0.0.1:34842_xbhli%2Fmt
   [junit4]   2> 803765 T3233 oasc.OverseerCollectionProcessor.createCollection Creating shard nodes_used_collection_shard2_replica2 as part of slice shard2 of collection nodes_used_collection on 127.0.0.1:50033_xbhli%2Fmt
   [junit4]   2> 803766 T3284 oasc.ZkController.publish publishing core=nodes_used_collection_shard1_replica1 state=down
   [junit4]   2> 803772 T3270 oasc.ZkController.publish publishing core=nodes_used_collection_shard2_replica2 state=down
   [junit4]   2> 803772 T3225 oasc.ZkController.publish publishing core=nodes_used_collection_shard1_replica2 state=down
   [junit4]   2> 803766 T3245 oasc.ZkController.publish publishing core=nodes_used_collection_shard2_replica1 state=down
   [junit4]   2> 803773 T3284 oasc.ZkController.waitForCoreNodeName look for our core node name
   [junit4]   2> 803773 T3270 oasc.ZkController.waitForCoreNodeName look for our core node name
   [junit4]   2> 803774 T3225 oasc.ZkController.waitForCoreNodeName look for our core node name
   [junit4]   2> 803775 T3245 oasc.ZkController.waitForCoreNodeName look for our core node name
   [junit4]   2> 805184 T3232 oascc.ZkStateReader.updateClusterState Updating cloud state from ZooKeeper... 
   [junit4]   2> 805185 T3232 oasc.Overseer$ClusterStateUpdater.updateState WARN Could not find collection node for nodes_used_collection, skipping publish state
   [junit4]   2> 805186 T3232 oasc.Overseer$ClusterStateUpdater.updateState Update state numShards=2 message={
   [junit4]   2> 	  "operation":"state",
   [junit4]   2> 	  "core_node_name":"core_node1",
   [junit4]   2> 	  "numShards":"2",
   [junit4]   2> 	  "shard":"shard1",
   [junit4]   2> 	  "roles":null,
   [junit4]   2> 	  "state":"down",
   [junit4]   2> 	  "shard_state":"active",
   [junit4]   2> 	  "core":"nodes_used_collection_shard1_replica1",
   [junit4]   2> 	  "collection":"nodes_used_collection",
   [junit4]   2> 	  "shard_range":null,
   [junit4]   2> 	  "node_name":"127.0.0.1:34487_xbhli%2Fmt",
   [junit4]   2> 	  "base_url":"http://127.0.0.1:34487/xbhli/mt"}
   [junit4]   2> 805190 T3232 oasc.Overseer$ClusterStateUpdater.updateState WARN Could not find collection node for nodes_used_collection, skipping publish state
   [junit4]   2> 805190 T3232 oasc.Overseer$ClusterStateUpdater.updateState Update state numShards=2 message={
   [junit4]   2> 	  "operation":"state",
   [junit4]   2> 	  "core_node_name":"core_node2",
   [junit4]   2> 	  "numShards":"2",
   [junit4]   2> 	  "shard":"shard2",
   [junit4]   2> 	  "roles":null,
   [junit4]   2> 	  "state":"down",
   [junit4]   2> 	  "shard_state":"active",
   [junit4]   2> 	  "core":"nodes_used_collection_shard2_replica2",
   [junit4]   2> 	  "collection":"nodes_used_collection",
   [junit4]   2> 	  "shard_range":null,
   [junit4]   2> 	  "node_name":"127.0.0.1:50033_xbhli%2Fmt",
   [junit4]   2> 	  "base_url":"http://127.0.0.1:50033/xbhli/mt"}
   [junit4]   2> 805194 T3232 oasc.Overseer$ClusterStateUpdater.updateState WARN Could not find collection node for nodes_used_collection, skipping publish state
   [junit4]   2> 805194 T3232 oasc.Overseer$ClusterStateUpdater.updateState Update state numShards=2 message={
   [junit4]   2> 	  "operation":"state",
   [junit4]   2> 	  "core_node_name":"core_node3",
   [junit4]   2> 	  "numShards":"2",
   [junit4]   2> 	  "shard":"shard1",
   [junit4]   2> 	  "roles":null,
   [junit4]   2> 	  "state":"down",
   [junit4]   2> 	  "shard_state":"active",
   [junit4]   2> 	  "core":"nodes_used_collection_shard1_replica2",
   [junit4]   2> 	  "collection":"nodes_used_collection",
   [junit4]   2> 	  "shard_range":null,
   [junit4]   2> 	  "node_name":"127.0.0.1:41741_xbhli%2Fmt",
   [junit4]   2> 	  "base_url":"http://127.0.0.1:41741/xbhli/mt"}
   [junit4]   2> 805198 T3232 oasc.Overseer$ClusterStateUpdater.updateState WARN Could not find collection node for nodes_used_collection, skipping publish state
   [junit4]   2> 805198 T3232 oasc.Overseer$ClusterStateUpdater.updateState Update state numShards=2 message={
   [junit4]   2> 	  "operation":"state",
   [junit4]   2> 	  "core_node_name":"core_node4",
   [junit4]   2> 	  "numShards":"2",
   [junit4]   2> 	  "shard":"shard2",
   [junit4]   2> 	  "roles":null,
   [junit4]   2> 	  "state":"down",
   [junit4]   2> 	  "shard_state":"active",
   [junit4]   2> 	  "core":"nodes_used_collection_shard2_replica1",
   [junit4]   2> 	  "collection":"nodes_used_collection",
   [junit4]   2> 	  "shard_range":null,
   [junit4]   2> 	  "node_name":"127.0.0.1:34842_xbhli%2Fmt",
   [junit4]   2> 	  "base_url":"http://127.0.0.1:34842/xbhli/mt"}
   [junit4]   2> 805202 T3277 oascc.ZkStateReader$2.process A cluster state change: WatchedEvent state:SyncConnected type:NodeDataChanged path:/clusterstate.json, has occurred - updating... (live nodes size: 5)
   [junit4]   2> 805202 T3263 oascc.ZkStateReader$2.process A cluster state change: WatchedEvent state:SyncConnected type:NodeDataChanged path:/clusterstate.json, has occurred - updating... (live nodes size: 5)
   [junit4]   2> 805202 T3231 oascc.ZkStateReader$2.process A cluster state change: WatchedEvent state:SyncConnected type:NodeDataChanged path:/clusterstate.json, has occurred - updating... (live nodes size: 5)
   [junit4]   2> 805202 T3291 oascc.ZkStateReader$2.process A cluster state change: WatchedEvent state:SyncConnected type:NodeDataChanged path:/clusterstate.json, has occurred - updating... (live nodes size: 5)
   [junit4]   2> 805202 T3236 oascc.ZkStateReader$2.process A cluster state change: WatchedEvent state:SyncConnected type:NodeDataChanged path:/clusterstate.json, has occurred - updating... (live nodes size: 5)
   [junit4]   2> 805202 T3249 oascc.ZkStateReader$2.process A cluster state change: WatchedEvent state:SyncConnected type:NodeDataChanged path:/clusterstate.json, has occurred - updating... (live nodes size: 5)
   [junit4]   2> 805774 T3284 oasc.ZkController.waitForShardId waiting to find shard id in clusterstate for nodes_used_collection_shard1_replica1
   [junit4]   2> 805775 T3225 oasc.ZkController.waitForShardId waiting to find shard id in clusterstate for nodes_used_collection_shard1_replica2
   [junit4]   2> 805775 T3245 oasc.ZkController.waitForShardId waiting to find shard id in clusterstate for nodes_used_collection_shard2_replica1
   [junit4]   2> 805774 T3270 oasc.ZkController.waitForShardId waiting to find shard id in clusterstate for nodes_used_collection_shard2_replica2
   [junit4]   2> 805776 T3245 oasc.CorePropertiesLocator.writePropertiesFile ERROR Couldn't persist core properties to /mnt/ssd/jenkins/workspace/Lucene-Solr-trunk-Linux/solr/build/solr-core/test/J0/./org.apache.solr.cloud.CollectionsAPIDistributedZkTest-jetty1-1375525421206/nodes_used_collection_shard2_replica1/core.properties: java.io.FileNotFoundException: /mnt/ssd/jenkins/workspace/Lucene-Solr-trunk-Linux/solr/build/solr-core/test/J0/./org.apache.solr.cloud.CollectionsAPIDistributedZkTest-jetty1-1375525421206/nodes_used_collection_shard2_replica1/core.properties (No such file or directory)
   [junit4]   2> 805776 T3270 oasc.CorePropertiesLocator.writePropertiesFile ERROR Couldn't persist core properties to /mnt/ssd/jenkins/workspace/Lucene-Solr-trunk-Linux/solr/build/solr-core/test/J0/./org.apache.solr.cloud.CollectionsAPIDistributedZkTest-jetty3-1375525423582/nodes_used_collection_shard2_replica2/core.properties: java.io.FileNotFoundException: /mnt/ssd/jenkins/workspace/Lucene-Solr-trunk-Linux/solr/build/solr-core/test/J0/./org.apache.solr.cloud.CollectionsAPIDistributedZkTest-jetty3-1375525423582/nodes_used_collection_shard2_replica2/core.properties (No such file or directory)
   [junit4]   2> 805776 T3225 oasc.CorePropertiesLocator.writePropertiesFile ERROR Couldn't persist core properties to /mnt/ssd/jenkins/workspace/Lucene-Solr-trunk-Linux/solr/build/solr-core/test/J0/./org.apache.solr.cloud.CollectionsAPIDistributedZkTest-controljetty-1375525421001/nodes_used_collection_shard1_replica2/core.properties: java.io.FileNotFoundException: /mnt/ssd/jenkins/workspace/Lucene-Solr-trunk-Linux/solr/build/solr-core/test/J0/./org.apache.solr.cloud.CollectionsAPIDistributedZkTest-controljetty-1375525421001/nodes_used_collection_shard1_replica2/core.properties (No such file or directory)
   [junit4]   2> 805775 T3284 oasc.CorePropertiesLocator.writePropertiesFile ERROR Couldn't persist core properties to /mnt/ssd/jenkins/workspace/Lucene-Solr-trunk-Linux/solr/build/solr-core/test/J0/./org.apache.solr.cloud.CollectionsAPIDistributedZkTest-jetty4-1375525424767/nodes_used_collection_shard1_replica1/core.properties: java.io.FileNotFoundException: /mnt/ssd/jenkins/workspace/Lucene-Solr-trunk-Linux/solr/build/solr-core/test/J0/./org.apache.solr.cloud.CollectionsAPIDistributedZkTest-jetty4-1375525424767/nodes_used_collection_shard1_replica1/core.properties (No such file or directory)
   [junit4]   2> 805777 T3225 oasc.CoreContainer.create Creating SolrCore 'nodes_used_collection_shard1_replica2' using instanceDir: /mnt/ssd/jenkins/workspace/Lucene-Solr-trunk-Linux/solr/build/solr-core/test/J0/./org.apache.solr.cloud.CollectionsAPIDistributedZkTest-controljetty-1375525421001/nodes_used_collection_shard1_replica2
   [junit4]   2> 805777 T3270 oasc.CoreContainer.create Creating SolrCore 'nodes_used_collection_shard2_replica2' using instanceDir: /mnt/ssd/jenkins/workspace/Lucene-Solr-trunk-Linux/solr/build/solr-core/test/J0/./org.apache.solr.cloud.CollectionsAPIDistributedZkTest-jetty3-1375525423582/nodes_used_collection_shard2_replica2
   [junit4]   2> 805778 T3270 oasc.ZkController.createCollectionZkNode Check for collection zkNode:nodes_used_collection
   [junit4]   2> 805777 T3245 oasc.CoreContainer.create Creating SolrCore 'nodes_used_collection_shard2_replica1' using instanceDir: /mnt/ssd/jenkins/workspace/Lucene-Solr-trunk-Linux/solr/build/solr-core/test/J0/./org.apache.solr.cloud.CollectionsAPIDistributedZkTest-jetty1-1375525421206/nodes_used_collection_shard2_replica1
   [junit4]   2> 805779 T3270 oasc.ZkController.createCollectionZkNode Creating collection in ZooKeeper:nodes_used_collection
   [junit4]   2> 805779 T3245 oasc.ZkController.createCollectionZkNode Check for collection zkNode:nodes_used_collection
   [junit4]   2> 805778 T3225 oasc.ZkController.createCollectionZkNode Check for collection zkNode:nodes_used_collection
   [junit4]   2> 805778 T3284 oasc.CoreContainer.create Creating SolrCore 'nodes_used_collection_shard1_replica1' using instanceDir: /mnt/ssd/jenkins/workspace/Lucene-Solr-trunk-Linux/solr/build/solr-core/test/J0/./org.apache.solr.cloud.CollectionsAPIDistributedZkTest-jetty4-1375525424767/nodes_used_collection_shard1_replica1
   [junit4]   2> 805780 T3284 oasc.ZkController.createCollectionZkNode Check for collection zkNode:nodes_used_collection
   [junit4]   2> 805780 T3245 oasc.ZkController.createCollectionZkNode Creating collection in ZooKeeper:nodes_used_collection
   [junit4]   2> 805779 T3270 oasc.ZkController.getConfName Looking for collection configName
   [junit4]   2> 805781 T3245 oasc.ZkController.getConfName Looking for collection configName
   [junit4]   2> 805781 T3284 oasc.ZkController.createCollectionZkNode Creating collection in ZooKeeper:nodes_used_collection
   [junit4]   2> 805782 T3284 oasc.ZkController.getConfName Looking for collection configName
   [junit4]   2> 805782 T3245 oasc.ZkController.getConfName Only one config set found in zk - using it:conf1
   [junit4]   2> 805781 T3225 oasc.ZkController.createCollectionZkNode Creating collection in ZooKeeper:nodes_used_collection
   [junit4]   2> 805783 T3284 oasc.ZkController.getConfName Only one config set found in zk - using it:conf1
   [junit4]   2> 805783 T3245 oascc.SolrZkClient.makePath makePath: /collections/nodes_used_collection
   [junit4]   2> 805782 T3270 oasc.ZkController.getConfName Only one config set found in zk - using it:conf1
   [junit4]   2> 805784 T3284 oascc.SolrZkClient.makePath makePath: /collections/nodes_used_collection
   [junit4]   2> 805783 T3225 oasc.ZkController.getConfName Looking for collection configName
   [junit4]   2> 805784 T3270 oascc.SolrZkClient.makePath makePath: /collections/nodes_used_collection
   [junit4]   2> 805786 T3245 oasc.ZkController.readConfigName Load collection config from:/collections/nodes_used_collection
   [junit4]   2> 805786 T3225 oascc.SolrZkClient.makePath makePath: /collections/nodes_used_collection
   [junit4]   2> 805787 T3284 oasc.ZkController.readConfigName Load collection config from:/collections/nodes_used_collection
   [junit4]   2> 805787 T3245 oasc.SolrResourceLoader.<init> new SolrResourceLoader for directory: '/mnt/ssd/jenkins/workspace/Lucene-Solr-trunk-Linux/solr/build/solr-core/test/J0/./org.apache.solr.cloud.CollectionsAPIDistributedZkTest-jetty1-1375525421206/nodes_used_collection_shard2_replica1/'
   [junit4]   2> 805787 T3270 oasc.ZkController.readConfigName Load collection config from:/collections/nodes_used_collection
   [junit4]   2> 805788 T3284 oasc.SolrResourceLoader.<init> new SolrResourceLoader for directory: '/mnt/ssd/jenkins/workspace/Lucene-Solr-trunk-Linux/solr/build/solr-core/test/J0/./org.apache.solr.cloud.CollectionsAPIDistributedZkTest-jetty4-1375525424767/nodes_used_collection_shard1_replica1/'
   [junit4]   2> 805789 T3225 oasc.ZkController.readConfigName Load collection config from:/collections/nodes_used_collection
   [junit4]   2> 805789 T3270 oasc.SolrResourceLoader.<init> new SolrResourceLoader for directory: '/mnt/ssd/jenkins/workspace/Lucene-Solr-trunk-Linux/solr/build/solr-core/test/J0/./org.apache.solr.cloud.CollectionsAPIDistributedZkTest-jetty3-1375525423582/nodes_used_collection_shard2_replica2/'
   [junit4]   2> 805792 T3225 oasc.SolrResourceLoader.<init> new SolrResourceLoader for directory: '/mnt/ssd/jenkins/workspace/Lucene-Solr-trunk-Linux/solr/build/solr-core/test/J0/./org.apache.solr.cloud.CollectionsAPIDistributedZkTest-controljetty-1375525421001/nodes_used_collection_shard1_replica2/'
   [junit4]   2> 805844 T3284 oasc.SolrConfig.<init> Using Lucene MatchVersion: LUCENE_50
   [junit4]   2> 805853 T3270 oasc.SolrConfig.<init> Using Lucene MatchVersion: LUCENE_50
   [junit4]   2> 805854 T3245 oasc.SolrConfig.<init> Using Lucene MatchVersion: LUCENE_50
   [junit4]   2> 805858 T3225 oasc.SolrConfig.<init> Using Lucene MatchVersion: LUCENE_50
   [junit4]   2> 805922 T3284 oasc.SolrConfig.<init> Loaded SolrConfig: solrconfig.xml
   [junit4]   2> 805924 T3284 oass.IndexSchema.readSchema Reading Solr Schema from schema.xml
   [junit4]   2> 805932 T3284 oass.IndexSchema.readSchema [nodes_used_collection_shard1_replica1] Schema name=test
   [junit4]   2> 805941 T3225 oasc.SolrConfig.<init> Loaded SolrConfig: solrconfig.xml
   [junit4]   2> 805943 T3225 oass.IndexSchema.readSchema Reading Solr Schema from schema.xml
   [junit4]   2> 805944 T3270 oasc.SolrConfig.<init> Loaded SolrConfig: solrconfig.xml
   [junit4]   2> 805945 T3245 oasc.SolrConfig.<init> Loaded SolrConfig: solrconfig.xml
   [junit4]   2> 805945 T3270 oass.IndexSchema.readSchema Reading Solr Schema from schema.xml
   [junit4]   2> 805946 T3245 oass.IndexSchema.readSchema Reading Solr Schema from schema.xml
   [junit4]   2> 805956 T3225 oass.IndexSchema.readSchema [nodes_used_collection_shard1_replica2] Schema name=test
   [junit4]   2> 805957 T3245 oass.IndexSchema.readSchema [nodes_used_collection_shard2_replica1] Schema name=test
   [junit4]   2> 805959 T3270 oass.IndexSchema.readSchema [nodes_used_collection_shard2_replica2] Schema name=test
   [junit4]   2> 806641 T3284 oass.OpenExchangeRatesOrgProvider.init Initialized with rates=open-exchange-rates.json, refreshInterval=1440.
   [junit4]   2> 806648 T3284 oass.IndexSchema.readSchema default search field in schema is text
   [junit4]   2> 806651 T3284 oass.IndexSchema.readSchema unique key field: id
   [junit4]   2> 806660 T3245 oass.OpenExchangeRatesOrgProvider.init Initialized with rates=open-exchange-rates.json, refreshInterval=1440.
   [junit4]   2> 806667 T3284 oass.FileExchangeRateProvider.reload Reloading exchange rates from file currency.xml
   [junit4]   2> 806669 T3245 oass.IndexSchema.readSchema default search field in schema is text
   [junit4]   2> 806672 T3284 oass.FileExchangeRateProvider.reload Reloading exchange rates from file currency.xml
   [junit4]   2> 806674 T3245 oass.IndexSchema.readSchema unique key field: id
   [junit4]   2> 806677 T3284 oass.OpenExchangeRatesOrgProvider.reload Reloading exchange rates from open-exchange-rates.json
   [junit4]   2> 806678 T3284 oass.OpenExchangeRatesOrgProvider$OpenExchangeRates.<init> WARN Unknown key IMPORTANT NOTE
   [junit4]   2> 806678 T3284 oass.OpenExchangeRatesOrgProvider$OpenExchangeRates.<init> WARN Expected key, got STRING
   [junit4]   2> 806679 T3284 oass.OpenExchangeRatesOrgProvider.reload Reloading exchange rates from open-exchange-rates.json
   [junit4]   2> 806680 T3284 oass.OpenExchangeRatesOrgProvider$OpenExchangeRates.<init> WARN Unknown key IMPORTANT NOTE
   [junit4]   2> 806681 T3284 oass.OpenExchangeRatesOrgProvider$OpenExchangeRates.<init> WARN Expected key, got STRING
   [junit4]   2> 806681 T3284 oasc.SolrCore.initDirectoryFactory org.apache.solr.core.MockDirectoryFactory
   [junit4]   2> 806682 T3284 oasc.SolrCore.<init> [nodes_used_collection_shard1_replica1] Opening new SolrCore at /mnt/ssd/jenkins/workspace/Lucene-Solr-trunk-Linux/solr/build/solr-core/test/J0/./org.apache.solr.cloud.CollectionsAPIDistributedZkTest-jetty4-1375525424767/nodes_used_collection_shard1_replica1/, dataDir=/mnt/ssd/jenkins/workspace/Lucene-Solr-trunk-Linux/solr/build/solr-core/test/J0/./org.apache.solr.cloud.CollectionsAPIDistributedZkTest-jetty4-1375525424767//nodes_used_collection_shard1_replica1/data/
   [junit4]   2> 806682 T3284 oasc.JmxMonitoredMap.<init> JMX monitoring is enabled. Adding Solr mbeans to JMX Server: com.sun.jmx.mbeanserver.JmxMBeanServer@75ec7c
   [junit4]   2> 806684 T3284 oasc.CachingDirectoryFactory.get return new directory for /mnt/ssd/jenkins/workspace/Lucene-Solr-trunk-Linux/solr/build/solr-core/test/J0/./org.apache.solr.cloud.CollectionsAPIDistributedZkTest-jetty4-1375525424767//nodes_used_collection_shard1_replica1/data
   [junit4]   2> 806684 T3284 oasc.SolrCore.getNewIndexDir New index directory detected: old=null new=/mnt/ssd/jenkins/workspace/Lucene-Solr-trunk-Linux/solr/build/solr-core/test/J0/./org.apache.solr.cloud.CollectionsAPIDistributedZkTest-jetty4-1375525424767//nodes_used_collection_shard1_replica1/data/index/
   [junit4]   2> 806684 T3225 oass.OpenExchangeRatesOrgProvider.init Initialized with rates=open-exchange-rates.json, refreshInterval=1440.
   [junit4]   2> 806685 T3284 oasc.SolrCore.initIndex WARN [nodes_used_collection_shard1_replica1] Solr index directory '/mnt/ssd/jenkins/workspace/Lucene-Solr-trunk-Linux/solr/build/solr-core/test/J0/./org.apache.solr.cloud.CollectionsAPIDistributedZkTest-jetty4-1375525424767/nodes_used_collection_shard1_replica1/data/index' doesn't exist. Creating new index...
   [junit4]   2> 806686 T3284 oasc.CachingDirectoryFactory.get return new directory for /mnt/ssd/jenkins/workspace/Lucene-Solr-trunk-Linux/solr/build/solr-core/test/J0/./org.apache.solr.cloud.CollectionsAPIDistributedZkTest-jetty4-1375525424767//nodes_used_collection_shard1_replica1/data/index
   [junit4]   2> 806686 T3245 oass.FileExchangeRateProvider.reload Reloading exchange rates from file currency.xml
   [junit4]   2> 806688 T3284 oasc.SolrDeletionPolicy.onCommit SolrDeletionPolicy.onCommit: commits: num=1
   [junit4]   2> 		commit{dir=MockDirWrapper(org.apache.lucene.store.RAMDirectory@14883a3 lockFactory=org.apache.lucene.store.NativeFSLockFactory@ea5789),segFN=segments_1,generation=1}
   [junit4]   2> 806688 T3284 oasc.SolrDeletionPolicy.updateCommits newest commit generation = 1
   [junit4]   2> 806691 T3245 oass.FileExchangeRateProvider.reload Reloading exchange rates from file currency.xml
   [junit4]   2> 806698 T3284 oasup.UpdateRequestProcessorChain.init inserting DistributedUpdateProcessorFactory into updateRequestProcessorChain "dedupe"
   [junit4]   2> 806698 T3284 oasup.UpdateRequestProcessorChain.init inserting DistributedUpdateProcessorFactory into updateRequestProcessorChain "stored_sig"
   [junit4]   2> 806699 T3225 oass.IndexSchema.readSchema default search field in schema is text
   [junit4]   2> 806699 T3284 oasup.UpdateRequestProcessorChain.init inserting DistributedUpdateProcessorFactory into updateRequestProcessorChain "distrib-dup-test-chain-implicit"
   [junit4]   2> 806700 T3284 oasc.RequestHandlers.initHandlersFromConfig created standard: solr.StandardRequestHandler
   [junit4]   2> 806701 T3284 oasc.RequestHandlers.initHandlersFromConfig created /get: solr.RealTimeGetHandler
   [junit4]   2> 806701 T3284 oasc.RequestHandlers.initHandlersFromConfig adding lazy requestHandler: solr.ReplicationHandler
   [junit4]   2> 806702 T3284 oasc.RequestHandlers.initHandlersFromConfig created /replication: solr.ReplicationHandler
   [junit4]   2> 806703 T3284 oasc.RequestHandlers.initHandlersFromConfig created /update: solr.UpdateRequestHandler
   [junit4]   2> 806703 T3225 oass.IndexSchema.readSchema unique key field: id
   [junit4]   2> 806703 T3284 oasc.RequestHandlers.initHandlersFromConfig created /admin/: org.apache.solr.handler.admin.AdminHandlers
   [junit4]   2> 806703 T3245 oass.OpenExchangeRatesOrgProvider.reload Reloading exchange rates from open-exchange-rates.json
   [junit4]   2> 806706 T3245 oass.OpenExchangeRatesOrgProvider$OpenExchangeRates.<init> WARN Unknown key IMPORTANT NOTE
   [junit4]   2> 806707 T3245 oass.OpenExchangeRatesOrgProvider$OpenExchangeRates.<init> WARN Expected key, got STRING
   [junit4]   2> 806707 T3245 oass.OpenExchangeRatesOrgProvider.reload Reloading exchange rates from open-exchange-rates.json
   [junit4]   2> 806707 T3284 oashl.XMLLoader.init xsltCacheLifetimeSeconds=60
   [junit4]   2> 806709 T3245 oass.OpenExchangeRatesOrgProvider$OpenExchangeRates.<init> WARN Unknown key IMPORTANT NOTE
   [junit4]   2> 806709 T3245 oass.OpenExchangeRatesOrgProvider$OpenExchangeRates.<init> WARN Expected key, got STRING
   [junit4]   2> 806709 T3245 oasc.SolrCore.initDirectoryFactory org.apache.solr.core.MockDirectoryFactory
   [junit4]   2> 806710 T3245 oasc.SolrCore.<init> [nodes_used_collection_shard2_replica1] Opening new SolrCore at /mnt/ssd/jenkins/workspace/Lucene-Solr-trunk-Linux/solr/build/solr-core/test/J0/./org.apache.solr.cloud.CollectionsAPIDistributedZkTest-jetty1-1375525421206/nodes_used_collection_shard2_replica1/, dataDir=/mnt/ssd/jenkins/workspace/Lucene-Solr-trunk-Linux/solr/build/solr-core/test/J0/./org.apache.solr.cloud.CollectionsAPIDistributedZkTest-jetty1-1375525421206//nodes_used_collection_shard2_replica1/data/
   [junit4]   2> 806710 T3245 oasc.JmxMonitoredMap.<init> JMX monitoring is enabled. Adding Solr mbeans to JMX Server: com.sun.jmx.mbeanserver.JmxMBeanServer@75ec7c
   [junit4]   2> 806711 T3284 oass.SolrIndexSearcher.<init> Opening Searcher@f7607a main
   [junit4]   2> 806711 T3245 oasc.CachingDirectoryFactory.get return new directory for /mnt/ssd/jenkins/workspace/Lucene-Solr-trunk-Linux/solr/build/solr-core/test/J0/./org.apache.solr.cloud.CollectionsAPIDistributedZkTest-jetty1-1375525421206//nodes_used_collection_shard2_replica1/data
   [junit4]   2> 806711 T3245 oasc.SolrCore.getNewIndexDir New index directory detected: old=null new=/mnt/ssd/jenkins/workspace/Lucene-Solr-trunk-Linux/solr/build/solr-core/test/J0/./org.apache.solr.cloud.CollectionsAPIDistributedZkTest-jetty1-1375525421206//nodes_used_collection_shard2_replica1/data/index/
   [junit4]   2> 806712 T3284 oasu.CommitTracker.<init> Hard AutoCommit: disabled
   [junit4]   2> 806712 T3245 oasc.SolrCore.initIndex WARN [nodes_used_collection_shard2_replica1] Solr index directory '/mnt/ssd/jenkins/workspace/Lucene-Solr-trunk-Linux/solr/build/solr-core/test/J0/./org.apache.solr.cloud.CollectionsAPIDistributedZkTest-jetty1-1375525421206/nodes_used_collection_shard2_replica1/data/index' doesn't exist. Creating new index...
   [junit4]   2> 806712 T3284 oasu.CommitTracker.<init> Soft AutoCommit: disabled
   [junit4]   2> 806713 T3245 oasc.CachingDirectoryFactory.get return new directory for /mnt/ssd/jenkins/workspace/Lucene-Solr-trunk-Linux/solr/build/solr-core/test/J0/./org.apache.solr.cloud.CollectionsAPIDistributedZkTest-jetty1-1375525421206//nodes_used_collection_shard2_replica1/data/index
   [junit4]   2> 806715 T3245 oasc.SolrDeletionPolicy.onCommit SolrDeletionPolicy.onCommit: commits: num=1
   [junit4]   2> 		commit{dir=MockDirWrapper(org.apache.lucene.store.RAMDirectory@5f5b32 lockFactory=org.apache.lucene.store.NativeFSLockFactory@5f1607),segFN=segments_1,generation=1}
   [junit4]   2> 806716 T3245 oasc.SolrDeletionPolicy.updateCommits newest commit generation = 1
   [junit4]   2> 806720 T3225 oass.FileExchangeRateProvider.reload Reloading exchange rates from file currency.xml
   [junit4]   2> 806721 T3297 oasc.SolrCore.registerSearcher [nodes_used_collection_shard1_replica1] Registered new searcher Searcher@f7607a main{StandardDirectoryReader(segments_1:1)}
   [junit4]   2> 806723 T3270 oass.OpenExchangeRatesOrgProvider.init Initialized with rates=open-exchange-rates.json, refreshInterval=1440.
   [junit4]   2> 806724 T3284 oasc.CoreContainer.registerCore registering core: nodes_used_collection_shard1_replica1
   [junit4]   2> 806724 T3284 oasc.ZkController.register Register replica - core:nodes_used_collection_shard1_replica1 address:http://127.0.0.1:34487/xbhli/mt collection:nodes_used_collection shard:shard1
   [junit4]   2> 806758 T3284 oascsi.HttpClientUtil.createClient Creating new http client, config:maxConnections=10000&maxConnectionsPerHost=20&connTimeout=15000&socketTimeout=30000&retry=false
   [junit4]   2> 806759 T3245 oasup.UpdateRequestProcessorChain.init inserting DistributedUpdateProcessorFactory into updateRequestProcessorChain "dedupe"
   [junit4]   2> 806759 T3225 oass.FileExchangeRateProvider.reload Reloading exchange rates from file currency.xml
   [junit4]   2> 806759 T3245 oasup.UpdateRequestProcessorChain.init inserting DistributedUpdateProcessorFactory into updateRequestProcessorChain "stored_sig"
   [junit4]   2> 806761 T3245 oasup.UpdateRequestProcessorChain.init inserting DistributedUpdateProcessorFactory into updateRequestProcessorChain "distrib-dup-test-chain-implicit"
   [junit4]   2> 806762 T3245 oasc.RequestHandlers.initHandlersFromConfig created standard: solr.StandardRequestHandler
   [junit4]   2> 806762 T3245 oasc.RequestHandlers.initHandlersFromConfig created /get: solr.RealTimeGetHandler
   [junit4]   2> 806763 T3245 oasc.RequestHandlers.initHandlersFromConfig adding lazy requestHandler: solr.ReplicationHandler
   [junit4]   2> 806763 T3270 oass.IndexSchema.readSchema default search field in schema is text
   [junit4]   2> 806763 T3245 oasc.RequestHandlers.initHandlersFromConfig created /replication: solr.ReplicationHandler
   [junit4]   2> 806763 T3284 oascc.SolrZkClient.makePath makePath: /collections/nodes_used_collection/leader_elect/shard1/election
   [junit4]   2> 806764 T3245 oasc.RequestHandlers.initHandlersFromConfig created /update: solr.UpdateRequestHandler
   [junit4]   2> 806764 T3225 oass.OpenExchangeRatesOrgProvider.reload Reloading exchange rates from open-exchange-rates.json
   [junit4]   2> 806765 T3245 oasc.RequestHandlers.initHandlersFromConfig created /admin/: org.apache.solr.handler.admin.AdminHandlers
   [junit4]   2> 806766 T3270 oass.IndexSchema.readSchema unique key field: id
   [junit4]   2> 806767 T3225 oass.OpenExchangeRatesOrgProvider$OpenExchangeRates.<init> WARN Unknown key IMPORTANT NOTE
   [junit4]   2> 806767 T3225 oass.OpenExchangeRatesOrgProvider$OpenExchangeRates.<init> WARN Expected key, got STRING
   [junit4]   2> 806768 T3225 oass.OpenExchangeRatesOrgProvider.reload Reloading exchange rates from open-exchange-rates.json
   [junit4]   2> 806770 T3225 oass.OpenExchangeRatesOrgProvider$OpenExchangeRates.<init> WARN Unknown key IMPORTANT NOTE
   [junit4]   2> 806770 T3225 oass.OpenExchangeRatesOrgProvider$OpenExchangeRates.<init> WARN Expected key, got STRING
   [junit4]   2> 806770 T3245 oashl.XMLLoader.init xsltCacheLifetimeSeconds=60
   [junit4]   2> 806771 T3284 oasc.ShardLeaderElectionContext.runLeaderProcess Running the leader process for shard shard1
   [junit4]   2> 806770 T3225 oasc.SolrCore.initDirectoryFactory org.apache.solr.core.MockDirectoryFactory
   [junit4]   2> 806772 T3225 oasc.SolrCore.<init> [nodes_used_collection_shard1_replica2] Opening new SolrCore at /mnt/ssd/jenkins/workspace/Lucene-Solr-trunk-Linux/solr/build/solr-core/test/J0/./org.apache.solr.cloud.CollectionsAPIDistributedZkTest-controljetty-1375525421001/nodes_used_collection_shard1_replica2/, dataDir=/mnt/ssd/jenkins/workspace/Lucene-Solr-trunk-Linux/solr/build/solr-core/test/J0/./org.apache.solr.cloud.CollectionsAPIDistributedZkTest-controljetty-1375525421001//nodes_used_collection_shard1_replica2/data/
   [junit4]   2> 806772 T3225 oasc.JmxMonitoredMap.<init> JMX monitoring is enabled. Adding Solr mbeans to JMX Server: com.sun.jmx.mbeanserver.JmxMBeanServer@75ec7c
   [junit4]   2> 806773 T3245 oass.SolrIndexSearcher.<init> Opening Searcher@1b0cfb9 main
   [junit4]   2> 806774 T3284 oasc.ShardLeaderElectionContext.waitForReplicasToComeUp Waiting until we see more replicas up for shard shard1: total=2 found=1 timeoutin=179999
   [junit4]   2> 806774 T3245 oasu.CommitTracker.<init> Hard AutoCommit: disabled
   [junit4]   2> 806773 T3225 oasc.CachingDirectoryFactory.get return new directory for /mnt/ssd/jenkins/workspace/Lucene-Solr-trunk-Linux/solr/build/solr-core/test/J0/./org.apache.solr.cloud.CollectionsAPIDistributedZkTest-controljetty-1375525421001//nodes_used_collection_shard1_replica2/data
   [junit4]   2> 806774 T3245 oasu.CommitTracker.<init> Soft AutoCommit: disabled
   [junit4]   2> 806775 T3225 oasc.SolrCore.getNewIndexDir New index directory detected: old=null new=/mnt/ssd/jenkins/workspace/Lucene-Solr-trunk-Linux/solr/build/solr-core/test/J0/./org.apache.solr.cloud.CollectionsAPIDistributedZkTest-controljetty-1375525421001//nodes_used_collection_shard1_replica2/data/index/
   [junit4]   2> 806775 T3225 oasc.SolrCore.initIndex WARN [nodes_used_collection_shard1_replica2] Solr index directory '/mnt/ssd/jenkins/workspace/Lucene-Solr-trunk-Linux/solr/build/solr-core/test/J0/./org.apache.solr.cloud.CollectionsAPIDistributedZkTest-controljetty-1375525421001/nodes_used_collection_shard1_replica2/data/index' doesn't exist. Creating new index...
   [junit4]   2> 806776 T3225 oasc.CachingDirectoryFactory.get return new directory for /mnt/ssd/jenkins/workspace/Lucene-Solr-trunk-Linux/solr/build/solr-core/test/J0/./org.apache.solr.cloud.CollectionsAPIDistributedZkTest-controljetty-1375525421001//nodes_used_collection_shard1_replica2/data/index
   [junit4]   2> 806778 T3225 oasc.SolrDeletionPolicy.onCommit SolrDeletionPolicy.onCommit: commits: num=1
   [junit4]   2> 		commit{dir=MockDirWrapper(org.apache.lucene.store.RAMDirectory@ff1c2c lockFactory=org.apache.lucene.store.NativeFSLockFactory@1c885ba),segFN=segments_1,generation=1}
   [junit4]   2> 806779 T3225 oasc.SolrDeletionPolicy.updateCommits newest commit generation = 1
   [junit4]   2> 806779 T3270 oass.FileExchangeRateProvider.reload Reloading exchange rates from file currency.xml
   [junit4]   2> 806779 T3298 oasc.SolrCore.registerSearcher [nodes_used_collection_shard2_replica1] Registered new searcher Searcher@1b0cfb9 main{StandardDirectoryReader(segments_1:1)}
   [junit4]   2> 806782 T3245 oasc.CoreContainer.registerCore registering core: nodes_used_collection_shard2_replica1
   [junit4]   2> 806782 T3245 oasc.ZkController.register Register replica - core:nodes_used_collection_shard2_replica1 address:http://127.0.0.1:34842/xbhli/mt collection:nodes_used_collection shard:shard2
   [junit4]   2> 806783 T3225 oasup.UpdateRequestProcessorChain.init inserting DistributedUpdateProcessorFactory into updateRequestProcessorChain "dedupe"
   [junit4]   2> 806783 T3245 oascsi.HttpClientUtil.createClient Creating new http client, config:maxConnections=10000&maxConnectionsPerHost=20&connTimeout=15000&socketTimeout=30000&retry=false
   [junit4]   2> 806783 T3225 oasup.UpdateRequestProcessorChain.init inserting DistributedUpdateProcessorFactory into updateRequestProcessorChain "stored_sig"
   [junit4]   2> 806789 T3270 oass.FileExchangeRateProvider.reload Reloading exchange rates from file currency.xml
   [junit4]   2> 806789 T3225 oasup.UpdateRequestProcessorChain.init inserting DistributedUpdateProcessorFactory into updateRequestProcessorChain "distrib-dup-test-chain-implicit"
   [junit4]   2> 806790 T3225 oasc.RequestHandlers.initHandlersFromConfig created standard: solr.StandardRequestHandler
   [junit4]   2> 806791 T3225 oasc.RequestHandlers.initHandlersFromConfig created /get: solr.RealTimeGetHandler
   [junit4]   2> 806791 T3225 oasc.RequestHandlers.initHandlersFromConfig adding lazy requestHandler: solr.ReplicationHandler
   [junit4]   2> 806792 T3225 oasc.RequestHandlers.initHandlersFromConfig created /replication: solr.ReplicationHandler
   [junit4]   2> 806792 T3270 oass.OpenExchangeRatesOrgProvider.reload Reloading exchange rates from open-exchange-rates.json
   [junit4]   2> 806793 T3225 oasc.RequestHandlers.initHandlersFromConfig created /update: solr.UpdateRequestHandler
   [junit4]   2> 806793 T3245 oascc.SolrZkClient.makePath makePath: /collections/nodes_used_collection/leader_elect/shard2/election
   [junit4]   2> 806793 T3225 oasc.RequestHandlers.initHandlersFromConfig created /admin/: org.apache.solr.handler.admin.AdminHandlers
   [junit4]   2> 806793 T3270 oass.OpenExchangeRatesOrgProvider$OpenExchangeRates.<init> WARN Unknown key IMPORTANT NOTE
   [junit4]   2> 806794 T3270 oass.OpenExchangeRatesOrgProvider$OpenExchangeRates.<init> WARN Expected key, got STRING
   [junit4]   2> 806795 T3270 oass.OpenExchangeRatesOrgProvider.reload Reloading exchange rates from open-exchange-rates.json
   [junit4]   2> 806796 T3225 oashl.XMLLoader.init xsltCacheLifetimeSeconds=60
   [junit4]   2> 806797 T3270 oass.OpenExchangeRatesOrgProvider$OpenExchangeRates.<init> WARN Unknown key IMPORTANT NOTE
   [junit4]   2> 806797 T3270 oass.OpenExchangeRatesOrgProvider$OpenExchangeRates.<init> WARN Expected key, got STRING
   [junit4]   2> 806798 T3270 oasc.SolrCore.initDirectoryFactory org.apache.solr.core.MockDirectoryFactory
   [junit4]   2> 806798 T3225 oass.SolrIndexSearcher.<init> Opening Searcher@15c0132 main
   [junit4]   2> 806798 T3245 oasc.ShardLeaderElectionContext.runLeaderProcess Running the leader process for shard shard2
   [junit4]   2> 806798 T3270 oasc.SolrCore.<init> [nodes_used_collection_shard2_replica2] Opening new SolrCore at /mnt/ssd/jenkins/workspace/Lucene-Solr-trunk-Linux/solr/build/solr-core/test/J0/./org.apache.solr.cloud.CollectionsAPIDistributedZkTest-jetty3-1375525423582/nodes_used_collection_shard2_replica2/, dataDir=/mnt/ssd/jenkins/workspace/Lucene-Solr-trunk-Linux/solr/build/solr-core/test/J0/./org.apache.solr.cloud.CollectionsAPIDistributedZkTest-jetty3-1375525423582//nodes_used_collection_shard2_replica2/data/
   [junit4]   2> 806799 T3225 oasu.CommitTracker.<init> Hard AutoCommit: disabled
   [junit4]   2> 806799 T3270 oasc.JmxMonitoredMap.<init> JMX monitoring is enabled. Adding Solr mbeans to JMX Server: com.sun.jmx.mbeanserver.JmxMBeanServer@75ec7c
   [junit4]   2> 806800 T3225 oasu.CommitTracker.<init> Soft AutoCommit: disabled
   [junit4]   2> 806801 T3270 oasc.CachingDirectoryFactory.get return new directory for /mnt/ssd/jenkins/workspace/Lucene-Solr-trunk-Linux/solr/build/solr-core/test/J0/./org.apache.solr.cloud.CollectionsAPIDistributedZkTest-jetty3-1375525423582//nodes_used_collection_shard2_replica2/data
   [junit4]   2> 806802 T3245 oasc.ShardLeaderElectionContext.waitForReplicasToComeUp Waiting until we see more replicas up for shard shard2: total=2 found=1 timeoutin=179999
   [junit4]   2> 806802 T3270 oasc.SolrCore.getNewIndexDir New index directory detected: old=null new=/mnt/ssd/jenkins/workspace/Lucene-Solr-trunk-Linux/solr/build/solr-core/test/J0/./org.apache.solr.cloud.CollectionsAPIDistributedZkTest-jetty3-1375525423582//nodes_used_collection_shard2_replica2/data/index/
   [junit4]   2> 806802 T3270 oasc.SolrCore.initIndex WARN [nodes_used_collection_shard2_replica2] Solr index directory '/mnt/ssd/jenkins/workspace/Lucene-Solr-trunk-Linux/solr/build/solr-core/test/J0/./org.apache.solr.cloud.CollectionsAPIDistributedZkTest-jetty3-1375525423582/nodes_used_collection_shard2_replica2/data/index' doesn't exist. Creating new index...
   [junit4]   2> 806803 T3270 oasc.CachingDirectoryFactory.get return new directory for /mnt/ssd/jenkins/workspace/Lucene-Solr-trunk-Linux/solr/build/solr-core/test/J0/./org.apache.solr.cloud.CollectionsAPIDistributedZkTest-jetty3-1375525423582//nodes_used_collection_shard2_replica2/data/index
   [junit4]   2> 806804 T3299 oasc.SolrCore.registerSearcher [nodes_used_collection_shard1_replica2] Registered new searcher Searcher@15c0132 main{StandardDirectoryReader(segments_1:1)}
   [junit4]   2> 806804 T3270 oasc.SolrDeletionPolicy.onCommit SolrDeletionPolicy.onCommit: commits: num=1
   [junit4]   2> 		commit{dir=MockDirWrapper(org.apache.lucene.store.RAMDirectory@1aafd84 lockFactory=org.apache.lucene.store.NativeFSLockFactory@d8b16),segFN=segments_1,generation=1}
   [junit4]   2> 806805 T3270 oasc.SolrDeletionPolicy.updateCommits newest commit generation = 1
   [junit4]   2> 806806 T3225 oasc.CoreContainer.registerCore registering core: nodes_used_collection_shard1_replica2
   [junit4]   2> 806806 T3225 oasc.ZkController.register Register replica - core:nodes_used_collection_shard1_replica2 address:http://127.0.0.1:41741/xbhli/mt collection:nodes_used_collection shard:shard1
   [junit4]   2> 806806 T3225 oascsi.HttpClientUtil.createClient Creating new http client, config:maxConnections=10000&maxConnectionsPerHost=20&connTimeout=15000&socketTimeout=30000&retry=false
   [junit4]   2> 806808 T3270 oasup.UpdateRequestProcessorChain.init inserting DistributedUpdateProcessorFactory into updateRequestProcessorChain "dedupe"
   [junit4]   2> 806808 T3270 oasup.UpdateRequestProcessorChain.init inserting DistributedUpdateProcessorFactory into updateRequestProcessorChain "stored_sig"
   [junit4]   2> 806809 T3270 oasup.UpdateRequestProcessorChain.init inserting DistributedUpdateProcessorFactory into updateRequestProcessorChain "distrib-dup-test-chain-implicit"
   [junit4]   2> 806809 T3270 oasc.RequestHandlers.initHandlersFromConfig created standard: solr.StandardRequestHandler
   [junit4]   2> 806810 T3270 oasc.RequestHandlers.initHandlersFromConfig created /get: solr.RealTimeGetHandler
   [junit4]   2> 806810 T3270 oasc.RequestHandlers.initHandlersFromConfig adding lazy requestHandler: solr.ReplicationHandler
   [junit4]   2> 806810 T3270 oasc.RequestHandlers.initHandlersFromConfig created /replication: solr.ReplicationHandler
   [junit4]   2> 806811 T3270 oasc.RequestHandlers.initHandlersFromConfig created /update: solr.UpdateRequestHandler
   [junit4]   2> 806811 T3270 oasc.RequestHandlers.initHandlersFromConfig created /admin/: org.apache.solr.handler.admin.AdminHandlers
   [junit4]   2> 806814 T3270 oashl.XMLLoader.init xsltCacheLifetimeSeconds=60
   [junit4]   2> 806816 T3270 oass.SolrIndexSearcher.<init> Opening Searcher@213366 main
   [junit4]   2> 806817 T3270 oasu.CommitTracker.<init> Hard AutoCommit: disabled
   [junit4]   2> 806817 T3270 oasu.CommitTracker.<init> Soft AutoCommit: disabled
   [junit4]   2> 806820 T3300 oasc.SolrCore.registerSearcher [nodes_used_collection_shard2_replica2] Registered new searcher Searcher@213366 main{StandardDirectoryReader(segments_1:1)}
   [junit4]   2> 806821 T3270 oasc.CoreContainer.registerCore registering core: nodes_used_collection_shard2_replica2
   [junit4]   2> 806822 T3270 oasc.ZkController.register Register replica - core:nodes_used_collection_shard2_replica2 address:http://127.0.0.1:50033/xbhli/mt collection:nodes_used_collection shard:shard2
   [junit4]   2> 806822 T3270 oascsi.HttpClientUtil.createClient Creating new http client, config:maxConnections=10000&maxConnectionsPerHost=20&connTimeout=15000&socketTimeout=30000&retry=false
   [junit4]   2> 807275 T3284 oasc.ShardLeaderElectionContext.waitForReplicasToComeUp Enough replicas found to continue.
   [junit4]   2> 807276 T3284 oasc.ShardLeaderElectionContext.runLeaderProcess I may be the new leader - try and sync
   [junit4]   2> 807276 T3284 oasc.SyncStrategy.sync Sync replicas to http://127.0.0.1:34487/xbhli/mt/nodes_used_collection_shard1_replica1/
   [junit4]   2> 807277 T3284 oasu.PeerSync.sync PeerSync: core=nodes_used_collection_shard1_replica1 url=http://127.0.0.1:34487/xbhli/mt START replicas=[http://127.0.0.1:41741/xbhli/mt/nodes_used_collection_shard1_replica2/] nUpdates=100
   [junit4]   2> 807278 T3284 oasu.PeerSync.sync PeerSync: core=nodes_used_collection_shard1_replica1 url=http://127.0.0.1:34487/xbhli/mt DONE.  We have no versions.  sync failed.
   [junit4]   2> 807278 T3284 oasc.SyncStrategy.syncReplicas Leader's attempt to sync with shard failed, moving to the next candidate
   [junit4]   2> 807279 T3284 oasc.ShardLeaderElectionContext.runLeaderProcess We failed sync, but we have no versions - we can't sync in that case - we were active before, so become leader anyway
   [junit4]   2> 807279 T3284 oasc.ShardLeaderElectionContext.runLeaderProcess I am the new leader: http://127.0.0.1:34487/xbhli/mt/nodes_used_collection_shard1_replica1/ shard1
   [junit4]   2> 807280 T3284 oascc.SolrZkClient.makePath makePath: /collections/nodes_used_collection/leaders/shard1
   [junit4]   2> ASYNC  NEW_CORE C5077 name=nodes_used_collection_shard1_replica2 org.apache.solr.core.SolrCore@13dc534 url=http://127.0.0.1:41741/xbhli/mt/nodes_used_collection_shard1_replica2 node=127.0.0.1:41741_xbhli%2Fmt C5077_STATE=coll:nodes_used_collection core:nodes_used_collection_shard1_replica2 props:{state=down, core=nodes_used_collection_shard1_replica2, node_name=127.0.0.1:41741_xbhli%2Fmt, base_url=http://127.0.0.1:41741/xbhli/mt}
   [junit4]   2> 807287 T3227 C5077 P41741 oasc.SolrCore.execute [nodes_used_collection_shard1_replica2] webapp=/xbhli/mt path=/get params={getVersions=100&distrib=false&wt=javabin&qt=/get&version=2} status=0 QTime=1 
   [junit4]   2> 807303 T3245 oasc.ShardLeaderElectionContext.waitForReplicasToComeUp Enough replicas found to continue.
   [junit4]   2> 807303 T3245 oasc.ShardLeaderElectionContext.runLeaderProcess I may be the new leader - try and sync
   [junit4]   2> 807303 T3245 oasc.SyncStrategy.sync Sync replicas to http://127.0.0.1:34842/xbhli/mt/nodes_used_collection_shard2_replica1/
   [junit4]   2> 807303 T3245 oasu.PeerSync.sync PeerSync: core=nodes_used_collection_shard2_replica1 url=http://127.0.0.1:34842/xbhli/mt START replicas=[http://127.0.0.1:50033/xbhli/mt/nodes_used_collection_shard2_replica2/] nUpdates=100
   [junit4]   2> 807304 T3245 oasu.PeerSync.sync PeerSync: core=nodes_used_collection_shard2_replica1 url=http://127.0.0.1:34842/xbhli/mt DONE.  We have no versions.  sync failed.
   [junit4]   2> 807304 T3245 oasc.SyncStrategy.syncReplicas Leader's attempt to sync with shard failed, moving to the next candidate
   [junit4]   2> 807305 T3245 oasc.ShardLeaderElectionContext.runLeaderProcess We failed sync, but we have no versions - we can't sync in that case - we were active before, so become leader anyway
   [junit4]   2> 807305 T3245 oasc.ShardLeaderElectionContext.runLeaderProcess I am the new leader: http://127.0.0.1:34842/xbhli/mt/nodes_used_collection_shard2_replica1/ shard2
   [junit4]   2> 807305 T3245 oascc.SolrZkClient.makePath makePath: /collections/nodes_used_collection/leaders/shard2
   [junit4]   2> ASYNC  NEW_CORE C5078 name=nodes_used_collection_shard2_replica2 org.apach

[...truncated too long message...]

st -Dtests.method=testDistribSearch -Dtests.seed=B5C97EC598F7BBC1 -Dtests.multiplier=3 -Dtests.slow=true -Dtests.locale=ca -Dtests.timezone=Europe/Malta -Dtests.file.encoding=US-ASCII
   [junit4] ERROR    124s J0 | CollectionsAPIDistributedZkTest.testDistribSearch <<<
   [junit4]    > Throwable #1: org.apache.solr.client.solrj.SolrServerException: Server refused connection at: http://127.0.0.1:34842/xbhli/mt
   [junit4]    > 	at __randomizedtesting.SeedInfo.seed([B5C97EC598F7BBC1:342FF0DDEFA8DBFD]:0)
   [junit4]    > 	at org.apache.solr.client.solrj.impl.HttpSolrServer.request(HttpSolrServer.java:428)
   [junit4]    > 	at org.apache.solr.client.solrj.impl.HttpSolrServer.request(HttpSolrServer.java:180)
   [junit4]    > 	at org.apache.solr.cloud.CollectionsAPIDistributedZkTest.testCustomCollectionsAPI(CollectionsAPIDistributedZkTest.java:764)
   [junit4]    > 	at org.apache.solr.cloud.CollectionsAPIDistributedZkTest.doTest(CollectionsAPIDistributedZkTest.java:159)
   [junit4]    > 	at org.apache.solr.BaseDistributedSearchTestCase.testDistribSearch(BaseDistributedSearchTestCase.java:835)
   [junit4]    > 	at java.lang.Thread.run(Thread.java:724)
   [junit4]    > Caused by: org.apache.http.conn.HttpHostConnectException: Connection to http://127.0.0.1:34842 refused
   [junit4]    > 	at org.apache.http.impl.conn.DefaultClientConnectionOperator.openConnection(DefaultClientConnectionOperator.java:190)
   [junit4]    > 	at org.apache.http.impl.conn.ManagedClientConnectionImpl.open(ManagedClientConnectionImpl.java:294)
   [junit4]    > 	at org.apache.http.impl.client.DefaultRequestDirector.tryConnect(DefaultRequestDirector.java:645)
   [junit4]    > 	at org.apache.http.impl.client.DefaultRequestDirector.execute(DefaultRequestDirector.java:480)
   [junit4]    > 	at org.apache.http.impl.client.AbstractHttpClient.execute(AbstractHttpClient.java:906)
   [junit4]    > 	at org.apache.http.impl.client.AbstractHttpClient.execute(AbstractHttpClient.java:805)
   [junit4]    > 	at org.apache.http.impl.client.AbstractHttpClient.execute(AbstractHttpClient.java:784)
   [junit4]    > 	at org.apache.solr.client.solrj.impl.HttpSolrServer.request(HttpSolrServer.java:365)
   [junit4]    > 	... 44 more
   [junit4]    > Caused by: java.net.ConnectException: Connection refused
   [junit4]    > 	at java.net.PlainSocketImpl.socketConnect(Native Method)
   [junit4]    > 	at java.net.AbstractPlainSocketImpl.doConnect(AbstractPlainSocketImpl.java:339)
   [junit4]    > 	at java.net.AbstractPlainSocketImpl.connectToAddress(AbstractPlainSocketImpl.java:200)
   [junit4]    > 	at java.net.AbstractPlainSocketImpl.connect(AbstractPlainSocketImpl.java:182)
   [junit4]    > 	at java.net.SocksSocketImpl.connect(SocksSocketImpl.java:392)
   [junit4]    > 	at java.net.Socket.connect(Socket.java:579)
   [junit4]    > 	at org.apache.http.conn.scheme.PlainSocketFactory.connectSocket(PlainSocketFactory.java:127)
   [junit4]    > 	at org.apache.http.impl.conn.DefaultClientConnectionOperator.openConnection(DefaultClientConnectionOperator.java:180)
   [junit4]    > 	... 51 more
   [junit4]   2> 921651 T3209 oas.SolrTestCaseJ4.deleteCore ###deleteCore
   [junit4]   2> 124371 T3208 ccr.ThreadLeakControl.checkThreadLeaks WARNING Will linger awaiting termination of 1 leaked thread(s).
   [junit4]   2> 922166 T3291 oasc.LeaderElector$1.process WARN  org.apache.zookeeper.KeeperException$SessionExpiredException: KeeperErrorCode = Session expired for /collections/new_implicit_coll_0/leader_elect/c/election
   [junit4]   2> 	at org.apache.zookeeper.KeeperException.create(KeeperException.java:127)
   [junit4]   2> 	at org.apache.zookeeper.KeeperException.create(KeeperException.java:51)
   [junit4]   2> 	at org.apache.zookeeper.ZooKeeper.getChildren(ZooKeeper.java:1468)
   [junit4]   2> 	at org.apache.solr.common.cloud.SolrZkClient$6.execute(SolrZkClient.java:235)
   [junit4]   2> 	at org.apache.solr.common.cloud.SolrZkClient$6.execute(SolrZkClient.java:232)
   [junit4]   2> 	at org.apache.solr.common.cloud.ZkCmdExecutor.retryOperation(ZkCmdExecutor.java:65)
   [junit4]   2> 	at org.apache.solr.common.cloud.SolrZkClient.getChildren(SolrZkClient.java:232)
   [junit4]   2> 	at org.apache.solr.cloud.LeaderElector.checkIfIamLeader(LeaderElector.java:84)
   [junit4]   2> 	at org.apache.solr.cloud.LeaderElector.access$000(LeaderElector.java:55)
   [junit4]   2> 	at org.apache.solr.cloud.LeaderElector$1.process(LeaderElector.java:129)
   [junit4]   2> 	at org.apache.zookeeper.ClientCnxn$EventThread.processEvent(ClientCnxn.java:519)
   [junit4]   2> 	at org.apache.zookeeper.ClientCnxn$EventThread.run(ClientCnxn.java:495)
   [junit4]   2> 
   [junit4]   2> 922167 T3291 oascc.ZkStateReader$2.process A cluster state change: WatchedEvent state:SyncConnected type:NodeChildrenChanged path:/live_nodes, has occurred - updating... (live nodes size: 1)
   [junit4]   2> 922167 T3291 oascc.ZkStateReader$2.process WARN ZooKeeper watch triggered, but Solr cannot talk to ZK
   [junit4]   2> 922167 T3291 oascc.ZkStateReader$3.process WARN ZooKeeper watch triggered, but Solr cannot talk to ZK
   [junit4]   2> 922168 T3291 oasc.LeaderElector$1.process WARN  org.apache.zookeeper.KeeperException$SessionExpiredException: KeeperErrorCode = Session expired for /collections/new_implicit_coll_0/leader_elect/b/election
   [junit4]   2> 	at org.apache.zookeeper.KeeperException.create(KeeperException.java:127)
   [junit4]   2> 	at org.apache.zookeeper.KeeperException.create(KeeperException.java:51)
   [junit4]   2> 	at org.apache.zookeeper.ZooKeeper.getChildren(ZooKeeper.java:1468)
   [junit4]   2> 	at org.apache.solr.common.cloud.SolrZkClient$6.execute(SolrZkClient.java:235)
   [junit4]   2> 	at org.apache.solr.common.cloud.SolrZkClient$6.execute(SolrZkClient.java:232)
   [junit4]   2> 	at org.apache.solr.common.cloud.ZkCmdExecutor.retryOperation(ZkCmdExecutor.java:65)
   [junit4]   2> 	at org.apache.solr.common.cloud.SolrZkClient.getChildren(SolrZkClient.java:232)
   [junit4]   2> 	at org.apache.solr.cloud.LeaderElector.checkIfIamLeader(LeaderElector.java:84)
   [junit4]   2> 	at org.apache.solr.cloud.LeaderElector.access$000(LeaderElector.java:55)
   [junit4]   2> 	at org.apache.solr.cloud.LeaderElector$1.process(LeaderElector.java:129)
   [junit4]   2> 	at org.apache.zookeeper.ClientCnxn$EventThread.processEvent(ClientCnxn.java:519)
   [junit4]   2> 	at org.apache.zookeeper.ClientCnxn$EventThread.run(ClientCnxn.java:495)
   [junit4]   2> 
   [junit4]   2> NOTE: test params are: codec=CheapBastard, sim=RandomSimilarityProvider(queryNorm=false,coord=yes): {}, locale=ca, timezone=Europe/Malta
   [junit4]   2> NOTE: Linux 3.2.0-51-generic i386/Oracle Corporation 1.7.0_25 (32-bit)/cpus=8,threads=11,free=48447192,total=202874880
   [junit4]   2> NOTE: All tests run in this JVM: [TestSort, FileBasedSpellCheckerTest, AnalysisAfterCoreReloadTest, SolrIndexSplitterTest, ChaosMonkeyNothingIsSafeTest, TestSolrIndexConfig, TestStressRecovery, SoftAutoCommitTest, CacheHeaderTest, SolrInfoMBeanTest, TestDocumentBuilder, BasicFunctionalityTest, ZkCLITest, TestFaceting, SolrTestCaseJ4Test, TestFuzzyAnalyzedSuggestions, LoggingHandlerTest, TestFunctionQuery, BadComponentTest, SliceStateTest, TestReversedWildcardFilterFactory, DistributedTermsComponentTest, TestConfig, TestTrie, MinimalSchemaTest, TestDynamicFieldCollectionResource, TestValueSourceCache, LegacyHTMLStripCharFilterTest, TestStressVersions, TestCloudManagedSchemaAddField, BinaryUpdateRequestHandlerTest, PeerSyncTest, ResourceLoaderTest, IndexSchemaTest, TestSurroundQueryParser, TestRemoteStreaming, LeaderElectionTest, ShowFileRequestHandlerTest, TestSweetSpotSimilarityFactory, TestReplicationHandler, AutoCommitTest, CoreMergeIndexesAdminHandlerTest, PluginInfoTest, WordBreakSolrSpellCheckerTest, ScriptEngineTest, TestSolrDeletionPolicy1, TestWriterPerf, DistributedQueryElevationComponentTest, DistributedSpellCheckComponentTest, SliceStateUpdateTest, UUIDFieldTest, TestPseudoReturnFields, ExternalFileFieldSortTest, AddSchemaFieldsUpdateProcessorFactoryTest, StatelessScriptUpdateProcessorFactoryTest, TestSolrDeletionPolicy2, TestPerFieldSimilarity, SuggesterFSTTest, TestGroupingSearch, CircularListTest, SystemInfoHandlerTest, OverseerCollectionProcessorTest, DocumentBuilderTest, TestSolrXmlPersistence, TestXIncludeConfig, TestCoreContainer, CoreAdminHandlerTest, DateFieldTest, BasicDistributedZkTest, PreAnalyzedUpdateProcessorTest, TestQuerySenderListener, RegexBoostProcessorTest, TestFieldResource, TestSolrQueryParserDefaultOperatorResource, HdfsChaosMonkeySafeLeaderTest, MoreLikeThisHandlerTest, ShardRoutingTest, SolrCoreTest, InfoHandlerTest, CollectionsAPIDistributedZkTest]
   [junit4] Completed on J0 in 125.15s, 1 test, 1 error <<< FAILURES!

[...truncated 493 lines...]
BUILD FAILED
/mnt/ssd/jenkins/workspace/Lucene-Solr-trunk-Linux/build.xml:389: The following error occurred while executing this line:
/mnt/ssd/jenkins/workspace/Lucene-Solr-trunk-Linux/build.xml:369: The following error occurred while executing this line:
/mnt/ssd/jenkins/workspace/Lucene-Solr-trunk-Linux/build.xml:39: The following error occurred while executing this line:
/mnt/ssd/jenkins/workspace/Lucene-Solr-trunk-Linux/solr/build.xml:181: The following error occurred while executing this line:
/mnt/ssd/jenkins/workspace/Lucene-Solr-trunk-Linux/solr/common-build.xml:449: The following error occurred while executing this line:
/mnt/ssd/jenkins/workspace/Lucene-Solr-trunk-Linux/lucene/common-build.xml:1230: The following error occurred while executing this line:
/mnt/ssd/jenkins/workspace/Lucene-Solr-trunk-Linux/lucene/common-build.xml:873: There were test failures: 320 suites, 1347 tests, 1 error, 34 ignored (6 assumptions)

Total time: 43 minutes 54 seconds
Build step 'Invoke Ant' marked build as failure
Description set: Java: 32bit/jdk1.7.0_25 -client -XX:+UseConcMarkSweepGC
Archiving artifacts
Recording test results
Email was triggered for: Failure
Sending email for trigger: Failure



Mime
View raw message