lucene-dev mailing list archives

Site index · List index
Message view « Date » · « Thread »
Top « Date » · « Thread »
From Policeman Jenkins Server <jenk...@thetaphi.de>
Subject [JENKINS] Lucene-Solr-4.x-Linux (64bit/jdk1.6.0_45) - Build # 6746 - Still Failing!
Date Thu, 01 Aug 2013 07:35:35 GMT
Build: http://jenkins.thetaphi.de/job/Lucene-Solr-4.x-Linux/6746/
Java: 64bit/jdk1.6.0_45 -XX:-UseCompressedOops -XX:+UseConcMarkSweepGC

1 tests failed.
FAILED:  org.apache.solr.cloud.CollectionsAPIDistributedZkTest.testDistribSearch

Error Message:
Server refused connection at: http://127.0.0.1:48965

Stack Trace:
org.apache.solr.client.solrj.SolrServerException: Server refused connection at: http://127.0.0.1:48965
	at __randomizedtesting.SeedInfo.seed([1C8DE9553FDBEA04:9D6B674D48848A38]:0)
	at org.apache.solr.client.solrj.impl.HttpSolrServer.request(HttpSolrServer.java:428)
	at org.apache.solr.client.solrj.impl.HttpSolrServer.request(HttpSolrServer.java:180)
	at org.apache.solr.cloud.CollectionsAPIDistributedZkTest.testCustomCollectionsAPI(CollectionsAPIDistributedZkTest.java:764)
	at org.apache.solr.cloud.CollectionsAPIDistributedZkTest.doTest(CollectionsAPIDistributedZkTest.java:159)
	at org.apache.solr.BaseDistributedSearchTestCase.testDistribSearch(BaseDistributedSearchTestCase.java:835)
	at sun.reflect.NativeMethodAccessorImpl.invoke0(Native Method)
	at sun.reflect.NativeMethodAccessorImpl.invoke(NativeMethodAccessorImpl.java:39)
	at sun.reflect.DelegatingMethodAccessorImpl.invoke(DelegatingMethodAccessorImpl.java:25)
	at java.lang.reflect.Method.invoke(Method.java:597)
	at com.carrotsearch.randomizedtesting.RandomizedRunner.invoke(RandomizedRunner.java:1559)
	at com.carrotsearch.randomizedtesting.RandomizedRunner.access$600(RandomizedRunner.java:79)
	at com.carrotsearch.randomizedtesting.RandomizedRunner$6.evaluate(RandomizedRunner.java:737)
	at com.carrotsearch.randomizedtesting.RandomizedRunner$7.evaluate(RandomizedRunner.java:773)
	at com.carrotsearch.randomizedtesting.RandomizedRunner$8.evaluate(RandomizedRunner.java:787)
	at com.carrotsearch.randomizedtesting.rules.SystemPropertiesRestoreRule$1.evaluate(SystemPropertiesRestoreRule.java:53)
	at org.apache.lucene.util.TestRuleSetupTeardownChained$1.evaluate(TestRuleSetupTeardownChained.java:50)
	at org.apache.lucene.util.TestRuleFieldCacheSanity$1.evaluate(TestRuleFieldCacheSanity.java:51)
	at org.apache.lucene.util.AbstractBeforeAfterRule$1.evaluate(AbstractBeforeAfterRule.java:46)
	at com.carrotsearch.randomizedtesting.rules.SystemPropertiesInvariantRule$1.evaluate(SystemPropertiesInvariantRule.java:55)
	at org.apache.lucene.util.TestRuleThreadAndTestName$1.evaluate(TestRuleThreadAndTestName.java:49)
	at org.apache.lucene.util.TestRuleIgnoreAfterMaxFailures$1.evaluate(TestRuleIgnoreAfterMaxFailures.java:70)
	at org.apache.lucene.util.TestRuleMarkFailure$1.evaluate(TestRuleMarkFailure.java:48)
	at com.carrotsearch.randomizedtesting.rules.StatementAdapter.evaluate(StatementAdapter.java:36)
	at com.carrotsearch.randomizedtesting.ThreadLeakControl$StatementRunner.run(ThreadLeakControl.java:358)
	at com.carrotsearch.randomizedtesting.ThreadLeakControl.forkTimeoutingTask(ThreadLeakControl.java:782)
	at com.carrotsearch.randomizedtesting.ThreadLeakControl$3.evaluate(ThreadLeakControl.java:442)
	at com.carrotsearch.randomizedtesting.RandomizedRunner.runSingleTest(RandomizedRunner.java:746)
	at com.carrotsearch.randomizedtesting.RandomizedRunner$3.evaluate(RandomizedRunner.java:648)
	at com.carrotsearch.randomizedtesting.RandomizedRunner$4.evaluate(RandomizedRunner.java:682)
	at com.carrotsearch.randomizedtesting.RandomizedRunner$5.evaluate(RandomizedRunner.java:693)
	at com.carrotsearch.randomizedtesting.rules.StatementAdapter.evaluate(StatementAdapter.java:36)
	at com.carrotsearch.randomizedtesting.rules.SystemPropertiesRestoreRule$1.evaluate(SystemPropertiesRestoreRule.java:53)
	at org.apache.lucene.util.AbstractBeforeAfterRule$1.evaluate(AbstractBeforeAfterRule.java:46)
	at org.apache.lucene.util.TestRuleStoreClassName$1.evaluate(TestRuleStoreClassName.java:42)
	at com.carrotsearch.randomizedtesting.rules.SystemPropertiesInvariantRule$1.evaluate(SystemPropertiesInvariantRule.java:55)
	at com.carrotsearch.randomizedtesting.rules.NoShadowingOrOverridesOnMethodsRule$1.evaluate(NoShadowingOrOverridesOnMethodsRule.java:39)
	at com.carrotsearch.randomizedtesting.rules.NoShadowingOrOverridesOnMethodsRule$1.evaluate(NoShadowingOrOverridesOnMethodsRule.java:39)
	at com.carrotsearch.randomizedtesting.rules.StatementAdapter.evaluate(StatementAdapter.java:36)
	at org.apache.lucene.util.TestRuleAssertionsRequired$1.evaluate(TestRuleAssertionsRequired.java:43)
	at org.apache.lucene.util.TestRuleMarkFailure$1.evaluate(TestRuleMarkFailure.java:48)
	at org.apache.lucene.util.TestRuleIgnoreAfterMaxFailures$1.evaluate(TestRuleIgnoreAfterMaxFailures.java:70)
	at org.apache.lucene.util.TestRuleIgnoreTestSuites$1.evaluate(TestRuleIgnoreTestSuites.java:55)
	at com.carrotsearch.randomizedtesting.rules.StatementAdapter.evaluate(StatementAdapter.java:36)
	at com.carrotsearch.randomizedtesting.ThreadLeakControl$StatementRunner.run(ThreadLeakControl.java:358)
	at java.lang.Thread.run(Thread.java:662)
Caused by: org.apache.http.conn.HttpHostConnectException: Connection to http://127.0.0.1:48965 refused
	at org.apache.http.impl.conn.DefaultClientConnectionOperator.openConnection(DefaultClientConnectionOperator.java:190)
	at org.apache.http.impl.conn.ManagedClientConnectionImpl.open(ManagedClientConnectionImpl.java:294)
	at org.apache.http.impl.client.DefaultRequestDirector.tryConnect(DefaultRequestDirector.java:645)
	at org.apache.http.impl.client.DefaultRequestDirector.execute(DefaultRequestDirector.java:480)
	at org.apache.http.impl.client.AbstractHttpClient.execute(AbstractHttpClient.java:906)
	at org.apache.http.impl.client.AbstractHttpClient.execute(AbstractHttpClient.java:805)
	at org.apache.http.impl.client.AbstractHttpClient.execute(AbstractHttpClient.java:784)
	at org.apache.solr.client.solrj.impl.HttpSolrServer.request(HttpSolrServer.java:365)
	... 44 more
Caused by: java.net.ConnectException: Connection refused
	at java.net.PlainSocketImpl.socketConnect(Native Method)
	at java.net.PlainSocketImpl.doConnect(PlainSocketImpl.java:351)
	at java.net.PlainSocketImpl.connectToAddress(PlainSocketImpl.java:213)
	at java.net.PlainSocketImpl.connect(PlainSocketImpl.java:200)
	at java.net.SocksSocketImpl.connect(SocksSocketImpl.java:366)
	at java.net.Socket.connect(Socket.java:529)
	at org.apache.http.conn.scheme.PlainSocketFactory.connectSocket(PlainSocketFactory.java:127)
	at org.apache.http.impl.conn.DefaultClientConnectionOperator.openConnection(DefaultClientConnectionOperator.java:180)
	... 51 more




Build Log:
[...truncated 9239 lines...]
   [junit4] Suite: org.apache.solr.cloud.CollectionsAPIDistributedZkTest
   [junit4]   2> 649972 T2166 oas.BaseDistributedSearchTestCase.initHostContext Setting hostContext system property: /
   [junit4]   2> 649977 T2166 oas.SolrTestCaseJ4.setUp ###Starting testDistribSearch
   [junit4]   2> Creating dataDir: /mnt/ssd/jenkins/workspace/Lucene-Solr-4.x-Linux/solr/build/solr-core/test/J1/./solrtest-CollectionsAPIDistributedZkTest-1375341606009
   [junit4]   2> 649978 T2166 oasc.ZkTestServer.run STARTING ZK TEST SERVER
   [junit4]   2> 649978 T2167 oasc.ZkTestServer$ZKServerMain.runFromConfig Starting server
   [junit4]   2> 650078 T2166 oasc.ZkTestServer.run start zk server on port:58707
   [junit4]   2> 650079 T2166 oascc.ConnectionManager.waitForConnected Waiting for client to connect to ZooKeeper
   [junit4]   2> 650083 T2173 oascc.ConnectionManager.process Watcher org.apache.solr.common.cloud.ConnectionManager@744e1c94 name:ZooKeeperConnection Watcher:127.0.0.1:58707 got event WatchedEvent state:SyncConnected type:None path:null path:null type:None
   [junit4]   2> 650083 T2166 oascc.ConnectionManager.waitForConnected Client is connected to ZooKeeper
   [junit4]   2> 650084 T2166 oascc.SolrZkClient.makePath makePath: /solr
   [junit4]   2> 650089 T2166 oascc.ConnectionManager.waitForConnected Waiting for client to connect to ZooKeeper
   [junit4]   2> 650090 T2175 oascc.ConnectionManager.process Watcher org.apache.solr.common.cloud.ConnectionManager@2f9065ba name:ZooKeeperConnection Watcher:127.0.0.1:58707/solr got event WatchedEvent state:SyncConnected type:None path:null path:null type:None
   [junit4]   2> 650090 T2166 oascc.ConnectionManager.waitForConnected Client is connected to ZooKeeper
   [junit4]   2> 650090 T2166 oascc.SolrZkClient.makePath makePath: /collections/collection1
   [junit4]   2> 650094 T2166 oascc.SolrZkClient.makePath makePath: /collections/collection1/shards
   [junit4]   2> 650098 T2166 oascc.SolrZkClient.makePath makePath: /collections/control_collection
   [junit4]   2> 650101 T2166 oascc.SolrZkClient.makePath makePath: /collections/control_collection/shards
   [junit4]   2> 650104 T2166 oasc.AbstractZkTestCase.putConfig put /mnt/ssd/jenkins/workspace/Lucene-Solr-4.x-Linux/solr/build/solr-core/test-files/solr/collection1/conf/solrconfig-tlog.xml to /configs/conf1/solrconfig.xml
   [junit4]   2> 650105 T2166 oascc.SolrZkClient.makePath makePath: /configs/conf1/solrconfig.xml
   [junit4]   2> 650110 T2166 oasc.AbstractZkTestCase.putConfig put /mnt/ssd/jenkins/workspace/Lucene-Solr-4.x-Linux/solr/build/solr-core/test-files/solr/collection1/conf/schema.xml to /configs/conf1/schema.xml
   [junit4]   2> 650111 T2166 oascc.SolrZkClient.makePath makePath: /configs/conf1/schema.xml
   [junit4]   2> 650115 T2166 oasc.AbstractZkTestCase.putConfig put /mnt/ssd/jenkins/workspace/Lucene-Solr-4.x-Linux/solr/build/solr-core/test-files/solr/collection1/conf/stopwords.txt to /configs/conf1/stopwords.txt
   [junit4]   2> 650116 T2166 oascc.SolrZkClient.makePath makePath: /configs/conf1/stopwords.txt
   [junit4]   2> 650120 T2166 oasc.AbstractZkTestCase.putConfig put /mnt/ssd/jenkins/workspace/Lucene-Solr-4.x-Linux/solr/build/solr-core/test-files/solr/collection1/conf/protwords.txt to /configs/conf1/protwords.txt
   [junit4]   2> 650120 T2166 oascc.SolrZkClient.makePath makePath: /configs/conf1/protwords.txt
   [junit4]   2> 650124 T2166 oasc.AbstractZkTestCase.putConfig put /mnt/ssd/jenkins/workspace/Lucene-Solr-4.x-Linux/solr/build/solr-core/test-files/solr/collection1/conf/currency.xml to /configs/conf1/currency.xml
   [junit4]   2> 650125 T2166 oascc.SolrZkClient.makePath makePath: /configs/conf1/currency.xml
   [junit4]   2> 650129 T2166 oasc.AbstractZkTestCase.putConfig put /mnt/ssd/jenkins/workspace/Lucene-Solr-4.x-Linux/solr/build/solr-core/test-files/solr/collection1/conf/open-exchange-rates.json to /configs/conf1/open-exchange-rates.json
   [junit4]   2> 650130 T2166 oascc.SolrZkClient.makePath makePath: /configs/conf1/open-exchange-rates.json
   [junit4]   2> 650134 T2166 oasc.AbstractZkTestCase.putConfig put /mnt/ssd/jenkins/workspace/Lucene-Solr-4.x-Linux/solr/build/solr-core/test-files/solr/collection1/conf/mapping-ISOLatin1Accent.txt to /configs/conf1/mapping-ISOLatin1Accent.txt
   [junit4]   2> 650134 T2166 oascc.SolrZkClient.makePath makePath: /configs/conf1/mapping-ISOLatin1Accent.txt
   [junit4]   2> 650139 T2166 oasc.AbstractZkTestCase.putConfig put /mnt/ssd/jenkins/workspace/Lucene-Solr-4.x-Linux/solr/build/solr-core/test-files/solr/collection1/conf/old_synonyms.txt to /configs/conf1/old_synonyms.txt
   [junit4]   2> 650139 T2166 oascc.SolrZkClient.makePath makePath: /configs/conf1/old_synonyms.txt
   [junit4]   2> 650143 T2166 oasc.AbstractZkTestCase.putConfig put /mnt/ssd/jenkins/workspace/Lucene-Solr-4.x-Linux/solr/build/solr-core/test-files/solr/collection1/conf/synonyms.txt to /configs/conf1/synonyms.txt
   [junit4]   2> 650143 T2166 oascc.SolrZkClient.makePath makePath: /configs/conf1/synonyms.txt
   [junit4]   2> 650222 T2166 oejs.Server.doStart jetty-8.1.10.v20130312
   [junit4]   2> 650225 T2166 oejs.AbstractConnector.doStart Started SelectChannelConnector@127.0.0.1:56128
   [junit4]   2> 650226 T2166 oass.SolrDispatchFilter.init SolrDispatchFilter.init()
   [junit4]   2> 650226 T2166 oasc.SolrResourceLoader.locateSolrHome JNDI not configured for solr (NoInitialContextEx)
   [junit4]   2> 650227 T2166 oasc.SolrResourceLoader.locateSolrHome using system property solr.solr.home: /mnt/ssd/jenkins/workspace/Lucene-Solr-4.x-Linux/solr/build/solr-core/test/J1/./org.apache.solr.cloud.CollectionsAPIDistributedZkTest-controljetty-1375341606180
   [junit4]   2> 650227 T2166 oasc.SolrResourceLoader.<init> new SolrResourceLoader for directory: '/mnt/ssd/jenkins/workspace/Lucene-Solr-4.x-Linux/solr/build/solr-core/test/J1/./org.apache.solr.cloud.CollectionsAPIDistributedZkTest-controljetty-1375341606180/'
   [junit4]   2> 650239 T2166 oasc.ConfigSolr.fromFile Loading container configuration from /mnt/ssd/jenkins/workspace/Lucene-Solr-4.x-Linux/solr/build/solr-core/test/J1/./org.apache.solr.cloud.CollectionsAPIDistributedZkTest-controljetty-1375341606180/solr.xml
   [junit4]   2> 650296 T2166 oasc.ConfigSolrXml.<init> Config-defined core root directory: 
   [junit4]   2> 650296 T2166 oasc.CoreContainer.<init> New CoreContainer 1941417921
   [junit4]   2> 650297 T2166 oasc.CoreContainer.load Loading cores into CoreContainer [instanceDir=/mnt/ssd/jenkins/workspace/Lucene-Solr-4.x-Linux/solr/build/solr-core/test/J1/./org.apache.solr.cloud.CollectionsAPIDistributedZkTest-controljetty-1375341606180/]
   [junit4]   2> 650298 T2166 oashc.HttpShardHandlerFactory.getParameter Setting socketTimeout to: 120000
   [junit4]   2> 650298 T2166 oashc.HttpShardHandlerFactory.getParameter Setting urlScheme to: http://
   [junit4]   2> 650299 T2166 oashc.HttpShardHandlerFactory.getParameter Setting connTimeout to: 15000
   [junit4]   2> 650299 T2166 oashc.HttpShardHandlerFactory.getParameter Setting maxConnectionsPerHost to: 20
   [junit4]   2> 650299 T2166 oashc.HttpShardHandlerFactory.getParameter Setting corePoolSize to: 0
   [junit4]   2> 650300 T2166 oashc.HttpShardHandlerFactory.getParameter Setting maximumPoolSize to: 2147483647
   [junit4]   2> 650300 T2166 oashc.HttpShardHandlerFactory.getParameter Setting maxThreadIdleTime to: 5
   [junit4]   2> 650300 T2166 oashc.HttpShardHandlerFactory.getParameter Setting sizeOfQueue to: -1
   [junit4]   2> 650301 T2166 oashc.HttpShardHandlerFactory.getParameter Setting fairnessPolicy to: false
   [junit4]   2> 650301 T2166 oascsi.HttpClientUtil.createClient Creating new http client, config:maxConnectionsPerHost=20&maxConnections=10000&socketTimeout=120000&connTimeout=15000&retry=false
   [junit4]   2> 650304 T2166 oasc.ZkContainer.initZooKeeper Zookeeper client=127.0.0.1:58707/solr
   [junit4]   2> 650305 T2166 oasc.ZkController.checkChrootPath zkHost includes chroot
   [junit4]   2> 650305 T2166 oascc.ConnectionManager.waitForConnected Waiting for client to connect to ZooKeeper
   [junit4]   2> 650307 T2186 oascc.ConnectionManager.process Watcher org.apache.solr.common.cloud.ConnectionManager@2073e341 name:ZooKeeperConnection Watcher:127.0.0.1:58707 got event WatchedEvent state:SyncConnected type:None path:null path:null type:None
   [junit4]   2> 650307 T2166 oascc.ConnectionManager.waitForConnected Client is connected to ZooKeeper
   [junit4]   2> 650310 T2166 oascsi.HttpClientUtil.createClient Creating new http client, config:maxConnections=500&maxConnectionsPerHost=16&socketTimeout=120000&connTimeout=15000
   [junit4]   2> 650313 T2166 oascc.ConnectionManager.waitForConnected Waiting for client to connect to ZooKeeper
   [junit4]   2> 650315 T2188 oascc.ConnectionManager.process Watcher org.apache.solr.common.cloud.ConnectionManager@5614f152 name:ZooKeeperConnection Watcher:127.0.0.1:58707/solr got event WatchedEvent state:SyncConnected type:None path:null path:null type:None
   [junit4]   2> 650315 T2166 oascc.ConnectionManager.waitForConnected Client is connected to ZooKeeper
   [junit4]   2> 650317 T2166 oascc.SolrZkClient.makePath makePath: /overseer/queue
   [junit4]   2> 650322 T2166 oascc.SolrZkClient.makePath makePath: /overseer/collection-queue-work
   [junit4]   2> 650327 T2166 oascc.SolrZkClient.makePath makePath: /live_nodes
   [junit4]   2> 650330 T2166 oasc.ZkController.createEphemeralLiveNode Register node as live in ZooKeeper:/live_nodes/127.0.0.1:56128_
   [junit4]   2> 650331 T2166 oascc.SolrZkClient.makePath makePath: /live_nodes/127.0.0.1:56128_
   [junit4]   2> 650337 T2166 oascc.SolrZkClient.makePath makePath: /overseer_elect/election
   [junit4]   2> 650343 T2166 oascc.SolrZkClient.makePath makePath: /overseer_elect/leader
   [junit4]   2> 650346 T2166 oasc.Overseer.start Overseer (id=90134387491536899-127.0.0.1:56128_-n_0000000000) starting
   [junit4]   2> 650350 T2166 oascc.SolrZkClient.makePath makePath: /overseer/queue-work
   [junit4]   2> 650355 T2190 oasc.OverseerCollectionProcessor.run Process current queue of collection creations
   [junit4]   2> 650356 T2166 oascc.SolrZkClient.makePath makePath: /clusterstate.json
   [junit4]   2> 650360 T2166 oascc.SolrZkClient.makePath makePath: /aliases.json
   [junit4]   2> 650362 T2166 oascc.ZkStateReader.createClusterStateWatchersAndUpdate Updating cluster state from ZooKeeper... 
   [junit4]   2> 650367 T2189 oasc.Overseer$ClusterStateUpdater.run Starting to work on the main queue
   [junit4]   2> 650370 T2166 oasc.CorePropertiesLocator.discover Looking for core definitions underneath /mnt/ssd/jenkins/workspace/Lucene-Solr-4.x-Linux/solr/build/solr-core/test/J1/./org.apache.solr.cloud.CollectionsAPIDistributedZkTest-controljetty-1375341606180
   [junit4]   2> 650393 T2166 oasc.CorePropertiesLocator.discoverUnder Found core conf in /mnt/ssd/jenkins/workspace/Lucene-Solr-4.x-Linux/solr/build/solr-core/test/J1/./org.apache.solr.cloud.CollectionsAPIDistributedZkTest-controljetty-1375341606180/conf/
   [junit4]   2> 650394 T2166 oasc.CorePropertiesLocator.discover Found 1 core definitions
   [junit4]   2> 650394 T2166 oass.SolrDispatchFilter.init user.dir=/mnt/ssd/jenkins/workspace/Lucene-Solr-4.x-Linux/solr/build/solr-core/test/J1
   [junit4]   2> 650395 T2166 oass.SolrDispatchFilter.init SolrDispatchFilter.init() done
   [junit4]   2> 650395 T2166 oascsi.HttpClientUtil.createClient Creating new http client, config:maxConnections=128&maxConnectionsPerHost=32&followRedirects=false
   [junit4]   2> 650398 T2166 oascsi.HttpClientUtil.createClient Creating new http client, config:
   [junit4]   2> 650399 T2166 oascc.ConnectionManager.waitForConnected Waiting for client to connect to ZooKeeper
   [junit4]   2> 650401 T2193 oascc.ConnectionManager.process Watcher org.apache.solr.common.cloud.ConnectionManager@28ec9089 name:ZooKeeperConnection Watcher:127.0.0.1:58707/solr got event WatchedEvent state:SyncConnected type:None path:null path:null type:None
   [junit4]   2> 650401 T2166 oascc.ConnectionManager.waitForConnected Client is connected to ZooKeeper
   [junit4]   2> 650403 T2166 oascc.ZkStateReader.createClusterStateWatchersAndUpdate Updating cluster state from ZooKeeper... 
   [junit4]   2> 650407 T2166 oasc.ChaosMonkey.monkeyLog monkey: init - expire sessions:true cause connection loss:true
   [junit4]   2> 650483 T2166 oejs.Server.doStart jetty-8.1.10.v20130312
   [junit4]   2> 650485 T2166 oejs.AbstractConnector.doStart Started SelectChannelConnector@127.0.0.1:48965
   [junit4]   2> 650486 T2166 oass.SolrDispatchFilter.init SolrDispatchFilter.init()
   [junit4]   2> 650486 T2166 oasc.SolrResourceLoader.locateSolrHome JNDI not configured for solr (NoInitialContextEx)
   [junit4]   2> 650487 T2166 oasc.SolrResourceLoader.locateSolrHome using system property solr.solr.home: /mnt/ssd/jenkins/workspace/Lucene-Solr-4.x-Linux/solr/build/solr-core/test/J1/./org.apache.solr.cloud.CollectionsAPIDistributedZkTest-jetty1-1375341606438
   [junit4]   2> 650487 T2166 oasc.SolrResourceLoader.<init> new SolrResourceLoader for directory: '/mnt/ssd/jenkins/workspace/Lucene-Solr-4.x-Linux/solr/build/solr-core/test/J1/./org.apache.solr.cloud.CollectionsAPIDistributedZkTest-jetty1-1375341606438/'
   [junit4]   2> 650499 T2166 oasc.ConfigSolr.fromFile Loading container configuration from /mnt/ssd/jenkins/workspace/Lucene-Solr-4.x-Linux/solr/build/solr-core/test/J1/./org.apache.solr.cloud.CollectionsAPIDistributedZkTest-jetty1-1375341606438/solr.xml
   [junit4]   2> 650539 T2166 oasc.ConfigSolrXml.<init> Config-defined core root directory: 
   [junit4]   2> 650539 T2166 oasc.CoreContainer.<init> New CoreContainer 1549874964
   [junit4]   2> 650540 T2166 oasc.CoreContainer.load Loading cores into CoreContainer [instanceDir=/mnt/ssd/jenkins/workspace/Lucene-Solr-4.x-Linux/solr/build/solr-core/test/J1/./org.apache.solr.cloud.CollectionsAPIDistributedZkTest-jetty1-1375341606438/]
   [junit4]   2> 650549 T2166 oashc.HttpShardHandlerFactory.getParameter Setting socketTimeout to: 120000
   [junit4]   2> 650549 T2166 oashc.HttpShardHandlerFactory.getParameter Setting urlScheme to: http://
   [junit4]   2> 650549 T2166 oashc.HttpShardHandlerFactory.getParameter Setting connTimeout to: 15000
   [junit4]   2> 650550 T2166 oashc.HttpShardHandlerFactory.getParameter Setting maxConnectionsPerHost to: 20
   [junit4]   2> 650550 T2166 oashc.HttpShardHandlerFactory.getParameter Setting corePoolSize to: 0
   [junit4]   2> 650550 T2166 oashc.HttpShardHandlerFactory.getParameter Setting maximumPoolSize to: 2147483647
   [junit4]   2> 650551 T2166 oashc.HttpShardHandlerFactory.getParameter Setting maxThreadIdleTime to: 5
   [junit4]   2> 650551 T2166 oashc.HttpShardHandlerFactory.getParameter Setting sizeOfQueue to: -1
   [junit4]   2> 650552 T2166 oashc.HttpShardHandlerFactory.getParameter Setting fairnessPolicy to: false
   [junit4]   2> 650552 T2166 oascsi.HttpClientUtil.createClient Creating new http client, config:maxConnectionsPerHost=20&maxConnections=10000&socketTimeout=120000&connTimeout=15000&retry=false
   [junit4]   2> 650555 T2166 oasc.ZkContainer.initZooKeeper Zookeeper client=127.0.0.1:58707/solr
   [junit4]   2> 650555 T2166 oasc.ZkController.checkChrootPath zkHost includes chroot
   [junit4]   2> 650556 T2166 oascc.ConnectionManager.waitForConnected Waiting for client to connect to ZooKeeper
   [junit4]   2> 650558 T2204 oascc.ConnectionManager.process Watcher org.apache.solr.common.cloud.ConnectionManager@3942a1e2 name:ZooKeeperConnection Watcher:127.0.0.1:58707 got event WatchedEvent state:SyncConnected type:None path:null path:null type:None
   [junit4]   2> 650558 T2166 oascc.ConnectionManager.waitForConnected Client is connected to ZooKeeper
   [junit4]   2> 650561 T2166 oascsi.HttpClientUtil.createClient Creating new http client, config:maxConnections=500&maxConnectionsPerHost=16&socketTimeout=120000&connTimeout=15000
   [junit4]   2> 650564 T2166 oascc.ConnectionManager.waitForConnected Waiting for client to connect to ZooKeeper
   [junit4]   2> 650565 T2206 oascc.ConnectionManager.process Watcher org.apache.solr.common.cloud.ConnectionManager@62a20728 name:ZooKeeperConnection Watcher:127.0.0.1:58707/solr got event WatchedEvent state:SyncConnected type:None path:null path:null type:None
   [junit4]   2> 650565 T2166 oascc.ConnectionManager.waitForConnected Client is connected to ZooKeeper
   [junit4]   2> 650571 T2166 oascc.ZkStateReader.createClusterStateWatchersAndUpdate Updating cluster state from ZooKeeper... 
   [junit4]   2> 651576 T2166 oasc.ZkController.createEphemeralLiveNode Register node as live in ZooKeeper:/live_nodes/127.0.0.1:48965_
   [junit4]   2> 651577 T2166 oascc.SolrZkClient.makePath makePath: /live_nodes/127.0.0.1:48965_
   [junit4]   2> 651582 T2193 oascc.ZkStateReader$3.process Updating live nodes... (2)
   [junit4]   2> 651583 T2188 oascc.ZkStateReader$3.process Updating live nodes... (2)
   [junit4]   2> 651583 T2206 oascc.ZkStateReader$3.process Updating live nodes... (2)
   [junit4]   2> 651590 T2166 oasc.CorePropertiesLocator.discover Looking for core definitions underneath /mnt/ssd/jenkins/workspace/Lucene-Solr-4.x-Linux/solr/build/solr-core/test/J1/./org.apache.solr.cloud.CollectionsAPIDistributedZkTest-jetty1-1375341606438
   [junit4]   2> 651613 T2166 oasc.CorePropertiesLocator.discoverUnder Found core conf in /mnt/ssd/jenkins/workspace/Lucene-Solr-4.x-Linux/solr/build/solr-core/test/J1/./org.apache.solr.cloud.CollectionsAPIDistributedZkTest-jetty1-1375341606438/conf/
   [junit4]   2> 651614 T2166 oasc.CorePropertiesLocator.discover Found 1 core definitions
   [junit4]   2> 651614 T2166 oass.SolrDispatchFilter.init user.dir=/mnt/ssd/jenkins/workspace/Lucene-Solr-4.x-Linux/solr/build/solr-core/test/J1
   [junit4]   2> 651615 T2166 oass.SolrDispatchFilter.init SolrDispatchFilter.init() done
   [junit4]   2> 651615 T2166 oascsi.HttpClientUtil.createClient Creating new http client, config:maxConnections=128&maxConnectionsPerHost=32&followRedirects=false
   [junit4]   2> 651685 T2166 oejs.Server.doStart jetty-8.1.10.v20130312
   [junit4]   2> 651687 T2166 oejs.AbstractConnector.doStart Started SelectChannelConnector@127.0.0.1:58824
   [junit4]   2> 651688 T2166 oass.SolrDispatchFilter.init SolrDispatchFilter.init()
   [junit4]   2> 651688 T2166 oasc.SolrResourceLoader.locateSolrHome JNDI not configured for solr (NoInitialContextEx)
   [junit4]   2> 651689 T2166 oasc.SolrResourceLoader.locateSolrHome using system property solr.solr.home: /mnt/ssd/jenkins/workspace/Lucene-Solr-4.x-Linux/solr/build/solr-core/test/J1/./org.apache.solr.cloud.CollectionsAPIDistributedZkTest-jetty2-1375341607649
   [junit4]   2> 651689 T2166 oasc.SolrResourceLoader.<init> new SolrResourceLoader for directory: '/mnt/ssd/jenkins/workspace/Lucene-Solr-4.x-Linux/solr/build/solr-core/test/J1/./org.apache.solr.cloud.CollectionsAPIDistributedZkTest-jetty2-1375341607649/'
   [junit4]   2> 651710 T2166 oasc.ConfigSolr.fromFile Loading container configuration from /mnt/ssd/jenkins/workspace/Lucene-Solr-4.x-Linux/solr/build/solr-core/test/J1/./org.apache.solr.cloud.CollectionsAPIDistributedZkTest-jetty2-1375341607649/solr.xml
   [junit4]   2> 651748 T2166 oasc.ConfigSolrXml.<init> Config-defined core root directory: 
   [junit4]   2> 651749 T2166 oasc.CoreContainer.<init> New CoreContainer 622448697
   [junit4]   2> 651749 T2166 oasc.CoreContainer.load Loading cores into CoreContainer [instanceDir=/mnt/ssd/jenkins/workspace/Lucene-Solr-4.x-Linux/solr/build/solr-core/test/J1/./org.apache.solr.cloud.CollectionsAPIDistributedZkTest-jetty2-1375341607649/]
   [junit4]   2> 651750 T2166 oashc.HttpShardHandlerFactory.getParameter Setting socketTimeout to: 120000
   [junit4]   2> 651751 T2166 oashc.HttpShardHandlerFactory.getParameter Setting urlScheme to: http://
   [junit4]   2> 651751 T2166 oashc.HttpShardHandlerFactory.getParameter Setting connTimeout to: 15000
   [junit4]   2> 651751 T2166 oashc.HttpShardHandlerFactory.getParameter Setting maxConnectionsPerHost to: 20
   [junit4]   2> 651752 T2166 oashc.HttpShardHandlerFactory.getParameter Setting corePoolSize to: 0
   [junit4]   2> 651752 T2166 oashc.HttpShardHandlerFactory.getParameter Setting maximumPoolSize to: 2147483647
   [junit4]   2> 651752 T2166 oashc.HttpShardHandlerFactory.getParameter Setting maxThreadIdleTime to: 5
   [junit4]   2> 651753 T2166 oashc.HttpShardHandlerFactory.getParameter Setting sizeOfQueue to: -1
   [junit4]   2> 651753 T2166 oashc.HttpShardHandlerFactory.getParameter Setting fairnessPolicy to: false
   [junit4]   2> 651753 T2166 oascsi.HttpClientUtil.createClient Creating new http client, config:maxConnectionsPerHost=20&maxConnections=10000&socketTimeout=120000&connTimeout=15000&retry=false
   [junit4]   2> 651756 T2166 oasc.ZkContainer.initZooKeeper Zookeeper client=127.0.0.1:58707/solr
   [junit4]   2> 651757 T2166 oasc.ZkController.checkChrootPath zkHost includes chroot
   [junit4]   2> 651759 T2166 oascc.ConnectionManager.waitForConnected Waiting for client to connect to ZooKeeper
   [junit4]   2> 651760 T2218 oascc.ConnectionManager.process Watcher org.apache.solr.common.cloud.ConnectionManager@6b0141ed name:ZooKeeperConnection Watcher:127.0.0.1:58707 got event WatchedEvent state:SyncConnected type:None path:null path:null type:None
   [junit4]   2> 651760 T2166 oascc.ConnectionManager.waitForConnected Client is connected to ZooKeeper
   [junit4]   2> 651763 T2166 oascsi.HttpClientUtil.createClient Creating new http client, config:maxConnections=500&maxConnectionsPerHost=16&socketTimeout=120000&connTimeout=15000
   [junit4]   2> 651766 T2166 oascc.ConnectionManager.waitForConnected Waiting for client to connect to ZooKeeper
   [junit4]   2> 651767 T2220 oascc.ConnectionManager.process Watcher org.apache.solr.common.cloud.ConnectionManager@95690a0 name:ZooKeeperConnection Watcher:127.0.0.1:58707/solr got event WatchedEvent state:SyncConnected type:None path:null path:null type:None
   [junit4]   2> 651767 T2166 oascc.ConnectionManager.waitForConnected Client is connected to ZooKeeper
   [junit4]   2> 651772 T2166 oascc.ZkStateReader.createClusterStateWatchersAndUpdate Updating cluster state from ZooKeeper... 
   [junit4]   2> 652777 T2166 oasc.ZkController.createEphemeralLiveNode Register node as live in ZooKeeper:/live_nodes/127.0.0.1:58824_
   [junit4]   2> 652779 T2166 oascc.SolrZkClient.makePath makePath: /live_nodes/127.0.0.1:58824_
   [junit4]   2> 652783 T2188 oascc.ZkStateReader$3.process Updating live nodes... (3)
   [junit4]   2> 652784 T2206 oascc.ZkStateReader$3.process Updating live nodes... (3)
   [junit4]   2> 652785 T2193 oascc.ZkStateReader$3.process Updating live nodes... (3)
   [junit4]   2> 652785 T2220 oascc.ZkStateReader$3.process Updating live nodes... (3)
   [junit4]   2> 652805 T2166 oasc.CorePropertiesLocator.discover Looking for core definitions underneath /mnt/ssd/jenkins/workspace/Lucene-Solr-4.x-Linux/solr/build/solr-core/test/J1/./org.apache.solr.cloud.CollectionsAPIDistributedZkTest-jetty2-1375341607649
   [junit4]   2> 652828 T2166 oasc.CorePropertiesLocator.discoverUnder Found core conf in /mnt/ssd/jenkins/workspace/Lucene-Solr-4.x-Linux/solr/build/solr-core/test/J1/./org.apache.solr.cloud.CollectionsAPIDistributedZkTest-jetty2-1375341607649/conf/
   [junit4]   2> 652829 T2166 oasc.CorePropertiesLocator.discover Found 1 core definitions
   [junit4]   2> 652830 T2166 oass.SolrDispatchFilter.init user.dir=/mnt/ssd/jenkins/workspace/Lucene-Solr-4.x-Linux/solr/build/solr-core/test/J1
   [junit4]   2> 652830 T2166 oass.SolrDispatchFilter.init SolrDispatchFilter.init() done
   [junit4]   2> 652830 T2166 oascsi.HttpClientUtil.createClient Creating new http client, config:maxConnections=128&maxConnectionsPerHost=32&followRedirects=false
   [junit4]   2> 652900 T2166 oejs.Server.doStart jetty-8.1.10.v20130312
   [junit4]   2> 652902 T2166 oejs.AbstractConnector.doStart Started SelectChannelConnector@127.0.0.1:36726
   [junit4]   2> 652903 T2166 oass.SolrDispatchFilter.init SolrDispatchFilter.init()
   [junit4]   2> 652903 T2166 oasc.SolrResourceLoader.locateSolrHome JNDI not configured for solr (NoInitialContextEx)
   [junit4]   2> 652904 T2166 oasc.SolrResourceLoader.locateSolrHome using system property solr.solr.home: /mnt/ssd/jenkins/workspace/Lucene-Solr-4.x-Linux/solr/build/solr-core/test/J1/./org.apache.solr.cloud.CollectionsAPIDistributedZkTest-jetty3-1375341608864
   [junit4]   2> 652904 T2166 oasc.SolrResourceLoader.<init> new SolrResourceLoader for directory: '/mnt/ssd/jenkins/workspace/Lucene-Solr-4.x-Linux/solr/build/solr-core/test/J1/./org.apache.solr.cloud.CollectionsAPIDistributedZkTest-jetty3-1375341608864/'
   [junit4]   2> 652916 T2166 oasc.ConfigSolr.fromFile Loading container configuration from /mnt/ssd/jenkins/workspace/Lucene-Solr-4.x-Linux/solr/build/solr-core/test/J1/./org.apache.solr.cloud.CollectionsAPIDistributedZkTest-jetty3-1375341608864/solr.xml
   [junit4]   2> 652962 T2166 oasc.ConfigSolrXml.<init> Config-defined core root directory: 
   [junit4]   2> 652963 T2166 oasc.CoreContainer.<init> New CoreContainer 1071320744
   [junit4]   2> 652963 T2166 oasc.CoreContainer.load Loading cores into CoreContainer [instanceDir=/mnt/ssd/jenkins/workspace/Lucene-Solr-4.x-Linux/solr/build/solr-core/test/J1/./org.apache.solr.cloud.CollectionsAPIDistributedZkTest-jetty3-1375341608864/]
   [junit4]   2> 652964 T2166 oashc.HttpShardHandlerFactory.getParameter Setting socketTimeout to: 120000
   [junit4]   2> 652965 T2166 oashc.HttpShardHandlerFactory.getParameter Setting urlScheme to: http://
   [junit4]   2> 652965 T2166 oashc.HttpShardHandlerFactory.getParameter Setting connTimeout to: 15000
   [junit4]   2> 652965 T2166 oashc.HttpShardHandlerFactory.getParameter Setting maxConnectionsPerHost to: 20
   [junit4]   2> 652966 T2166 oashc.HttpShardHandlerFactory.getParameter Setting corePoolSize to: 0
   [junit4]   2> 652966 T2166 oashc.HttpShardHandlerFactory.getParameter Setting maximumPoolSize to: 2147483647
   [junit4]   2> 652966 T2166 oashc.HttpShardHandlerFactory.getParameter Setting maxThreadIdleTime to: 5
   [junit4]   2> 652967 T2166 oashc.HttpShardHandlerFactory.getParameter Setting sizeOfQueue to: -1
   [junit4]   2> 652967 T2166 oashc.HttpShardHandlerFactory.getParameter Setting fairnessPolicy to: false
   [junit4]   2> 652968 T2166 oascsi.HttpClientUtil.createClient Creating new http client, config:maxConnectionsPerHost=20&maxConnections=10000&socketTimeout=120000&connTimeout=15000&retry=false
   [junit4]   2> 652970 T2166 oasc.ZkContainer.initZooKeeper Zookeeper client=127.0.0.1:58707/solr
   [junit4]   2> 652971 T2166 oasc.ZkController.checkChrootPath zkHost includes chroot
   [junit4]   2> 652972 T2166 oascc.ConnectionManager.waitForConnected Waiting for client to connect to ZooKeeper
   [junit4]   2> 652973 T2232 oascc.ConnectionManager.process Watcher org.apache.solr.common.cloud.ConnectionManager@469f5858 name:ZooKeeperConnection Watcher:127.0.0.1:58707 got event WatchedEvent state:SyncConnected type:None path:null path:null type:None
   [junit4]   2> 652974 T2166 oascc.ConnectionManager.waitForConnected Client is connected to ZooKeeper
   [junit4]   2> 652977 T2166 oascsi.HttpClientUtil.createClient Creating new http client, config:maxConnections=500&maxConnectionsPerHost=16&socketTimeout=120000&connTimeout=15000
   [junit4]   2> 652980 T2166 oascc.ConnectionManager.waitForConnected Waiting for client to connect to ZooKeeper
   [junit4]   2> 652981 T2234 oascc.ConnectionManager.process Watcher org.apache.solr.common.cloud.ConnectionManager@1601cf4b name:ZooKeeperConnection Watcher:127.0.0.1:58707/solr got event WatchedEvent state:SyncConnected type:None path:null path:null type:None
   [junit4]   2> 652982 T2166 oascc.ConnectionManager.waitForConnected Client is connected to ZooKeeper
   [junit4]   2> 652987 T2166 oascc.ZkStateReader.createClusterStateWatchersAndUpdate Updating cluster state from ZooKeeper... 
   [junit4]   2> 653992 T2166 oasc.ZkController.createEphemeralLiveNode Register node as live in ZooKeeper:/live_nodes/127.0.0.1:36726_
   [junit4]   2> 653994 T2166 oascc.SolrZkClient.makePath makePath: /live_nodes/127.0.0.1:36726_
   [junit4]   2> 654001 T2188 oascc.ZkStateReader$3.process Updating live nodes... (4)
   [junit4]   2> 654001 T2220 oascc.ZkStateReader$3.process Updating live nodes... (4)
   [junit4]   2> 654001 T2193 oascc.ZkStateReader$3.process Updating live nodes... (4)
   [junit4]   2> 654002 T2206 oascc.ZkStateReader$3.process Updating live nodes... (4)
   [junit4]   2> 654003 T2234 oascc.ZkStateReader$3.process Updating live nodes... (4)
   [junit4]   2> 654010 T2166 oasc.CorePropertiesLocator.discover Looking for core definitions underneath /mnt/ssd/jenkins/workspace/Lucene-Solr-4.x-Linux/solr/build/solr-core/test/J1/./org.apache.solr.cloud.CollectionsAPIDistributedZkTest-jetty3-1375341608864
   [junit4]   2> 654036 T2166 oasc.CorePropertiesLocator.discoverUnder Found core conf in /mnt/ssd/jenkins/workspace/Lucene-Solr-4.x-Linux/solr/build/solr-core/test/J1/./org.apache.solr.cloud.CollectionsAPIDistributedZkTest-jetty3-1375341608864/conf/
   [junit4]   2> 654036 T2166 oasc.CorePropertiesLocator.discover Found 1 core definitions
   [junit4]   2> 654037 T2166 oass.SolrDispatchFilter.init user.dir=/mnt/ssd/jenkins/workspace/Lucene-Solr-4.x-Linux/solr/build/solr-core/test/J1
   [junit4]   2> 654037 T2166 oass.SolrDispatchFilter.init SolrDispatchFilter.init() done
   [junit4]   2> 654037 T2166 oascsi.HttpClientUtil.createClient Creating new http client, config:maxConnections=128&maxConnectionsPerHost=32&followRedirects=false
   [junit4]   2> 654114 T2166 oejs.Server.doStart jetty-8.1.10.v20130312
   [junit4]   2> 654117 T2166 oejs.AbstractConnector.doStart Started SelectChannelConnector@127.0.0.1:57585
   [junit4]   2> 654118 T2166 oass.SolrDispatchFilter.init SolrDispatchFilter.init()
   [junit4]   2> 654118 T2166 oasc.SolrResourceLoader.locateSolrHome JNDI not configured for solr (NoInitialContextEx)
   [junit4]   2> 654118 T2166 oasc.SolrResourceLoader.locateSolrHome using system property solr.solr.home: /mnt/ssd/jenkins/workspace/Lucene-Solr-4.x-Linux/solr/build/solr-core/test/J1/./org.apache.solr.cloud.CollectionsAPIDistributedZkTest-jetty4-1375341610071
   [junit4]   2> 654119 T2166 oasc.SolrResourceLoader.<init> new SolrResourceLoader for directory: '/mnt/ssd/jenkins/workspace/Lucene-Solr-4.x-Linux/solr/build/solr-core/test/J1/./org.apache.solr.cloud.CollectionsAPIDistributedZkTest-jetty4-1375341610071/'
   [junit4]   2> 654131 T2166 oasc.ConfigSolr.fromFile Loading container configuration from /mnt/ssd/jenkins/workspace/Lucene-Solr-4.x-Linux/solr/build/solr-core/test/J1/./org.apache.solr.cloud.CollectionsAPIDistributedZkTest-jetty4-1375341610071/solr.xml
   [junit4]   2> 654183 T2166 oasc.ConfigSolrXml.<init> Config-defined core root directory: 
   [junit4]   2> 654183 T2166 oasc.CoreContainer.<init> New CoreContainer 962566848
   [junit4]   2> 654184 T2166 oasc.CoreContainer.load Loading cores into CoreContainer [instanceDir=/mnt/ssd/jenkins/workspace/Lucene-Solr-4.x-Linux/solr/build/solr-core/test/J1/./org.apache.solr.cloud.CollectionsAPIDistributedZkTest-jetty4-1375341610071/]
   [junit4]   2> 654185 T2166 oashc.HttpShardHandlerFactory.getParameter Setting socketTimeout to: 120000
   [junit4]   2> 654185 T2166 oashc.HttpShardHandlerFactory.getParameter Setting urlScheme to: http://
   [junit4]   2> 654186 T2166 oashc.HttpShardHandlerFactory.getParameter Setting connTimeout to: 15000
   [junit4]   2> 654186 T2166 oashc.HttpShardHandlerFactory.getParameter Setting maxConnectionsPerHost to: 20
   [junit4]   2> 654186 T2166 oashc.HttpShardHandlerFactory.getParameter Setting corePoolSize to: 0
   [junit4]   2> 654187 T2166 oashc.HttpShardHandlerFactory.getParameter Setting maximumPoolSize to: 2147483647
   [junit4]   2> 654187 T2166 oashc.HttpShardHandlerFactory.getParameter Setting maxThreadIdleTime to: 5
   [junit4]   2> 654187 T2166 oashc.HttpShardHandlerFactory.getParameter Setting sizeOfQueue to: -1
   [junit4]   2> 654188 T2166 oashc.HttpShardHandlerFactory.getParameter Setting fairnessPolicy to: false
   [junit4]   2> 654188 T2166 oascsi.HttpClientUtil.createClient Creating new http client, config:maxConnectionsPerHost=20&maxConnections=10000&socketTimeout=120000&connTimeout=15000&retry=false
   [junit4]   2> 654191 T2166 oasc.ZkContainer.initZooKeeper Zookeeper client=127.0.0.1:58707/solr
   [junit4]   2> 654192 T2166 oasc.ZkController.checkChrootPath zkHost includes chroot
   [junit4]   2> 654193 T2166 oascc.ConnectionManager.waitForConnected Waiting for client to connect to ZooKeeper
   [junit4]   2> 654195 T2246 oascc.ConnectionManager.process Watcher org.apache.solr.common.cloud.ConnectionManager@33a8d0ad name:ZooKeeperConnection Watcher:127.0.0.1:58707 got event WatchedEvent state:SyncConnected type:None path:null path:null type:None
   [junit4]   2> 654195 T2166 oascc.ConnectionManager.waitForConnected Client is connected to ZooKeeper
   [junit4]   2> 654198 T2166 oascsi.HttpClientUtil.createClient Creating new http client, config:maxConnections=500&maxConnectionsPerHost=16&socketTimeout=120000&connTimeout=15000
   [junit4]   2> 654202 T2166 oascc.ConnectionManager.waitForConnected Waiting for client to connect to ZooKeeper
   [junit4]   2> 654204 T2248 oascc.ConnectionManager.process Watcher org.apache.solr.common.cloud.ConnectionManager@9704ee name:ZooKeeperConnection Watcher:127.0.0.1:58707/solr got event WatchedEvent state:SyncConnected type:None path:null path:null type:None
   [junit4]   2> 654204 T2166 oascc.ConnectionManager.waitForConnected Client is connected to ZooKeeper
   [junit4]   2> 654210 T2166 oascc.ZkStateReader.createClusterStateWatchersAndUpdate Updating cluster state from ZooKeeper... 
   [junit4]   2> 655215 T2166 oasc.ZkController.createEphemeralLiveNode Register node as live in ZooKeeper:/live_nodes/127.0.0.1:57585_
   [junit4]   2> 655217 T2166 oascc.SolrZkClient.makePath makePath: /live_nodes/127.0.0.1:57585_
   [junit4]   2> 655224 T2188 oascc.ZkStateReader$3.process Updating live nodes... (5)
   [junit4]   2> 655224 T2193 oascc.ZkStateReader$3.process Updating live nodes... (5)
   [junit4]   2> 655225 T2234 oascc.ZkStateReader$3.process Updating live nodes... (5)
   [junit4]   2> 655226 T2248 oascc.ZkStateReader$3.process Updating live nodes... (5)
   [junit4]   2> 655226 T2220 oascc.ZkStateReader$3.process Updating live nodes... (5)
   [junit4]   2> 655226 T2206 oascc.ZkStateReader$3.process Updating live nodes... (5)
   [junit4]   2> 655232 T2166 oasc.CorePropertiesLocator.discover Looking for core definitions underneath /mnt/ssd/jenkins/workspace/Lucene-Solr-4.x-Linux/solr/build/solr-core/test/J1/./org.apache.solr.cloud.CollectionsAPIDistributedZkTest-jetty4-1375341610071
   [junit4]   2> 655255 T2166 oasc.CorePropertiesLocator.discoverUnder Found core conf in /mnt/ssd/jenkins/workspace/Lucene-Solr-4.x-Linux/solr/build/solr-core/test/J1/./org.apache.solr.cloud.CollectionsAPIDistributedZkTest-jetty4-1375341610071/conf/
   [junit4]   2> 655256 T2166 oasc.CorePropertiesLocator.discover Found 1 core definitions
   [junit4]   2> 655257 T2166 oass.SolrDispatchFilter.init user.dir=/mnt/ssd/jenkins/workspace/Lucene-Solr-4.x-Linux/solr/build/solr-core/test/J1
   [junit4]   2> 655257 T2166 oass.SolrDispatchFilter.init SolrDispatchFilter.init() done
   [junit4]   2> 655257 T2166 oascsi.HttpClientUtil.createClient Creating new http client, config:maxConnections=128&maxConnectionsPerHost=32&followRedirects=false
   [junit4]   2> 655261 T2166 oascsi.HttpClientUtil.createClient Creating new http client, config:maxConnections=128&maxConnectionsPerHost=32&followRedirects=false
   [junit4]   2> 655265 T2200 oasha.CollectionsHandler.handleCreateAction Creating Collection : numShards=2&name=nodes_used_collection&replicationFactor=2&action=CREATE&wt=javabin&version=2
   [junit4]   2> 655268 T2188 oasc.DistributedQueue$LatchChildWatcher.process Watcher fired on path: /overseer/collection-queue-work state: SyncConnected type NodeChildrenChanged
   [junit4]   2> 655270 T2190 oasc.OverseerCollectionProcessor.run Overseer Collection Processor: Get the message id:/overseer/collection-queue-work/qn-0000000000 message:{
   [junit4]   2> 	  "operation":"createcollection",
   [junit4]   2> 	  "numShards":"2",
   [junit4]   2> 	  "name":"nodes_used_collection",
   [junit4]   2> 	  "replicationFactor":"2"}
   [junit4]   2> 655270 T2190 oasc.OverseerCollectionProcessor.processMessage WARN OverseerCollectionProcessor.processMessage : createcollection , {
   [junit4]   2> 	  "operation":"createcollection",
   [junit4]   2> 	  "numShards":"2",
   [junit4]   2> 	  "name":"nodes_used_collection",
   [junit4]   2> 	  "replicationFactor":"2"}
   [junit4]   2> 656380 T2189 oascc.ZkStateReader.updateClusterState Updating cloud state from ZooKeeper... 
   [junit4]   2> 656381 T2189 oasc.Overseer$ClusterStateUpdater.buildCollection building a new collection: nodes_used_collection
   [junit4]   2> 656381 T2189 oasc.Overseer$ClusterStateUpdater.createCollection Create collection nodes_used_collection with shards [shard1, shard2]
   [junit4]   2> 656387 T2188 oascc.ZkStateReader$2.process A cluster state change: WatchedEvent state:SyncConnected type:NodeDataChanged path:/clusterstate.json, has occurred - updating... (live nodes size: 5)
   [junit4]   2> 656387 T2193 oascc.ZkStateReader$2.process A cluster state change: WatchedEvent state:SyncConnected type:NodeDataChanged path:/clusterstate.json, has occurred - updating... (live nodes size: 5)
   [junit4]   2> 656387 T2220 oascc.ZkStateReader$2.process A cluster state change: WatchedEvent state:SyncConnected type:NodeDataChanged path:/clusterstate.json, has occurred - updating... (live nodes size: 5)
   [junit4]   2> 656387 T2248 oascc.ZkStateReader$2.process A cluster state change: WatchedEvent state:SyncConnected type:NodeDataChanged path:/clusterstate.json, has occurred - updating... (live nodes size: 5)
   [junit4]   2> 656387 T2206 oascc.ZkStateReader$2.process A cluster state change: WatchedEvent state:SyncConnected type:NodeDataChanged path:/clusterstate.json, has occurred - updating... (live nodes size: 5)
   [junit4]   2> 656388 T2234 oascc.ZkStateReader$2.process A cluster state change: WatchedEvent state:SyncConnected type:NodeDataChanged path:/clusterstate.json, has occurred - updating... (live nodes size: 5)
   [junit4]   2> 656477 T2190 oasc.OverseerCollectionProcessor.createCollection going to create cores replicas shardNames [shard1, shard2] , repFactor : 2
   [junit4]   2> 656477 T2190 oasc.OverseerCollectionProcessor.createCollection Creating shard nodes_used_collection_shard1_replica1 as part of slice shard1 of collection nodes_used_collection on 127.0.0.1:58824_
   [junit4]   2> 656478 T2190 oasc.OverseerCollectionProcessor.createCollection Creating shard nodes_used_collection_shard1_replica2 as part of slice shard1 of collection nodes_used_collection on 127.0.0.1:56128_
   [junit4]   2> 656479 T2190 oasc.OverseerCollectionProcessor.createCollection Creating shard nodes_used_collection_shard2_replica1 as part of slice shard2 of collection nodes_used_collection on 127.0.0.1:48965_
   [junit4]   2> 656480 T2190 oasc.OverseerCollectionProcessor.createCollection Creating shard nodes_used_collection_shard2_replica2 as part of slice shard2 of collection nodes_used_collection on 127.0.0.1:57585_
   [junit4]   2> 656484 T2213 oasc.ZkController.publish publishing core=nodes_used_collection_shard1_replica1 state=down
   [junit4]   2> 656484 T2183 oasc.ZkController.publish publishing core=nodes_used_collection_shard1_replica2 state=down
   [junit4]   2> 656485 T2241 oasc.ZkController.publish publishing core=nodes_used_collection_shard2_replica2 state=down
   [junit4]   2> 656485 T2201 oasc.ZkController.publish publishing core=nodes_used_collection_shard2_replica1 state=down
   [junit4]   2> 656486 T2183 oasc.ZkController.waitForCoreNodeName look for our core node name
   [junit4]   2> 656487 T2241 oasc.ZkController.waitForCoreNodeName look for our core node name
   [junit4]   2> 656487 T2213 oasc.ZkController.waitForCoreNodeName look for our core node name
   [junit4]   2> 656488 T2201 oasc.ZkController.waitForCoreNodeName look for our core node name
   [junit4]   2> 657901 T2189 oascc.ZkStateReader.updateClusterState Updating cloud state from ZooKeeper... 
   [junit4]   2> 657902 T2189 oasc.Overseer$ClusterStateUpdater.updateState WARN Could not find collection node for nodes_used_collection, skipping publish state
   [junit4]   2> 657902 T2189 oasc.Overseer$ClusterStateUpdater.updateState Update state numShards=2 message={
   [junit4]   2> 	  "operation":"state",
   [junit4]   2> 	  "core_node_name":"core_node1",
   [junit4]   2> 	  "numShards":"2",
   [junit4]   2> 	  "shard":"shard1",
   [junit4]   2> 	  "roles":null,
   [junit4]   2> 	  "state":"down",
   [junit4]   2> 	  "shard_state":"active",
   [junit4]   2> 	  "core":"nodes_used_collection_shard1_replica1",
   [junit4]   2> 	  "collection":"nodes_used_collection",
   [junit4]   2> 	  "shard_range":null,
   [junit4]   2> 	  "node_name":"127.0.0.1:58824_",
   [junit4]   2> 	  "base_url":"http://127.0.0.1:58824"}
   [junit4]   2> 657908 T2189 oasc.Overseer$ClusterStateUpdater.updateState WARN Could not find collection node for nodes_used_collection, skipping publish state
   [junit4]   2> 657909 T2189 oasc.Overseer$ClusterStateUpdater.updateState Update state numShards=2 message={
   [junit4]   2> 	  "operation":"state",
   [junit4]   2> 	  "core_node_name":"core_node2",
   [junit4]   2> 	  "numShards":"2",
   [junit4]   2> 	  "shard":"shard1",
   [junit4]   2> 	  "roles":null,
   [junit4]   2> 	  "state":"down",
   [junit4]   2> 	  "shard_state":"active",
   [junit4]   2> 	  "core":"nodes_used_collection_shard1_replica2",
   [junit4]   2> 	  "collection":"nodes_used_collection",
   [junit4]   2> 	  "shard_range":null,
   [junit4]   2> 	  "node_name":"127.0.0.1:56128_",
   [junit4]   2> 	  "base_url":"http://127.0.0.1:56128"}
   [junit4]   2> 657914 T2189 oasc.Overseer$ClusterStateUpdater.updateState WARN Could not find collection node for nodes_used_collection, skipping publish state
   [junit4]   2> 657914 T2189 oasc.Overseer$ClusterStateUpdater.updateState Update state numShards=2 message={
   [junit4]   2> 	  "operation":"state",
   [junit4]   2> 	  "core_node_name":"core_node3",
   [junit4]   2> 	  "numShards":"2",
   [junit4]   2> 	  "shard":"shard2",
   [junit4]   2> 	  "roles":null,
   [junit4]   2> 	  "state":"down",
   [junit4]   2> 	  "shard_state":"active",
   [junit4]   2> 	  "core":"nodes_used_collection_shard2_replica2",
   [junit4]   2> 	  "collection":"nodes_used_collection",
   [junit4]   2> 	  "shard_range":null,
   [junit4]   2> 	  "node_name":"127.0.0.1:57585_",
   [junit4]   2> 	  "base_url":"http://127.0.0.1:57585"}
   [junit4]   2> 657931 T2189 oasc.Overseer$ClusterStateUpdater.updateState WARN Could not find collection node for nodes_used_collection, skipping publish state
   [junit4]   2> 657931 T2189 oasc.Overseer$ClusterStateUpdater.updateState Update state numShards=2 message={
   [junit4]   2> 	  "operation":"state",
   [junit4]   2> 	  "core_node_name":"core_node4",
   [junit4]   2> 	  "numShards":"2",
   [junit4]   2> 	  "shard":"shard2",
   [junit4]   2> 	  "roles":null,
   [junit4]   2> 	  "state":"down",
   [junit4]   2> 	  "shard_state":"active",
   [junit4]   2> 	  "core":"nodes_used_collection_shard2_replica1",
   [junit4]   2> 	  "collection":"nodes_used_collection",
   [junit4]   2> 	  "shard_range":null,
   [junit4]   2> 	  "node_name":"127.0.0.1:48965_",
   [junit4]   2> 	  "base_url":"http://127.0.0.1:48965"}
   [junit4]   2> 657936 T2220 oascc.ZkStateReader$2.process A cluster state change: WatchedEvent state:SyncConnected type:NodeDataChanged path:/clusterstate.json, has occurred - updating... (live nodes size: 5)
   [junit4]   2> 657936 T2193 oascc.ZkStateReader$2.process A cluster state change: WatchedEvent state:SyncConnected type:NodeDataChanged path:/clusterstate.json, has occurred - updating... (live nodes size: 5)
   [junit4]   2> 657937 T2234 oascc.ZkStateReader$2.process A cluster state change: WatchedEvent state:SyncConnected type:NodeDataChanged path:/clusterstate.json, has occurred - updating... (live nodes size: 5)
   [junit4]   2> 657937 T2206 oascc.ZkStateReader$2.process A cluster state change: WatchedEvent state:SyncConnected type:NodeDataChanged path:/clusterstate.json, has occurred - updating... (live nodes size: 5)
   [junit4]   2> 657937 T2248 oascc.ZkStateReader$2.process A cluster state change: WatchedEvent state:SyncConnected type:NodeDataChanged path:/clusterstate.json, has occurred - updating... (live nodes size: 5)
   [junit4]   2> 657937 T2188 oascc.ZkStateReader$2.process A cluster state change: WatchedEvent state:SyncConnected type:NodeDataChanged path:/clusterstate.json, has occurred - updating... (live nodes size: 5)
   [junit4]   2> 658487 T2183 oasc.ZkController.waitForShardId waiting to find shard id in clusterstate for nodes_used_collection_shard1_replica2
   [junit4]   2> 658488 T2213 oasc.ZkController.waitForShardId waiting to find shard id in clusterstate for nodes_used_collection_shard1_replica1
   [junit4]   2> 658487 T2241 oasc.ZkController.waitForShardId waiting to find shard id in clusterstate for nodes_used_collection_shard2_replica2
   [junit4]   2> 658489 T2213 oasc.CorePropertiesLocator.writePropertiesFile ERROR Couldn't persist core properties to /mnt/ssd/jenkins/workspace/Lucene-Solr-4.x-Linux/solr/build/solr-core/test/J1/./org.apache.solr.cloud.CollectionsAPIDistributedZkTest-jetty2-1375341607649/nodes_used_collection_shard1_replica1/core.properties: java.io.FileNotFoundException: /mnt/ssd/jenkins/workspace/Lucene-Solr-4.x-Linux/solr/build/solr-core/test/J1/./org.apache.solr.cloud.CollectionsAPIDistributedZkTest-jetty2-1375341607649/nodes_used_collection_shard1_replica1/core.properties (No such file or directory)
   [junit4]   2> 658490 T2213 oasc.CoreContainer.create Creating SolrCore 'nodes_used_collection_shard1_replica1' using instanceDir: /mnt/ssd/jenkins/workspace/Lucene-Solr-4.x-Linux/solr/build/solr-core/test/J1/./org.apache.solr.cloud.CollectionsAPIDistributedZkTest-jetty2-1375341607649/nodes_used_collection_shard1_replica1
   [junit4]   2> 658488 T2183 oasc.CorePropertiesLocator.writePropertiesFile ERROR Couldn't persist core properties to /mnt/ssd/jenkins/workspace/Lucene-Solr-4.x-Linux/solr/build/solr-core/test/J1/./org.apache.solr.cloud.CollectionsAPIDistributedZkTest-controljetty-1375341606180/nodes_used_collection_shard1_replica2/core.properties: java.io.FileNotFoundException: /mnt/ssd/jenkins/workspace/Lucene-Solr-4.x-Linux/solr/build/solr-core/test/J1/./org.apache.solr.cloud.CollectionsAPIDistributedZkTest-controljetty-1375341606180/nodes_used_collection_shard1_replica2/core.properties (No such file or directory)
   [junit4]   2> 658489 T2201 oasc.ZkController.waitForShardId waiting to find shard id in clusterstate for nodes_used_collection_shard2_replica1
   [junit4]   2> 658491 T2183 oasc.CoreContainer.create Creating SolrCore 'nodes_used_collection_shard1_replica2' using instanceDir: /mnt/ssd/jenkins/workspace/Lucene-Solr-4.x-Linux/solr/build/solr-core/test/J1/./org.apache.solr.cloud.CollectionsAPIDistributedZkTest-controljetty-1375341606180/nodes_used_collection_shard1_replica2
   [junit4]   2> 658492 T2183 oasc.ZkController.createCollectionZkNode Check for collection zkNode:nodes_used_collection
   [junit4]   2> 658490 T2213 oasc.ZkController.createCollectionZkNode Check for collection zkNode:nodes_used_collection
   [junit4]   2> 658490 T2241 oasc.CorePropertiesLocator.writePropertiesFile ERROR Couldn't persist core properties to /mnt/ssd/jenkins/workspace/Lucene-Solr-4.x-Linux/solr/build/solr-core/test/J1/./org.apache.solr.cloud.CollectionsAPIDistributedZkTest-jetty4-1375341610071/nodes_used_collection_shard2_replica2/core.properties: java.io.FileNotFoundException: /mnt/ssd/jenkins/workspace/Lucene-Solr-4.x-Linux/solr/build/solr-core/test/J1/./org.apache.solr.cloud.CollectionsAPIDistributedZkTest-jetty4-1375341610071/nodes_used_collection_shard2_replica2/core.properties (No such file or directory)
   [junit4]   2> 658491 T2201 oasc.CorePropertiesLocator.writePropertiesFile ERROR Couldn't persist core properties to /mnt/ssd/jenkins/workspace/Lucene-Solr-4.x-Linux/solr/build/solr-core/test/J1/./org.apache.solr.cloud.CollectionsAPIDistributedZkTest-jetty1-1375341606438/nodes_used_collection_shard2_replica1/core.properties: java.io.FileNotFoundException: /mnt/ssd/jenkins/workspace/Lucene-Solr-4.x-Linux/solr/build/solr-core/test/J1/./org.apache.solr.cloud.CollectionsAPIDistributedZkTest-jetty1-1375341606438/nodes_used_collection_shard2_replica1/core.properties (No such file or directory)
   [junit4]   2> 658493 T2241 oasc.CoreContainer.create Creating SolrCore 'nodes_used_collection_shard2_replica2' using instanceDir: /mnt/ssd/jenkins/workspace/Lucene-Solr-4.x-Linux/solr/build/solr-core/test/J1/./org.apache.solr.cloud.CollectionsAPIDistributedZkTest-jetty4-1375341610071/nodes_used_collection_shard2_replica2
   [junit4]   2> 658493 T2241 oasc.ZkController.createCollectionZkNode Check for collection zkNode:nodes_used_collection
   [junit4]   2> 658493 T2183 oasc.ZkController.createCollectionZkNode Creating collection in ZooKeeper:nodes_used_collection
   [junit4]   2> 658493 T2201 oasc.CoreContainer.create Creating SolrCore 'nodes_used_collection_shard2_replica1' using instanceDir: /mnt/ssd/jenkins/workspace/Lucene-Solr-4.x-Linux/solr/build/solr-core/test/J1/./org.apache.solr.cloud.CollectionsAPIDistributedZkTest-jetty1-1375341606438/nodes_used_collection_shard2_replica1
   [junit4]   2> 658494 T2201 oasc.ZkController.createCollectionZkNode Check for collection zkNode:nodes_used_collection
   [junit4]   2> 658494 T2241 oasc.ZkController.createCollectionZkNode Creating collection in ZooKeeper:nodes_used_collection
   [junit4]   2> 658494 T2183 oasc.ZkController.getConfName Looking for collection configName
   [junit4]   2> 658493 T2213 oasc.ZkController.createCollectionZkNode Creating collection in ZooKeeper:nodes_used_collection
   [junit4]   2> 658496 T2201 oasc.ZkController.createCollectionZkNode Creating collection in ZooKeeper:nodes_used_collection
   [junit4]   2> 658495 T2241 oasc.ZkController.getConfName Looking for collection configName
   [junit4]   2> 658496 T2201 oasc.ZkController.getConfName Looking for collection configName
   [junit4]   2> 658496 T2213 oasc.ZkController.getConfName Looking for collection configName
   [junit4]   2> 658498 T2183 oasc.ZkController.getConfName Only one config set found in zk - using it:conf1
   [junit4]   2> 658498 T2183 oascc.SolrZkClient.makePath makePath: /collections/nodes_used_collection
   [junit4]   2> 658500 T2241 oasc.ZkController.getConfName Only one config set found in zk - using it:conf1
   [junit4]   2> 658500 T2241 oascc.SolrZkClient.makePath makePath: /collections/nodes_used_collection
   [junit4]   2> 658500 T2201 oasc.ZkController.getConfName Only one config set found in zk - using it:conf1
   [junit4]   2> 658501 T2201 oascc.SolrZkClient.makePath makePath: /collections/nodes_used_collection
   [junit4]   2> 658503 T2213 oasc.ZkController.getConfName Only one config set found in zk - using it:conf1
   [junit4]   2> 658503 T2213 oascc.SolrZkClient.makePath makePath: /collections/nodes_used_collection
   [junit4]   2> 658507 T2183 oasc.ZkController.readConfigName Load collection config from:/collections/nodes_used_collection
   [junit4]   2> 658508 T2241 oasc.ZkController.readConfigName Load collection config from:/collections/nodes_used_collection
   [junit4]   2> 658508 T2213 oasc.ZkController.readConfigName Load collection config from:/collections/nodes_used_collection
   [junit4]   2> 658510 T2201 oasc.ZkController.readConfigName Load collection config from:/collections/nodes_used_collection
   [junit4]   2> 658512 T2213 oasc.SolrResourceLoader.<init> new SolrResourceLoader for directory: '/mnt/ssd/jenkins/workspace/Lucene-Solr-4.x-Linux/solr/build/solr-core/test/J1/./org.apache.solr.cloud.CollectionsAPIDistributedZkTest-jetty2-1375341607649/nodes_used_collection_shard1_replica1/'
   [junit4]   2> 658512 T2183 oasc.SolrResourceLoader.<init> new SolrResourceLoader for directory: '/mnt/ssd/jenkins/workspace/Lucene-Solr-4.x-Linux/solr/build/solr-core/test/J1/./org.apache.solr.cloud.CollectionsAPIDistributedZkTest-controljetty-1375341606180/nodes_used_collection_shard1_replica2/'
   [junit4]   2> 658513 T2241 oasc.SolrResourceLoader.<init> new SolrResourceLoader for directory: '/mnt/ssd/jenkins/workspace/Lucene-Solr-4.x-Linux/solr/build/solr-core/test/J1/./org.apache.solr.cloud.CollectionsAPIDistributedZkTest-jetty4-1375341610071/nodes_used_collection_shard2_replica2/'
   [junit4]   2> 658514 T2201 oasc.SolrResourceLoader.<init> new SolrResourceLoader for directory: '/mnt/ssd/jenkins/workspace/Lucene-Solr-4.x-Linux/solr/build/solr-core/test/J1/./org.apache.solr.cloud.CollectionsAPIDistributedZkTest-jetty1-1375341606438/nodes_used_collection_shard2_replica1/'
   [junit4]   2> 658603 T2213 oasc.SolrConfig.<init> Using Lucene MatchVersion: LUCENE_45
   [junit4]   2> 658615 T2183 oasc.SolrConfig.<init> Using Lucene MatchVersion: LUCENE_45
   [junit4]   2> 658615 T2241 oasc.SolrConfig.<init> Using Lucene MatchVersion: LUCENE_45
   [junit4]   2> 658639 T2201 oasc.SolrConfig.<init> Using Lucene MatchVersion: LUCENE_45
   [junit4]   2> 658710 T2213 oasc.SolrConfig.<init> Loaded SolrConfig: solrconfig.xml
   [junit4]   2> 658713 T2213 oass.IndexSchema.readSchema Reading Solr Schema from schema.xml
   [junit4]   2> 658728 T2213 oass.IndexSchema.readSchema [nodes_used_collection_shard1_replica1] Schema name=test
   [junit4]   2> 658732 T2241 oasc.SolrConfig.<init> Loaded SolrConfig: solrconfig.xml
   [junit4]   2> 658742 T2183 oasc.SolrConfig.<init> Loaded SolrConfig: solrconfig.xml
   [junit4]   2> 658743 T2241 oass.IndexSchema.readSchema Reading Solr Schema from schema.xml
   [junit4]   2> 658746 T2183 oass.IndexSchema.readSchema Reading Solr Schema from schema.xml
   [junit4]   2> 658761 T2201 oasc.SolrConfig.<init> Loaded SolrConfig: solrconfig.xml
   [junit4]   2> 658764 T2241 oass.IndexSchema.readSchema [nodes_used_collection_shard2_replica2] Schema name=test
   [junit4]   2> 658765 T2183 oass.IndexSchema.readSchema [nodes_used_collection_shard1_replica2] Schema name=test
   [junit4]   2> 658765 T2201 oass.IndexSchema.readSchema Reading Solr Schema from schema.xml
   [junit4]   2> 658801 T2201 oass.IndexSchema.readSchema [nodes_used_collection_shard2_replica1] Schema name=test
   [junit4]   2> 659882 T2213 oass.ByteField.init WARN ByteField is deprecated and will be removed in 5.0. You should use TrieIntField instead.
   [junit4]   2> 659883 T2213 oass.ShortField.init WARN ShortField is deprecated and will be removed in 5.0. You should use TrieIntField instead.
   [junit4]   2> 659883 T2213 oass.OpenExchangeRatesOrgProvider.init Initialized with rates=open-exchange-rates.json, refreshInterval=1440.
   [junit4]   2> 659900 T2213 oass.IndexSchema.readSchema default search field in schema is text
   [junit4]   2> 659903 T2213 oass.IndexSchema.readSchema unique key field: id
   [junit4]   2> 659937 T2213 oass.FileExchangeRateProvider.reload Reloading exchange rates from file currency.xml
   [junit4]   2> 659942 T2213 oass.FileExchangeRateProvider.reload Reloading exchange rates from file currency.xml
   [junit4]   2> 659946 T2213 oass.OpenExchangeRatesOrgProvider.reload Reloading exchange rates from open-exchange-rates.json
   [junit4]   2> 659959 T2213 oass.OpenExchangeRatesOrgProvider$OpenExchangeRates.<init> WARN Unknown key IMPORTANT NOTE
   [junit4]   2> 659960 T2213 oass.OpenExchangeRatesOrgProvider$OpenExchangeRates.<init> WARN Expected key, got STRING
   [junit4]   2> 659960 T2213 oass.OpenExchangeRatesOrgProvider.reload Reloading exchange rates from open-exchange-rates.json
   [junit4]   2> 659962 T2213 oass.OpenExchangeRatesOrgProvider$OpenExchangeRates.<init> WARN Unknown key IMPORTANT NOTE
   [junit4]   2> 659962 T2213 oass.OpenExchangeRatesOrgProvider$OpenExchangeRates.<init> WARN Expected key, got STRING
   [junit4]   2> 659962 T2213 oasc.SolrCore.initDirectoryFactory org.apache.solr.core.MockDirectoryFactory
   [junit4]   2> 659963 T2213 oasc.SolrCore.<init> [nodes_used_collection_shard1_replica1] Opening new SolrCore at /mnt/ssd/jenkins/workspace/Lucene-Solr-4.x-Linux/solr/build/solr-core/test/J1/./org.apache.solr.cloud.CollectionsAPIDistributedZkTest-jetty2-1375341607649/nodes_used_collection_shard1_replica1/, dataDir=/mnt/ssd/jenkins/workspace/Lucene-Solr-4.x-Linux/solr/build/solr-core/test/J1/./org.apache.solr.cloud.CollectionsAPIDistributedZkTest-jetty2-1375341607649//nodes_used_collection_shard1_replica1/data/
   [junit4]   2> 659963 T2213 oasc.JmxMonitoredMap.<init> JMX monitoring is enabled. Adding Solr mbeans to JMX Server: com.sun.jmx.mbeanserver.JmxMBeanServer@2123baa0
   [junit4]   2> 659964 T2213 oasc.CachingDirectoryFactory.get return new directory for /mnt/ssd/jenkins/workspace/Lucene-Solr-4.x-Linux/solr/build/solr-core/test/J1/./org.apache.solr.cloud.CollectionsAPIDistributedZkTest-jetty2-1375341607649//nodes_used_collection_shard1_replica1/data
   [junit4]   2> 659964 T2213 oasc.SolrCore.getNewIndexDir New index directory detected: old=null new=/mnt/ssd/jenkins/workspace/Lucene-Solr-4.x-Linux/solr/build/solr-core/test/J1/./org.apache.solr.cloud.CollectionsAPIDistributedZkTest-jetty2-1375341607649//nodes_used_collection_shard1_replica1/data/index/
   [junit4]   2> 659965 T2213 oasc.SolrCore.initIndex WARN [nodes_used_collection_shard1_replica1] Solr index directory '/mnt/ssd/jenkins/workspace/Lucene-Solr-4.x-Linux/solr/build/solr-core/test/J1/./org.apache.solr.cloud.CollectionsAPIDistributedZkTest-jetty2-1375341607649/nodes_used_collection_shard1_replica1/data/index' doesn't exist. Creating new index...
   [junit4]   2> 659965 T2213 oasc.CachingDirectoryFactory.get return new directory for /mnt/ssd/jenkins/workspace/Lucene-Solr-4.x-Linux/solr/build/solr-core/test/J1/./org.apache.solr.cloud.CollectionsAPIDistributedZkTest-jetty2-1375341607649//nodes_used_collection_shard1_replica1/data/index
   [junit4]   2> 659967 T2213 oasc.SolrDeletionPolicy.onCommit SolrDeletionPolicy.onCommit: commits: num=1
   [junit4]   2> 		commit{dir=MockDirWrapper(org.apache.lucene.store.RAMDirectory@61848fc lockFactory=org.apache.lucene.store.NativeFSLockFactory@2c5e234c),segFN=segments_1,generation=1}
   [junit4]   2> 659967 T2213 oasc.SolrDeletionPolicy.updateCommits newest commit generation = 1
   [junit4]   2> 659978 T2213 oasup.UpdateRequestProcessorChain.init inserting DistributedUpdateProcessorFactory into updateRequestProcessorChain "dedupe"
   [junit4]   2> 659979 T2213 oasup.UpdateRequestProcessorChain.init inserting DistributedUpdateProcessorFactory into updateRequestProcessorChain "stored_sig"
   [junit4]   2> 659980 T2213 oasup.UpdateRequestProcessorChain.init inserting DistributedUpdateProcessorFactory into updateRequestProcessorChain "distrib-dup-test-chain-implicit"
   [junit4]   2> 659980 T2213 oasc.RequestHandlers.initHandlersFromConfig created standard: solr.StandardRequestHandler
   [junit4]   2> 659981 T2213 oasc.RequestHandlers.initHandlersFromConfig created /get: solr.RealTimeGetHandler
   [junit4]   2> 659981 T2213 oasc.RequestHandlers.initHandlersFromConfig adding lazy requestHandler: solr.ReplicationHandler
   [junit4]   2> 659982 T2213 oasc.RequestHandlers.initHandlersFromConfig created /replication: solr.ReplicationHandler
   [junit4]   2> 659982 T2213 oasc.RequestHandlers.initHandlersFromConfig created /update: solr.UpdateRequestHandler
   [junit4]   2> 659983 T2213 oasc.RequestHandlers.initHandlersFromConfig created /admin/: org.apache.solr.handler.admin.AdminHandlers
   [junit4]   2> 659984 T2213 oashl.XMLLoader.init xsltCacheLifetimeSeconds=60
   [junit4]   2> 659987 T2213 oass.SolrIndexSearcher.<init> Opening Searcher@48f819ae main
   [junit4]   2> 659988 T2213 oasu.CommitTracker.<init> Hard AutoCommit: disabled
   [junit4]   2> 659988 T2213 oasu.CommitTracker.<init> Soft AutoCommit: disabled
   [junit4]   2> 660001 T2254 oasc.SolrCore.registerSearcher [nodes_used_collection_shard1_replica1] Registered new searcher Searcher@48f819ae main{StandardDirectoryReader(segments_1:1)}
   [junit4]   2> 660003 T2213 oasc.CoreContainer.registerCore registering core: nodes_used_collection_shard1_replica1
   [junit4]   2> 660004 T2213 oasc.ZkController.register Register replica - core:nodes_used_collection_shard1_replica1 address:http://127.0.0.1:58824 collection:nodes_used_collection shard:shard1
   [junit4]   2> 660004 T2213 oascsi.HttpClientUtil.createClient Creating new http client, config:maxConnections=10000&maxConnectionsPerHost=20&connTimeout=15000&socketTimeout=30000&retry=false
   [junit4]   2> 660026 T2213 oascc.SolrZkClient.makePath makePath: /collections/nodes_used_collection/leader_elect/shard1/election
   [junit4]   2> 660035 T2201 oass.ByteField.init WARN ByteField is deprecated and will be removed in 5.0. You should use TrieIntField instead.
   [junit4]   2> 660035 T2201 oass.ShortField.init WARN ShortField is deprecated and will be removed in 5.0. You should use TrieIntField instead.
   [junit4]   2> 660036 T2213 oasc.ShardLeaderElectionContext.runLeaderProcess Running the leader process for shard shard1
   [junit4]   2> 660037 T2201 oass.OpenExchangeRatesOrgProvider.init Initialized with rates=open-exchange-rates.json, refreshInterval=1440.
   [junit4]   2> 660049 T2213 oasc.ShardLeaderElectionContext.waitForReplicasToComeUp Waiting until we see more replicas up for shard shard1: total=2 found=1 timeoutin=180000
   [junit4]   2> 660055 T2201 oass.IndexSchema.readSchema default search field in schema is text
   [junit4]   2> 660060 T2201 oass.IndexSchema.readSchema unique key field: id
   [junit4]   2> 660076 T2183 oass.ByteField.init WARN ByteField is deprecated and will be removed in 5.0. You should use TrieIntField instead.
   [junit4]   2> 660077 T2183 oass.ShortField.init WARN ShortField is deprecated and will be removed in 5.0. You should use TrieIntField instead.
   [junit4]   2> 660078 T2183 oass.OpenExchangeRatesOrgProvider.init Initialized with rates=open-exchange-rates.json, refreshInterval=1440.
   [junit4]   2> 660086 T2241 oass.ByteField.init WARN ByteField is deprecated and will be removed in 5.0. You should use TrieIntField instead.
   [junit4]   2> 660086 T2241 oass.ShortField.init WARN ShortField is deprecated and will be removed in 5.0. You should use TrieIntField instead.
   [junit4]   2> 660086 T2183 oass.IndexSchema.readSchema default search field in schema is text
   [junit4]   2> 660087 T2241 oass.OpenExchangeRatesOrgProvider.init Initialized with rates=open-exchange-rates.json, refreshInterval=1440.
   [junit4]   2> 660101 T2183 oass.IndexSchema.readSchema unique key field: id
   [junit4]   2> 660102 T2201 oass.FileExchangeRateProvider.reload Reloading exchange rates from file currency.xml
   [junit4]   2> 660105 T2241 oass.IndexSchema.readSchema default search field in schema is text
   [junit4]   2> 660107 T2201 oass.FileExchangeRateProvider.reload Reloading exchange rates from file currency.xml
   [junit4]   2> 660109 T2241 oass.IndexSchema.readSchema unique key field: id
   [junit4]   2> 660114 T2201 oass.OpenExchangeRatesOrgProvider.reload Reloading exchange rates from open-exchange-rates.json
   [junit4]   2> 660117 T2201 oass.OpenExchangeRatesOrgProvider$OpenExchangeRates.<init> WARN Unknown key IMPORTANT NOTE
   [junit4]   2> 660117 T2201 oass.OpenExchangeRatesOrgProvider$OpenExchangeRates.<init> WARN Expected key, got STRING
   [junit4]   2> 660118 T2201 oass.OpenExchangeRatesOrgProvider.reload Reloading exchange rates from open-exchange-rates.json
   [junit4]   2> 660122 T2201 oass.OpenExchangeRatesOrgProvider$OpenExchangeRates.<init> WARN Unknown key IMPORTANT NOTE
   [junit4]   2> 660122 T2201 oass.OpenExchangeRatesOrgProvider$OpenExchangeRates.<init> WARN Expected key, got STRING
   [junit4]   2> 660123 T2201 oasc.SolrCore.initDirectoryFactory org.apache.solr.core.MockDirectoryFactory
   [junit4]   2> 660124 T2201 oasc.SolrCore.<init> [nodes_used_collection_shard2_replica1] Opening new SolrCore at /mnt/ssd/jenkins/workspace/Lucene-Solr-4.x-Linux/solr/build/solr-core/test/J1/./org.apache.solr.cloud.CollectionsAPIDistributedZkTest-jetty1-1375341606438/nodes_used_collection_shard2_replica1/, dataDir=/mnt/ssd/jenkins/workspace/Lucene-Solr-4.x-Linux/solr/build/solr-core/test/J1/./org.apache.solr.cloud.CollectionsAPIDistributedZkTest-jetty1-1375341606438//nodes_used_collection_shard2_replica1/data/
   [junit4]   2> 660124 T2201 oasc.JmxMonitoredMap.<init> JMX monitoring is enabled. Adding Solr mbeans to JMX Server: com.sun.jmx.mbeanserver.JmxMBeanServer@2123baa0
   [junit4]   2> 660125 T2201 oasc.CachingDirectoryFactory.get return new directory for /mnt/ssd/jenkins/workspace/Lucene-Solr-4.x-Linux/solr/build/solr-core/test/J1/./org.apache.solr.cloud.CollectionsAPIDistributedZkTest-jetty1-1375341606438//nodes_used_collection_shard2_replica1/data
   [junit4]   2> 660125 T2201 oasc.SolrCore.getNewIndexDir New index directory detected: old=null new=/mnt/ssd/jenkins/workspace/Lucene-Solr-4.x-Linux/solr/build/solr-core/test/J1/./org.apache.solr.cloud.CollectionsAPIDistributedZkTest-jetty1-1375341606438//nodes_used_collection_shard2_replica1/data/index/
   [junit4]   2> 660126 T2201 oasc.SolrCore.initIndex WARN [nodes_used_collection_shard2_replica1] Solr index directory '/mnt/ssd/jenkins/workspace/Lucene-Solr-4.x-Linux/solr/build/solr-core/test/J1/./org.apache.solr.cloud.CollectionsAPIDistributedZkTest-jetty1-1375341606438/nodes_used_collection_shard2_replica1/data/index' doesn't exist. Creating new index...
   [junit4]   2> 660126 T2201 oasc.CachingDirectoryFactory.get return new directory for /mnt/ssd/jenkins/workspace/Lucene-Solr-4.x-Linux/solr/build/solr-core/test/J1/./org.apache.solr.cloud.CollectionsAPIDistributedZkTest-jetty1-1375341606438//nodes_used_collection_shard2_replica1/data/index
   [junit4]   2> 660128 T2201 oasc.SolrDeletionPolicy.onCommit SolrDeletionPolicy.onCommit: commits: num=1
   [junit4]   2> 		commit{dir=MockDirWrapper(org.apache.lucene.store.RAMDirectory@1fc5bac3 lockFactory=org.apache.lucene.store.NativeFSLockFactory@17d36f6),segFN=segments_1,generation=1}
   [junit4]   2> 660128 T2201 oasc.SolrDeletionPolicy.updateCommits newest commit generation = 1
   [junit4]   2> 660132 T2201 oasup.UpdateRequestProcessorChain.init inserting DistributedUpdateProcessorFactory into updateRequestProcessorChain "dedupe"
   [junit4]   2> 660132 T2183 oass.FileExchangeRateProvider.reload Reloading exchange rates from file currency.xml
   [junit4]   2> 660133 T2201 oasup.UpdateRequestProcessorChain.init inserting DistributedUpdateProcessorFactory into updateRequestProcessorChain "stored_sig"
   [junit4]   2> 660133 T2201 oasup.UpdateRequestProcessorChain.init inserting DistributedUpdateProcessorFactory into updateRequestProcessorChain "distrib-dup-test-chain-implicit"
   [junit4]   2> 660134 T2201 oasc.RequestHandlers.initHandlersFromConfig created standard: solr.StandardRequestHandler
   [junit4]   2> 660135 T2201 oasc.RequestHandlers.initHandlersFromConfig created /get: solr.RealTimeGetHandler
   [junit4]   2> 660135 T2201 oasc.RequestHandlers.initHandlersFromConfig adding lazy requestHandler: solr.ReplicationHandler
   [junit4]   2> 660135 T2201 oasc.RequestHandlers.initHandlersFromConfig created /replication: solr.ReplicationHandler
   [junit4]   2> 660136 T2201 oasc.RequestHandlers.initHandlersFromConfig created /update: solr.UpdateRequestHandler
   [junit4]   2> 660136 T2201 oasc.RequestHandlers.initHandlersFromConfig created /admin/: org.apache.solr.handler.admin.AdminHandlers
   [junit4]   2> 660138 T2201 oashl.XMLLoader.init xsltCacheLifetimeSeconds=60
   [junit4]   2> 660139 T2183 oass.FileExchangeRateProvider.reload Reloading exchange rates from file currency.xml
   [junit4]   2> 660139 T2241 oass.FileExchangeRateProvider.reload Reloading exchange rates from file currency.xml
   [junit4]   2> 660151 T2201 oass.SolrIndexSearcher.<init> Opening Searcher@401c7205 main
   [junit4]   2> 660152 T2201 oasu.CommitTracker.<init> Hard AutoCommit: disabled
   [junit4]   2> 660152 T2201 oasu.CommitTracker.<init> Soft AutoCommit: disabled
   [junit4]   2> 660154 T2183 oass.OpenExchangeRatesOrgProvider.reload Reloading exchange rates from open-exchange-rates.json
   [junit4]   2> 660155 T2241 oass.FileExchangeRateProvider.reload Reloading exchange rates from file currency.xml
   [junit4]   2> 660156 T2255 oasc.SolrCore.registerSearcher [nodes_used_collection_shard2_replica1] Registered new searcher Searcher@401c7205 main{StandardDirectoryReader(segments_1:1)}
   [junit4]   2> 660157 T2183 oass.OpenExchangeRatesOrgProvider$OpenExchangeRates.<init> WARN Unknown key IMPORTANT NOTE
   [junit4]   2> 660158 T2183 oass.OpenExchangeRatesOrgProvider$OpenExchangeRates.<init> WARN Expected key, got STRING
   [junit4]   2> 660158 T2183 oass.OpenExchangeRatesOrgProvider.reload Reloading exchange rates from open-exchange-rates.json
   [junit4]   2> 660158 T2201 oasc.CoreContainer.registerCore registering core: nodes_used_collection_shard2_replica1
   [junit4]   2> 660159 T2201 oasc.ZkController.register Register replica - core:nodes_used_collection_shard2_replica1 address:http://127.0.0.1:48965 collection:nodes_used_collection shard:shard2
   [junit4]   2> 660159 T2201 oascsi.HttpClientUtil.createClient Creating new http client, config:maxConnections=10000&maxConnectionsPerHost=20&connTimeout=15000&socketTimeout=30000&retry=false
   [junit4]   2> 660160 T2183 oass.OpenExchangeRatesOrgProvider$OpenExchangeRates.<init> WARN Unknown key IMPORTANT NOTE
   [junit4]   2> 660160 T2183 oass.OpenExchangeRatesOrgProvider$OpenExchangeRates.<init> WARN Expected key, got STRING
   [junit4]   2> 660161 T2183 oasc.SolrCore.initDirectoryFactory org.apache.solr.core.MockDirectoryFactory
   [junit4]   2> 660161 T2183 oasc.SolrCore.<init> [nodes_used_collection_shard1_replica2] Opening new SolrCore at /mnt/ssd/jenkins/workspace/Lucene-Solr-4.x-Linux/solr/build/solr-core/test/J1/./org.apache.solr.cloud.CollectionsAPIDistributedZkTest-controljetty-1375341606180/nodes_used_collection_shard1_replica2/, dataDir=/mnt/ssd/jenkins/workspace/Lucene-Solr-4.x-Linux/solr/build/solr-core/test/J1/./org.apache.solr.cloud.CollectionsAPIDistributedZkTest-controljetty-1375341606180//nodes_used_collection_shard1_replica2/data/
   [junit4]   2> 660161 T2183 oasc.JmxMonitoredMap.<init> JMX monitoring is enabled. Adding Solr mbeans to JMX Server: com.sun.jmx.mbeanserver.JmxMBeanServer@2123baa0
   [junit4]   2> 660162 T2241 oass.OpenExchangeRatesOrgProvider.reload Reloading exchange rates from open-exchange-rates.json
   [junit4]   2> 660162 T2183 oasc.CachingDirectoryFactory.get return new directory for /mnt/ssd/jenkins/workspace/Lucene-Solr-4.x-Linux/solr/build/solr-core/test/J1/./org.apache.solr.cloud.CollectionsAPIDistributedZkTest-controljetty-1375341606180//nodes_used_collection_shard1_replica2/data
   [junit4]   2> 660162 T2183 oasc.SolrCore.getNewIndexDir New index directory detected: old=null new=/mnt/ssd/jenkins/workspace/Lucene-Solr-4.x-Linux/solr/build/solr-core/test/J1/./org.apache.solr.cloud.CollectionsAPIDistributedZkTest-controljetty-1375341606180//nodes_used_collection_shard1_replica2/data/index/
   [junit4]   2> 660163 T2183 oasc.SolrCore.initIndex WARN [nodes_used_collection_shard1_replica2] Solr index directory '/mnt/ssd/jenkins/workspace/Lucene-Solr-4.x-Linux/solr/build/solr-core/test/J1/./org.apache.solr.cloud.CollectionsAPIDistributedZkTest-controljetty-1375341606180/nodes_used_collection_shard1_replica2/data/index' doesn't exist. Creating new index...
   [junit4]   2> 660163 T2183 oasc.CachingDirectoryFactory.get return new directory for /mnt/ssd/jenkins/workspace/Lucene-Solr-4.x-Linux/solr/build/solr-core/test/J1/./org.apache.solr.cloud.CollectionsAPIDistributedZkTest-controljetty-1375341606180//nodes_used_collection_shard1_replica2/data/index
   [junit4]   2> 660164 T2241 oass.OpenExchangeRatesOrgProvider$OpenExchangeRates.<init> WARN Unknown key IMPORTANT NOTE
   [junit4]   2> 660164 T2241 oass.OpenExchangeRatesOrgProvider$OpenExchangeRates.<init> WARN Expected key, got STRING
   [junit4]   2> 660164 T2201 oascc.SolrZkClient.makePath makePath: /collections/nodes_used_collection/leader_elect/shard2/election
   [junit4]   2> 660165 T2241 oass.OpenExchangeRatesOrgProvider.reload Reloading exchange rates from open-exchange-rates.json
   [junit4]   2> 660165 T2183 oasc.SolrDeletionPolicy.onCommit SolrDeletionPolicy.onCommit: commits: num=1
   [junit4]   2> 		commit{dir=MockDirWrapper(org.apache.lucene.store.RAMDirectory@1efa591c lockFactory=org.apache.lucene.store.NativeFSLockFactory@40808f51),segFN=segments_1,generation=1}
   [junit4]   2> 660166 T2183 oasc.SolrDeletionPolicy.updateCommits newest commit generation = 1
   [junit4]   2> 660168 T2241 oass.OpenExchangeRatesOrgProvider$OpenExchangeRates.<init> WARN Unknown key IMPORTANT NOTE
   [junit4]   2> 660168 T2241 oass.OpenExchangeRatesOrgProvider$OpenExchangeRates.<init> WARN Expected key, got STRING
   [junit4]   2> 660169 T2241 oasc.SolrCore.initDirectoryFactory org.apache.solr.core.MockDirectoryFactory
   [junit4]   2> 660169 T2241 oasc.SolrCore.<init> [nodes_used_collection_shard2_replica2] Opening new SolrCore at /mnt/ssd/jenkins/workspace/Lucene-Solr-4.x-Linux/solr/build/solr-core/test/J1/./org.apache.solr.cloud.CollectionsAPIDistributedZkTest-jetty4-1375341610071/nodes_used_collection_shard2_replica2/, dataDir=/mnt/ssd/jenkins/workspace/Lucene-Solr-4.x-Linux/solr/build/solr-core/test/J1/./org.apache.solr.cloud.CollectionsAPIDistributedZkTest-jetty4-1375341610071//nodes_used_collection_shard2_replica2/data/
   [junit4]   2> 660170 T2183 oasup.UpdateRequestProcessorChain.init inserting DistributedUpdateProcessorFactory into updateRequestProcessorChain "dedupe"
   [junit4]   2> 660170 T2241 oasc.JmxMonitoredMap.<init> JMX monitoring is enabled. Adding Solr mbeans to JMX Server: com.sun.jmx.mbeanserver.JmxMBeanServer@2123baa0
   [junit4]   2> 660170 T2183 oasup.UpdateRequestProcessorChain.init inserting DistributedUpdateProcessorFactory into updateRequestProcessorChain "stored_sig"
   [junit4]   2> 660171 T2183 oasup.UpdateRequestProcessorChain.init inserting DistributedUpdateProcessorFactory into updateRequestProcessorChain "distrib-dup-test-chain-implicit"
   [junit4]   2> 660172 T2241 oasc.CachingDirectoryFactory.get return new directory for /mnt/ssd/jenkins/workspace/Lucene-Solr-4.x-Linux/solr/build/solr-core/test/J1/./org.apache.solr.cloud.CollectionsAPIDistributedZkTest-jetty4-1375341610071//nodes_used_collection_shard2_replica2/data
   [junit4]   2> 660172 T2183 oasc.RequestHandlers.initHandlersFromConfig created standard: solr.StandardRequestHandler
   [junit4]   2> 660172 T2241 oasc.SolrCore.getNewIndexDir New index directory detected: old=null new=/mnt/ssd/jenkins/workspace/Lucene-Solr-4.x-Linux/solr/build/solr-core/test/J1/./org.apache.solr.cloud.CollectionsAPIDistributedZkTest-jetty4-1375341610071//nodes_used_collection_shard2_replica2/data/index/
   [junit4]   2> 660173 T2241 oasc.SolrCore.initIndex WARN [nodes_used_collection_shard2_replica2] Solr index directory '/mnt/ssd/jenkins/workspace/Lucene-Solr-4.x-Linux/solr/build/solr-core/test/J1/./org.apache.solr.cloud.CollectionsAPIDistributedZkTest-jetty4-1375341610071/nodes_used_collection_shard2_replica2/data/index' doesn't exist. Creating new index...
   [junit4]   2> 660173 T2183 oasc.RequestHandlers.initHandlersFromConfig created /get: solr.RealTimeGetHandler
   [junit4]   2> 660174 T2183 oasc.RequestHandlers.initHandlersFromConfig adding lazy requestHandler: solr.ReplicationHandler
   [junit4]   2> 660174 T2241 oasc.CachingDirectoryFactory.get return new directory for /mnt/ssd/jenkins/workspace/Lucene-Solr-4.x-Linux/solr/build/solr-core/test/J1/./org.apache.solr.cloud.CollectionsAPIDistributedZkTest-jetty4-1375341610071//nodes_used_collection_shard2_replica2/data/index
   [junit4]   2> 660174 T2183 oasc.RequestHandlers.initHandlersFromConfig created /replication: solr.ReplicationHandler
   [junit4]   2> 660175 T2183 oasc.RequestHandlers.initHandlersFromConfig created /update: solr.UpdateRequestHandler
   [junit4]   2> 660175 T2201 oasc.ShardLeaderElectionContext.runLeaderProcess Running the leader process for shard shard2
   [junit4]   2> 660176 T2183 oasc.RequestHandlers.initHandlersFromConfig created /admin/: org.apache.solr.handler.admin.AdminHandlers
   [junit4]   2> 660176 T2241 oasc.SolrDeletionPolicy.onCommit SolrDeletionPolicy.onCommit: commits: num=1
   [junit4]   2> 		commit{dir=MockDirWrapper(org.apache.lucene.store.RAMDirectory@7b0376bc lockFactory=org.apache.lucene.store.NativeFSLockFactory@570d137a),segFN=segments_1,generation=1}
   [junit4]   2> 660177 T2241 oasc.SolrDeletionPolicy.updateCommits newest commit generation = 1
   [junit4]   2> 660178 T2183 oashl.XMLLoader.init xsltCacheLifetimeSeconds=60
   [junit4]   2> 660179 T2201 oasc.ShardLeaderElectionContext.waitForReplicasToComeUp Waiting until we see more replicas up for shard shard2: total=2 found=1 timeoutin=179999
   [junit4]   2> 660181 T2183 oass.SolrIndexSearcher.<init> Opening Searcher@662d5af6 main
   [junit4]   2> 660181 T2183 oasu.CommitTracker.<init> Hard AutoCommit: disabled
   [junit4]   2> 660182 T2183 oasu.CommitTracker.<init> Soft AutoCommit: disabled
   [junit4]   2> 660182 T2241 oasup.UpdateRequestProcessorChain.init inserting DistributedUpdateProcessorFactory into updateRequestProcessorChain "dedupe"
   [junit4]   2> 660183 T2241 oasup.UpdateRequestProcessorChain.init inserting DistributedUpdateProcessorFactory into updateRequestProcessorChain "stored_sig"
   [junit4]   2> 660183 T2241 oasup.UpdateRequestProcessorChain.init inserting DistributedUpdateProcessorFactory into updateRequestProcessorChain "distrib-dup-test-chain-implicit"
   [junit4]   2> 660184 T2241 oasc.RequestHandlers.initHandlersFromConfig created standard: solr.StandardRequestHandler
   [junit4]   2> 660185 T2241 oasc.RequestHandlers.initHandlersFromConfig created /get: solr.RealTimeGetHandler
   [junit4]   2> 660185 T2241 oasc.RequestHandlers.initHandlersFromConfig adding lazy requestHandler: solr.ReplicationHandler
   [junit4]   2> 660185 T2256 oasc.SolrCore.registerSearcher [nodes_used_collection_shard1_replica2] Registered new searcher Searcher@662d5af6 main{StandardDirectoryReader(segments_1:1)}
   [junit4]   2> 660186 T2241 oasc.RequestHandlers.initHandlersFromConfig created /replication: solr.ReplicationHandler
   [junit4]   2> 660187 T2241 oasc.RequestHandlers.initHandlersFromConfig created /update: solr.UpdateRequestHandler
   [junit4]   2> 660187 T2241 oasc.RequestHandlers.initHandlersFromConfig created /admin/: org.apache.solr.handler.admin.AdminHandlers
   [junit4]   2> 660188 T2183 oasc.CoreContainer.registerCore registering core: nodes_used_collection_shard1_replica2
   [junit4]   2> 660188 T2183 oasc.ZkController.register Register replica - core:nodes_used_collection_shard1_replica2 address:http://127.0.0.1:56128 collection:nodes_used_collection shard:shard1
   [junit4]   2> 660189 T2183 oascsi.HttpClientUtil.createClient Creating new http client, config:maxConnections=10000&maxConnectionsPerHost=20&connTimeout=15000&socketTimeout=30000&retry=false
   [junit4]   2> 660190 T2241 oashl.XMLLoader.init xsltCacheLifetimeSeconds=60
   [junit4]   2> 660201 T2241 oass.SolrIndexSearcher.<init> Opening Searcher@5f681ad9 main
   [junit4]   2> 660203 T2241 oasu.CommitTracker.<init> Hard AutoCommit: disabled
   [junit4]   2> 660203 T2241 oasu.CommitTracker.<init> Soft AutoCommit: disabled
   [junit4]   2> 660207 T2257 oasc.SolrCore.registerSearcher [nodes_used_collection_shard2_replica2] Registered new searcher Searcher@5f681ad9 main{StandardDirectoryReader(segments_1:1)}
   [junit4]   2> 660210 T2241 oasc.CoreContainer.registerCore registering core: nodes_used_collection_shard2_replica2
   [junit4]   2> 660210 T2241 oasc.ZkController.register Register replica - core:nodes_used_collection_shard2_replica2 address:http://127.0.0.1:57585 collection:nodes_used_collection shard:shard2
   [junit4]   2> 660211 T2241 oascsi.HttpClientUtil.createClient Creating new http client, config:maxConnections=10000&maxConnectionsPerHost=20&connTimeout=15000&socketTimeout=30000&retry=false
   [junit4]   2> 660551 T2213 oasc.ShardLeaderElectionContext.waitForReplicasToComeUp Enough replicas found to continue.
   [junit4]   2> 660552 T2213 oasc.ShardLeaderElectionContext.runLeaderProcess I may be the new leader - try and sync
   [junit4]   2> 660552 T2213 oasc.SyncStrategy.sync Sync replicas to http://127.0.0.1:58824/nodes_used_collection_shard1_replica1/
   [junit4]   2> 660553 T2213 oasu.PeerSync.sync PeerSync: core=nodes_used_collection_shard1_replica1 url=http://127.0.0.1:58824 START replicas=[http://127.0.0.1:56128/nodes_used_collection_shard1_replica2/] nUpdates=100
   [junit4]   2> 660553 T2213 oasu.PeerSync.sync PeerSync: core=nodes_used_collection_shard1_replica1 url=http://127.0.0.1:58824 DONE.  We have no versions.  sync failed.
   [junit4]   2> 660554 T2213 oasc.SyncStrategy.syncReplicas Leader's attempt to sync with shard failed, moving to the next candidate
   [junit4]   2> 660554 T2213 oasc.ShardLeaderElectionContext.runLeaderProcess We failed sync, but we have no versions - we can't sync in that case - we were active before, so become leader anyway
   [junit4]   2> 660555 T2213 oasc.ShardLeaderElectionContext.runLeaderProcess I am the new leader: http://127.0.0.1:58824/nodes_used_collection_shard1_replica1/ shard1
   [junit4]   2> 660555 T2213 oascc.SolrZkClient.makePath makePath: /collections/nodes_used_collection/leaders/shard1
   [junit4]   2> ASYNC  NEW_CORE C6867 name=nodes_used_collection_shard1_replica2 org.apache.solr.core.SolrCore@743a2276 url=http://127.0.0.1:56128/nodes_used_collection_shard1_replica2 node=127.0.0.1:56128_ C6867_STATE=coll:nodes_used_collection core:nodes_used_collection_shard1_replica2 props:{state=down, core=nodes_used_collection_shard1_replica2, node_name=127.0.0.1:56128_, base_url=http://127.0.0.1:56128}
   [junit4]   2> 660560 T2181 C6867 P56128 oasc.SolrCore.execute [nodes_used_collection_shard1_replica2] webapp= path=/get params={getVersions=100&distrib=false&wt=javabin&qt=/get&version=2} status=0 QTime=1 
   [junit4]   2> 660680 T2201 oasc.ShardLeaderElectionContext.waitForReplicasToComeUp Enough replicas found to continue.
   [junit4]   2> 660681 T2201 oasc.ShardLeaderElectionContext.runLeaderProcess I may be the new leader - try and sync
   [junit4]   2> 660681 T2201 oasc.SyncStrategy.sync Sync replicas to http://127.0.0.1:48965/nodes_used_collection_shard2_replica1/
   [junit4]   2> 660682 T2201 oasu.PeerSync.sync PeerSync: core=nodes_used_collection_shard2_replica1 url=http://127.0.0.1:48965 START replicas=[http://127.0.0.1:57585/nodes_used_collection_shard2_replica2/] nUpdates=100
   [junit4]   2> 660682 T2201 oasu.PeerSync.sync PeerSync: core=nodes_used_collection_shard2_replica1 url=http://127.0.0.1:48965 DONE.  We have no versions.  sync failed.
   [junit4]

[...truncated too long message...]

exWriter
   [junit4]   2> 787240 T2166 oasu.DefaultSolrCoreState.closeIndexWriter closing IndexWriter with IndexWriterCloser
   [junit4]   2> 787243 T2166 oasc.SolrCore.closeSearcher [new_implicit_coll_1_b_replica2] Closing main searcher on request.
   [junit4]   2> 787243 T2166 oasc.CachingDirectoryFactory.close Closing MockDirectoryFactory - 2 directories currently being tracked
   [junit4]   2> 787244 T2166 oasc.CachingDirectoryFactory.closeCacheValue looking to close /mnt/ssd/jenkins/workspace/Lucene-Solr-4.x-Linux/solr/build/solr-core/test/J1/./org.apache.solr.cloud.CollectionsAPIDistributedZkTest-jetty4-1375341610071//new_implicit_coll_1_b_replica2/data [CachedDir<<refCount=0;path=/mnt/ssd/jenkins/workspace/Lucene-Solr-4.x-Linux/solr/build/solr-core/test/J1/./org.apache.solr.cloud.CollectionsAPIDistributedZkTest-jetty4-1375341610071//new_implicit_coll_1_b_replica2/data;done=false>>]
   [junit4]   2> 787244 T2166 oasc.CachingDirectoryFactory.close Closing directory: /mnt/ssd/jenkins/workspace/Lucene-Solr-4.x-Linux/solr/build/solr-core/test/J1/./org.apache.solr.cloud.CollectionsAPIDistributedZkTest-jetty4-1375341610071//new_implicit_coll_1_b_replica2/data
   [junit4]   2> 787245 T2166 oasc.CachingDirectoryFactory.closeCacheValue looking to close /mnt/ssd/jenkins/workspace/Lucene-Solr-4.x-Linux/solr/build/solr-core/test/J1/./org.apache.solr.cloud.CollectionsAPIDistributedZkTest-jetty4-1375341610071//new_implicit_coll_1_b_replica2/data/index [CachedDir<<refCount=0;path=/mnt/ssd/jenkins/workspace/Lucene-Solr-4.x-Linux/solr/build/solr-core/test/J1/./org.apache.solr.cloud.CollectionsAPIDistributedZkTest-jetty4-1375341610071//new_implicit_coll_1_b_replica2/data/index;done=false>>]
   [junit4]   2> 787245 T2166 oasc.CachingDirectoryFactory.close Closing directory: /mnt/ssd/jenkins/workspace/Lucene-Solr-4.x-Linux/solr/build/solr-core/test/J1/./org.apache.solr.cloud.CollectionsAPIDistributedZkTest-jetty4-1375341610071//new_implicit_coll_1_b_replica2/data/index
   [junit4]   2> 787248 T2444 oasc.Overseer$ClusterStateUpdater.amILeader According to ZK I (id=90134387491536908-127.0.0.1:57585_-n_0000000004) am no longer a leader.
   [junit4]   2> 787251 T2248 oascc.ZkStateReader$2.process A cluster state change: WatchedEvent state:SyncConnected type:NodeChildrenChanged path:/live_nodes, has occurred - updating... (live nodes size: 1)
   [junit4]   2> 787272 T2166 oejsh.ContextHandler.doStop stopped o.e.j.s.ServletContextHandler{/,null}
   [junit4]   2> 787325 T2166 oas.SolrTestCaseJ4.tearDown ###Ending testDistribSearch
   [junit4]   2> 787329 T2166 oasc.ZkTestServer.send4LetterWord connecting to 127.0.0.1:58707 58707
   [junit4]   1> client port:0.0.0.0/0.0.0.0:0
   [junit4]   2> NOTE: reproduce with: ant test  -Dtestcase=CollectionsAPIDistributedZkTest -Dtests.method=testDistribSearch -Dtests.seed=1C8DE9553FDBEA04 -Dtests.multiplier=3 -Dtests.slow=true -Dtests.locale=es_VE -Dtests.timezone=GMT -Dtests.file.encoding=ISO-8859-1
   [junit4] ERROR    137s J1 | CollectionsAPIDistributedZkTest.testDistribSearch <<<
   [junit4]    > Throwable #1: org.apache.solr.client.solrj.SolrServerException: Server refused connection at: http://127.0.0.1:48965
   [junit4]    > 	at __randomizedtesting.SeedInfo.seed([1C8DE9553FDBEA04:9D6B674D48848A38]:0)
   [junit4]    > 	at org.apache.solr.client.solrj.impl.HttpSolrServer.request(HttpSolrServer.java:428)
   [junit4]    > 	at org.apache.solr.client.solrj.impl.HttpSolrServer.request(HttpSolrServer.java:180)
   [junit4]    > 	at org.apache.solr.cloud.CollectionsAPIDistributedZkTest.testCustomCollectionsAPI(CollectionsAPIDistributedZkTest.java:764)
   [junit4]    > 	at org.apache.solr.cloud.CollectionsAPIDistributedZkTest.doTest(CollectionsAPIDistributedZkTest.java:159)
   [junit4]    > 	at org.apache.solr.BaseDistributedSearchTestCase.testDistribSearch(BaseDistributedSearchTestCase.java:835)
   [junit4]    > 	at java.lang.Thread.run(Thread.java:662)
   [junit4]    > Caused by: org.apache.http.conn.HttpHostConnectException: Connection to http://127.0.0.1:48965 refused
   [junit4]    > 	at org.apache.http.impl.conn.DefaultClientConnectionOperator.openConnection(DefaultClientConnectionOperator.java:190)
   [junit4]    > 	at org.apache.http.impl.conn.ManagedClientConnectionImpl.open(ManagedClientConnectionImpl.java:294)
   [junit4]    > 	at org.apache.http.impl.client.DefaultRequestDirector.tryConnect(DefaultRequestDirector.java:645)
   [junit4]    > 	at org.apache.http.impl.client.DefaultRequestDirector.execute(DefaultRequestDirector.java:480)
   [junit4]    > 	at org.apache.http.impl.client.AbstractHttpClient.execute(AbstractHttpClient.java:906)
   [junit4]    > 	at org.apache.http.impl.client.AbstractHttpClient.execute(AbstractHttpClient.java:805)
   [junit4]    > 	at org.apache.http.impl.client.AbstractHttpClient.execute(AbstractHttpClient.java:784)
   [junit4]    > 	at org.apache.solr.client.solrj.impl.HttpSolrServer.request(HttpSolrServer.java:365)
   [junit4]    > 	... 44 more
   [junit4]    > Caused by: java.net.ConnectException: Connection refused
   [junit4]    > 	at java.net.PlainSocketImpl.socketConnect(Native Method)
   [junit4]    > 	at java.net.PlainSocketImpl.doConnect(PlainSocketImpl.java:351)
   [junit4]    > 	at java.net.PlainSocketImpl.connectToAddress(PlainSocketImpl.java:213)
   [junit4]    > 	at java.net.PlainSocketImpl.connect(PlainSocketImpl.java:200)
   [junit4]    > 	at java.net.SocksSocketImpl.connect(SocksSocketImpl.java:366)
   [junit4]    > 	at java.net.Socket.connect(Socket.java:529)
   [junit4]    > 	at org.apache.http.conn.scheme.PlainSocketFactory.connectSocket(PlainSocketFactory.java:127)
   [junit4]    > 	at org.apache.http.impl.conn.DefaultClientConnectionOperator.openConnection(DefaultClientConnectionOperator.java:180)
   [junit4]    > 	... 51 more
   [junit4]   2> 787370 T2166 oas.SolrTestCaseJ4.deleteCore ###deleteCore
   [junit4]   2> 137410 T2165 ccr.ThreadLeakControl.checkThreadLeaks WARNING Will linger awaiting termination of 2 leaked thread(s).
   [junit4]   2> 788551 T2248 oascc.ZkStateReader$2.process WARN ZooKeeper watch triggered, but Solr cannot talk to ZK
   [junit4]   2> 788552 T2248 oascc.ZkStateReader$3.process WARN ZooKeeper watch triggered, but Solr cannot talk to ZK
   [junit4]   2> NOTE: test params are: codec=HighCompressionCompressingStoredFields(storedFieldsFormat=CompressingStoredFieldsFormat(compressionMode=HIGH_COMPRESSION, chunkSize=84), termVectorsFormat=CompressingTermVectorsFormat(compressionMode=HIGH_COMPRESSION, chunkSize=84)), sim=RandomSimilarityProvider(queryNorm=true,coord=no): {}, locale=es_VE, timezone=GMT
   [junit4]   2> NOTE: Linux 3.2.0-51-generic amd64/Sun Microsystems Inc. 1.6.0_45 (64-bit)/cpus=8,threads=3,free=76665752,total=212672512
   [junit4]   2> NOTE: All tests run in this JVM: [TestPartialUpdateDeduplication, TestSchemaResource, TestClassNameShortening, TestStressLucene, FileUtilsTest, BasicDistributedZk2Test, NoCacheHeaderTest, TestDefaultSimilarityFactory, TestComponentsName, TestUtils, TestReload, TestLuceneMatchVersion, TestSolrXMLSerializer, HdfsCollectionsAPIDistributedZkTest, DocumentAnalysisRequestHandlerTest, CurrencyFieldOpenExchangeTest, CopyFieldTest, MultiTermTest, HdfsLockFactoryTest, TestCSVResponseWriter, TestLazyCores, PathHierarchyTokenizerFactoryTest, ClusterStateTest, NotRequiredUniqueKeyTest, NumericFieldsTest, SignatureUpdateProcessorFactoryTest, EchoParamsTest, TestSystemIdResolver, TestStressReorder, ZkNodePropsTest, ZkSolrClientTest, URLClassifyProcessorTest, DistanceFunctionTest, TestManagedSchema, FullSolrCloudDistribCmdsTest, BadCopyFieldTest, PingRequestHandlerTest, TestJmxIntegration, TestCollationKeyRangeQueries, IndexBasedSpellCheckerTest, TestAnalyzedSuggestions, TestElisionMultitermQuery, TestIndexingPerformance, CoreAdminCreateDiscoverTest, PreAnalyzedUpdateProcessorTest, DisMaxRequestHandlerTest, JSONWriterTest, OpenExchangeRatesOrgProviderTest, TestCollationField, SolrCoreCheckLockOnStartupTest, TestFoldingMultitermQuery, UniqFieldsUpdateProcessorFactoryTest, FieldAnalysisRequestHandlerTest, TestHashPartitioner, TestBM25SimilarityFactory, TestAddFieldRealTimeGet, SimplePostToolTest, DateMathParserTest, HdfsRecoveryZkTest, TestNumberUtils, TestPostingsSolrHighlighter, AssignTest, DocValuesMultiTest, TestUpdate, SpellCheckCollatorTest, HighlighterConfigTest, TestFiltering, TestCopyFieldCollectionResource, SolrCmdDistributorTest, TestPropInject, TestInfoStreamLogging, DebugComponentTest, TestQueryTypes, TermVectorComponentDistributedTest, SampleTest, TestSerializedLuceneMatchVersion, SortByFunctionTest, BasicDistributedZkTest, ChaosMonkeySafeLeaderTest, CollectionsAPIDistributedZkTest]
   [junit4] Completed on J1 in 138.70s, 1 test, 1 error <<< FAILURES!

[...truncated 485 lines...]
BUILD FAILED
/mnt/ssd/jenkins/workspace/Lucene-Solr-4.x-Linux/build.xml:395: The following error occurred while executing this line:
/mnt/ssd/jenkins/workspace/Lucene-Solr-4.x-Linux/build.xml:375: The following error occurred while executing this line:
/mnt/ssd/jenkins/workspace/Lucene-Solr-4.x-Linux/build.xml:39: The following error occurred while executing this line:
/mnt/ssd/jenkins/workspace/Lucene-Solr-4.x-Linux/solr/build.xml:181: The following error occurred while executing this line:
/mnt/ssd/jenkins/workspace/Lucene-Solr-4.x-Linux/solr/common-build.xml:449: The following error occurred while executing this line:
/mnt/ssd/jenkins/workspace/Lucene-Solr-4.x-Linux/lucene/common-build.xml:1233: The following error occurred while executing this line:
/mnt/ssd/jenkins/workspace/Lucene-Solr-4.x-Linux/lucene/common-build.xml:876: There were test failures: 321 suites, 1350 tests, 1 error, 35 ignored (7 assumptions)

Total time: 46 minutes 41 seconds
Build step 'Invoke Ant' marked build as failure
Description set: Java: 64bit/jdk1.6.0_45 -XX:-UseCompressedOops -XX:+UseConcMarkSweepGC
Archiving artifacts
Recording test results
Email was triggered for: Failure
Sending email for trigger: Failure



Mime
View raw message