lucene-dev mailing list archives

Site index · List index
Message view « Date » · « Thread »
Top « Date » · « Thread »
From Policeman Jenkins Server <jenk...@thetaphi.de>
Subject [JENKINS] Lucene-Solr-4.x-Linux (64bit/jdk1.6.0_45) - Build # 6787 - Failure!
Date Sat, 03 Aug 2013 19:58:21 GMT
Build: http://jenkins.thetaphi.de/job/Lucene-Solr-4.x-Linux/6787/
Java: 64bit/jdk1.6.0_45 -XX:-UseCompressedOops -XX:+UseSerialGC

1 tests failed.
FAILED:  org.apache.solr.cloud.CollectionsAPIDistributedZkTest.testDistribSearch

Error Message:
Server refused connection at: http://127.0.0.1:58624/v/f

Stack Trace:
org.apache.solr.client.solrj.SolrServerException: Server refused connection at: http://127.0.0.1:58624/v/f
	at __randomizedtesting.SeedInfo.seed([D91C4FA6CB18C597:58FAC1BEBC47A5AB]:0)
	at org.apache.solr.client.solrj.impl.HttpSolrServer.request(HttpSolrServer.java:428)
	at org.apache.solr.client.solrj.impl.HttpSolrServer.request(HttpSolrServer.java:180)
	at org.apache.solr.cloud.AbstractFullDistribZkTestBase.createCollection(AbstractFullDistribZkTestBase.java:1535)
	at org.apache.solr.cloud.CollectionsAPIDistributedZkTest.testCustomCollectionsAPI(CollectionsAPIDistributedZkTest.java:677)
	at org.apache.solr.cloud.CollectionsAPIDistributedZkTest.doTest(CollectionsAPIDistributedZkTest.java:159)
	at org.apache.solr.BaseDistributedSearchTestCase.testDistribSearch(BaseDistributedSearchTestCase.java:835)
	at sun.reflect.NativeMethodAccessorImpl.invoke0(Native Method)
	at sun.reflect.NativeMethodAccessorImpl.invoke(NativeMethodAccessorImpl.java:39)
	at sun.reflect.DelegatingMethodAccessorImpl.invoke(DelegatingMethodAccessorImpl.java:25)
	at java.lang.reflect.Method.invoke(Method.java:597)
	at com.carrotsearch.randomizedtesting.RandomizedRunner.invoke(RandomizedRunner.java:1559)
	at com.carrotsearch.randomizedtesting.RandomizedRunner.access$600(RandomizedRunner.java:79)
	at com.carrotsearch.randomizedtesting.RandomizedRunner$6.evaluate(RandomizedRunner.java:737)
	at com.carrotsearch.randomizedtesting.RandomizedRunner$7.evaluate(RandomizedRunner.java:773)
	at com.carrotsearch.randomizedtesting.RandomizedRunner$8.evaluate(RandomizedRunner.java:787)
	at com.carrotsearch.randomizedtesting.rules.SystemPropertiesRestoreRule$1.evaluate(SystemPropertiesRestoreRule.java:53)
	at org.apache.lucene.util.TestRuleSetupTeardownChained$1.evaluate(TestRuleSetupTeardownChained.java:50)
	at org.apache.lucene.util.TestRuleFieldCacheSanity$1.evaluate(TestRuleFieldCacheSanity.java:51)
	at org.apache.lucene.util.AbstractBeforeAfterRule$1.evaluate(AbstractBeforeAfterRule.java:46)
	at com.carrotsearch.randomizedtesting.rules.SystemPropertiesInvariantRule$1.evaluate(SystemPropertiesInvariantRule.java:55)
	at org.apache.lucene.util.TestRuleThreadAndTestName$1.evaluate(TestRuleThreadAndTestName.java:49)
	at org.apache.lucene.util.TestRuleIgnoreAfterMaxFailures$1.evaluate(TestRuleIgnoreAfterMaxFailures.java:70)
	at org.apache.lucene.util.TestRuleMarkFailure$1.evaluate(TestRuleMarkFailure.java:48)
	at com.carrotsearch.randomizedtesting.rules.StatementAdapter.evaluate(StatementAdapter.java:36)
	at com.carrotsearch.randomizedtesting.ThreadLeakControl$StatementRunner.run(ThreadLeakControl.java:358)
	at com.carrotsearch.randomizedtesting.ThreadLeakControl.forkTimeoutingTask(ThreadLeakControl.java:782)
	at com.carrotsearch.randomizedtesting.ThreadLeakControl$3.evaluate(ThreadLeakControl.java:442)
	at com.carrotsearch.randomizedtesting.RandomizedRunner.runSingleTest(RandomizedRunner.java:746)
	at com.carrotsearch.randomizedtesting.RandomizedRunner$3.evaluate(RandomizedRunner.java:648)
	at com.carrotsearch.randomizedtesting.RandomizedRunner$4.evaluate(RandomizedRunner.java:682)
	at com.carrotsearch.randomizedtesting.RandomizedRunner$5.evaluate(RandomizedRunner.java:693)
	at com.carrotsearch.randomizedtesting.rules.StatementAdapter.evaluate(StatementAdapter.java:36)
	at com.carrotsearch.randomizedtesting.rules.SystemPropertiesRestoreRule$1.evaluate(SystemPropertiesRestoreRule.java:53)
	at org.apache.lucene.util.AbstractBeforeAfterRule$1.evaluate(AbstractBeforeAfterRule.java:46)
	at org.apache.lucene.util.TestRuleStoreClassName$1.evaluate(TestRuleStoreClassName.java:42)
	at com.carrotsearch.randomizedtesting.rules.SystemPropertiesInvariantRule$1.evaluate(SystemPropertiesInvariantRule.java:55)
	at com.carrotsearch.randomizedtesting.rules.NoShadowingOrOverridesOnMethodsRule$1.evaluate(NoShadowingOrOverridesOnMethodsRule.java:39)
	at com.carrotsearch.randomizedtesting.rules.NoShadowingOrOverridesOnMethodsRule$1.evaluate(NoShadowingOrOverridesOnMethodsRule.java:39)
	at com.carrotsearch.randomizedtesting.rules.StatementAdapter.evaluate(StatementAdapter.java:36)
	at org.apache.lucene.util.TestRuleAssertionsRequired$1.evaluate(TestRuleAssertionsRequired.java:43)
	at org.apache.lucene.util.TestRuleMarkFailure$1.evaluate(TestRuleMarkFailure.java:48)
	at org.apache.lucene.util.TestRuleIgnoreAfterMaxFailures$1.evaluate(TestRuleIgnoreAfterMaxFailures.java:70)
	at org.apache.lucene.util.TestRuleIgnoreTestSuites$1.evaluate(TestRuleIgnoreTestSuites.java:55)
	at com.carrotsearch.randomizedtesting.rules.StatementAdapter.evaluate(StatementAdapter.java:36)
	at com.carrotsearch.randomizedtesting.ThreadLeakControl$StatementRunner.run(ThreadLeakControl.java:358)
	at java.lang.Thread.run(Thread.java:662)
Caused by: org.apache.http.conn.HttpHostConnectException: Connection to http://127.0.0.1:58624 refused
	at org.apache.http.impl.conn.DefaultClientConnectionOperator.openConnection(DefaultClientConnectionOperator.java:190)
	at org.apache.http.impl.conn.ManagedClientConnectionImpl.open(ManagedClientConnectionImpl.java:294)
	at org.apache.http.impl.client.DefaultRequestDirector.tryConnect(DefaultRequestDirector.java:645)
	at org.apache.http.impl.client.DefaultRequestDirector.execute(DefaultRequestDirector.java:480)
	at org.apache.http.impl.client.AbstractHttpClient.execute(AbstractHttpClient.java:906)
	at org.apache.http.impl.client.AbstractHttpClient.execute(AbstractHttpClient.java:805)
	at org.apache.http.impl.client.AbstractHttpClient.execute(AbstractHttpClient.java:784)
	at org.apache.solr.client.solrj.impl.HttpSolrServer.request(HttpSolrServer.java:365)
	... 45 more
Caused by: java.net.ConnectException: Connection refused
	at java.net.PlainSocketImpl.socketConnect(Native Method)
	at java.net.PlainSocketImpl.doConnect(PlainSocketImpl.java:351)
	at java.net.PlainSocketImpl.connectToAddress(PlainSocketImpl.java:213)
	at java.net.PlainSocketImpl.connect(PlainSocketImpl.java:200)
	at java.net.SocksSocketImpl.connect(SocksSocketImpl.java:366)
	at java.net.Socket.connect(Socket.java:529)
	at org.apache.http.conn.scheme.PlainSocketFactory.connectSocket(PlainSocketFactory.java:127)
	at org.apache.http.impl.conn.DefaultClientConnectionOperator.openConnection(DefaultClientConnectionOperator.java:180)
	... 52 more




Build Log:
[...truncated 9296 lines...]
   [junit4] Suite: org.apache.solr.cloud.CollectionsAPIDistributedZkTest
   [junit4]   2> 745536 T1939 oas.BaseDistributedSearchTestCase.initHostContext Setting hostContext system property: /v/f
   [junit4]   2> 745540 T1939 oas.SolrTestCaseJ4.setUp ###Starting testDistribSearch
   [junit4]   2> Creating dataDir: /mnt/ssd/jenkins/workspace/Lucene-Solr-4.x-Linux/solr/build/solr-core/test/J1/./solrtest-CollectionsAPIDistributedZkTest-1375559266293
   [junit4]   2> 745541 T1939 oasc.ZkTestServer.run STARTING ZK TEST SERVER
   [junit4]   2> 745541 T1940 oasc.ZkTestServer$ZKServerMain.runFromConfig Starting server
   [junit4]   2> 745641 T1939 oasc.ZkTestServer.run start zk server on port:34192
   [junit4]   2> 745643 T1939 oascc.ConnectionManager.waitForConnected Waiting for client to connect to ZooKeeper
   [junit4]   2> 746545 T1946 oascc.ConnectionManager.process Watcher org.apache.solr.common.cloud.ConnectionManager@30a7e71 name:ZooKeeperConnection Watcher:127.0.0.1:34192 got event WatchedEvent state:SyncConnected type:None path:null path:null type:None
   [junit4]   2> 746546 T1939 oascc.ConnectionManager.waitForConnected Client is connected to ZooKeeper
   [junit4]   2> 746546 T1939 oascc.SolrZkClient.makePath makePath: /solr
   [junit4]   2> 746556 T1939 oascc.ConnectionManager.waitForConnected Waiting for client to connect to ZooKeeper
   [junit4]   2> 746559 T1948 oascc.ConnectionManager.process Watcher org.apache.solr.common.cloud.ConnectionManager@766e067c name:ZooKeeperConnection Watcher:127.0.0.1:34192/solr got event WatchedEvent state:SyncConnected type:None path:null path:null type:None
   [junit4]   2> 746559 T1939 oascc.ConnectionManager.waitForConnected Client is connected to ZooKeeper
   [junit4]   2> 746560 T1939 oascc.SolrZkClient.makePath makePath: /collections/collection1
   [junit4]   2> 746568 T1939 oascc.SolrZkClient.makePath makePath: /collections/collection1/shards
   [junit4]   2> 746575 T1939 oascc.SolrZkClient.makePath makePath: /collections/control_collection
   [junit4]   2> 746581 T1939 oascc.SolrZkClient.makePath makePath: /collections/control_collection/shards
   [junit4]   2> 746588 T1939 oasc.AbstractZkTestCase.putConfig put /mnt/ssd/jenkins/workspace/Lucene-Solr-4.x-Linux/solr/build/solr-core/test-files/solr/collection1/conf/solrconfig-tlog.xml to /configs/conf1/solrconfig.xml
   [junit4]   2> 746589 T1939 oascc.SolrZkClient.makePath makePath: /configs/conf1/solrconfig.xml
   [junit4]   2> 746601 T1939 oasc.AbstractZkTestCase.putConfig put /mnt/ssd/jenkins/workspace/Lucene-Solr-4.x-Linux/solr/build/solr-core/test-files/solr/collection1/conf/schema.xml to /configs/conf1/schema.xml
   [junit4]   2> 746602 T1939 oascc.SolrZkClient.makePath makePath: /configs/conf1/schema.xml
   [junit4]   2> 746611 T1939 oasc.AbstractZkTestCase.putConfig put /mnt/ssd/jenkins/workspace/Lucene-Solr-4.x-Linux/solr/build/solr-core/test-files/solr/collection1/conf/stopwords.txt to /configs/conf1/stopwords.txt
   [junit4]   2> 746612 T1939 oascc.SolrZkClient.makePath makePath: /configs/conf1/stopwords.txt
   [junit4]   2> 746620 T1939 oasc.AbstractZkTestCase.putConfig put /mnt/ssd/jenkins/workspace/Lucene-Solr-4.x-Linux/solr/build/solr-core/test-files/solr/collection1/conf/protwords.txt to /configs/conf1/protwords.txt
   [junit4]   2> 746620 T1939 oascc.SolrZkClient.makePath makePath: /configs/conf1/protwords.txt
   [junit4]   2> 746629 T1939 oasc.AbstractZkTestCase.putConfig put /mnt/ssd/jenkins/workspace/Lucene-Solr-4.x-Linux/solr/build/solr-core/test-files/solr/collection1/conf/currency.xml to /configs/conf1/currency.xml
   [junit4]   2> 746630 T1939 oascc.SolrZkClient.makePath makePath: /configs/conf1/currency.xml
   [junit4]   2> 746638 T1939 oasc.AbstractZkTestCase.putConfig put /mnt/ssd/jenkins/workspace/Lucene-Solr-4.x-Linux/solr/build/solr-core/test-files/solr/collection1/conf/open-exchange-rates.json to /configs/conf1/open-exchange-rates.json
   [junit4]   2> 746639 T1939 oascc.SolrZkClient.makePath makePath: /configs/conf1/open-exchange-rates.json
   [junit4]   2> 746646 T1939 oasc.AbstractZkTestCase.putConfig put /mnt/ssd/jenkins/workspace/Lucene-Solr-4.x-Linux/solr/build/solr-core/test-files/solr/collection1/conf/mapping-ISOLatin1Accent.txt to /configs/conf1/mapping-ISOLatin1Accent.txt
   [junit4]   2> 746647 T1939 oascc.SolrZkClient.makePath makePath: /configs/conf1/mapping-ISOLatin1Accent.txt
   [junit4]   2> 746655 T1939 oasc.AbstractZkTestCase.putConfig put /mnt/ssd/jenkins/workspace/Lucene-Solr-4.x-Linux/solr/build/solr-core/test-files/solr/collection1/conf/old_synonyms.txt to /configs/conf1/old_synonyms.txt
   [junit4]   2> 746656 T1939 oascc.SolrZkClient.makePath makePath: /configs/conf1/old_synonyms.txt
   [junit4]   2> 746664 T1939 oasc.AbstractZkTestCase.putConfig put /mnt/ssd/jenkins/workspace/Lucene-Solr-4.x-Linux/solr/build/solr-core/test-files/solr/collection1/conf/synonyms.txt to /configs/conf1/synonyms.txt
   [junit4]   2> 746665 T1939 oascc.SolrZkClient.makePath makePath: /configs/conf1/synonyms.txt
   [junit4]   2> 746765 T1939 oejs.Server.doStart jetty-8.1.10.v20130312
   [junit4]   2> 746769 T1939 oejs.AbstractConnector.doStart Started SelectChannelConnector@127.0.0.1:37958
   [junit4]   2> 746769 T1939 oass.SolrDispatchFilter.init SolrDispatchFilter.init()
   [junit4]   2> 746770 T1939 oasc.SolrResourceLoader.locateSolrHome JNDI not configured for solr (NoInitialContextEx)
   [junit4]   2> 746770 T1939 oasc.SolrResourceLoader.locateSolrHome using system property solr.solr.home: /mnt/ssd/jenkins/workspace/Lucene-Solr-4.x-Linux/solr/build/solr-core/test/J1/./org.apache.solr.cloud.CollectionsAPIDistributedZkTest-controljetty-1375559267427
   [junit4]   2> 746770 T1939 oasc.SolrResourceLoader.<init> new SolrResourceLoader for directory: '/mnt/ssd/jenkins/workspace/Lucene-Solr-4.x-Linux/solr/build/solr-core/test/J1/./org.apache.solr.cloud.CollectionsAPIDistributedZkTest-controljetty-1375559267427/'
   [junit4]   2> 746780 T1939 oasc.ConfigSolr.fromFile Loading container configuration from /mnt/ssd/jenkins/workspace/Lucene-Solr-4.x-Linux/solr/build/solr-core/test/J1/./org.apache.solr.cloud.CollectionsAPIDistributedZkTest-controljetty-1375559267427/solr.xml
   [junit4]   2> 746824 T1939 oasc.ConfigSolrXml.<init> Config-defined core root directory: 
   [junit4]   2> 746826 T1939 oasc.CoreContainer.<init> New CoreContainer 719733555
   [junit4]   2> 746826 T1939 oasc.CoreContainer.load Loading cores into CoreContainer [instanceDir=/mnt/ssd/jenkins/workspace/Lucene-Solr-4.x-Linux/solr/build/solr-core/test/J1/./org.apache.solr.cloud.CollectionsAPIDistributedZkTest-controljetty-1375559267427/]
   [junit4]   2> 746828 T1939 oashc.HttpShardHandlerFactory.getParameter Setting socketTimeout to: 120000
   [junit4]   2> 746828 T1939 oashc.HttpShardHandlerFactory.getParameter Setting urlScheme to: http://
   [junit4]   2> 746828 T1939 oashc.HttpShardHandlerFactory.getParameter Setting connTimeout to: 15000
   [junit4]   2> 746829 T1939 oashc.HttpShardHandlerFactory.getParameter Setting maxConnectionsPerHost to: 20
   [junit4]   2> 746829 T1939 oashc.HttpShardHandlerFactory.getParameter Setting corePoolSize to: 0
   [junit4]   2> 746830 T1939 oashc.HttpShardHandlerFactory.getParameter Setting maximumPoolSize to: 2147483647
   [junit4]   2> 746830 T1939 oashc.HttpShardHandlerFactory.getParameter Setting maxThreadIdleTime to: 5
   [junit4]   2> 746830 T1939 oashc.HttpShardHandlerFactory.getParameter Setting sizeOfQueue to: -1
   [junit4]   2> 746831 T1939 oashc.HttpShardHandlerFactory.getParameter Setting fairnessPolicy to: false
   [junit4]   2> 746831 T1939 oascsi.HttpClientUtil.createClient Creating new http client, config:maxConnectionsPerHost=20&maxConnections=10000&socketTimeout=120000&connTimeout=15000&retry=false
   [junit4]   2> 746834 T1939 oasc.ZkContainer.initZooKeeper Zookeeper client=127.0.0.1:34192/solr
   [junit4]   2> 746834 T1939 oasc.ZkController.checkChrootPath zkHost includes chroot
   [junit4]   2> 746835 T1939 oascc.ConnectionManager.waitForConnected Waiting for client to connect to ZooKeeper
   [junit4]   2> 746838 T1959 oascc.ConnectionManager.process Watcher org.apache.solr.common.cloud.ConnectionManager@7345df45 name:ZooKeeperConnection Watcher:127.0.0.1:34192 got event WatchedEvent state:SyncConnected type:None path:null path:null type:None
   [junit4]   2> 746838 T1939 oascc.ConnectionManager.waitForConnected Client is connected to ZooKeeper
   [junit4]   2> 746842 T1939 oascsi.HttpClientUtil.createClient Creating new http client, config:maxConnections=500&maxConnectionsPerHost=16&socketTimeout=120000&connTimeout=15000
   [junit4]   2> 746845 T1939 oascc.ConnectionManager.waitForConnected Waiting for client to connect to ZooKeeper
   [junit4]   2> 746847 T1961 oascc.ConnectionManager.process Watcher org.apache.solr.common.cloud.ConnectionManager@51d3370e name:ZooKeeperConnection Watcher:127.0.0.1:34192/solr got event WatchedEvent state:SyncConnected type:None path:null path:null type:None
   [junit4]   2> 746847 T1939 oascc.ConnectionManager.waitForConnected Client is connected to ZooKeeper
   [junit4]   2> 746851 T1939 oascc.SolrZkClient.makePath makePath: /overseer/queue
   [junit4]   2> 746860 T1939 oascc.SolrZkClient.makePath makePath: /overseer/collection-queue-work
   [junit4]   2> 746869 T1939 oascc.SolrZkClient.makePath makePath: /live_nodes
   [junit4]   2> 746874 T1939 oasc.ZkController.createEphemeralLiveNode Register node as live in ZooKeeper:/live_nodes/127.0.0.1:37958_v%2Ff
   [junit4]   2> 746876 T1939 oascc.SolrZkClient.makePath makePath: /live_nodes/127.0.0.1:37958_v%2Ff
   [junit4]   2> 746887 T1939 oascc.SolrZkClient.makePath makePath: /overseer_elect/election
   [junit4]   2> 746900 T1939 oascc.SolrZkClient.makePath makePath: /overseer_elect/leader
   [junit4]   2> 746907 T1939 oasc.Overseer.start Overseer (id=90148652076040195-127.0.0.1:37958_v%2Ff-n_0000000000) starting
   [junit4]   2> 746915 T1939 oascc.SolrZkClient.makePath makePath: /overseer/queue-work
   [junit4]   2> 746924 T1963 oasc.OverseerCollectionProcessor.run Process current queue of collection creations
   [junit4]   2> 746926 T1939 oascc.SolrZkClient.makePath makePath: /clusterstate.json
   [junit4]   2> 746934 T1939 oascc.SolrZkClient.makePath makePath: /aliases.json
   [junit4]   2> 746940 T1939 oascc.ZkStateReader.createClusterStateWatchersAndUpdate Updating cluster state from ZooKeeper... 
   [junit4]   2> 746949 T1962 oasc.Overseer$ClusterStateUpdater.run Starting to work on the main queue
   [junit4]   2> 746952 T1939 oasc.CorePropertiesLocator.discover Looking for core definitions underneath /mnt/ssd/jenkins/workspace/Lucene-Solr-4.x-Linux/solr/build/solr-core/test/J1/./org.apache.solr.cloud.CollectionsAPIDistributedZkTest-controljetty-1375559267427
   [junit4]   2> 746987 T1939 oasc.CorePropertiesLocator.discoverUnder Found core conf in /mnt/ssd/jenkins/workspace/Lucene-Solr-4.x-Linux/solr/build/solr-core/test/J1/./org.apache.solr.cloud.CollectionsAPIDistributedZkTest-controljetty-1375559267427/conf/
   [junit4]   2> 746987 T1939 oasc.CorePropertiesLocator.discover Found 1 core definitions
   [junit4]   2> 746988 T1939 oass.SolrDispatchFilter.init user.dir=/mnt/ssd/jenkins/workspace/Lucene-Solr-4.x-Linux/solr/build/solr-core/test/J1
   [junit4]   2> 746988 T1939 oass.SolrDispatchFilter.init SolrDispatchFilter.init() done
   [junit4]   2> 746989 T1939 oascsi.HttpClientUtil.createClient Creating new http client, config:maxConnections=128&maxConnectionsPerHost=32&followRedirects=false
   [junit4]   2> 746992 T1939 oascsi.HttpClientUtil.createClient Creating new http client, config:
   [junit4]   2> 746993 T1939 oascc.ConnectionManager.waitForConnected Waiting for client to connect to ZooKeeper
   [junit4]   2> 746994 T1966 oascc.ConnectionManager.process Watcher org.apache.solr.common.cloud.ConnectionManager@4827fbb5 name:ZooKeeperConnection Watcher:127.0.0.1:34192/solr got event WatchedEvent state:SyncConnected type:None path:null path:null type:None
   [junit4]   2> 746995 T1939 oascc.ConnectionManager.waitForConnected Client is connected to ZooKeeper
   [junit4]   2> 746998 T1939 oascc.ZkStateReader.createClusterStateWatchersAndUpdate Updating cluster state from ZooKeeper... 
   [junit4]   2> 747004 T1939 oasc.ChaosMonkey.monkeyLog monkey: init - expire sessions:true cause connection loss:true
   [junit4]   2> 747091 T1939 oejs.Server.doStart jetty-8.1.10.v20130312
   [junit4]   2> 747093 T1939 oejs.AbstractConnector.doStart Started SelectChannelConnector@127.0.0.1:58624
   [junit4]   2> 747094 T1939 oass.SolrDispatchFilter.init SolrDispatchFilter.init()
   [junit4]   2> 747094 T1939 oasc.SolrResourceLoader.locateSolrHome JNDI not configured for solr (NoInitialContextEx)
   [junit4]   2> 747095 T1939 oasc.SolrResourceLoader.locateSolrHome using system property solr.solr.home: /mnt/ssd/jenkins/workspace/Lucene-Solr-4.x-Linux/solr/build/solr-core/test/J1/./org.apache.solr.cloud.CollectionsAPIDistributedZkTest-jetty1-1375559267756
   [junit4]   2> 747095 T1939 oasc.SolrResourceLoader.<init> new SolrResourceLoader for directory: '/mnt/ssd/jenkins/workspace/Lucene-Solr-4.x-Linux/solr/build/solr-core/test/J1/./org.apache.solr.cloud.CollectionsAPIDistributedZkTest-jetty1-1375559267756/'
   [junit4]   2> 747113 T1939 oasc.ConfigSolr.fromFile Loading container configuration from /mnt/ssd/jenkins/workspace/Lucene-Solr-4.x-Linux/solr/build/solr-core/test/J1/./org.apache.solr.cloud.CollectionsAPIDistributedZkTest-jetty1-1375559267756/solr.xml
   [junit4]   2> 747152 T1939 oasc.ConfigSolrXml.<init> Config-defined core root directory: 
   [junit4]   2> 747153 T1939 oasc.CoreContainer.<init> New CoreContainer 1708016757
   [junit4]   2> 747153 T1939 oasc.CoreContainer.load Loading cores into CoreContainer [instanceDir=/mnt/ssd/jenkins/workspace/Lucene-Solr-4.x-Linux/solr/build/solr-core/test/J1/./org.apache.solr.cloud.CollectionsAPIDistributedZkTest-jetty1-1375559267756/]
   [junit4]   2> 747154 T1939 oashc.HttpShardHandlerFactory.getParameter Setting socketTimeout to: 120000
   [junit4]   2> 747155 T1939 oashc.HttpShardHandlerFactory.getParameter Setting urlScheme to: http://
   [junit4]   2> 747155 T1939 oashc.HttpShardHandlerFactory.getParameter Setting connTimeout to: 15000
   [junit4]   2> 747155 T1939 oashc.HttpShardHandlerFactory.getParameter Setting maxConnectionsPerHost to: 20
   [junit4]   2> 747156 T1939 oashc.HttpShardHandlerFactory.getParameter Setting corePoolSize to: 0
   [junit4]   2> 747156 T1939 oashc.HttpShardHandlerFactory.getParameter Setting maximumPoolSize to: 2147483647
   [junit4]   2> 747156 T1939 oashc.HttpShardHandlerFactory.getParameter Setting maxThreadIdleTime to: 5
   [junit4]   2> 747157 T1939 oashc.HttpShardHandlerFactory.getParameter Setting sizeOfQueue to: -1
   [junit4]   2> 747157 T1939 oashc.HttpShardHandlerFactory.getParameter Setting fairnessPolicy to: false
   [junit4]   2> 747157 T1939 oascsi.HttpClientUtil.createClient Creating new http client, config:maxConnectionsPerHost=20&maxConnections=10000&socketTimeout=120000&connTimeout=15000&retry=false
   [junit4]   2> 747161 T1939 oasc.ZkContainer.initZooKeeper Zookeeper client=127.0.0.1:34192/solr
   [junit4]   2> 747161 T1939 oasc.ZkController.checkChrootPath zkHost includes chroot
   [junit4]   2> 747162 T1939 oascc.ConnectionManager.waitForConnected Waiting for client to connect to ZooKeeper
   [junit4]   2> 747164 T1977 oascc.ConnectionManager.process Watcher org.apache.solr.common.cloud.ConnectionManager@48f0918a name:ZooKeeperConnection Watcher:127.0.0.1:34192 got event WatchedEvent state:SyncConnected type:None path:null path:null type:None
   [junit4]   2> 747164 T1939 oascc.ConnectionManager.waitForConnected Client is connected to ZooKeeper
   [junit4]   2> 747168 T1939 oascsi.HttpClientUtil.createClient Creating new http client, config:maxConnections=500&maxConnectionsPerHost=16&socketTimeout=120000&connTimeout=15000
   [junit4]   2> 747171 T1939 oascc.ConnectionManager.waitForConnected Waiting for client to connect to ZooKeeper
   [junit4]   2> 747173 T1979 oascc.ConnectionManager.process Watcher org.apache.solr.common.cloud.ConnectionManager@52b7814b name:ZooKeeperConnection Watcher:127.0.0.1:34192/solr got event WatchedEvent state:SyncConnected type:None path:null path:null type:None
   [junit4]   2> 747173 T1939 oascc.ConnectionManager.waitForConnected Client is connected to ZooKeeper
   [junit4]   2> 747185 T1939 oascc.ZkStateReader.createClusterStateWatchersAndUpdate Updating cluster state from ZooKeeper... 
   [junit4]   2> 748195 T1939 oasc.ZkController.createEphemeralLiveNode Register node as live in ZooKeeper:/live_nodes/127.0.0.1:58624_v%2Ff
   [junit4]   2> 748197 T1939 oascc.SolrZkClient.makePath makePath: /live_nodes/127.0.0.1:58624_v%2Ff
   [junit4]   2> 748204 T1966 oascc.ZkStateReader$3.process Updating live nodes... (2)
   [junit4]   2> 748206 T1961 oascc.ZkStateReader$3.process Updating live nodes... (2)
   [junit4]   2> 748206 T1979 oascc.ZkStateReader$3.process Updating live nodes... (2)
   [junit4]   2> 748218 T1939 oasc.CorePropertiesLocator.discover Looking for core definitions underneath /mnt/ssd/jenkins/workspace/Lucene-Solr-4.x-Linux/solr/build/solr-core/test/J1/./org.apache.solr.cloud.CollectionsAPIDistributedZkTest-jetty1-1375559267756
   [junit4]   2> 748261 T1939 oasc.CorePropertiesLocator.discoverUnder Found core conf in /mnt/ssd/jenkins/workspace/Lucene-Solr-4.x-Linux/solr/build/solr-core/test/J1/./org.apache.solr.cloud.CollectionsAPIDistributedZkTest-jetty1-1375559267756/conf/
   [junit4]   2> 748262 T1939 oasc.CorePropertiesLocator.discover Found 1 core definitions
   [junit4]   2> 748262 T1939 oass.SolrDispatchFilter.init user.dir=/mnt/ssd/jenkins/workspace/Lucene-Solr-4.x-Linux/solr/build/solr-core/test/J1
   [junit4]   2> 748263 T1939 oass.SolrDispatchFilter.init SolrDispatchFilter.init() done
   [junit4]   2> 748263 T1939 oascsi.HttpClientUtil.createClient Creating new http client, config:maxConnections=128&maxConnectionsPerHost=32&followRedirects=false
   [junit4]   2> 748332 T1939 oejs.Server.doStart jetty-8.1.10.v20130312
   [junit4]   2> 748334 T1939 oejs.AbstractConnector.doStart Started SelectChannelConnector@127.0.0.1:38130
   [junit4]   2> 748335 T1939 oass.SolrDispatchFilter.init SolrDispatchFilter.init()
   [junit4]   2> 748336 T1939 oasc.SolrResourceLoader.locateSolrHome JNDI not configured for solr (NoInitialContextEx)
   [junit4]   2> 748336 T1939 oasc.SolrResourceLoader.locateSolrHome using system property solr.solr.home: /mnt/ssd/jenkins/workspace/Lucene-Solr-4.x-Linux/solr/build/solr-core/test/J1/./org.apache.solr.cloud.CollectionsAPIDistributedZkTest-jetty2-1375559269018
   [junit4]   2> 748337 T1939 oasc.SolrResourceLoader.<init> new SolrResourceLoader for directory: '/mnt/ssd/jenkins/workspace/Lucene-Solr-4.x-Linux/solr/build/solr-core/test/J1/./org.apache.solr.cloud.CollectionsAPIDistributedZkTest-jetty2-1375559269018/'
   [junit4]   2> 748351 T1939 oasc.ConfigSolr.fromFile Loading container configuration from /mnt/ssd/jenkins/workspace/Lucene-Solr-4.x-Linux/solr/build/solr-core/test/J1/./org.apache.solr.cloud.CollectionsAPIDistributedZkTest-jetty2-1375559269018/solr.xml
   [junit4]   2> 748394 T1939 oasc.ConfigSolrXml.<init> Config-defined core root directory: 
   [junit4]   2> 748395 T1939 oasc.CoreContainer.<init> New CoreContainer 73315987
   [junit4]   2> 748395 T1939 oasc.CoreContainer.load Loading cores into CoreContainer [instanceDir=/mnt/ssd/jenkins/workspace/Lucene-Solr-4.x-Linux/solr/build/solr-core/test/J1/./org.apache.solr.cloud.CollectionsAPIDistributedZkTest-jetty2-1375559269018/]
   [junit4]   2> 748396 T1939 oashc.HttpShardHandlerFactory.getParameter Setting socketTimeout to: 120000
   [junit4]   2> 748397 T1939 oashc.HttpShardHandlerFactory.getParameter Setting urlScheme to: http://
   [junit4]   2> 748397 T1939 oashc.HttpShardHandlerFactory.getParameter Setting connTimeout to: 15000
   [junit4]   2> 748397 T1939 oashc.HttpShardHandlerFactory.getParameter Setting maxConnectionsPerHost to: 20
   [junit4]   2> 748398 T1939 oashc.HttpShardHandlerFactory.getParameter Setting corePoolSize to: 0
   [junit4]   2> 748398 T1939 oashc.HttpShardHandlerFactory.getParameter Setting maximumPoolSize to: 2147483647
   [junit4]   2> 748399 T1939 oashc.HttpShardHandlerFactory.getParameter Setting maxThreadIdleTime to: 5
   [junit4]   2> 748399 T1939 oashc.HttpShardHandlerFactory.getParameter Setting sizeOfQueue to: -1
   [junit4]   2> 748399 T1939 oashc.HttpShardHandlerFactory.getParameter Setting fairnessPolicy to: false
   [junit4]   2> 748400 T1939 oascsi.HttpClientUtil.createClient Creating new http client, config:maxConnectionsPerHost=20&maxConnections=10000&socketTimeout=120000&connTimeout=15000&retry=false
   [junit4]   2> 748403 T1939 oasc.ZkContainer.initZooKeeper Zookeeper client=127.0.0.1:34192/solr
   [junit4]   2> 748404 T1939 oasc.ZkController.checkChrootPath zkHost includes chroot
   [junit4]   2> 748405 T1939 oascc.ConnectionManager.waitForConnected Waiting for client to connect to ZooKeeper
   [junit4]   2> 748407 T1991 oascc.ConnectionManager.process Watcher org.apache.solr.common.cloud.ConnectionManager@66246f22 name:ZooKeeperConnection Watcher:127.0.0.1:34192 got event WatchedEvent state:SyncConnected type:None path:null path:null type:None
   [junit4]   2> 748407 T1939 oascc.ConnectionManager.waitForConnected Client is connected to ZooKeeper
   [junit4]   2> 748410 T1939 oascsi.HttpClientUtil.createClient Creating new http client, config:maxConnections=500&maxConnectionsPerHost=16&socketTimeout=120000&connTimeout=15000
   [junit4]   2> 748414 T1939 oascc.ConnectionManager.waitForConnected Waiting for client to connect to ZooKeeper
   [junit4]   2> 748416 T1993 oascc.ConnectionManager.process Watcher org.apache.solr.common.cloud.ConnectionManager@41aacb08 name:ZooKeeperConnection Watcher:127.0.0.1:34192/solr got event WatchedEvent state:SyncConnected type:None path:null path:null type:None
   [junit4]   2> 748416 T1939 oascc.ConnectionManager.waitForConnected Client is connected to ZooKeeper
   [junit4]   2> 748424 T1939 oascc.ZkStateReader.createClusterStateWatchersAndUpdate Updating cluster state from ZooKeeper... 
   [junit4]   2> 749434 T1939 oasc.ZkController.createEphemeralLiveNode Register node as live in ZooKeeper:/live_nodes/127.0.0.1:38130_v%2Ff
   [junit4]   2> 749436 T1939 oascc.SolrZkClient.makePath makePath: /live_nodes/127.0.0.1:38130_v%2Ff
   [junit4]   2> 749446 T1966 oascc.ZkStateReader$3.process Updating live nodes... (3)
   [junit4]   2> 749447 T1993 oascc.ZkStateReader$3.process Updating live nodes... (3)
   [junit4]   2> 749449 T1979 oascc.ZkStateReader$3.process Updating live nodes... (3)
   [junit4]   2> 749449 T1961 oascc.ZkStateReader$3.process Updating live nodes... (3)
   [junit4]   2> 749459 T1939 oasc.CorePropertiesLocator.discover Looking for core definitions underneath /mnt/ssd/jenkins/workspace/Lucene-Solr-4.x-Linux/solr/build/solr-core/test/J1/./org.apache.solr.cloud.CollectionsAPIDistributedZkTest-jetty2-1375559269018
   [junit4]   2> 749500 T1939 oasc.CorePropertiesLocator.discoverUnder Found core conf in /mnt/ssd/jenkins/workspace/Lucene-Solr-4.x-Linux/solr/build/solr-core/test/J1/./org.apache.solr.cloud.CollectionsAPIDistributedZkTest-jetty2-1375559269018/conf/
   [junit4]   2> 749501 T1939 oasc.CorePropertiesLocator.discover Found 1 core definitions
   [junit4]   2> 749501 T1939 oass.SolrDispatchFilter.init user.dir=/mnt/ssd/jenkins/workspace/Lucene-Solr-4.x-Linux/solr/build/solr-core/test/J1
   [junit4]   2> 749501 T1939 oass.SolrDispatchFilter.init SolrDispatchFilter.init() done
   [junit4]   2> 749502 T1939 oascsi.HttpClientUtil.createClient Creating new http client, config:maxConnections=128&maxConnectionsPerHost=32&followRedirects=false
   [junit4]   2> 749572 T1939 oejs.Server.doStart jetty-8.1.10.v20130312
   [junit4]   2> 749574 T1939 oejs.AbstractConnector.doStart Started SelectChannelConnector@127.0.0.1:35632
   [junit4]   2> 749574 T1939 oass.SolrDispatchFilter.init SolrDispatchFilter.init()
   [junit4]   2> 749575 T1939 oasc.SolrResourceLoader.locateSolrHome JNDI not configured for solr (NoInitialContextEx)
   [junit4]   2> 749575 T1939 oasc.SolrResourceLoader.locateSolrHome using system property solr.solr.home: /mnt/ssd/jenkins/workspace/Lucene-Solr-4.x-Linux/solr/build/solr-core/test/J1/./org.apache.solr.cloud.CollectionsAPIDistributedZkTest-jetty3-1375559270256
   [junit4]   2> 749575 T1939 oasc.SolrResourceLoader.<init> new SolrResourceLoader for directory: '/mnt/ssd/jenkins/workspace/Lucene-Solr-4.x-Linux/solr/build/solr-core/test/J1/./org.apache.solr.cloud.CollectionsAPIDistributedZkTest-jetty3-1375559270256/'
   [junit4]   2> 749585 T1939 oasc.ConfigSolr.fromFile Loading container configuration from /mnt/ssd/jenkins/workspace/Lucene-Solr-4.x-Linux/solr/build/solr-core/test/J1/./org.apache.solr.cloud.CollectionsAPIDistributedZkTest-jetty3-1375559270256/solr.xml
   [junit4]   2> 749626 T1939 oasc.ConfigSolrXml.<init> Config-defined core root directory: 
   [junit4]   2> 749626 T1939 oasc.CoreContainer.<init> New CoreContainer 1677321502
   [junit4]   2> 749626 T1939 oasc.CoreContainer.load Loading cores into CoreContainer [instanceDir=/mnt/ssd/jenkins/workspace/Lucene-Solr-4.x-Linux/solr/build/solr-core/test/J1/./org.apache.solr.cloud.CollectionsAPIDistributedZkTest-jetty3-1375559270256/]
   [junit4]   2> 749627 T1939 oashc.HttpShardHandlerFactory.getParameter Setting socketTimeout to: 120000
   [junit4]   2> 749628 T1939 oashc.HttpShardHandlerFactory.getParameter Setting urlScheme to: http://
   [junit4]   2> 749628 T1939 oashc.HttpShardHandlerFactory.getParameter Setting connTimeout to: 15000
   [junit4]   2> 749628 T1939 oashc.HttpShardHandlerFactory.getParameter Setting maxConnectionsPerHost to: 20
   [junit4]   2> 749629 T1939 oashc.HttpShardHandlerFactory.getParameter Setting corePoolSize to: 0
   [junit4]   2> 749629 T1939 oashc.HttpShardHandlerFactory.getParameter Setting maximumPoolSize to: 2147483647
   [junit4]   2> 749629 T1939 oashc.HttpShardHandlerFactory.getParameter Setting maxThreadIdleTime to: 5
   [junit4]   2> 749630 T1939 oashc.HttpShardHandlerFactory.getParameter Setting sizeOfQueue to: -1
   [junit4]   2> 749630 T1939 oashc.HttpShardHandlerFactory.getParameter Setting fairnessPolicy to: false
   [junit4]   2> 749630 T1939 oascsi.HttpClientUtil.createClient Creating new http client, config:maxConnectionsPerHost=20&maxConnections=10000&socketTimeout=120000&connTimeout=15000&retry=false
   [junit4]   2> 749633 T1939 oasc.ZkContainer.initZooKeeper Zookeeper client=127.0.0.1:34192/solr
   [junit4]   2> 749633 T1939 oasc.ZkController.checkChrootPath zkHost includes chroot
   [junit4]   2> 749634 T1939 oascc.ConnectionManager.waitForConnected Waiting for client to connect to ZooKeeper
   [junit4]   2> 749636 T2005 oascc.ConnectionManager.process Watcher org.apache.solr.common.cloud.ConnectionManager@2b3147d9 name:ZooKeeperConnection Watcher:127.0.0.1:34192 got event WatchedEvent state:SyncConnected type:None path:null path:null type:None
   [junit4]   2> 749636 T1939 oascc.ConnectionManager.waitForConnected Client is connected to ZooKeeper
   [junit4]   2> 749639 T1939 oascsi.HttpClientUtil.createClient Creating new http client, config:maxConnections=500&maxConnectionsPerHost=16&socketTimeout=120000&connTimeout=15000
   [junit4]   2> 749642 T1939 oascc.ConnectionManager.waitForConnected Waiting for client to connect to ZooKeeper
   [junit4]   2> 749643 T2007 oascc.ConnectionManager.process Watcher org.apache.solr.common.cloud.ConnectionManager@39bf0c32 name:ZooKeeperConnection Watcher:127.0.0.1:34192/solr got event WatchedEvent state:SyncConnected type:None path:null path:null type:None
   [junit4]   2> 749643 T1939 oascc.ConnectionManager.waitForConnected Client is connected to ZooKeeper
   [junit4]   2> 749649 T1939 oascc.ZkStateReader.createClusterStateWatchersAndUpdate Updating cluster state from ZooKeeper... 
   [junit4]   2> 750655 T1939 oasc.ZkController.createEphemeralLiveNode Register node as live in ZooKeeper:/live_nodes/127.0.0.1:35632_v%2Ff
   [junit4]   2> 750657 T1939 oascc.SolrZkClient.makePath makePath: /live_nodes/127.0.0.1:35632_v%2Ff
   [junit4]   2> 750668 T1966 oascc.ZkStateReader$3.process Updating live nodes... (4)
   [junit4]   2> 750668 T1993 oascc.ZkStateReader$3.process Updating live nodes... (4)
   [junit4]   2> 750669 T1961 oascc.ZkStateReader$3.process Updating live nodes... (4)
   [junit4]   2> 750669 T1979 oascc.ZkStateReader$3.process Updating live nodes... (4)
   [junit4]   2> 750671 T2007 oascc.ZkStateReader$3.process Updating live nodes... (4)
   [junit4]   2> 750682 T1939 oasc.CorePropertiesLocator.discover Looking for core definitions underneath /mnt/ssd/jenkins/workspace/Lucene-Solr-4.x-Linux/solr/build/solr-core/test/J1/./org.apache.solr.cloud.CollectionsAPIDistributedZkTest-jetty3-1375559270256
   [junit4]   2> 750723 T1939 oasc.CorePropertiesLocator.discoverUnder Found core conf in /mnt/ssd/jenkins/workspace/Lucene-Solr-4.x-Linux/solr/build/solr-core/test/J1/./org.apache.solr.cloud.CollectionsAPIDistributedZkTest-jetty3-1375559270256/conf/
   [junit4]   2> 750723 T1939 oasc.CorePropertiesLocator.discover Found 1 core definitions
   [junit4]   2> 750724 T1939 oass.SolrDispatchFilter.init user.dir=/mnt/ssd/jenkins/workspace/Lucene-Solr-4.x-Linux/solr/build/solr-core/test/J1
   [junit4]   2> 750724 T1939 oass.SolrDispatchFilter.init SolrDispatchFilter.init() done
   [junit4]   2> 750724 T1939 oascsi.HttpClientUtil.createClient Creating new http client, config:maxConnections=128&maxConnectionsPerHost=32&followRedirects=false
   [junit4]   2> 750794 T1939 oejs.Server.doStart jetty-8.1.10.v20130312
   [junit4]   2> 750797 T1939 oejs.AbstractConnector.doStart Started SelectChannelConnector@127.0.0.1:57715
   [junit4]   2> 750798 T1939 oass.SolrDispatchFilter.init SolrDispatchFilter.init()
   [junit4]   2> 750798 T1939 oasc.SolrResourceLoader.locateSolrHome JNDI not configured for solr (NoInitialContextEx)
   [junit4]   2> 750799 T1939 oasc.SolrResourceLoader.locateSolrHome using system property solr.solr.home: /mnt/ssd/jenkins/workspace/Lucene-Solr-4.x-Linux/solr/build/solr-core/test/J1/./org.apache.solr.cloud.CollectionsAPIDistributedZkTest-jetty4-1375559271479
   [junit4]   2> 750799 T1939 oasc.SolrResourceLoader.<init> new SolrResourceLoader for directory: '/mnt/ssd/jenkins/workspace/Lucene-Solr-4.x-Linux/solr/build/solr-core/test/J1/./org.apache.solr.cloud.CollectionsAPIDistributedZkTest-jetty4-1375559271479/'
   [junit4]   2> 750816 T1939 oasc.ConfigSolr.fromFile Loading container configuration from /mnt/ssd/jenkins/workspace/Lucene-Solr-4.x-Linux/solr/build/solr-core/test/J1/./org.apache.solr.cloud.CollectionsAPIDistributedZkTest-jetty4-1375559271479/solr.xml
   [junit4]   2> 750857 T1939 oasc.ConfigSolrXml.<init> Config-defined core root directory: 
   [junit4]   2> 750858 T1939 oasc.CoreContainer.<init> New CoreContainer 173992838
   [junit4]   2> 750858 T1939 oasc.CoreContainer.load Loading cores into CoreContainer [instanceDir=/mnt/ssd/jenkins/workspace/Lucene-Solr-4.x-Linux/solr/build/solr-core/test/J1/./org.apache.solr.cloud.CollectionsAPIDistributedZkTest-jetty4-1375559271479/]
   [junit4]   2> 750859 T1939 oashc.HttpShardHandlerFactory.getParameter Setting socketTimeout to: 120000
   [junit4]   2> 750860 T1939 oashc.HttpShardHandlerFactory.getParameter Setting urlScheme to: http://
   [junit4]   2> 750860 T1939 oashc.HttpShardHandlerFactory.getParameter Setting connTimeout to: 15000
   [junit4]   2> 750860 T1939 oashc.HttpShardHandlerFactory.getParameter Setting maxConnectionsPerHost to: 20
   [junit4]   2> 750861 T1939 oashc.HttpShardHandlerFactory.getParameter Setting corePoolSize to: 0
   [junit4]   2> 750861 T1939 oashc.HttpShardHandlerFactory.getParameter Setting maximumPoolSize to: 2147483647
   [junit4]   2> 750862 T1939 oashc.HttpShardHandlerFactory.getParameter Setting maxThreadIdleTime to: 5
   [junit4]   2> 750862 T1939 oashc.HttpShardHandlerFactory.getParameter Setting sizeOfQueue to: -1
   [junit4]   2> 750862 T1939 oashc.HttpShardHandlerFactory.getParameter Setting fairnessPolicy to: false
   [junit4]   2> 750863 T1939 oascsi.HttpClientUtil.createClient Creating new http client, config:maxConnectionsPerHost=20&maxConnections=10000&socketTimeout=120000&connTimeout=15000&retry=false
   [junit4]   2> 750866 T1939 oasc.ZkContainer.initZooKeeper Zookeeper client=127.0.0.1:34192/solr
   [junit4]   2> 750866 T1939 oasc.ZkController.checkChrootPath zkHost includes chroot
   [junit4]   2> 750867 T1939 oascc.ConnectionManager.waitForConnected Waiting for client to connect to ZooKeeper
   [junit4]   2> 750869 T2019 oascc.ConnectionManager.process Watcher org.apache.solr.common.cloud.ConnectionManager@5db8afbb name:ZooKeeperConnection Watcher:127.0.0.1:34192 got event WatchedEvent state:SyncConnected type:None path:null path:null type:None
   [junit4]   2> 750869 T1939 oascc.ConnectionManager.waitForConnected Client is connected to ZooKeeper
   [junit4]   2> 750873 T1939 oascsi.HttpClientUtil.createClient Creating new http client, config:maxConnections=500&maxConnectionsPerHost=16&socketTimeout=120000&connTimeout=15000
   [junit4]   2> 750877 T1939 oascc.ConnectionManager.waitForConnected Waiting for client to connect to ZooKeeper
   [junit4]   2> 750878 T2021 oascc.ConnectionManager.process Watcher org.apache.solr.common.cloud.ConnectionManager@502b578f name:ZooKeeperConnection Watcher:127.0.0.1:34192/solr got event WatchedEvent state:SyncConnected type:None path:null path:null type:None
   [junit4]   2> 750879 T1939 oascc.ConnectionManager.waitForConnected Client is connected to ZooKeeper
   [junit4]   2> 750888 T1939 oascc.ZkStateReader.createClusterStateWatchersAndUpdate Updating cluster state from ZooKeeper... 
   [junit4]   2> 751898 T1939 oasc.ZkController.createEphemeralLiveNode Register node as live in ZooKeeper:/live_nodes/127.0.0.1:57715_v%2Ff
   [junit4]   2> 751900 T1939 oascc.SolrZkClient.makePath makePath: /live_nodes/127.0.0.1:57715_v%2Ff
   [junit4]   2> 751912 T1966 oascc.ZkStateReader$3.process Updating live nodes... (5)
   [junit4]   2> 751913 T1979 oascc.ZkStateReader$3.process Updating live nodes... (5)
   [junit4]   2> 751913 T1993 oascc.ZkStateReader$3.process Updating live nodes... (5)
   [junit4]   2> 751914 T2007 oascc.ZkStateReader$3.process Updating live nodes... (5)
   [junit4]   2> 751915 T2021 oascc.ZkStateReader$3.process Updating live nodes... (5)
   [junit4]   2> 751916 T1961 oascc.ZkStateReader$3.process Updating live nodes... (5)
   [junit4]   2> 751928 T1939 oasc.CorePropertiesLocator.discover Looking for core definitions underneath /mnt/ssd/jenkins/workspace/Lucene-Solr-4.x-Linux/solr/build/solr-core/test/J1/./org.apache.solr.cloud.CollectionsAPIDistributedZkTest-jetty4-1375559271479
   [junit4]   2> 751964 T1939 oasc.CorePropertiesLocator.discoverUnder Found core conf in /mnt/ssd/jenkins/workspace/Lucene-Solr-4.x-Linux/solr/build/solr-core/test/J1/./org.apache.solr.cloud.CollectionsAPIDistributedZkTest-jetty4-1375559271479/conf/
   [junit4]   2> 751965 T1939 oasc.CorePropertiesLocator.discover Found 1 core definitions
   [junit4]   2> 751965 T1939 oass.SolrDispatchFilter.init user.dir=/mnt/ssd/jenkins/workspace/Lucene-Solr-4.x-Linux/solr/build/solr-core/test/J1
   [junit4]   2> 751966 T1939 oass.SolrDispatchFilter.init SolrDispatchFilter.init() done
   [junit4]   2> 751966 T1939 oascsi.HttpClientUtil.createClient Creating new http client, config:maxConnections=128&maxConnectionsPerHost=32&followRedirects=false
   [junit4]   2> 751969 T1939 oascsi.HttpClientUtil.createClient Creating new http client, config:maxConnections=128&maxConnectionsPerHost=32&followRedirects=false
   [junit4]   2> 751971 T1973 oasha.CollectionsHandler.handleCreateAction Creating Collection : numShards=2&name=nodes_used_collection&replicationFactor=2&action=CREATE&wt=javabin&version=2
   [junit4]   2> 751973 T1961 oasc.DistributedQueue$LatchChildWatcher.process Watcher fired on path: /overseer/collection-queue-work state: SyncConnected type NodeChildrenChanged
   [junit4]   2> 751974 T1961 oasc.DistributedQueue$LatchChildWatcher.process Watcher fired on path: /overseer/collection-queue-work state: SyncConnected type NodeChildrenChanged
   [junit4]   2> 751975 T1963 oasc.OverseerCollectionProcessor.run Overseer Collection Processor: Get the message id:/overseer/collection-queue-work/qn-0000000000 message:{
   [junit4]   2> 	  "operation":"createcollection",
   [junit4]   2> 	  "numShards":"2",
   [junit4]   2> 	  "name":"nodes_used_collection",
   [junit4]   2> 	  "replicationFactor":"2"}
   [junit4]   2> 751975 T1963 oasc.OverseerCollectionProcessor.processMessage WARN OverseerCollectionProcessor.processMessage : createcollection , {
   [junit4]   2> 	  "operation":"createcollection",
   [junit4]   2> 	  "numShards":"2",
   [junit4]   2> 	  "name":"nodes_used_collection",
   [junit4]   2> 	  "replicationFactor":"2"}
   [junit4]   2> 752971 T1962 oascc.ZkStateReader.updateClusterState Updating cloud state from ZooKeeper... 
   [junit4]   2> 752973 T1962 oasc.Overseer$ClusterStateUpdater.buildCollection building a new collection: nodes_used_collection
   [junit4]   2> 752973 T1962 oasc.Overseer$ClusterStateUpdater.createCollection Create collection nodes_used_collection with shards [shard1, shard2]
   [junit4]   2> 752983 T1966 oascc.ZkStateReader$2.process A cluster state change: WatchedEvent state:SyncConnected type:NodeDataChanged path:/clusterstate.json, has occurred - updating... (live nodes size: 5)
   [junit4]   2> 752983 T2007 oascc.ZkStateReader$2.process A cluster state change: WatchedEvent state:SyncConnected type:NodeDataChanged path:/clusterstate.json, has occurred - updating... (live nodes size: 5)
   [junit4]   2> 752984 T2021 oascc.ZkStateReader$2.process A cluster state change: WatchedEvent state:SyncConnected type:NodeDataChanged path:/clusterstate.json, has occurred - updating... (live nodes size: 5)
   [junit4]   2> 752983 T1979 oascc.ZkStateReader$2.process A cluster state change: WatchedEvent state:SyncConnected type:NodeDataChanged path:/clusterstate.json, has occurred - updating... (live nodes size: 5)
   [junit4]   2> 752984 T1993 oascc.ZkStateReader$2.process A cluster state change: WatchedEvent state:SyncConnected type:NodeDataChanged path:/clusterstate.json, has occurred - updating... (live nodes size: 5)
   [junit4]   2> 752984 T1961 oascc.ZkStateReader$2.process A cluster state change: WatchedEvent state:SyncConnected type:NodeDataChanged path:/clusterstate.json, has occurred - updating... (live nodes size: 5)
   [junit4]   2> 753080 T1963 oasc.OverseerCollectionProcessor.createCollection going to create cores replicas shardNames [shard1, shard2] , repFactor : 2
   [junit4]   2> 753080 T1963 oasc.OverseerCollectionProcessor.createCollection Creating shard nodes_used_collection_shard1_replica1 as part of slice shard1 of collection nodes_used_collection on 127.0.0.1:35632_v%2Ff
   [junit4]   2> 753081 T1963 oasc.OverseerCollectionProcessor.createCollection Creating shard nodes_used_collection_shard1_replica2 as part of slice shard1 of collection nodes_used_collection on 127.0.0.1:57715_v%2Ff
   [junit4]   2> 753082 T1963 oasc.OverseerCollectionProcessor.createCollection Creating shard nodes_used_collection_shard2_replica1 as part of slice shard2 of collection nodes_used_collection on 127.0.0.1:58624_v%2Ff
   [junit4]   2> 753083 T1963 oasc.OverseerCollectionProcessor.createCollection Creating shard nodes_used_collection_shard2_replica2 as part of slice shard2 of collection nodes_used_collection on 127.0.0.1:38130_v%2Ff
   [junit4]   2> 753085 T2015 oasc.ZkController.publish publishing core=nodes_used_collection_shard1_replica2 state=down
   [junit4]   2> 753085 T1972 oasc.ZkController.publish publishing core=nodes_used_collection_shard2_replica1 state=down
   [junit4]   2> 753085 T2002 oasc.ZkController.publish publishing core=nodes_used_collection_shard1_replica1 state=down
   [junit4]   2> 753086 T1986 oasc.ZkController.publish publishing core=nodes_used_collection_shard2_replica2 state=down
   [junit4]   2> 753089 T1972 oasc.ZkController.waitForCoreNodeName look for our core node name
   [junit4]   2> 753089 T2015 oasc.ZkController.waitForCoreNodeName look for our core node name
   [junit4]   2> 753090 T1986 oasc.ZkController.waitForCoreNodeName look for our core node name
   [junit4]   2> 753091 T2002 oasc.ZkController.waitForCoreNodeName look for our core node name
   [junit4]   2> 754508 T1962 oascc.ZkStateReader.updateClusterState Updating cloud state from ZooKeeper... 
   [junit4]   2> 754511 T1962 oasc.Overseer$ClusterStateUpdater.updateState WARN Could not find collection node for nodes_used_collection, skipping publish state
   [junit4]   2> 754511 T1962 oasc.Overseer$ClusterStateUpdater.updateState Update state numShards=2 message={
   [junit4]   2> 	  "operation":"state",
   [junit4]   2> 	  "core_node_name":"core_node1",
   [junit4]   2> 	  "numShards":"2",
   [junit4]   2> 	  "shard":"shard1",
   [junit4]   2> 	  "roles":null,
   [junit4]   2> 	  "state":"down",
   [junit4]   2> 	  "shard_state":"active",
   [junit4]   2> 	  "core":"nodes_used_collection_shard1_replica2",
   [junit4]   2> 	  "collection":"nodes_used_collection",
   [junit4]   2> 	  "shard_range":null,
   [junit4]   2> 	  "node_name":"127.0.0.1:57715_v%2Ff",
   [junit4]   2> 	  "base_url":"http://127.0.0.1:57715/v/f"}
   [junit4]   2> 754522 T1962 oasc.Overseer$ClusterStateUpdater.updateState WARN Could not find collection node for nodes_used_collection, skipping publish state
   [junit4]   2> 754523 T1962 oasc.Overseer$ClusterStateUpdater.updateState Update state numShards=2 message={
   [junit4]   2> 	  "operation":"state",
   [junit4]   2> 	  "core_node_name":"core_node2",
   [junit4]   2> 	  "numShards":"2",
   [junit4]   2> 	  "shard":"shard2",
   [junit4]   2> 	  "roles":null,
   [junit4]   2> 	  "state":"down",
   [junit4]   2> 	  "shard_state":"active",
   [junit4]   2> 	  "core":"nodes_used_collection_shard2_replica1",
   [junit4]   2> 	  "collection":"nodes_used_collection",
   [junit4]   2> 	  "shard_range":null,
   [junit4]   2> 	  "node_name":"127.0.0.1:58624_v%2Ff",
   [junit4]   2> 	  "base_url":"http://127.0.0.1:58624/v/f"}
   [junit4]   2> 754534 T1962 oasc.Overseer$ClusterStateUpdater.updateState WARN Could not find collection node for nodes_used_collection, skipping publish state
   [junit4]   2> 754534 T1962 oasc.Overseer$ClusterStateUpdater.updateState Update state numShards=2 message={
   [junit4]   2> 	  "operation":"state",
   [junit4]   2> 	  "core_node_name":"core_node3",
   [junit4]   2> 	  "numShards":"2",
   [junit4]   2> 	  "shard":"shard1",
   [junit4]   2> 	  "roles":null,
   [junit4]   2> 	  "state":"down",
   [junit4]   2> 	  "shard_state":"active",
   [junit4]   2> 	  "core":"nodes_used_collection_shard1_replica1",
   [junit4]   2> 	  "collection":"nodes_used_collection",
   [junit4]   2> 	  "shard_range":null,
   [junit4]   2> 	  "node_name":"127.0.0.1:35632_v%2Ff",
   [junit4]   2> 	  "base_url":"http://127.0.0.1:35632/v/f"}
   [junit4]   2> 754547 T1962 oasc.Overseer$ClusterStateUpdater.updateState WARN Could not find collection node for nodes_used_collection, skipping publish state
   [junit4]   2> 754547 T1962 oasc.Overseer$ClusterStateUpdater.updateState Update state numShards=2 message={
   [junit4]   2> 	  "operation":"state",
   [junit4]   2> 	  "core_node_name":"core_node4",
   [junit4]   2> 	  "numShards":"2",
   [junit4]   2> 	  "shard":"shard2",
   [junit4]   2> 	  "roles":null,
   [junit4]   2> 	  "state":"down",
   [junit4]   2> 	  "shard_state":"active",
   [junit4]   2> 	  "core":"nodes_used_collection_shard2_replica2",
   [junit4]   2> 	  "collection":"nodes_used_collection",
   [junit4]   2> 	  "shard_range":null,
   [junit4]   2> 	  "node_name":"127.0.0.1:38130_v%2Ff",
   [junit4]   2> 	  "base_url":"http://127.0.0.1:38130/v/f"}
   [junit4]   2> 754557 T1966 oascc.ZkStateReader$2.process A cluster state change: WatchedEvent state:SyncConnected type:NodeDataChanged path:/clusterstate.json, has occurred - updating... (live nodes size: 5)
   [junit4]   2> 754558 T1961 oascc.ZkStateReader$2.process A cluster state change: WatchedEvent state:SyncConnected type:NodeDataChanged path:/clusterstate.json, has occurred - updating... (live nodes size: 5)
   [junit4]   2> 754557 T1993 oascc.ZkStateReader$2.process A cluster state change: WatchedEvent state:SyncConnected type:NodeDataChanged path:/clusterstate.json, has occurred - updating... (live nodes size: 5)
   [junit4]   2> 754558 T1979 oascc.ZkStateReader$2.process A cluster state change: WatchedEvent state:SyncConnected type:NodeDataChanged path:/clusterstate.json, has occurred - updating... (live nodes size: 5)
   [junit4]   2> 754558 T2007 oascc.ZkStateReader$2.process A cluster state change: WatchedEvent state:SyncConnected type:NodeDataChanged path:/clusterstate.json, has occurred - updating... (live nodes size: 5)
   [junit4]   2> 754559 T2021 oascc.ZkStateReader$2.process A cluster state change: WatchedEvent state:SyncConnected type:NodeDataChanged path:/clusterstate.json, has occurred - updating... (live nodes size: 5)
   [junit4]   2> 755090 T1972 oasc.ZkController.waitForShardId waiting to find shard id in clusterstate for nodes_used_collection_shard2_replica1
   [junit4]   2> 755091 T2015 oasc.ZkController.waitForShardId waiting to find shard id in clusterstate for nodes_used_collection_shard1_replica2
   [junit4]   2> 755092 T1986 oasc.ZkController.waitForShardId waiting to find shard id in clusterstate for nodes_used_collection_shard2_replica2
   [junit4]   2> 755092 T2015 oasc.CorePropertiesLocator.writePropertiesFile ERROR Couldn't persist core properties to /mnt/ssd/jenkins/workspace/Lucene-Solr-4.x-Linux/solr/build/solr-core/test/J1/./org.apache.solr.cloud.CollectionsAPIDistributedZkTest-jetty4-1375559271479/nodes_used_collection_shard1_replica2/core.properties: java.io.FileNotFoundException: /mnt/ssd/jenkins/workspace/Lucene-Solr-4.x-Linux/solr/build/solr-core/test/J1/./org.apache.solr.cloud.CollectionsAPIDistributedZkTest-jetty4-1375559271479/nodes_used_collection_shard1_replica2/core.properties (No such file or directory)
   [junit4]   2> 755091 T1972 oasc.CorePropertiesLocator.writePropertiesFile ERROR Couldn't persist core properties to /mnt/ssd/jenkins/workspace/Lucene-Solr-4.x-Linux/solr/build/solr-core/test/J1/./org.apache.solr.cloud.CollectionsAPIDistributedZkTest-jetty1-1375559267756/nodes_used_collection_shard2_replica1/core.properties: java.io.FileNotFoundException: /mnt/ssd/jenkins/workspace/Lucene-Solr-4.x-Linux/solr/build/solr-core/test/J1/./org.apache.solr.cloud.CollectionsAPIDistributedZkTest-jetty1-1375559267756/nodes_used_collection_shard2_replica1/core.properties (No such file or directory)
   [junit4]   2> 755092 T2002 oasc.ZkController.waitForShardId waiting to find shard id in clusterstate for nodes_used_collection_shard1_replica1
   [junit4]   2> 755094 T1972 oasc.CoreContainer.create Creating SolrCore 'nodes_used_collection_shard2_replica1' using instanceDir: /mnt/ssd/jenkins/workspace/Lucene-Solr-4.x-Linux/solr/build/solr-core/test/J1/./org.apache.solr.cloud.CollectionsAPIDistributedZkTest-jetty1-1375559267756/nodes_used_collection_shard2_replica1
   [junit4]   2> 755095 T1972 oasc.ZkController.createCollectionZkNode Check for collection zkNode:nodes_used_collection
   [junit4]   2> 755093 T2015 oasc.CoreContainer.create Creating SolrCore 'nodes_used_collection_shard1_replica2' using instanceDir: /mnt/ssd/jenkins/workspace/Lucene-Solr-4.x-Linux/solr/build/solr-core/test/J1/./org.apache.solr.cloud.CollectionsAPIDistributedZkTest-jetty4-1375559271479/nodes_used_collection_shard1_replica2
   [junit4]   2> 755096 T2015 oasc.ZkController.createCollectionZkNode Check for collection zkNode:nodes_used_collection
   [junit4]   2> 755093 T1986 oasc.CorePropertiesLocator.writePropertiesFile ERROR Couldn't persist core properties to /mnt/ssd/jenkins/workspace/Lucene-Solr-4.x-Linux/solr/build/solr-core/test/J1/./org.apache.solr.cloud.CollectionsAPIDistributedZkTest-jetty2-1375559269018/nodes_used_collection_shard2_replica2/core.properties: java.io.FileNotFoundException: /mnt/ssd/jenkins/workspace/Lucene-Solr-4.x-Linux/solr/build/solr-core/test/J1/./org.apache.solr.cloud.CollectionsAPIDistributedZkTest-jetty2-1375559269018/nodes_used_collection_shard2_replica2/core.properties (No such file or directory)
   [junit4]   2> 755097 T1972 oasc.ZkController.createCollectionZkNode Creating collection in ZooKeeper:nodes_used_collection
   [junit4]   2> 755094 T2002 oasc.CorePropertiesLocator.writePropertiesFile ERROR Couldn't persist core properties to /mnt/ssd/jenkins/workspace/Lucene-Solr-4.x-Linux/solr/build/solr-core/test/J1/./org.apache.solr.cloud.CollectionsAPIDistributedZkTest-jetty3-1375559270256/nodes_used_collection_shard1_replica1/core.properties: java.io.FileNotFoundException: /mnt/ssd/jenkins/workspace/Lucene-Solr-4.x-Linux/solr/build/solr-core/test/J1/./org.apache.solr.cloud.CollectionsAPIDistributedZkTest-jetty3-1375559270256/nodes_used_collection_shard1_replica1/core.properties (No such file or directory)
   [junit4]   2> 755098 T2015 oasc.ZkController.createCollectionZkNode Creating collection in ZooKeeper:nodes_used_collection
   [junit4]   2> 755097 T1972 oasc.ZkController.getConfName Looking for collection configName
   [junit4]   2> 755097 T1986 oasc.CoreContainer.create Creating SolrCore 'nodes_used_collection_shard2_replica2' using instanceDir: /mnt/ssd/jenkins/workspace/Lucene-Solr-4.x-Linux/solr/build/solr-core/test/J1/./org.apache.solr.cloud.CollectionsAPIDistributedZkTest-jetty2-1375559269018/nodes_used_collection_shard2_replica2
   [junit4]   2> 755100 T1986 oasc.ZkController.createCollectionZkNode Check for collection zkNode:nodes_used_collection
   [junit4]   2> 755099 T2015 oasc.ZkController.getConfName Looking for collection configName
   [junit4]   2> 755098 T2002 oasc.CoreContainer.create Creating SolrCore 'nodes_used_collection_shard1_replica1' using instanceDir: /mnt/ssd/jenkins/workspace/Lucene-Solr-4.x-Linux/solr/build/solr-core/test/J1/./org.apache.solr.cloud.CollectionsAPIDistributedZkTest-jetty3-1375559270256/nodes_used_collection_shard1_replica1
   [junit4]   2> 755102 T2002 oasc.ZkController.createCollectionZkNode Check for collection zkNode:nodes_used_collection
   [junit4]   2> 755104 T2002 oasc.ZkController.createCollectionZkNode Creating collection in ZooKeeper:nodes_used_collection
   [junit4]   2> 755105 T1986 oasc.ZkController.createCollectionZkNode Creating collection in ZooKeeper:nodes_used_collection
   [junit4]   2> 755105 T2002 oasc.ZkController.getConfName Looking for collection configName
   [junit4]   2> 755106 T1972 oasc.ZkController.getConfName Only one config set found in zk - using it:conf1
   [junit4]   2> 755106 T1986 oasc.ZkController.getConfName Looking for collection configName
   [junit4]   2> 755107 T1972 oascc.SolrZkClient.makePath makePath: /collections/nodes_used_collection
   [junit4]   2> 755107 T2015 oasc.ZkController.getConfName Only one config set found in zk - using it:conf1
   [junit4]   2> 755109 T2015 oascc.SolrZkClient.makePath makePath: /collections/nodes_used_collection
   [junit4]   2> 755110 T2002 oasc.ZkController.getConfName Only one config set found in zk - using it:conf1
   [junit4]   2> 755111 T2002 oascc.SolrZkClient.makePath makePath: /collections/nodes_used_collection
   [junit4]   2> 755117 T1986 oasc.ZkController.getConfName Only one config set found in zk - using it:conf1
   [junit4]   2> 755118 T1986 oascc.SolrZkClient.makePath makePath: /collections/nodes_used_collection
   [junit4]   2> 755118 T1972 oasc.ZkController.readConfigName Load collection config from:/collections/nodes_used_collection
   [junit4]   2> 755121 T2015 oasc.ZkController.readConfigName Load collection config from:/collections/nodes_used_collection
   [junit4]   2> 755127 T2015 oasc.SolrResourceLoader.<init> new SolrResourceLoader for directory: '/mnt/ssd/jenkins/workspace/Lucene-Solr-4.x-Linux/solr/build/solr-core/test/J1/./org.apache.solr.cloud.CollectionsAPIDistributedZkTest-jetty4-1375559271479/nodes_used_collection_shard1_replica2/'
   [junit4]   2> 755128 T2002 oasc.ZkController.readConfigName Load collection config from:/collections/nodes_used_collection
   [junit4]   2> 755129 T1972 oasc.SolrResourceLoader.<init> new SolrResourceLoader for directory: '/mnt/ssd/jenkins/workspace/Lucene-Solr-4.x-Linux/solr/build/solr-core/test/J1/./org.apache.solr.cloud.CollectionsAPIDistributedZkTest-jetty1-1375559267756/nodes_used_collection_shard2_replica1/'
   [junit4]   2> 755129 T1986 oasc.ZkController.readConfigName Load collection config from:/collections/nodes_used_collection
   [junit4]   2> 755134 T2002 oasc.SolrResourceLoader.<init> new SolrResourceLoader for directory: '/mnt/ssd/jenkins/workspace/Lucene-Solr-4.x-Linux/solr/build/solr-core/test/J1/./org.apache.solr.cloud.CollectionsAPIDistributedZkTest-jetty3-1375559270256/nodes_used_collection_shard1_replica1/'
   [junit4]   2> 755134 T1986 oasc.SolrResourceLoader.<init> new SolrResourceLoader for directory: '/mnt/ssd/jenkins/workspace/Lucene-Solr-4.x-Linux/solr/build/solr-core/test/J1/./org.apache.solr.cloud.CollectionsAPIDistributedZkTest-jetty2-1375559269018/nodes_used_collection_shard2_replica2/'
   [junit4]   2> 755231 T1972 oasc.SolrConfig.<init> Using Lucene MatchVersion: LUCENE_45
   [junit4]   2> 755233 T1986 oasc.SolrConfig.<init> Using Lucene MatchVersion: LUCENE_45
   [junit4]   2> 755239 T2015 oasc.SolrConfig.<init> Using Lucene MatchVersion: LUCENE_45
   [junit4]   2> 755254 T2002 oasc.SolrConfig.<init> Using Lucene MatchVersion: LUCENE_45
   [junit4]   2> 755297 T1972 oasc.SolrConfig.<init> Loaded SolrConfig: solrconfig.xml
   [junit4]   2> 755299 T1972 oass.IndexSchema.readSchema Reading Solr Schema from schema.xml
   [junit4]   2> 755299 T1986 oasc.SolrConfig.<init> Loaded SolrConfig: solrconfig.xml
   [junit4]   2> 755314 T1986 oass.IndexSchema.readSchema Reading Solr Schema from schema.xml
   [junit4]   2> 755324 T1972 oass.IndexSchema.readSchema [nodes_used_collection_shard2_replica1] Schema name=test
   [junit4]   2> 755329 T1986 oass.IndexSchema.readSchema [nodes_used_collection_shard2_replica2] Schema name=test
   [junit4]   2> 755334 T2015 oasc.SolrConfig.<init> Loaded SolrConfig: solrconfig.xml
   [junit4]   2> 755336 T2002 oasc.SolrConfig.<init> Loaded SolrConfig: solrconfig.xml
   [junit4]   2> 755337 T2015 oass.IndexSchema.readSchema Reading Solr Schema from schema.xml
   [junit4]   2> 755338 T2002 oass.IndexSchema.readSchema Reading Solr Schema from schema.xml
   [junit4]   2> 755362 T2015 oass.IndexSchema.readSchema [nodes_used_collection_shard1_replica2] Schema name=test
   [junit4]   2> 755364 T2002 oass.IndexSchema.readSchema [nodes_used_collection_shard1_replica1] Schema name=test
   [junit4]   2> 755945 T2002 oass.ByteField.init WARN ByteField is deprecated and will be removed in 5.0. You should use TrieIntField instead.
   [junit4]   2> 755945 T2002 oass.ShortField.init WARN ShortField is deprecated and will be removed in 5.0. You should use TrieIntField instead.
   [junit4]   2> 755946 T2002 oass.OpenExchangeRatesOrgProvider.init Initialized with rates=open-exchange-rates.json, refreshInterval=1440.
   [junit4]   2> 755956 T2002 oass.IndexSchema.readSchema default search field in schema is text
   [junit4]   2> 755960 T2002 oass.IndexSchema.readSchema unique key field: id
   [junit4]   2> 755962 T1986 oass.ByteField.init WARN ByteField is deprecated and will be removed in 5.0. You should use TrieIntField instead.
   [junit4]   2> 755963 T1986 oass.ShortField.init WARN ShortField is deprecated and will be removed in 5.0. You should use TrieIntField instead.
   [junit4]   2> 755963 T1986 oass.OpenExchangeRatesOrgProvider.init Initialized with rates=open-exchange-rates.json, refreshInterval=1440.
   [junit4]   2> 755970 T1986 oass.IndexSchema.readSchema default search field in schema is text
   [junit4]   2> 755973 T1986 oass.IndexSchema.readSchema unique key field: id
   [junit4]   2> 755988 T2002 oass.FileExchangeRateProvider.reload Reloading exchange rates from file currency.xml
   [junit4]   2> 755994 T2002 oass.FileExchangeRateProvider.reload Reloading exchange rates from file currency.xml
   [junit4]   2> 756001 T2002 oass.OpenExchangeRatesOrgProvider.reload Reloading exchange rates from open-exchange-rates.json
   [junit4]   2> 756005 T2002 oass.OpenExchangeRatesOrgProvider$OpenExchangeRates.<init> WARN Unknown key IMPORTANT NOTE
   [junit4]   2> 756005 T2002 oass.OpenExchangeRatesOrgProvider$OpenExchangeRates.<init> WARN Expected key, got STRING
   [junit4]   2> 756006 T2002 oass.OpenExchangeRatesOrgProvider.reload Reloading exchange rates from open-exchange-rates.json
   [junit4]   2> 756010 T2002 oass.OpenExchangeRatesOrgProvider$OpenExchangeRates.<init> WARN Unknown key IMPORTANT NOTE
   [junit4]   2> 756011 T2002 oass.OpenExchangeRatesOrgProvider$OpenExchangeRates.<init> WARN Expected key, got STRING
   [junit4]   2> 756011 T2002 oasc.SolrCore.initDirectoryFactory org.apache.solr.core.MockDirectoryFactory
   [junit4]   2> 756011 T2002 oasc.SolrCore.<init> [nodes_used_collection_shard1_replica1] Opening new SolrCore at /mnt/ssd/jenkins/workspace/Lucene-Solr-4.x-Linux/solr/build/solr-core/test/J1/./org.apache.solr.cloud.CollectionsAPIDistributedZkTest-jetty3-1375559270256/nodes_used_collection_shard1_replica1/, dataDir=/mnt/ssd/jenkins/workspace/Lucene-Solr-4.x-Linux/solr/build/solr-core/test/J1/./org.apache.solr.cloud.CollectionsAPIDistributedZkTest-jetty3-1375559270256//nodes_used_collection_shard1_replica1/data/
   [junit4]   2> 756012 T2002 oasc.JmxMonitoredMap.<init> JMX monitoring is enabled. Adding Solr mbeans to JMX Server: com.sun.jmx.mbeanserver.JmxMBeanServer@593f5a2f
   [junit4]   2> 756013 T2002 oasc.CachingDirectoryFactory.get return new directory for /mnt/ssd/jenkins/workspace/Lucene-Solr-4.x-Linux/solr/build/solr-core/test/J1/./org.apache.solr.cloud.CollectionsAPIDistributedZkTest-jetty3-1375559270256//nodes_used_collection_shard1_replica1/data
   [junit4]   2> 756013 T1986 oass.FileExchangeRateProvider.reload Reloading exchange rates from file currency.xml
   [junit4]   2> 756013 T2002 oasc.SolrCore.getNewIndexDir New index directory detected: old=null new=/mnt/ssd/jenkins/workspace/Lucene-Solr-4.x-Linux/solr/build/solr-core/test/J1/./org.apache.solr.cloud.CollectionsAPIDistributedZkTest-jetty3-1375559270256//nodes_used_collection_shard1_replica1/data/index/
   [junit4]   2> 756014 T2002 oasc.SolrCore.initIndex WARN [nodes_used_collection_shard1_replica1] Solr index directory '/mnt/ssd/jenkins/workspace/Lucene-Solr-4.x-Linux/solr/build/solr-core/test/J1/./org.apache.solr.cloud.CollectionsAPIDistributedZkTest-jetty3-1375559270256/nodes_used_collection_shard1_replica1/data/index' doesn't exist. Creating new index...
   [junit4]   2> 756015 T2002 oasc.CachingDirectoryFactory.get return new directory for /mnt/ssd/jenkins/workspace/Lucene-Solr-4.x-Linux/solr/build/solr-core/test/J1/./org.apache.solr.cloud.CollectionsAPIDistributedZkTest-jetty3-1375559270256//nodes_used_collection_shard1_replica1/data/index
   [junit4]   2> 756017 T2002 oasc.SolrDeletionPolicy.onCommit SolrDeletionPolicy.onCommit: commits: num=1
   [junit4]   2> 		commit{dir=MockDirWrapper(org.apache.lucene.store.RAMDirectory@42f72dd7 lockFactory=org.apache.lucene.store.NativeFSLockFactory@6d9cc971),segFN=segments_1,generation=1}
   [junit4]   2> 756018 T2002 oasc.SolrDeletionPolicy.updateCommits newest commit generation = 1
   [junit4]   2> 756020 T1986 oass.FileExchangeRateProvider.reload Reloading exchange rates from file currency.xml
   [junit4]   2> 756022 T2002 oasup.UpdateRequestProcessorChain.init inserting DistributedUpdateProcessorFactory into updateRequestProcessorChain "dedupe"
   [junit4]   2> 756023 T2002 oasup.UpdateRequestProcessorChain.init inserting DistributedUpdateProcessorFactory into updateRequestProcessorChain "stored_sig"
   [junit4]   2> 756024 T2002 oasup.UpdateRequestProcessorChain.init inserting DistributedUpdateProcessorFactory into updateRequestProcessorChain "distrib-dup-test-chain-implicit"
   [junit4]   2> 756025 T2002 oasc.RequestHandlers.initHandlersFromConfig created standard: solr.StandardRequestHandler
   [junit4]   2> 756034 T2002 oasc.RequestHandlers.initHandlersFromConfig created /get: solr.RealTimeGetHandler
   [junit4]   2> 756034 T2002 oasc.RequestHandlers.initHandlersFromConfig adding lazy requestHandler: solr.ReplicationHandler
   [junit4]   2> 756034 T2002 oasc.RequestHandlers.initHandlersFromConfig created /replication: solr.ReplicationHandler
   [junit4]   2> 756035 T2002 oasc.RequestHandlers.initHandlersFromConfig created /update: solr.UpdateRequestHandler
   [junit4]   2> 756035 T2002 oasc.RequestHandlers.initHandlersFromConfig created /admin/: org.apache.solr.handler.admin.AdminHandlers
   [junit4]   2> 756036 T1986 oass.OpenExchangeRatesOrgProvider.reload Reloading exchange rates from open-exchange-rates.json
   [junit4]   2> 756037 T2002 oashl.XMLLoader.init xsltCacheLifetimeSeconds=60
   [junit4]   2> 756039 T1986 oass.OpenExchangeRatesOrgProvider$OpenExchangeRates.<init> WARN Unknown key IMPORTANT NOTE
   [junit4]   2> 756039 T1986 oass.OpenExchangeRatesOrgProvider$OpenExchangeRates.<init> WARN Expected key, got STRING
   [junit4]   2> 756040 T1986 oass.OpenExchangeRatesOrgProvider.reload Reloading exchange rates from open-exchange-rates.json
   [junit4]   2> 756040 T2002 oass.SolrIndexSearcher.<init> Opening Searcher@324ff339 main
   [junit4]   2> 756041 T2002 oasu.CommitTracker.<init> Hard AutoCommit: disabled
   [junit4]   2> 756041 T2002 oasu.CommitTracker.<init> Soft AutoCommit: disabled
   [junit4]   2> 756042 T1986 oass.OpenExchangeRatesOrgProvider$OpenExchangeRates.<init> WARN Unknown key IMPORTANT NOTE
   [junit4]   2> 756043 T1986 oass.OpenExchangeRatesOrgProvider$OpenExchangeRates.<init> WARN Expected key, got STRING
   [junit4]   2> 756043 T1972 oass.ByteField.init WARN ByteField is deprecated and will be removed in 5.0. You should use TrieIntField instead.
   [junit4]   2> 756043 T1972 oass.ShortField.init WARN ShortField is deprecated and will be removed in 5.0. You should use TrieIntField instead.
   [junit4]   2> 756043 T1986 oasc.SolrCore.initDirectoryFactory org.apache.solr.core.MockDirectoryFactory
   [junit4]   2> 756044 T1972 oass.OpenExchangeRatesOrgProvider.init Initialized with rates=open-exchange-rates.json, refreshInterval=1440.
   [junit4]   2> 756044 T1986 oasc.SolrCore.<init> [nodes_used_collection_shard2_replica2] Opening new SolrCore at /mnt/ssd/jenkins/workspace/Lucene-Solr-4.x-Linux/solr/build/solr-core/test/J1/./org.apache.solr.cloud.CollectionsAPIDistributedZkTest-jetty2-1375559269018/nodes_used_collection_shard2_replica2/, dataDir=/mnt/ssd/jenkins/workspace/Lucene-Solr-4.x-Linux/solr/build/solr-core/test/J1/./org.apache.solr.cloud.CollectionsAPIDistributedZkTest-jetty2-1375559269018//nodes_used_collection_shard2_replica2/data/
   [junit4]   2> 756045 T1986 oasc.JmxMonitoredMap.<init> JMX monitoring is enabled. Adding Solr mbeans to JMX Server: com.sun.jmx.mbeanserver.JmxMBeanServer@593f5a2f
   [junit4]   2> 756046 T1986 oasc.CachingDirectoryFactory.get return new directory for /mnt/ssd/jenkins/workspace/Lucene-Solr-4.x-Linux/solr/build/solr-core/test/J1/./org.apache.solr.cloud.CollectionsAPIDistributedZkTest-jetty2-1375559269018//nodes_used_collection_shard2_replica2/data
   [junit4]   2> 756047 T2027 oasc.SolrCore.registerSearcher [nodes_used_collection_shard1_replica1] Registered new searcher Searcher@324ff339 main{StandardDirectoryReader(segments_1:1)}
   [junit4]   2> 756047 T1986 oasc.SolrCore.getNewIndexDir New index directory detected: old=null new=/mnt/ssd/jenkins/workspace/Lucene-Solr-4.x-Linux/solr/build/solr-core/test/J1/./org.apache.solr.cloud.CollectionsAPIDistributedZkTest-jetty2-1375559269018//nodes_used_collection_shard2_replica2/data/index/
   [junit4]   2> 756047 T1986 oasc.SolrCore.initIndex WARN [nodes_used_collection_shard2_replica2] Solr index directory '/mnt/ssd/jenkins/workspace/Lucene-Solr-4.x-Linux/solr/build/solr-core/test/J1/./org.apache.solr.cloud.CollectionsAPIDistributedZkTest-jetty2-1375559269018/nodes_used_collection_shard2_replica2/data/index' doesn't exist. Creating new index...
   [junit4]   2> 756048 T1986 oasc.CachingDirectoryFactory.get return new directory for /mnt/ssd/jenkins/workspace/Lucene-Solr-4.x-Linux/solr/build/solr-core/test/J1/./org.apache.solr.cloud.CollectionsAPIDistributedZkTest-jetty2-1375559269018//nodes_used_collection_shard2_replica2/data/index
   [junit4]   2> 756049 T2002 oasc.CoreContainer.registerCore registering core: nodes_used_collection_shard1_replica1
   [junit4]   2> 756049 T2002 oasc.ZkController.register Register replica - core:nodes_used_collection_shard1_replica1 address:http://127.0.0.1:35632/v/f collection:nodes_used_collection shard:shard1
   [junit4]   2> 756049 T2002 oascsi.HttpClientUtil.createClient Creating new http client, config:maxConnections=10000&maxConnectionsPerHost=20&connTimeout=15000&socketTimeout=30000&retry=false
   [junit4]   2> 756051 T1972 oass.IndexSchema.readSchema default search field in schema is text
   [junit4]   2> 756051 T1986 oasc.SolrDeletionPolicy.onCommit SolrDeletionPolicy.onCommit: commits: num=1
   [junit4]   2> 		commit{dir=MockDirWrapper(org.apache.lucene.store.RAMDirectory@516fc4ce lockFactory=org.apache.lucene.store.NativeFSLockFactory@4cc2e9fc),segFN=segments_1,generation=1}
   [junit4]   2> 756052 T1986 oasc.SolrDeletionPolicy.updateCommits newest commit generation = 1
   [junit4]   2> 756055 T1972 oass.IndexSchema.readSchema unique key field: id
   [junit4]   2> 756055 T2002 oascc.SolrZkClient.makePath makePath: /collections/nodes_used_collection/leader_elect/shard1/election
   [junit4]   2> 756056 T1986 oasup.UpdateRequestProcessorChain.init inserting DistributedUpdateProcessorFactory into updateRequestProcessorChain "dedupe"
   [junit4]   2> 756057 T1986 oasup.UpdateRequestProcessorChain.init inserting DistributedUpdateProcessorFactory into updateRequestProcessorChain "stored_sig"
   [junit4]   2> 756057 T1986 oasup.UpdateRequestProcessorChain.init inserting DistributedUpdateProcessorFactory into updateRequestProcessorChain "distrib-dup-test-chain-implicit"
   [junit4]   2> 756058 T1986 oasc.RequestHandlers.initHandlersFromConfig created standard: solr.StandardRequestHandler
   [junit4]   2> 756058 T1986 oasc.RequestHandlers.initHandlersFromConfig created /get: solr.RealTimeGetHandler
   [junit4]   2> 756059 T1986 oasc.RequestHandlers.initHandlersFromConfig adding lazy requestHandler: solr.ReplicationHandler
   [junit4]   2> 756059 T1986 oasc.RequestHandlers.initHandlersFromConfig created /replication: solr.ReplicationHandler
   [junit4]   2> 756059 T1986 oasc.RequestHandlers.initHandlersFromConfig created /update: solr.UpdateRequestHandler
   [junit4]   2> 756060 T1986 oasc.RequestHandlers.initHandlersFromConfig created /admin/: org.apache.solr.handler.admin.AdminHandlers
   [junit4]   2> 756062 T1986 oashl.XMLLoader.init xsltCacheLifetimeSeconds=60
   [junit4]   2> 756064 T1986 oass.SolrIndexSearcher.<init> Opening Searcher@25c920af main
   [junit4]   2> 756065 T1986 oasu.CommitTracker.<init> Hard AutoCommit: disabled
   [junit4]   2> 756065 T1986 oasu.CommitTracker.<init> Soft AutoCommit: disabled
   [junit4]   2> 756068 T2028 oasc.SolrCore.registerSearcher [nodes_used_collection_shard2_replica2] Registered new searcher Searcher@25c920af main{StandardDirectoryReader(segments_1:1)}
   [junit4]   2> 756069 T1986 oasc.CoreContainer.registerCore registering core: nodes_used_collection_shard2_replica2
   [junit4]   2> 756070 T1986 oasc.ZkController.register Register replica - core:nodes_used_collection_shard2_replica2 address:http://127.0.0.1:38130/v/f collection:nodes_used_collection shard:shard2
   [junit4]   2> 756070 T1986 oascsi.HttpClientUtil.createClient Creating new http client, config:maxConnections=10000&maxConnectionsPerHost=20&connTimeout=15000&socketTimeout=30000&retry=false
   [junit4]   2> 756072 T2002 oasc.ShardLeaderElectionContext.runLeaderProcess Running the leader process for shard shard1
   [junit4]   2> 756074 T1986 oascc.SolrZkClient.makePath makePath: /collections/nodes_used_collection/leader_elect/shard2/election
   [junit4]   2> 756079 T2002 oasc.ShardLeaderElectionContext.waitForReplicasToComeUp Waiting until we see more replicas up for shard shard1: total=2 found=1 timeoutin=179998
   [junit4]   2> 756092 T1972 oass.FileExchangeRateProvider.reload Reloading exchange rates from file currency.xml
   [junit4]   2> 756097 T1962 oascc.ZkStateReader.updateClusterState Updating cloud state from ZooKeeper... 
   [junit4]   2> 756098 T1986 oasc.ShardLeaderElectionContext.runLeaderProcess Running the leader process for shard shard2
   [junit4]   2> 756100 T1972 oass.FileExchangeRateProvider.reload Reloading exchange rates from file currency.xml
   [junit4]   2> 756104 T1986 oasc.ShardLeaderElectionContext.waitForReplicasToComeUp Waiting until we see more replicas up for shard shard2: total=2 found=1 timeoutin=179999
   [junit4]   2> 756107 T1972 oass.OpenExchangeRatesOrgProvider.reload Reloading exchange rates from open-exchange-rates.json
   [junit4]   2> 756108 T2015 oass.ByteField.init WARN ByteField is deprecated and will be removed in 5.0. You should use TrieIntField instead.
   [junit4]   2> 756108 T2015 oass.ShortField.init WARN ShortField is deprecated and will be removed in 5.0. You should use TrieIntField instead.
   [junit4]   2> 756109 T2015 oass.OpenExchangeRatesOrgProvider.init Initialized with rates=open-exchange-rates.json, refreshInterval=1440.
   [junit4]   2> 756109 T1972 oass.OpenExchangeRatesOrgProvider$OpenExchangeRates.<init> WARN Unknown key IMPORTANT NOTE
   [junit4]   2> 756110 T1972 oass.OpenExchangeRatesOrgProvider$OpenExchangeRates.<init> WARN Expected key, got STRING
   [junit4]   2> 756111 T1972 oass.OpenExchangeRatesOrgProvider.reload Reloading exchange rates from open-exchange-rates.json
   [junit4]   2> 756113 T1972 oass.OpenExchangeRatesOrgProvider$OpenExchangeRates.<init> WARN Unknown key IMPORTANT NOTE
   [junit4]   2> 756113 T1972 oass.OpenExchangeRatesOrgProvider$OpenExchangeRates.<init> WARN Expected key, got STRING
   [junit4]   2> 756114 T1966 oascc.ZkStateReader$2.process A cluster state change: WatchedEvent state:SyncConnected type:NodeDataChanged path:/clusterstate.json, has occurred - updating... (live nodes size: 5)
   [junit4]   2> 756114 T1961 oascc.ZkStateReader$2.process A cluster state change: WatchedEvent state:SyncConnected type:NodeDataChanged path:/clusterstate.json, has occurred - updating... (live nodes size: 5)
   [junit4]   2> 756114 T1972 oasc.SolrCore.initDirectoryFactory org.apache.solr.core.MockDirectoryFactory
   [junit4]   2> 756114 T2021 oascc.ZkStateReader$2.process A cluster state change: WatchedEvent state:SyncConnected type:NodeDataChanged path:/clusterstate.json, has occurred - updating... (live nodes size: 5)
   [junit4]   2> 756115 T2007 oascc.ZkStateReader$2.process A cluster state change: WatchedEvent state:SyncConnected type:NodeDataChanged path:/clusterstate.json, has occurred - updating... (live nodes size: 5)
   [junit4]   2> 756114 T1993 oascc.ZkStateReader$2.process A cluster state change: WatchedEvent state:SyncConnected type:NodeDataChanged path:/clusterstate.json, has occurred - updating... (live nodes size: 5)
   [junit4]   2> 756115 T1972 oasc.SolrCore.<init> [nodes_used_collection_shard2_replica1] Opening new SolrCore at /mnt/ssd/jenkins/workspace/Lucene-Solr-4.x-Linux/solr/build/solr-core/test/J1/./org.apache.solr.cloud.CollectionsAPIDistributedZkTest-jetty1-1375559267756/nodes_used_collection_shard2_replica1/, dataDir=/mnt/ssd/jenkins/workspace/Lucene-Solr-4.x-Linux/solr/build/solr-core/test/J1/./org.apache.solr.cloud.CollectionsAPIDistributedZkTest-jetty1-1375559267756//nodes_used_collection_shard2_replica1/data/
   [junit4]   2> 756116 T1972 oasc.JmxMonitoredMap.<init> JMX monitoring is enabled. Adding Solr mbeans to JMX Server: com.sun.jmx.mbeanserver.JmxMBeanServer@593f5a2f
   [junit4]   2> 756115 T1979 oascc.ZkStateReader$2.process A cluster state change: WatchedEvent state:SyncConnected type:NodeDataChanged path:/clusterstate.json, has occurred - updating... (live nodes size: 5)
   [junit4]   2> 756117 T1972 oasc.CachingDirectoryFactory.get return new directory for /mnt/ssd/jenkins/workspace/Lucene-Solr-4.x-Linux/solr/build/solr-core/test/J1/./org.apache.solr.cloud.CollectionsAPIDistributedZkTest-jetty1-1375559267756//nodes_used_collection_shard2_replica1/data
   [junit4]   2> 756117 T1972 oasc.SolrCore.getNewIndexDir New index directory detected: old=null new=/mnt/ssd/jenkins/workspace/Lucene-Solr-4.x-Linux/solr/build/solr-core/test/J1/./org.apache.solr.cloud.CollectionsAPIDistributedZkTest-jetty1-1375559267756//nodes_used_collection_shard2_replica1/data/index/
   [junit4]   2> 756117 T1972 oasc.SolrCore.initIndex WARN [nodes_used_collection_shard2_replica1] Solr index directory '/mnt/ssd/jenkins/workspace/Lucene-Solr-4.x-Linux/solr/build/solr-core/test/J1/./org.apache.solr.cloud.CollectionsAPIDistributedZkTest-jetty1-1375559267756/nodes_used_collection_shard2_replica1/data/index' doesn't exist. Creating new index...
   [junit4]   2> 756118 T1972 oasc.CachingDirectoryFactory.get return new directory for /mnt/ssd/jenkins/workspace/Lucene-Solr-4.x-Linux/solr/build/solr-core/test/J1/./org.apache.solr.cloud.CollectionsAPIDistributedZkTest-jetty1-1375559267756//nodes_used_collection_shard2_replica1/data/index
   [junit4]   2> 756120 T1972 oasc.SolrDeletionPolicy.onCommit SolrDeletionPolicy.onCommit: commits: num=1
   [junit4]   2> 		commit{dir=MockDirWrapper(org.apache.lucene.store.RAMDirectory@9b0ea84 lockFactory=org.apache.lucene.store.NativeFSLockFactory@403611cc),segFN=segments_1,generation=1}
   [junit4]   2> 756121 T1972 oasc.SolrDeletionPolicy.updateCommits newest commit generation = 1
   [junit4]   2> 756121 T2015 oass.IndexSchema.readSchema default search field in schema is text
   [junit4]   2> 756125 T1972 oasup.UpdateRequestProcessorChain.init inserting DistributedUpdateProcessorFactory into updateRequestProcessorChain "dedupe"
   [junit4]   2> 756125 T1972 oasup.UpdateRequestProcessorChain.init inserting DistributedUpdateProcessorFactory into updateRequestProcessorChain "stored_sig"
   [junit4]   2> 756126 T1972 oasup.UpdateRequestProcessorChain.init inserting DistributedUpdateProcessorFactory into updateRequestProcessorChain "distrib-dup-test-chain-implicit"
   [junit4]   2> 756127 T2015 oass.IndexSchema.readSchema unique key field: id
   [junit4]   2> 756127 T1972 oasc.RequestHandlers.initHandlersFromConfig created standard: solr.StandardRequestHandler
   [junit4]   2> 756128 T1972 oasc.RequestHandlers.initHandlersFromConfig created /get: solr.RealTimeGetHandler
   [junit4]   2> 756128 T1972 oasc.RequestHandlers.initHandlersFromConfig adding lazy requestHandler: solr.ReplicationHandler
   [junit4]   2> 756129 T1972 oasc.RequestHandlers.initHandlersFromConfig created /replication: solr.ReplicationHandler
   [junit4]   2> 756129 T1972 oasc.RequestHandlers.initHandlersFromConfig created /update: solr.UpdateRequestHandler
   [junit4]   2> 756130 T1972 oasc.RequestHandlers.initHandlersFromConfig created /admin/: org.apache.solr.handler.admin.AdminHandlers
   [junit4]   2> 756133 T1972 oashl.XMLLoader.init xsltCacheLifetimeSeconds=60
   [junit4]   2> 756135 T1972 oass.SolrIndexSearcher.<init> Opening Searcher@33310338 main
   [junit4]   2> 756135 T1972 oasu.CommitTracker.<init> Hard AutoCommit: disabled
   [junit4]   2> 756136 T1972 oasu.CommitTracker.<init> Soft AutoCommit: disabled
   [junit4]   2> 756140 T2029 oasc.SolrCore.registerSearcher [nodes_used_collection_shard2_replica1] Registered new searcher Searcher@33310338 main{StandardDirectoryReader(segments_1:1)}
   [junit4]   2> 756141 T1972 oasc.CoreContainer.registerCore registering core: nodes_used_collection_shard2_replica1
   [junit4]   2> 756141 T1972 oasc.ZkController.register Register replica - core:nodes_used_collection_shard2_replica1 address:http://127.0.0.1:58624/v/f collection:nodes_used_collection shard:shard2
   [junit4]   2> 756142 T1972 oascsi.HttpClientUtil.createClient Creating new http client, config:maxConnections=10000&maxConnectionsPerHost=20&connTimeout=15000&socketTimeout=30000&retry=false
   [junit4]   2> 756153 T2015 oass.FileExchangeRateProvider.reload Reloading exchange rates from file currency.xml
   [junit4]   2> 756159 T2015 oass.FileExchangeRateProvider.reload Reloading exchange rates from file currency.xml
   [junit4]   2> 756163 T2015 oass.OpenExchangeRatesOrgProvider.reload Reloading exchange rates from open-exchange-rates.json
   [junit4]   2> 756166 T2015 oass.OpenExchangeRatesOrgProvider$OpenExchangeRates.<init> WARN Unknown key IMPORTANT NOTE
   [junit4]   2> 756166 T2015 oass.OpenExchangeRatesOrgProvider$OpenExchangeRates.<init> WARN Expected key, got STRING
   [junit4]   2> 756166 T2015 oass.OpenExchangeRatesOrgProvider.reload Reloading exchange rates from open-exchange-rates.json
   [junit4]   2> 756168 T2015 oass.OpenExchangeRatesOrgProvider$OpenExchangeRates.<init> WARN Unknown key IMPORTANT NOTE
   [junit4]   2> 756169 T2015 oass.OpenExchangeRatesOrgProvider$OpenExchangeRates.<init> WARN Expected key, got STRING
   [junit4]   2> 756169 T2015 oasc.SolrCore.initDirectoryFactory org.apache.solr.core.MockDirectoryFactory
   [junit4]   2> 756169 T2015 oasc.SolrCore.<init> [nodes_used_collection_shard1_replica2] Opening new SolrCore at /mnt/ssd/jenkins/workspace/Lucene-Solr-4.x-Linux/solr/build/solr-core/test/J1/./org.apache.solr.cloud.CollectionsAPIDistributedZkTest-jetty4-1375559271479/nodes_used_collection_shard1_replica2/, dataDir=/mnt/ssd/jenkins/workspace/Lucene-Solr-4.x-Linux/solr/build/solr-core/test/J1/./org.apache.solr.cloud.CollectionsAPIDistributedZkTest-jetty4-1375559271479//nodes_used_collection_shard1_replica2/data/
   [junit4]   2> 756170 T2015 oasc.JmxMonitoredMap.<init> JMX monitoring is enabled. Adding Solr mbeans to JMX Server: com.sun.jmx.mbeanserver.JmxMBeanServer@593f5a2f
   [junit4]   2> 756171 T2015 oasc.CachingDirectoryFactory.get return new directory for /mnt/ssd/jenkins/workspace/Lucene-Solr-4.x-Linux/solr/build/solr-core/test/J1/./org.apache.solr.cloud.CollectionsAPIDistributedZkTest-jetty4-1375559271479//nodes_used_collection_shard1_replica2/data
   [junit4]   2> 756171 T2015 oasc.SolrCore.getNewIndexDir New index directory detected: old=null new=/mnt/ssd/jenkins/workspace/Lucene-Solr-4.x-Linux/solr/build/solr-core/test/J1/./org.apache.solr.cloud.CollectionsAPIDistributedZkTest-jetty4-1375559271479//nodes_used_collection_shard1_replica2/data/index/
   [junit4]   2> 756171 T2015 oasc.SolrCore.initIndex WARN [nodes_used_collection_shard1_replica2] Solr index directory '/mnt/ssd/jenkins/workspace/Lucene-Solr-4.x-Linux/solr/build/solr-core/test/J1/./org.apache.solr.cloud.CollectionsAPIDistributedZkTest-jetty4-1375559271479/nodes_used_collection_shard1_replica2/data/index' doesn't exist. Creating new index...
   [junit4]   2> 756171 T2015 oasc.CachingDirectoryFactory.get return new directory for /mnt/ssd/jenkins/workspace/Lucene-Solr-4.x-Linux/solr/build/solr-core/test/J1/./org.apache.solr.cloud.CollectionsAPIDistributedZkTest-jetty4-1375559271479//nodes_used_collection_shard1_replica2/data/index
   [junit4]   2> 756173 T2015 oasc.SolrDeletionPolicy.onCommit SolrDeletionPolicy.onCommit: commits: num=1
   [junit4]   2> 		commit{dir=MockDirWrapper(org.apache.lucene.store.RAMDirectory@68b43db2 lockFactory=org.apache.lucene.store.NativeFSLockFactory@397513c),segFN=segments_1,generation=1}
   [junit4]   2> 756173 T2015 oasc.SolrDeletionPolicy.updateCommits newest commit generation = 1
   [junit4]   2> 756176 T2015 oasup.UpdateRequestProcessorChain.init inserting DistributedUpdateProcessorFactory into updateRequestProcessorChain "dedupe"
   [junit4]   2> 756177 T2015 oasup.UpdateRequestProcessorChain.init inserting DistributedUpdateProcessorFactory into updateRequestProcessorChain "stored_sig"
   [junit4]   2> 756177 T2015 oasup.UpdateRequestProcessorChain.init inserting DistributedUpdateProcessorFactory into updateRequestProcessorChain "distrib-dup-test-chain-implicit"
   [junit4]   2> 756178 T2015 oasc.RequestHandlers.initHandlersFromConfig created standard: solr.StandardRequestHandler
   [junit4]   2> 756178 T2015 oasc.RequestHandlers.initHandlersFromConfig created /get: solr.RealTimeGetHandler
   [junit4]   2> 756178 T2015 oasc.RequestHandlers.initHandlersFromConfig adding lazy requestHandler: solr.ReplicationHandler
   [junit4]   2> 756179 T2015 oasc.RequestHandlers.initHandlersFromConfig created /replication: solr.ReplicationHandler
   [junit4]   2> 756179 T2015 oasc.RequestHandlers.initHandlersFromConfig created /update: solr.UpdateRequestHandler
   [junit4]   2> 756180 T2015 oasc.RequestHandlers.initHandlersFromConfig created /admin/: org.apache.solr.handler.admin.AdminHandlers
   [junit4]   2> 756181 T2015 oashl.XMLLoader.init xsltCacheLifetimeSeconds=60
   [junit4]   2> 756184 T2015 oass.SolrIndexSearcher.<init> Opening Searcher@73a8a2e4 main
   [junit4]   2> 756184 T2015 oasu.CommitTracker.<init> Hard AutoCommit: disabled
   [junit4]   2> 756185 T2015 oasu.CommitTracker.<init> Soft AutoCommit: disabled
   [junit4]   2> 756187 T2030 oasc.SolrCore.registerSearcher [nodes_used_collection_shard1_replica2] Registered new searcher Searcher@73a8a2e4 main{StandardDirectoryReader(segments_1:1)}
   [junit4]   2> 756189 T2015 oasc.CoreContainer.registerCore registering core: nodes_used_collection_shard1_replica2
   [junit4]   2> 756189 T2015 oasc.ZkController.register Register replica - core:nodes_used_collection_shard1_replica2 address:http://127.0.0.1:57715/v/f collection:nodes_used_collection shard:shard1
   [junit4]   2> 756189 T2015 oascsi.HttpClientUtil.createClient Creating new http client, config:maxConnections=10000&maxConnectionsPerHost=20&connTimeout=15000&socketTimeout=30000&retry=false
   [junit4]   2> 756581 T2002 oasc.ShardLeaderElectionContext.waitForReplicasToComeUp Enough replicas found to continue.
   [junit4]   2> 756581 T2002 oasc.ShardLeaderElectionContext.runLeaderProcess I may be the new leader - try and sync
   [junit4]   2> 756581 T2002 oasc.SyncStrategy.sync Sync replicas to http://127.0.0.1:35632/v/f/nodes_used_collection_shard1_replica1/
   [junit4]   2> 756582 T2002 oasu.PeerSync.sync PeerSync: core=nodes_used_collection_shard1_replica1 url=http://127.0.0.1:35632/v/f START replicas=[http://127.0.0.1:57715/v/f/nodes_used_collection_shard1_replica2/] nUpdates=100
   [junit4]   2> 756582 T2002 oasu.PeerSync.sync PeerSync: core=nodes_used_collection_shard1_replica1 url=http://127.0.0.1:35632/v/f DONE.  We have no versions.  sync failed.
   [junit4]   2> 756582 T2002 oasc.SyncStrategy.syncReplicas Leader's attempt to sync with shard failed, moving to the next candidate
   [junit4]   2> 756583 T2002 oasc.ShardLeaderElectionContext.runLeaderProcess We failed sync, but we have no versions - we ca

[...truncated too long message...]

oryFactory.closeCacheValue looking to close /mnt/ssd/jenkins/workspace/Lucene-Solr-4.x-Linux/solr/build/solr-core/test/J1/./org.apache.solr.cloud.CollectionsAPIDistributedZkTest-jetty4-1375559271479//new_implicit_coll_1_d_replica1/data [CachedDir<<refCount=0;path=/mnt/ssd/jenkins/workspace/Lucene-Solr-4.x-Linux/solr/build/solr-core/test/J1/./org.apache.solr.cloud.CollectionsAPIDistributedZkTest-jetty4-1375559271479//new_implicit_coll_1_d_replica1/data;done=false>>]
   [junit4]   2> 893180 T1939 oasc.CachingDirectoryFactory.close Closing directory: /mnt/ssd/jenkins/workspace/Lucene-Solr-4.x-Linux/solr/build/solr-core/test/J1/./org.apache.solr.cloud.CollectionsAPIDistributedZkTest-jetty4-1375559271479//new_implicit_coll_1_d_replica1/data
   [junit4]   2> 893194 T2573 oasc.Overseer$ClusterStateUpdater.amILeader According to ZK I (id=90148652076040204-127.0.0.1:57715_v%2Ff-n_0000000004) am no longer a leader.
   [junit4]   2> 893223 T1939 oejsh.ContextHandler.doStop stopped o.e.j.s.ServletContextHandler{/v/f,null}
   [junit4]   2> 893278 T1939 oas.SolrTestCaseJ4.tearDown ###Ending testDistribSearch
   [junit4]   2> 893281 T1939 oasc.ZkTestServer.send4LetterWord connecting to 127.0.0.1:34192 34192
   [junit4]   1> client port:0.0.0.0/0.0.0.0:0
   [junit4]   2> NOTE: reproduce with: ant test  -Dtestcase=CollectionsAPIDistributedZkTest -Dtests.method=testDistribSearch -Dtests.seed=D91C4FA6CB18C597 -Dtests.multiplier=3 -Dtests.slow=true -Dtests.locale=th_TH -Dtests.timezone=Asia/Riyadh89 -Dtests.file.encoding=ISO-8859-1
   [junit4] ERROR    148s J1 | CollectionsAPIDistributedZkTest.testDistribSearch <<<
   [junit4]    > Throwable #1: org.apache.solr.client.solrj.SolrServerException: Server refused connection at: http://127.0.0.1:58624/v/f
   [junit4]    > 	at __randomizedtesting.SeedInfo.seed([D91C4FA6CB18C597:58FAC1BEBC47A5AB]:0)
   [junit4]    > 	at org.apache.solr.client.solrj.impl.HttpSolrServer.request(HttpSolrServer.java:428)
   [junit4]    > 	at org.apache.solr.client.solrj.impl.HttpSolrServer.request(HttpSolrServer.java:180)
   [junit4]    > 	at org.apache.solr.cloud.AbstractFullDistribZkTestBase.createCollection(AbstractFullDistribZkTestBase.java:1535)
   [junit4]    > 	at org.apache.solr.cloud.CollectionsAPIDistributedZkTest.testCustomCollectionsAPI(CollectionsAPIDistributedZkTest.java:677)
   [junit4]    > 	at org.apache.solr.cloud.CollectionsAPIDistributedZkTest.doTest(CollectionsAPIDistributedZkTest.java:159)
   [junit4]    > 	at org.apache.solr.BaseDistributedSearchTestCase.testDistribSearch(BaseDistributedSearchTestCase.java:835)
   [junit4]    > 	at java.lang.Thread.run(Thread.java:662)
   [junit4]    > Caused by: org.apache.http.conn.HttpHostConnectException: Connection to http://127.0.0.1:58624 refused
   [junit4]    > 	at org.apache.http.impl.conn.DefaultClientConnectionOperator.openConnection(DefaultClientConnectionOperator.java:190)
   [junit4]    > 	at org.apache.http.impl.conn.ManagedClientConnectionImpl.open(ManagedClientConnectionImpl.java:294)
   [junit4]    > 	at org.apache.http.impl.client.DefaultRequestDirector.tryConnect(DefaultRequestDirector.java:645)
   [junit4]    > 	at org.apache.http.impl.client.DefaultRequestDirector.execute(DefaultRequestDirector.java:480)
   [junit4]    > 	at org.apache.http.impl.client.AbstractHttpClient.execute(AbstractHttpClient.java:906)
   [junit4]    > 	at org.apache.http.impl.client.AbstractHttpClient.execute(AbstractHttpClient.java:805)
   [junit4]    > 	at org.apache.http.impl.client.AbstractHttpClient.execute(AbstractHttpClient.java:784)
   [junit4]    > 	at org.apache.solr.client.solrj.impl.HttpSolrServer.request(HttpSolrServer.java:365)
   [junit4]    > 	... 45 more
   [junit4]    > Caused by: java.net.ConnectException: Connection refused
   [junit4]    > 	at java.net.PlainSocketImpl.socketConnect(Native Method)
   [junit4]    > 	at java.net.PlainSocketImpl.doConnect(PlainSocketImpl.java:351)
   [junit4]    > 	at java.net.PlainSocketImpl.connectToAddress(PlainSocketImpl.java:213)
   [junit4]    > 	at java.net.PlainSocketImpl.connect(PlainSocketImpl.java:200)
   [junit4]    > 	at java.net.SocksSocketImpl.connect(SocksSocketImpl.java:366)
   [junit4]    > 	at java.net.Socket.connect(Socket.java:529)
   [junit4]    > 	at org.apache.http.conn.scheme.PlainSocketFactory.connectSocket(PlainSocketFactory.java:127)
   [junit4]    > 	at org.apache.http.impl.conn.DefaultClientConnectionOperator.openConnection(DefaultClientConnectionOperator.java:180)
   [junit4]    > 	... 52 more
   [junit4]   2> 893716 T1939 oas.SolrTestCaseJ4.deleteCore ###deleteCore
   [junit4]   2> 148186 T1938 ccr.ThreadLeakControl.checkThreadLeaks WARNING Will linger awaiting termination of 2 leaked thread(s).
   [junit4]   2> 894496 T2021 oascc.ZkStateReader$3.process WARN ZooKeeper watch triggered, but Solr cannot talk to ZK
   [junit4]   2> 894496 T2021 oascc.ZkStateReader$2.process A cluster state change: WatchedEvent state:SyncConnected type:NodeChildrenChanged path:/live_nodes, has occurred - updating... (live nodes size: 1)
   [junit4]   2> 894496 T2021 oascc.ZkStateReader$2.process WARN ZooKeeper watch triggered, but Solr cannot talk to ZK
   [junit4]   2> 894497 T2021 oasc.LeaderElector$1.process WARN  org.apache.zookeeper.KeeperException$SessionExpiredException: KeeperErrorCode = Session expired for /collections/new_implicit_coll_0/leader_elect/c/election
   [junit4]   2> 	at org.apache.zookeeper.KeeperException.create(KeeperException.java:127)
   [junit4]   2> 	at org.apache.zookeeper.KeeperException.create(KeeperException.java:51)
   [junit4]   2> 	at org.apache.zookeeper.ZooKeeper.getChildren(ZooKeeper.java:1468)
   [junit4]   2> 	at org.apache.solr.common.cloud.SolrZkClient$6.execute(SolrZkClient.java:235)
   [junit4]   2> 	at org.apache.solr.common.cloud.SolrZkClient$6.execute(SolrZkClient.java:232)
   [junit4]   2> 	at org.apache.solr.common.cloud.ZkCmdExecutor.retryOperation(ZkCmdExecutor.java:65)
   [junit4]   2> 	at org.apache.solr.common.cloud.SolrZkClient.getChildren(SolrZkClient.java:232)
   [junit4]   2> 	at org.apache.solr.cloud.LeaderElector.checkIfIamLeader(LeaderElector.java:84)
   [junit4]   2> 	at org.apache.solr.cloud.LeaderElector.access$000(LeaderElector.java:55)
   [junit4]   2> 	at org.apache.solr.cloud.LeaderElector$1.process(LeaderElector.java:129)
   [junit4]   2> 	at org.apache.zookeeper.ClientCnxn$EventThread.processEvent(ClientCnxn.java:519)
   [junit4]   2> 	at org.apache.zookeeper.ClientCnxn$EventThread.run(ClientCnxn.java:495)
   [junit4]   2> 
   [junit4]   2> NOTE: test params are: codec=Lucene3x, sim=RandomSimilarityProvider(queryNorm=false,coord=no): {}, locale=th_TH, timezone=Asia/Riyadh89
   [junit4]   2> NOTE: Linux 3.2.0-51-generic amd64/Sun Microsystems Inc. 1.6.0_45 (64-bit)/cpus=8,threads=1,free=104891296,total=353333248
   [junit4]   2> NOTE: All tests run in this JVM: [NoCacheHeaderTest, TestLMJelinekMercerSimilarityFactory, DOMUtilTest, BasicDistributedZk2Test, TestCodecSupport, TestSerializedLuceneMatchVersion, HdfsLockFactoryTest, DistanceFunctionTest, TestManagedSchema, CoreContainerCoreInitFailuresTest, RequestHandlersTest, SampleTest, TestMultiCoreConfBootstrap, TestPostingsSolrHighlighter, HardAutoCommitTest, EchoParamsTest, URLClassifyProcessorTest, TestLuceneMatchVersion, ShardSplitTest, SolrCmdDistributorTest, BadIndexSchemaTest, AssignTest, TestStressReorder, TestSystemIdResolver, IndexReaderFactoryTest, SortByFunctionTest, TestUtils, TestAddFieldRealTimeGet, TestElisionMultitermQuery, HighlighterConfigTest, TestNumberUtils, TestCopyFieldCollectionResource, QueryResultKeyTest, TestPartialUpdateDeduplication, ShardRoutingCustomTest, TestCollationField, DocumentAnalysisRequestHandlerTest, StandardRequestHandlerTest, TestSchemaVersionResource, TestBM25SimilarityFactory, DateMathParserTest, TestDistributedGrouping, FieldAnalysisRequestHandlerTest, TestWordDelimiterFilterFactory, SolrRequestParserTest, TestRandomMergePolicy, TestRecovery, TestDFRSimilarityFactory, DebugComponentTest, HighlighterTest, IndexSchemaRuntimeFieldTest, TestBinaryResponseWriter, TestQueryTypes, SolrCoreCheckLockOnStartupTest, CopyFieldTest, UpdateParamsTest, BlockCacheTest, StatsComponentTest, FullSolrCloudDistribCmdsTest, SpellCheckCollatorTest, TestCollationKeyRangeQueries, XmlUpdateRequestHandlerTest, BasicZkTest, SpellCheckComponentTest, TestSolrJ, DisMaxRequestHandlerTest, OutputWriterTest, TestAnalyzedSuggestions, DefaultValueUpdateProcessorTest, SimplePostToolTest, TimeZoneUtilsTest, TestFieldCollectionResource, CurrencyFieldXmlFileTest, TestComponentsName, TestFoldingMultitermQuery, DirectUpdateHandlerTest, ChaosMonkeySafeLeaderTest, CollectionsAPIDistributedZkTest]
   [junit4] Completed on J1 in 149.23s, 1 test, 1 error <<< FAILURES!

[...truncated 484 lines...]
BUILD FAILED
/mnt/ssd/jenkins/workspace/Lucene-Solr-4.x-Linux/build.xml:395: The following error occurred while executing this line:
/mnt/ssd/jenkins/workspace/Lucene-Solr-4.x-Linux/build.xml:375: The following error occurred while executing this line:
/mnt/ssd/jenkins/workspace/Lucene-Solr-4.x-Linux/build.xml:39: The following error occurred while executing this line:
/mnt/ssd/jenkins/workspace/Lucene-Solr-4.x-Linux/solr/build.xml:181: The following error occurred while executing this line:
/mnt/ssd/jenkins/workspace/Lucene-Solr-4.x-Linux/solr/common-build.xml:449: The following error occurred while executing this line:
/mnt/ssd/jenkins/workspace/Lucene-Solr-4.x-Linux/lucene/common-build.xml:1233: The following error occurred while executing this line:
/mnt/ssd/jenkins/workspace/Lucene-Solr-4.x-Linux/lucene/common-build.xml:876: There were test failures: 321 suites, 1352 tests, 1 error, 34 ignored (6 assumptions)

Total time: 41 minutes 53 seconds
Build step 'Invoke Ant' marked build as failure
Description set: Java: 64bit/jdk1.6.0_45 -XX:-UseCompressedOops -XX:+UseSerialGC
Archiving artifacts
Recording test results
Email was triggered for: Failure
Sending email for trigger: Failure



Mime
View raw message