lucene-dev mailing list archives

Site index · List index
Message view « Date » · « Thread »
Top « Date » · « Thread »
From Apache Jenkins Server <jenk...@builds.apache.org>
Subject [JENKINS] Lucene-Solr-Tests-4.x-Java6 - Build # 1860 - Still Failing
Date Thu, 01 Aug 2013 07:31:14 GMT
Build: https://builds.apache.org/job/Lucene-Solr-Tests-4.x-Java6/1860/

1 tests failed.
FAILED:  org.apache.solr.cloud.CollectionsAPIDistributedZkTest.testDistribSearch

Error Message:
IOException occured when talking to server at: http://127.0.0.1:31990/wli/wq

Stack Trace:
org.apache.solr.client.solrj.SolrServerException: IOException occured when talking to server at: http://127.0.0.1:31990/wli/wq
	at __randomizedtesting.SeedInfo.seed([323929E81520CBE:82C51C86F60D6C82]:0)
	at org.apache.solr.client.solrj.impl.HttpSolrServer.request(HttpSolrServer.java:435)
	at org.apache.solr.client.solrj.impl.HttpSolrServer.request(HttpSolrServer.java:180)
	at org.apache.solr.cloud.AbstractFullDistribZkTestBase.createCollection(AbstractFullDistribZkTestBase.java:1535)
	at org.apache.solr.cloud.CollectionsAPIDistributedZkTest.testCustomCollectionsAPI(CollectionsAPIDistributedZkTest.java:677)
	at org.apache.solr.cloud.CollectionsAPIDistributedZkTest.doTest(CollectionsAPIDistributedZkTest.java:159)
	at org.apache.solr.BaseDistributedSearchTestCase.testDistribSearch(BaseDistributedSearchTestCase.java:835)
	at sun.reflect.NativeMethodAccessorImpl.invoke0(Native Method)
	at sun.reflect.NativeMethodAccessorImpl.invoke(NativeMethodAccessorImpl.java:57)
	at sun.reflect.DelegatingMethodAccessorImpl.invoke(DelegatingMethodAccessorImpl.java:43)
	at java.lang.reflect.Method.invoke(Method.java:616)
	at com.carrotsearch.randomizedtesting.RandomizedRunner.invoke(RandomizedRunner.java:1559)
	at com.carrotsearch.randomizedtesting.RandomizedRunner.access$600(RandomizedRunner.java:79)
	at com.carrotsearch.randomizedtesting.RandomizedRunner$6.evaluate(RandomizedRunner.java:737)
	at com.carrotsearch.randomizedtesting.RandomizedRunner$7.evaluate(RandomizedRunner.java:773)
	at com.carrotsearch.randomizedtesting.RandomizedRunner$8.evaluate(RandomizedRunner.java:787)
	at com.carrotsearch.randomizedtesting.rules.SystemPropertiesRestoreRule$1.evaluate(SystemPropertiesRestoreRule.java:53)
	at org.apache.lucene.util.TestRuleSetupTeardownChained$1.evaluate(TestRuleSetupTeardownChained.java:50)
	at org.apache.lucene.util.TestRuleFieldCacheSanity$1.evaluate(TestRuleFieldCacheSanity.java:51)
	at org.apache.lucene.util.AbstractBeforeAfterRule$1.evaluate(AbstractBeforeAfterRule.java:46)
	at com.carrotsearch.randomizedtesting.rules.SystemPropertiesInvariantRule$1.evaluate(SystemPropertiesInvariantRule.java:55)
	at org.apache.lucene.util.TestRuleThreadAndTestName$1.evaluate(TestRuleThreadAndTestName.java:49)
	at org.apache.lucene.util.TestRuleIgnoreAfterMaxFailures$1.evaluate(TestRuleIgnoreAfterMaxFailures.java:70)
	at org.apache.lucene.util.TestRuleMarkFailure$1.evaluate(TestRuleMarkFailure.java:48)
	at com.carrotsearch.randomizedtesting.rules.StatementAdapter.evaluate(StatementAdapter.java:36)
	at com.carrotsearch.randomizedtesting.ThreadLeakControl$StatementRunner.run(ThreadLeakControl.java:358)
	at com.carrotsearch.randomizedtesting.ThreadLeakControl.forkTimeoutingTask(ThreadLeakControl.java:782)
	at com.carrotsearch.randomizedtesting.ThreadLeakControl$3.evaluate(ThreadLeakControl.java:442)
	at com.carrotsearch.randomizedtesting.RandomizedRunner.runSingleTest(RandomizedRunner.java:746)
	at com.carrotsearch.randomizedtesting.RandomizedRunner$3.evaluate(RandomizedRunner.java:648)
	at com.carrotsearch.randomizedtesting.RandomizedRunner$4.evaluate(RandomizedRunner.java:682)
	at com.carrotsearch.randomizedtesting.RandomizedRunner$5.evaluate(RandomizedRunner.java:693)
	at com.carrotsearch.randomizedtesting.rules.StatementAdapter.evaluate(StatementAdapter.java:36)
	at com.carrotsearch.randomizedtesting.rules.SystemPropertiesRestoreRule$1.evaluate(SystemPropertiesRestoreRule.java:53)
	at org.apache.lucene.util.AbstractBeforeAfterRule$1.evaluate(AbstractBeforeAfterRule.java:46)
	at org.apache.lucene.util.TestRuleStoreClassName$1.evaluate(TestRuleStoreClassName.java:42)
	at com.carrotsearch.randomizedtesting.rules.SystemPropertiesInvariantRule$1.evaluate(SystemPropertiesInvariantRule.java:55)
	at com.carrotsearch.randomizedtesting.rules.NoShadowingOrOverridesOnMethodsRule$1.evaluate(NoShadowingOrOverridesOnMethodsRule.java:39)
	at com.carrotsearch.randomizedtesting.rules.NoShadowingOrOverridesOnMethodsRule$1.evaluate(NoShadowingOrOverridesOnMethodsRule.java:39)
	at com.carrotsearch.randomizedtesting.rules.StatementAdapter.evaluate(StatementAdapter.java:36)
	at org.apache.lucene.util.TestRuleAssertionsRequired$1.evaluate(TestRuleAssertionsRequired.java:43)
	at org.apache.lucene.util.TestRuleMarkFailure$1.evaluate(TestRuleMarkFailure.java:48)
	at org.apache.lucene.util.TestRuleIgnoreAfterMaxFailures$1.evaluate(TestRuleIgnoreAfterMaxFailures.java:70)
	at org.apache.lucene.util.TestRuleIgnoreTestSuites$1.evaluate(TestRuleIgnoreTestSuites.java:55)
	at com.carrotsearch.randomizedtesting.rules.StatementAdapter.evaluate(StatementAdapter.java:36)
	at com.carrotsearch.randomizedtesting.ThreadLeakControl$StatementRunner.run(ThreadLeakControl.java:358)
	at java.lang.Thread.run(Thread.java:679)
Caused by: org.apache.http.conn.ConnectTimeoutException: Connect to 127.0.0.1:31990 timed out
	at org.apache.http.conn.scheme.PlainSocketFactory.connectSocket(PlainSocketFactory.java:129)
	at org.apache.http.impl.conn.DefaultClientConnectionOperator.openConnection(DefaultClientConnectionOperator.java:180)
	at org.apache.http.impl.conn.ManagedClientConnectionImpl.open(ManagedClientConnectionImpl.java:294)
	at org.apache.http.impl.client.DefaultRequestDirector.tryConnect(DefaultRequestDirector.java:645)
	at org.apache.http.impl.client.DefaultRequestDirector.execute(DefaultRequestDirector.java:480)
	at org.apache.http.impl.client.AbstractHttpClient.execute(AbstractHttpClient.java:906)
	at org.apache.http.impl.client.AbstractHttpClient.execute(AbstractHttpClient.java:805)
	at org.apache.http.impl.client.AbstractHttpClient.execute(AbstractHttpClient.java:784)
	at org.apache.solr.client.solrj.impl.HttpSolrServer.request(HttpSolrServer.java:365)
	... 45 more




Build Log:
[...truncated 9301 lines...]
   [junit4] Suite: org.apache.solr.cloud.CollectionsAPIDistributedZkTest
   [junit4]   2> 1384180 T3249 oas.BaseDistributedSearchTestCase.initHostContext Setting hostContext system property: /wli/wq
   [junit4]   2> 1384185 T3249 oas.SolrTestCaseJ4.setUp ###Starting testDistribSearch
   [junit4]   2> Creating dataDir: /usr/home/hudson/hudson-slave/workspace/Lucene-Solr-Tests-4.x-Java6/solr/build/solr-core/test/J0/./solrtest-CollectionsAPIDistributedZkTest-1375341617414
   [junit4]   2> 1384186 T3249 oasc.ZkTestServer.run STARTING ZK TEST SERVER
   [junit4]   2> 1384187 T3250 oasc.ZkTestServer$ZKServerMain.runFromConfig Starting server
   [junit4]   2> 1384288 T3249 oasc.ZkTestServer.run start zk server on port:31983
   [junit4]   2> 1384289 T3249 oascc.ConnectionManager.waitForConnected Waiting for client to connect to ZooKeeper
   [junit4]   2> 1384296 T3256 oascc.ConnectionManager.process Watcher org.apache.solr.common.cloud.ConnectionManager@15e2809 name:ZooKeeperConnection Watcher:127.0.0.1:31983 got event WatchedEvent state:SyncConnected type:None path:null path:null type:None
   [junit4]   2> 1384296 T3249 oascc.ConnectionManager.waitForConnected Client is connected to ZooKeeper
   [junit4]   2> 1384296 T3249 oascc.SolrZkClient.makePath makePath: /solr
   [junit4]   2> 1384310 T3249 oascc.ConnectionManager.waitForConnected Waiting for client to connect to ZooKeeper
   [junit4]   2> 1384312 T3258 oascc.ConnectionManager.process Watcher org.apache.solr.common.cloud.ConnectionManager@24b67eaf name:ZooKeeperConnection Watcher:127.0.0.1:31983/solr got event WatchedEvent state:SyncConnected type:None path:null path:null type:None
   [junit4]   2> 1384312 T3249 oascc.ConnectionManager.waitForConnected Client is connected to ZooKeeper
   [junit4]   2> 1384312 T3249 oascc.SolrZkClient.makePath makePath: /collections/collection1
   [junit4]   2> 1384317 T3249 oascc.SolrZkClient.makePath makePath: /collections/collection1/shards
   [junit4]   2> 1384319 T3249 oascc.SolrZkClient.makePath makePath: /collections/control_collection
   [junit4]   2> 1384329 T3249 oascc.SolrZkClient.makePath makePath: /collections/control_collection/shards
   [junit4]   2> 1384332 T3249 oasc.AbstractZkTestCase.putConfig put /usr/home/hudson/hudson-slave/workspace/Lucene-Solr-Tests-4.x-Java6/solr/build/solr-core/test-files/solr/collection1/conf/solrconfig-tlog.xml to /configs/conf1/solrconfig.xml
   [junit4]   2> 1384333 T3249 oascc.SolrZkClient.makePath makePath: /configs/conf1/solrconfig.xml
   [junit4]   2> 1384352 T3249 oasc.AbstractZkTestCase.putConfig put /usr/home/hudson/hudson-slave/workspace/Lucene-Solr-Tests-4.x-Java6/solr/build/solr-core/test-files/solr/collection1/conf/schema.xml to /configs/conf1/schema.xml
   [junit4]   2> 1384353 T3249 oascc.SolrZkClient.makePath makePath: /configs/conf1/schema.xml
   [junit4]   2> 1384457 T3249 oasc.AbstractZkTestCase.putConfig put /usr/home/hudson/hudson-slave/workspace/Lucene-Solr-Tests-4.x-Java6/solr/build/solr-core/test-files/solr/collection1/conf/stopwords.txt to /configs/conf1/stopwords.txt
   [junit4]   2> 1384458 T3249 oascc.SolrZkClient.makePath makePath: /configs/conf1/stopwords.txt
   [junit4]   2> 1384461 T3249 oasc.AbstractZkTestCase.putConfig put /usr/home/hudson/hudson-slave/workspace/Lucene-Solr-Tests-4.x-Java6/solr/build/solr-core/test-files/solr/collection1/conf/protwords.txt to /configs/conf1/protwords.txt
   [junit4]   2> 1384461 T3249 oascc.SolrZkClient.makePath makePath: /configs/conf1/protwords.txt
   [junit4]   2> 1384473 T3249 oasc.AbstractZkTestCase.putConfig put /usr/home/hudson/hudson-slave/workspace/Lucene-Solr-Tests-4.x-Java6/solr/build/solr-core/test-files/solr/collection1/conf/currency.xml to /configs/conf1/currency.xml
   [junit4]   2> 1384473 T3249 oascc.SolrZkClient.makePath makePath: /configs/conf1/currency.xml
   [junit4]   2> 1384476 T3249 oasc.AbstractZkTestCase.putConfig put /usr/home/hudson/hudson-slave/workspace/Lucene-Solr-Tests-4.x-Java6/solr/build/solr-core/test-files/solr/collection1/conf/open-exchange-rates.json to /configs/conf1/open-exchange-rates.json
   [junit4]   2> 1384477 T3249 oascc.SolrZkClient.makePath makePath: /configs/conf1/open-exchange-rates.json
   [junit4]   2> 1384480 T3249 oasc.AbstractZkTestCase.putConfig put /usr/home/hudson/hudson-slave/workspace/Lucene-Solr-Tests-4.x-Java6/solr/build/solr-core/test-files/solr/collection1/conf/mapping-ISOLatin1Accent.txt to /configs/conf1/mapping-ISOLatin1Accent.txt
   [junit4]   2> 1384480 T3249 oascc.SolrZkClient.makePath makePath: /configs/conf1/mapping-ISOLatin1Accent.txt
   [junit4]   2> 1384483 T3249 oasc.AbstractZkTestCase.putConfig put /usr/home/hudson/hudson-slave/workspace/Lucene-Solr-Tests-4.x-Java6/solr/build/solr-core/test-files/solr/collection1/conf/old_synonyms.txt to /configs/conf1/old_synonyms.txt
   [junit4]   2> 1384484 T3249 oascc.SolrZkClient.makePath makePath: /configs/conf1/old_synonyms.txt
   [junit4]   2> 1384491 T3249 oasc.AbstractZkTestCase.putConfig put /usr/home/hudson/hudson-slave/workspace/Lucene-Solr-Tests-4.x-Java6/solr/build/solr-core/test-files/solr/collection1/conf/synonyms.txt to /configs/conf1/synonyms.txt
   [junit4]   2> 1384492 T3249 oascc.SolrZkClient.makePath makePath: /configs/conf1/synonyms.txt
   [junit4]   2> 1384762 T3249 oejs.Server.doStart jetty-8.1.10.v20130312
   [junit4]   2> 1384768 T3249 oejs.AbstractConnector.doStart Started SocketConnector@127.0.0.1:?????
   [junit4]   2> 1384769 T3249 oass.SolrDispatchFilter.init SolrDispatchFilter.init()
   [junit4]   2> 1384769 T3249 oasc.SolrResourceLoader.locateSolrHome JNDI not configured for solr (NoInitialContextEx)
   [junit4]   2> 1384769 T3249 oasc.SolrResourceLoader.locateSolrHome using system property solr.solr.home: /usr/home/hudson/hudson-slave/workspace/Lucene-Solr-Tests-4.x-Java6/solr/build/solr-core/test/J0/./org.apache.solr.cloud.CollectionsAPIDistributedZkTest-controljetty-1375341617723
   [junit4]   2> 1384770 T3249 oasc.SolrResourceLoader.<init> new SolrResourceLoader for directory: '/usr/home/hudson/hudson-slave/workspace/Lucene-Solr-Tests-4.x-Java6/solr/build/solr-core/test/J0/./org.apache.solr.cloud.CollectionsAPIDistributedZkTest-controljetty-1375341617723/'
   [junit4]   2> 1384810 T3249 oasc.ConfigSolr.fromFile Loading container configuration from /usr/home/hudson/hudson-slave/workspace/Lucene-Solr-Tests-4.x-Java6/solr/build/solr-core/test/J0/./org.apache.solr.cloud.CollectionsAPIDistributedZkTest-controljetty-1375341617723/solr.xml
   [junit4]   2> 1384890 T3249 oasc.ConfigSolrXml.<init> Config-defined core root directory: 
   [junit4]   2> 1384890 T3249 oasc.CoreContainer.<init> New CoreContainer 288076846
   [junit4]   2> 1384891 T3249 oasc.CoreContainer.load Loading cores into CoreContainer [instanceDir=/usr/home/hudson/hudson-slave/workspace/Lucene-Solr-Tests-4.x-Java6/solr/build/solr-core/test/J0/./org.apache.solr.cloud.CollectionsAPIDistributedZkTest-controljetty-1375341617723/]
   [junit4]   2> 1384893 T3249 oashc.HttpShardHandlerFactory.getParameter Setting socketTimeout to: 120000
   [junit4]   2> 1384893 T3249 oashc.HttpShardHandlerFactory.getParameter Setting urlScheme to: http://
   [junit4]   2> 1384894 T3249 oashc.HttpShardHandlerFactory.getParameter Setting connTimeout to: 15000
   [junit4]   2> 1384894 T3249 oashc.HttpShardHandlerFactory.getParameter Setting maxConnectionsPerHost to: 20
   [junit4]   2> 1384895 T3249 oashc.HttpShardHandlerFactory.getParameter Setting corePoolSize to: 0
   [junit4]   2> 1384895 T3249 oashc.HttpShardHandlerFactory.getParameter Setting maximumPoolSize to: 2147483647
   [junit4]   2> 1384896 T3249 oashc.HttpShardHandlerFactory.getParameter Setting maxThreadIdleTime to: 5
   [junit4]   2> 1384896 T3249 oashc.HttpShardHandlerFactory.getParameter Setting sizeOfQueue to: -1
   [junit4]   2> 1384896 T3249 oashc.HttpShardHandlerFactory.getParameter Setting fairnessPolicy to: false
   [junit4]   2> 1384897 T3249 oascsi.HttpClientUtil.createClient Creating new http client, config:maxConnectionsPerHost=20&maxConnections=10000&socketTimeout=120000&connTimeout=15000&retry=false
   [junit4]   2> 1384915 T3249 oasc.ZkContainer.initZooKeeper Zookeeper client=127.0.0.1:31983/solr
   [junit4]   2> 1384915 T3249 oasc.ZkController.checkChrootPath zkHost includes chroot
   [junit4]   2> 1384916 T3249 oascc.ConnectionManager.waitForConnected Waiting for client to connect to ZooKeeper
   [junit4]   2> 1384919 T3269 oascc.ConnectionManager.process Watcher org.apache.solr.common.cloud.ConnectionManager@4c4240d0 name:ZooKeeperConnection Watcher:127.0.0.1:31983 got event WatchedEvent state:SyncConnected type:None path:null path:null type:None
   [junit4]   2> 1384919 T3249 oascc.ConnectionManager.waitForConnected Client is connected to ZooKeeper
   [junit4]   2> 1384921 T3249 oascsi.HttpClientUtil.createClient Creating new http client, config:maxConnections=500&maxConnectionsPerHost=16&socketTimeout=120000&connTimeout=15000
   [junit4]   2> 1384932 T3249 oascc.ConnectionManager.waitForConnected Waiting for client to connect to ZooKeeper
   [junit4]   2> 1384934 T3271 oascc.ConnectionManager.process Watcher org.apache.solr.common.cloud.ConnectionManager@bd89668 name:ZooKeeperConnection Watcher:127.0.0.1:31983/solr got event WatchedEvent state:SyncConnected type:None path:null path:null type:None
   [junit4]   2> 1384935 T3249 oascc.ConnectionManager.waitForConnected Client is connected to ZooKeeper
   [junit4]   2> 1384936 T3249 oascc.SolrZkClient.makePath makePath: /overseer/queue
   [junit4]   2> 1384947 T3249 oascc.SolrZkClient.makePath makePath: /overseer/collection-queue-work
   [junit4]   2> 1384950 T3249 oascc.SolrZkClient.makePath makePath: /live_nodes
   [junit4]   2> 1384958 T3249 oasc.ZkController.createEphemeralLiveNode Register node as live in ZooKeeper:/live_nodes/127.0.0.1:31986_wli%2Fwq
   [junit4]   2> 1384959 T3249 oascc.SolrZkClient.makePath makePath: /live_nodes/127.0.0.1:31986_wli%2Fwq
   [junit4]   2> 1384962 T3249 oascc.SolrZkClient.makePath makePath: /overseer_elect/election
   [junit4]   2> 1384980 T3249 oascc.SolrZkClient.makePath makePath: /overseer_elect/leader
   [junit4]   2> 1384982 T3249 oasc.Overseer.start Overseer (id=90134388239302659-127.0.0.1:31986_wli%2Fwq-n_0000000000) starting
   [junit4]   2> 1384997 T3249 oascc.SolrZkClient.makePath makePath: /overseer/queue-work
   [junit4]   2> 1385001 T3273 oasc.OverseerCollectionProcessor.run Process current queue of collection creations
   [junit4]   2> 1385001 T3249 oascc.SolrZkClient.makePath makePath: /clusterstate.json
   [junit4]   2> 1385011 T3249 oascc.SolrZkClient.makePath makePath: /aliases.json
   [junit4]   2> 1385013 T3249 oascc.ZkStateReader.createClusterStateWatchersAndUpdate Updating cluster state from ZooKeeper... 
   [junit4]   2> 1385015 T3272 oasc.Overseer$ClusterStateUpdater.run Starting to work on the main queue
   [junit4]   2> 1385019 T3249 oasc.CorePropertiesLocator.discover Looking for core definitions underneath /usr/home/hudson/hudson-slave/workspace/Lucene-Solr-Tests-4.x-Java6/solr/build/solr-core/test/J0/./org.apache.solr.cloud.CollectionsAPIDistributedZkTest-controljetty-1375341617723
   [junit4]   2> 1385022 T3249 oasc.CorePropertiesLocator.discoverUnder Found core conf in /usr/home/hudson/hudson-slave/workspace/Lucene-Solr-Tests-4.x-Java6/solr/build/solr-core/test/J0/./org.apache.solr.cloud.CollectionsAPIDistributedZkTest-controljetty-1375341617723/conf/
   [junit4]   2> 1385199 T3249 oasc.CorePropertiesLocator.discover Found 1 core definitions
   [junit4]   2> 1385200 T3249 oass.SolrDispatchFilter.init user.dir=/usr/home/hudson/hudson-slave/workspace/Lucene-Solr-Tests-4.x-Java6/solr/build/solr-core/test/J0
   [junit4]   2> 1385200 T3249 oass.SolrDispatchFilter.init SolrDispatchFilter.init() done
   [junit4]   2> 1385201 T3249 oascsi.HttpClientUtil.createClient Creating new http client, config:maxConnections=128&maxConnectionsPerHost=32&followRedirects=false
   [junit4]   2> 1385216 T3249 oascsi.HttpClientUtil.createClient Creating new http client, config:
   [junit4]   2> 1385218 T3249 oascc.ConnectionManager.waitForConnected Waiting for client to connect to ZooKeeper
   [junit4]   2> 1385220 T3276 oascc.ConnectionManager.process Watcher org.apache.solr.common.cloud.ConnectionManager@66f96b40 name:ZooKeeperConnection Watcher:127.0.0.1:31983/solr got event WatchedEvent state:SyncConnected type:None path:null path:null type:None
   [junit4]   2> 1385220 T3249 oascc.ConnectionManager.waitForConnected Client is connected to ZooKeeper
   [junit4]   2> 1385221 T3249 oascc.ZkStateReader.createClusterStateWatchersAndUpdate Updating cluster state from ZooKeeper... 
   [junit4]   2> 1385223 T3249 oasc.ChaosMonkey.monkeyLog monkey: init - expire sessions:true cause connection loss:true
   [junit4]   2> 1385505 T3249 oejs.Server.doStart jetty-8.1.10.v20130312
   [junit4]   2> 1385509 T3249 oejs.AbstractConnector.doStart Started SocketConnector@127.0.0.1:?????
   [junit4]   2> 1385509 T3249 oass.SolrDispatchFilter.init SolrDispatchFilter.init()
   [junit4]   2> 1385510 T3249 oasc.SolrResourceLoader.locateSolrHome JNDI not configured for solr (NoInitialContextEx)
   [junit4]   2> 1385510 T3249 oasc.SolrResourceLoader.locateSolrHome using system property solr.solr.home: /usr/home/hudson/hudson-slave/workspace/Lucene-Solr-Tests-4.x-Java6/solr/build/solr-core/test/J0/./org.apache.solr.cloud.CollectionsAPIDistributedZkTest-jetty1-1375341618451
   [junit4]   2> 1385511 T3249 oasc.SolrResourceLoader.<init> new SolrResourceLoader for directory: '/usr/home/hudson/hudson-slave/workspace/Lucene-Solr-Tests-4.x-Java6/solr/build/solr-core/test/J0/./org.apache.solr.cloud.CollectionsAPIDistributedZkTest-jetty1-1375341618451/'
   [junit4]   2> 1385555 T3249 oasc.ConfigSolr.fromFile Loading container configuration from /usr/home/hudson/hudson-slave/workspace/Lucene-Solr-Tests-4.x-Java6/solr/build/solr-core/test/J0/./org.apache.solr.cloud.CollectionsAPIDistributedZkTest-jetty1-1375341618451/solr.xml
   [junit4]   2> 1385644 T3249 oasc.ConfigSolrXml.<init> Config-defined core root directory: 
   [junit4]   2> 1385645 T3249 oasc.CoreContainer.<init> New CoreContainer 874891123
   [junit4]   2> 1385646 T3249 oasc.CoreContainer.load Loading cores into CoreContainer [instanceDir=/usr/home/hudson/hudson-slave/workspace/Lucene-Solr-Tests-4.x-Java6/solr/build/solr-core/test/J0/./org.apache.solr.cloud.CollectionsAPIDistributedZkTest-jetty1-1375341618451/]
   [junit4]   2> 1385648 T3249 oashc.HttpShardHandlerFactory.getParameter Setting socketTimeout to: 120000
   [junit4]   2> 1385648 T3249 oashc.HttpShardHandlerFactory.getParameter Setting urlScheme to: http://
   [junit4]   2> 1385648 T3249 oashc.HttpShardHandlerFactory.getParameter Setting connTimeout to: 15000
   [junit4]   2> 1385649 T3249 oashc.HttpShardHandlerFactory.getParameter Setting maxConnectionsPerHost to: 20
   [junit4]   2> 1385649 T3249 oashc.HttpShardHandlerFactory.getParameter Setting corePoolSize to: 0
   [junit4]   2> 1385650 T3249 oashc.HttpShardHandlerFactory.getParameter Setting maximumPoolSize to: 2147483647
   [junit4]   2> 1385650 T3249 oashc.HttpShardHandlerFactory.getParameter Setting maxThreadIdleTime to: 5
   [junit4]   2> 1385651 T3249 oashc.HttpShardHandlerFactory.getParameter Setting sizeOfQueue to: -1
   [junit4]   2> 1385651 T3249 oashc.HttpShardHandlerFactory.getParameter Setting fairnessPolicy to: false
   [junit4]   2> 1385652 T3249 oascsi.HttpClientUtil.createClient Creating new http client, config:maxConnectionsPerHost=20&maxConnections=10000&socketTimeout=120000&connTimeout=15000&retry=false
   [junit4]   2> 1385668 T3249 oasc.ZkContainer.initZooKeeper Zookeeper client=127.0.0.1:31983/solr
   [junit4]   2> 1385668 T3249 oasc.ZkController.checkChrootPath zkHost includes chroot
   [junit4]   2> 1385669 T3249 oascc.ConnectionManager.waitForConnected Waiting for client to connect to ZooKeeper
   [junit4]   2> 1385672 T3287 oascc.ConnectionManager.process Watcher org.apache.solr.common.cloud.ConnectionManager@1c4969c4 name:ZooKeeperConnection Watcher:127.0.0.1:31983 got event WatchedEvent state:SyncConnected type:None path:null path:null type:None
   [junit4]   2> 1385672 T3249 oascc.ConnectionManager.waitForConnected Client is connected to ZooKeeper
   [junit4]   2> 1385684 T3249 oascsi.HttpClientUtil.createClient Creating new http client, config:maxConnections=500&maxConnectionsPerHost=16&socketTimeout=120000&connTimeout=15000
   [junit4]   2> 1385693 T3249 oascc.ConnectionManager.waitForConnected Waiting for client to connect to ZooKeeper
   [junit4]   2> 1385695 T3289 oascc.ConnectionManager.process Watcher org.apache.solr.common.cloud.ConnectionManager@2d16c514 name:ZooKeeperConnection Watcher:127.0.0.1:31983/solr got event WatchedEvent state:SyncConnected type:None path:null path:null type:None
   [junit4]   2> 1385695 T3249 oascc.ConnectionManager.waitForConnected Client is connected to ZooKeeper
   [junit4]   2> 1385707 T3249 oascc.ZkStateReader.createClusterStateWatchersAndUpdate Updating cluster state from ZooKeeper... 
   [junit4]   2> 1386710 T3249 oasc.ZkController.createEphemeralLiveNode Register node as live in ZooKeeper:/live_nodes/127.0.0.1:31990_wli%2Fwq
   [junit4]   2> 1386737 T3249 oascc.SolrZkClient.makePath makePath: /live_nodes/127.0.0.1:31990_wli%2Fwq
   [junit4]   2> 1386740 T3271 oascc.ZkStateReader$3.process Updating live nodes... (2)
   [junit4]   2> 1386740 T3289 oascc.ZkStateReader$3.process Updating live nodes... (2)
   [junit4]   2> 1386740 T3276 oascc.ZkStateReader$3.process Updating live nodes... (2)
   [junit4]   2> 1386754 T3249 oasc.CorePropertiesLocator.discover Looking for core definitions underneath /usr/home/hudson/hudson-slave/workspace/Lucene-Solr-Tests-4.x-Java6/solr/build/solr-core/test/J0/./org.apache.solr.cloud.CollectionsAPIDistributedZkTest-jetty1-1375341618451
   [junit4]   2> 1386759 T3249 oasc.CorePropertiesLocator.discoverUnder Found core conf in /usr/home/hudson/hudson-slave/workspace/Lucene-Solr-Tests-4.x-Java6/solr/build/solr-core/test/J0/./org.apache.solr.cloud.CollectionsAPIDistributedZkTest-jetty1-1375341618451/conf/
   [junit4]   2> 1386920 T3249 oasc.CorePropertiesLocator.discover Found 1 core definitions
   [junit4]   2> 1386920 T3249 oass.SolrDispatchFilter.init user.dir=/usr/home/hudson/hudson-slave/workspace/Lucene-Solr-Tests-4.x-Java6/solr/build/solr-core/test/J0
   [junit4]   2> 1386921 T3249 oass.SolrDispatchFilter.init SolrDispatchFilter.init() done
   [junit4]   2> 1386921 T3249 oascsi.HttpClientUtil.createClient Creating new http client, config:maxConnections=128&maxConnectionsPerHost=32&followRedirects=false
   [junit4]   2> 1387202 T3249 oejs.Server.doStart jetty-8.1.10.v20130312
   [junit4]   2> 1387205 T3249 oejs.AbstractConnector.doStart Started SocketConnector@127.0.0.1:?????
   [junit4]   2> 1387206 T3249 oass.SolrDispatchFilter.init SolrDispatchFilter.init()
   [junit4]   2> 1387206 T3249 oasc.SolrResourceLoader.locateSolrHome JNDI not configured for solr (NoInitialContextEx)
   [junit4]   2> 1387207 T3249 oasc.SolrResourceLoader.locateSolrHome using system property solr.solr.home: /usr/home/hudson/hudson-slave/workspace/Lucene-Solr-Tests-4.x-Java6/solr/build/solr-core/test/J0/./org.apache.solr.cloud.CollectionsAPIDistributedZkTest-jetty2-1375341620164
   [junit4]   2> 1387207 T3249 oasc.SolrResourceLoader.<init> new SolrResourceLoader for directory: '/usr/home/hudson/hudson-slave/workspace/Lucene-Solr-Tests-4.x-Java6/solr/build/solr-core/test/J0/./org.apache.solr.cloud.CollectionsAPIDistributedZkTest-jetty2-1375341620164/'
   [junit4]   2> 1387245 T3249 oasc.ConfigSolr.fromFile Loading container configuration from /usr/home/hudson/hudson-slave/workspace/Lucene-Solr-Tests-4.x-Java6/solr/build/solr-core/test/J0/./org.apache.solr.cloud.CollectionsAPIDistributedZkTest-jetty2-1375341620164/solr.xml
   [junit4]   2> 1387307 T3249 oasc.ConfigSolrXml.<init> Config-defined core root directory: 
   [junit4]   2> 1387308 T3249 oasc.CoreContainer.<init> New CoreContainer 241044468
   [junit4]   2> 1387308 T3249 oasc.CoreContainer.load Loading cores into CoreContainer [instanceDir=/usr/home/hudson/hudson-slave/workspace/Lucene-Solr-Tests-4.x-Java6/solr/build/solr-core/test/J0/./org.apache.solr.cloud.CollectionsAPIDistributedZkTest-jetty2-1375341620164/]
   [junit4]   2> 1387310 T3249 oashc.HttpShardHandlerFactory.getParameter Setting socketTimeout to: 120000
   [junit4]   2> 1387310 T3249 oashc.HttpShardHandlerFactory.getParameter Setting urlScheme to: http://
   [junit4]   2> 1387310 T3249 oashc.HttpShardHandlerFactory.getParameter Setting connTimeout to: 15000
   [junit4]   2> 1387310 T3249 oashc.HttpShardHandlerFactory.getParameter Setting maxConnectionsPerHost to: 20
   [junit4]   2> 1387311 T3249 oashc.HttpShardHandlerFactory.getParameter Setting corePoolSize to: 0
   [junit4]   2> 1387311 T3249 oashc.HttpShardHandlerFactory.getParameter Setting maximumPoolSize to: 2147483647
   [junit4]   2> 1387311 T3249 oashc.HttpShardHandlerFactory.getParameter Setting maxThreadIdleTime to: 5
   [junit4]   2> 1387312 T3249 oashc.HttpShardHandlerFactory.getParameter Setting sizeOfQueue to: -1
   [junit4]   2> 1387312 T3249 oashc.HttpShardHandlerFactory.getParameter Setting fairnessPolicy to: false
   [junit4]   2> 1387312 T3249 oascsi.HttpClientUtil.createClient Creating new http client, config:maxConnectionsPerHost=20&maxConnections=10000&socketTimeout=120000&connTimeout=15000&retry=false
   [junit4]   2> 1387322 T3249 oasc.ZkContainer.initZooKeeper Zookeeper client=127.0.0.1:31983/solr
   [junit4]   2> 1387322 T3249 oasc.ZkController.checkChrootPath zkHost includes chroot
   [junit4]   2> 1387323 T3249 oascc.ConnectionManager.waitForConnected Waiting for client to connect to ZooKeeper
   [junit4]   2> 1387331 T3301 oascc.ConnectionManager.process Watcher org.apache.solr.common.cloud.ConnectionManager@4062c78a name:ZooKeeperConnection Watcher:127.0.0.1:31983 got event WatchedEvent state:SyncConnected type:None path:null path:null type:None
   [junit4]   2> 1387331 T3249 oascc.ConnectionManager.waitForConnected Client is connected to ZooKeeper
   [junit4]   2> 1387345 T3249 oascsi.HttpClientUtil.createClient Creating new http client, config:maxConnections=500&maxConnectionsPerHost=16&socketTimeout=120000&connTimeout=15000
   [junit4]   2> 1387355 T3249 oascc.ConnectionManager.waitForConnected Waiting for client to connect to ZooKeeper
   [junit4]   2> 1387357 T3303 oascc.ConnectionManager.process Watcher org.apache.solr.common.cloud.ConnectionManager@612d68bc name:ZooKeeperConnection Watcher:127.0.0.1:31983/solr got event WatchedEvent state:SyncConnected type:None path:null path:null type:None
   [junit4]   2> 1387357 T3249 oascc.ConnectionManager.waitForConnected Client is connected to ZooKeeper
   [junit4]   2> 1387369 T3249 oascc.ZkStateReader.createClusterStateWatchersAndUpdate Updating cluster state from ZooKeeper... 
   [junit4]   2> 1388372 T3249 oasc.ZkController.createEphemeralLiveNode Register node as live in ZooKeeper:/live_nodes/127.0.0.1:31993_wli%2Fwq
   [junit4]   2> 1388376 T3249 oascc.SolrZkClient.makePath makePath: /live_nodes/127.0.0.1:31993_wli%2Fwq
   [junit4]   2> 1388379 T3271 oascc.ZkStateReader$3.process Updating live nodes... (3)
   [junit4]   2> 1388379 T3276 oascc.ZkStateReader$3.process Updating live nodes... (3)
   [junit4]   2> 1388379 T3303 oascc.ZkStateReader$3.process Updating live nodes... (3)
   [junit4]   2> 1388379 T3289 oascc.ZkStateReader$3.process Updating live nodes... (3)
   [junit4]   2> 1388385 T3249 oasc.CorePropertiesLocator.discover Looking for core definitions underneath /usr/home/hudson/hudson-slave/workspace/Lucene-Solr-Tests-4.x-Java6/solr/build/solr-core/test/J0/./org.apache.solr.cloud.CollectionsAPIDistributedZkTest-jetty2-1375341620164
   [junit4]   2> 1388550 T3249 oasc.CorePropertiesLocator.discoverUnder Found core conf in /usr/home/hudson/hudson-slave/workspace/Lucene-Solr-Tests-4.x-Java6/solr/build/solr-core/test/J0/./org.apache.solr.cloud.CollectionsAPIDistributedZkTest-jetty2-1375341620164/conf/
   [junit4]   2> 1388550 T3249 oasc.CorePropertiesLocator.discover Found 1 core definitions
   [junit4]   2> 1388551 T3249 oass.SolrDispatchFilter.init user.dir=/usr/home/hudson/hudson-slave/workspace/Lucene-Solr-Tests-4.x-Java6/solr/build/solr-core/test/J0
   [junit4]   2> 1388551 T3249 oass.SolrDispatchFilter.init SolrDispatchFilter.init() done
   [junit4]   2> 1388552 T3249 oascsi.HttpClientUtil.createClient Creating new http client, config:maxConnections=128&maxConnectionsPerHost=32&followRedirects=false
   [junit4]   2> 1388833 T3249 oejs.Server.doStart jetty-8.1.10.v20130312
   [junit4]   2> 1388837 T3249 oejs.AbstractConnector.doStart Started SocketConnector@127.0.0.1:?????
   [junit4]   2> 1388837 T3249 oass.SolrDispatchFilter.init SolrDispatchFilter.init()
   [junit4]   2> 1388838 T3249 oasc.SolrResourceLoader.locateSolrHome JNDI not configured for solr (NoInitialContextEx)
   [junit4]   2> 1388838 T3249 oasc.SolrResourceLoader.locateSolrHome using system property solr.solr.home: /usr/home/hudson/hudson-slave/workspace/Lucene-Solr-Tests-4.x-Java6/solr/build/solr-core/test/J0/./org.apache.solr.cloud.CollectionsAPIDistributedZkTest-jetty3-1375341621795
   [junit4]   2> 1388839 T3249 oasc.SolrResourceLoader.<init> new SolrResourceLoader for directory: '/usr/home/hudson/hudson-slave/workspace/Lucene-Solr-Tests-4.x-Java6/solr/build/solr-core/test/J0/./org.apache.solr.cloud.CollectionsAPIDistributedZkTest-jetty3-1375341621795/'
   [junit4]   2> 1388877 T3249 oasc.ConfigSolr.fromFile Loading container configuration from /usr/home/hudson/hudson-slave/workspace/Lucene-Solr-Tests-4.x-Java6/solr/build/solr-core/test/J0/./org.apache.solr.cloud.CollectionsAPIDistributedZkTest-jetty3-1375341621795/solr.xml
   [junit4]   2> 1388948 T3249 oasc.ConfigSolrXml.<init> Config-defined core root directory: 
   [junit4]   2> 1388949 T3249 oasc.CoreContainer.<init> New CoreContainer 70297703
   [junit4]   2> 1388949 T3249 oasc.CoreContainer.load Loading cores into CoreContainer [instanceDir=/usr/home/hudson/hudson-slave/workspace/Lucene-Solr-Tests-4.x-Java6/solr/build/solr-core/test/J0/./org.apache.solr.cloud.CollectionsAPIDistributedZkTest-jetty3-1375341621795/]
   [junit4]   2> 1388951 T3249 oashc.HttpShardHandlerFactory.getParameter Setting socketTimeout to: 120000
   [junit4]   2> 1388951 T3249 oashc.HttpShardHandlerFactory.getParameter Setting urlScheme to: http://
   [junit4]   2> 1388952 T3249 oashc.HttpShardHandlerFactory.getParameter Setting connTimeout to: 15000
   [junit4]   2> 1388952 T3249 oashc.HttpShardHandlerFactory.getParameter Setting maxConnectionsPerHost to: 20
   [junit4]   2> 1388953 T3249 oashc.HttpShardHandlerFactory.getParameter Setting corePoolSize to: 0
   [junit4]   2> 1388953 T3249 oashc.HttpShardHandlerFactory.getParameter Setting maximumPoolSize to: 2147483647
   [junit4]   2> 1388954 T3249 oashc.HttpShardHandlerFactory.getParameter Setting maxThreadIdleTime to: 5
   [junit4]   2> 1388954 T3249 oashc.HttpShardHandlerFactory.getParameter Setting sizeOfQueue to: -1
   [junit4]   2> 1388955 T3249 oashc.HttpShardHandlerFactory.getParameter Setting fairnessPolicy to: false
   [junit4]   2> 1388955 T3249 oascsi.HttpClientUtil.createClient Creating new http client, config:maxConnectionsPerHost=20&maxConnections=10000&socketTimeout=120000&connTimeout=15000&retry=false
   [junit4]   2> 1388971 T3249 oasc.ZkContainer.initZooKeeper Zookeeper client=127.0.0.1:31983/solr
   [junit4]   2> 1388972 T3249 oasc.ZkController.checkChrootPath zkHost includes chroot
   [junit4]   2> 1388973 T3249 oascc.ConnectionManager.waitForConnected Waiting for client to connect to ZooKeeper
   [junit4]   2> 1388976 T3315 oascc.ConnectionManager.process Watcher org.apache.solr.common.cloud.ConnectionManager@16800457 name:ZooKeeperConnection Watcher:127.0.0.1:31983 got event WatchedEvent state:SyncConnected type:None path:null path:null type:None
   [junit4]   2> 1388976 T3249 oascc.ConnectionManager.waitForConnected Client is connected to ZooKeeper
   [junit4]   2> 1388978 T3249 oascsi.HttpClientUtil.createClient Creating new http client, config:maxConnections=500&maxConnectionsPerHost=16&socketTimeout=120000&connTimeout=15000
   [junit4]   2> 1388990 T3249 oascc.ConnectionManager.waitForConnected Waiting for client to connect to ZooKeeper
   [junit4]   2> 1388992 T3317 oascc.ConnectionManager.process Watcher org.apache.solr.common.cloud.ConnectionManager@7e44a305 name:ZooKeeperConnection Watcher:127.0.0.1:31983/solr got event WatchedEvent state:SyncConnected type:None path:null path:null type:None
   [junit4]   2> 1388992 T3249 oascc.ConnectionManager.waitForConnected Client is connected to ZooKeeper
   [junit4]   2> 1389004 T3249 oascc.ZkStateReader.createClusterStateWatchersAndUpdate Updating cluster state from ZooKeeper... 
   [junit4]   2> 1390007 T3249 oasc.ZkController.createEphemeralLiveNode Register node as live in ZooKeeper:/live_nodes/127.0.0.1:31998_wli%2Fwq
   [junit4]   2> 1390018 T3249 oascc.SolrZkClient.makePath makePath: /live_nodes/127.0.0.1:31998_wli%2Fwq
   [junit4]   2> 1390021 T3289 oascc.ZkStateReader$3.process Updating live nodes... (4)
   [junit4]   2> 1390021 T3303 oascc.ZkStateReader$3.process Updating live nodes... (4)
   [junit4]   2> 1390021 T3317 oascc.ZkStateReader$3.process Updating live nodes... (4)
   [junit4]   2> 1390021 T3271 oascc.ZkStateReader$3.process Updating live nodes... (4)
   [junit4]   2> 1390021 T3276 oascc.ZkStateReader$3.process Updating live nodes... (4)
   [junit4]   2> 1390039 T3249 oasc.CorePropertiesLocator.discover Looking for core definitions underneath /usr/home/hudson/hudson-slave/workspace/Lucene-Solr-Tests-4.x-Java6/solr/build/solr-core/test/J0/./org.apache.solr.cloud.CollectionsAPIDistributedZkTest-jetty3-1375341621795
   [junit4]   2> 1390041 T3249 oasc.CorePropertiesLocator.discoverUnder Found core conf in /usr/home/hudson/hudson-slave/workspace/Lucene-Solr-Tests-4.x-Java6/solr/build/solr-core/test/J0/./org.apache.solr.cloud.CollectionsAPIDistributedZkTest-jetty3-1375341621795/conf/
   [junit4]   2> 1390235 T3249 oasc.CorePropertiesLocator.discover Found 1 core definitions
   [junit4]   2> 1390235 T3249 oass.SolrDispatchFilter.init user.dir=/usr/home/hudson/hudson-slave/workspace/Lucene-Solr-Tests-4.x-Java6/solr/build/solr-core/test/J0
   [junit4]   2> 1390236 T3249 oass.SolrDispatchFilter.init SolrDispatchFilter.init() done
   [junit4]   2> 1390236 T3249 oascsi.HttpClientUtil.createClient Creating new http client, config:maxConnections=128&maxConnectionsPerHost=32&followRedirects=false
   [junit4]   2> 1390531 T3249 oejs.Server.doStart jetty-8.1.10.v20130312
   [junit4]   2> 1390535 T3249 oejs.AbstractConnector.doStart Started SocketConnector@127.0.0.1:?????
   [junit4]   2> 1390536 T3249 oass.SolrDispatchFilter.init SolrDispatchFilter.init()
   [junit4]   2> 1390536 T3249 oasc.SolrResourceLoader.locateSolrHome JNDI not configured for solr (NoInitialContextEx)
   [junit4]   2> 1390537 T3249 oasc.SolrResourceLoader.locateSolrHome using system property solr.solr.home: /usr/home/hudson/hudson-slave/workspace/Lucene-Solr-Tests-4.x-Java6/solr/build/solr-core/test/J0/./org.apache.solr.cloud.CollectionsAPIDistributedZkTest-jetty4-1375341623480
   [junit4]   2> 1390537 T3249 oasc.SolrResourceLoader.<init> new SolrResourceLoader for directory: '/usr/home/hudson/hudson-slave/workspace/Lucene-Solr-Tests-4.x-Java6/solr/build/solr-core/test/J0/./org.apache.solr.cloud.CollectionsAPIDistributedZkTest-jetty4-1375341623480/'
   [junit4]   2> 1390575 T3249 oasc.ConfigSolr.fromFile Loading container configuration from /usr/home/hudson/hudson-slave/workspace/Lucene-Solr-Tests-4.x-Java6/solr/build/solr-core/test/J0/./org.apache.solr.cloud.CollectionsAPIDistributedZkTest-jetty4-1375341623480/solr.xml
   [junit4]   2> 1390655 T3249 oasc.ConfigSolrXml.<init> Config-defined core root directory: 
   [junit4]   2> 1390656 T3249 oasc.CoreContainer.<init> New CoreContainer 1747134810
   [junit4]   2> 1390656 T3249 oasc.CoreContainer.load Loading cores into CoreContainer [instanceDir=/usr/home/hudson/hudson-slave/workspace/Lucene-Solr-Tests-4.x-Java6/solr/build/solr-core/test/J0/./org.apache.solr.cloud.CollectionsAPIDistributedZkTest-jetty4-1375341623480/]
   [junit4]   2> 1390658 T3249 oashc.HttpShardHandlerFactory.getParameter Setting socketTimeout to: 120000
   [junit4]   2> 1390659 T3249 oashc.HttpShardHandlerFactory.getParameter Setting urlScheme to: http://
   [junit4]   2> 1390659 T3249 oashc.HttpShardHandlerFactory.getParameter Setting connTimeout to: 15000
   [junit4]   2> 1390660 T3249 oashc.HttpShardHandlerFactory.getParameter Setting maxConnectionsPerHost to: 20
   [junit4]   2> 1390660 T3249 oashc.HttpShardHandlerFactory.getParameter Setting corePoolSize to: 0
   [junit4]   2> 1390661 T3249 oashc.HttpShardHandlerFactory.getParameter Setting maximumPoolSize to: 2147483647
   [junit4]   2> 1390661 T3249 oashc.HttpShardHandlerFactory.getParameter Setting maxThreadIdleTime to: 5
   [junit4]   2> 1390661 T3249 oashc.HttpShardHandlerFactory.getParameter Setting sizeOfQueue to: -1
   [junit4]   2> 1390662 T3249 oashc.HttpShardHandlerFactory.getParameter Setting fairnessPolicy to: false
   [junit4]   2> 1390662 T3249 oascsi.HttpClientUtil.createClient Creating new http client, config:maxConnectionsPerHost=20&maxConnections=10000&socketTimeout=120000&connTimeout=15000&retry=false
   [junit4]   2> 1390677 T3249 oasc.ZkContainer.initZooKeeper Zookeeper client=127.0.0.1:31983/solr
   [junit4]   2> 1390678 T3249 oasc.ZkController.checkChrootPath zkHost includes chroot
   [junit4]   2> 1390679 T3249 oascc.ConnectionManager.waitForConnected Waiting for client to connect to ZooKeeper
   [junit4]   2> 1390681 T3329 oascc.ConnectionManager.process Watcher org.apache.solr.common.cloud.ConnectionManager@5c70091f name:ZooKeeperConnection Watcher:127.0.0.1:31983 got event WatchedEvent state:SyncConnected type:None path:null path:null type:None
   [junit4]   2> 1390681 T3249 oascc.ConnectionManager.waitForConnected Client is connected to ZooKeeper
   [junit4]   2> 1390683 T3249 oascsi.HttpClientUtil.createClient Creating new http client, config:maxConnections=500&maxConnectionsPerHost=16&socketTimeout=120000&connTimeout=15000
   [junit4]   2> 1390692 T3249 oascc.ConnectionManager.waitForConnected Waiting for client to connect to ZooKeeper
   [junit4]   2> 1390694 T3331 oascc.ConnectionManager.process Watcher org.apache.solr.common.cloud.ConnectionManager@78f6d18a name:ZooKeeperConnection Watcher:127.0.0.1:31983/solr got event WatchedEvent state:SyncConnected type:None path:null path:null type:None
   [junit4]   2> 1390694 T3249 oascc.ConnectionManager.waitForConnected Client is connected to ZooKeeper
   [junit4]   2> 1390706 T3249 oascc.ZkStateReader.createClusterStateWatchersAndUpdate Updating cluster state from ZooKeeper... 
   [junit4]   2> 1391708 T3249 oasc.ZkController.createEphemeralLiveNode Register node as live in ZooKeeper:/live_nodes/127.0.0.1:32002_wli%2Fwq
   [junit4]   2> 1391710 T3249 oascc.SolrZkClient.makePath makePath: /live_nodes/127.0.0.1:32002_wli%2Fwq
   [junit4]   2> 1391713 T3276 oascc.ZkStateReader$3.process Updating live nodes... (5)
   [junit4]   2> 1391713 T3303 oascc.ZkStateReader$3.process Updating live nodes... (5)
   [junit4]   2> 1391713 T3271 oascc.ZkStateReader$3.process Updating live nodes... (5)
   [junit4]   2> 1391713 T3331 oascc.ZkStateReader$3.process Updating live nodes... (5)
   [junit4]   2> 1391713 T3317 oascc.ZkStateReader$3.process Updating live nodes... (5)
   [junit4]   2> 1391713 T3289 oascc.ZkStateReader$3.process Updating live nodes... (5)
   [junit4]   2> 1391731 T3249 oasc.CorePropertiesLocator.discover Looking for core definitions underneath /usr/home/hudson/hudson-slave/workspace/Lucene-Solr-Tests-4.x-Java6/solr/build/solr-core/test/J0/./org.apache.solr.cloud.CollectionsAPIDistributedZkTest-jetty4-1375341623480
   [junit4]   2> 1391734 T3249 oasc.CorePropertiesLocator.discoverUnder Found core conf in /usr/home/hudson/hudson-slave/workspace/Lucene-Solr-Tests-4.x-Java6/solr/build/solr-core/test/J0/./org.apache.solr.cloud.CollectionsAPIDistributedZkTest-jetty4-1375341623480/conf/
   [junit4]   2> 1391897 T3249 oasc.CorePropertiesLocator.discover Found 1 core definitions
   [junit4]   2> 1391898 T3249 oass.SolrDispatchFilter.init user.dir=/usr/home/hudson/hudson-slave/workspace/Lucene-Solr-Tests-4.x-Java6/solr/build/solr-core/test/J0
   [junit4]   2> 1391898 T3249 oass.SolrDispatchFilter.init SolrDispatchFilter.init() done
   [junit4]   2> 1391899 T3249 oascsi.HttpClientUtil.createClient Creating new http client, config:maxConnections=128&maxConnectionsPerHost=32&followRedirects=false
   [junit4]   2> 1391913 T3249 oascsi.HttpClientUtil.createClient Creating new http client, config:maxConnections=128&maxConnectionsPerHost=32&followRedirects=false
   [junit4]   2> 1391923 T3279 oasha.CollectionsHandler.handleCreateAction Creating Collection : numShards=2&name=nodes_used_collection&replicationFactor=2&action=CREATE&wt=javabin&version=2
   [junit4]   2> 1391925 T3271 oasc.DistributedQueue$LatchChildWatcher.process Watcher fired on path: /overseer/collection-queue-work state: SyncConnected type NodeChildrenChanged
   [junit4]   2> 1391926 T3273 oasc.OverseerCollectionProcessor.run Overseer Collection Processor: Get the message id:/overseer/collection-queue-work/qn-0000000000 message:{
   [junit4]   2> 	  "operation":"createcollection",
   [junit4]   2> 	  "numShards":"2",
   [junit4]   2> 	  "name":"nodes_used_collection",
   [junit4]   2> 	  "replicationFactor":"2"}
   [junit4]   2> 1391927 T3273 oasc.OverseerCollectionProcessor.processMessage WARN OverseerCollectionProcessor.processMessage : createcollection , {
   [junit4]   2> 	  "operation":"createcollection",
   [junit4]   2> 	  "numShards":"2",
   [junit4]   2> 	  "name":"nodes_used_collection",
   [junit4]   2> 	  "replicationFactor":"2"}
   [junit4]   2> 1392527 T3272 oascc.ZkStateReader.updateClusterState Updating cloud state from ZooKeeper... 
   [junit4]   2> 1392528 T3272 oasc.Overseer$ClusterStateUpdater.buildCollection building a new collection: nodes_used_collection
   [junit4]   2> 1392528 T3272 oasc.Overseer$ClusterStateUpdater.createCollection Create collection nodes_used_collection with shards [shard1, shard2]
   [junit4]   2> 1392547 T3331 oascc.ZkStateReader$2.process A cluster state change: WatchedEvent state:SyncConnected type:NodeDataChanged path:/clusterstate.json, has occurred - updating... (live nodes size: 5)
   [junit4]   2> 1392547 T3271 oascc.ZkStateReader$2.process A cluster state change: WatchedEvent state:SyncConnected type:NodeDataChanged path:/clusterstate.json, has occurred - updating... (live nodes size: 5)
   [junit4]   2> 1392547 T3289 oascc.ZkStateReader$2.process A cluster state change: WatchedEvent state:SyncConnected type:NodeDataChanged path:/clusterstate.json, has occurred - updating... (live nodes size: 5)
   [junit4]   2> 1392547 T3303 oascc.ZkStateReader$2.process A cluster state change: WatchedEvent state:SyncConnected type:NodeDataChanged path:/clusterstate.json, has occurred - updating... (live nodes size: 5)
   [junit4]   2> 1392547 T3276 oascc.ZkStateReader$2.process A cluster state change: WatchedEvent state:SyncConnected type:NodeDataChanged path:/clusterstate.json, has occurred - updating... (live nodes size: 5)
   [junit4]   2> 1392547 T3317 oascc.ZkStateReader$2.process A cluster state change: WatchedEvent state:SyncConnected type:NodeDataChanged path:/clusterstate.json, has occurred - updating... (live nodes size: 5)
   [junit4]   2> 1392552 T3273 oasc.OverseerCollectionProcessor.createCollection going to create cores replicas shardNames [shard1, shard2] , repFactor : 2
   [junit4]   2> 1392552 T3273 oasc.OverseerCollectionProcessor.createCollection Creating shard nodes_used_collection_shard1_replica1 as part of slice shard1 of collection nodes_used_collection on 127.0.0.1:31990_wli%2Fwq
   [junit4]   2> 1392552 T3273 oasc.OverseerCollectionProcessor.createCollection Creating shard nodes_used_collection_shard1_replica2 as part of slice shard1 of collection nodes_used_collection on 127.0.0.1:31998_wli%2Fwq
   [junit4]   2> 1392554 T3273 oasc.OverseerCollectionProcessor.createCollection Creating shard nodes_used_collection_shard2_replica1 as part of slice shard2 of collection nodes_used_collection on 127.0.0.1:32002_wli%2Fwq
   [junit4]   2> 1392554 T3273 oasc.OverseerCollectionProcessor.createCollection Creating shard nodes_used_collection_shard2_replica2 as part of slice shard2 of collection nodes_used_collection on 127.0.0.1:31986_wli%2Fwq
   [junit4]   2> 1392557 T3307 oasc.ZkController.publish publishing core=nodes_used_collection_shard1_replica2 state=down
   [junit4]   2> 1392557 T3321 oasc.ZkController.publish publishing core=nodes_used_collection_shard2_replica1 state=down
   [junit4]   2> 1392557 T3280 oasc.ZkController.publish publishing core=nodes_used_collection_shard1_replica1 state=down
   [junit4]   2> 1392557 T3261 oasc.ZkController.publish publishing core=nodes_used_collection_shard2_replica2 state=down
   [junit4]   2> 1392558 T3307 oasc.ZkController.waitForCoreNodeName look for our core node name
   [junit4]   2> 1392559 T3321 oasc.ZkController.waitForCoreNodeName look for our core node name
   [junit4]   2> 1392559 T3280 oasc.ZkController.waitForCoreNodeName look for our core node name
   [junit4]   2> 1392560 T3261 oasc.ZkController.waitForCoreNodeName look for our core node name
   [junit4]   2> 1394052 T3272 oascc.ZkStateReader.updateClusterState Updating cloud state from ZooKeeper... 
   [junit4]   2> 1394053 T3272 oasc.Overseer$ClusterStateUpdater.updateState WARN Could not find collection node for nodes_used_collection, skipping publish state
   [junit4]   2> 1394053 T3272 oasc.Overseer$ClusterStateUpdater.updateState Update state numShards=2 message={
   [junit4]   2> 	  "operation":"state",
   [junit4]   2> 	  "core_node_name":"core_node1",
   [junit4]   2> 	  "numShards":"2",
   [junit4]   2> 	  "shard":"shard1",
   [junit4]   2> 	  "roles":null,
   [junit4]   2> 	  "state":"down",
   [junit4]   2> 	  "shard_state":"active",
   [junit4]   2> 	  "core":"nodes_used_collection_shard1_replica2",
   [junit4]   2> 	  "collection":"nodes_used_collection",
   [junit4]   2> 	  "shard_range":null,
   [junit4]   2> 	  "node_name":"127.0.0.1:31998_wli%2Fwq",
   [junit4]   2> 	  "base_url":"http://127.0.0.1:31998/wli/wq"}
   [junit4]   2> 1394057 T3272 oasc.Overseer$ClusterStateUpdater.updateState WARN Could not find collection node for nodes_used_collection, skipping publish state
   [junit4]   2> 1394057 T3272 oasc.Overseer$ClusterStateUpdater.updateState Update state numShards=2 message={
   [junit4]   2> 	  "operation":"state",
   [junit4]   2> 	  "core_node_name":"core_node2",
   [junit4]   2> 	  "numShards":"2",
   [junit4]   2> 	  "shard":"shard2",
   [junit4]   2> 	  "roles":null,
   [junit4]   2> 	  "state":"down",
   [junit4]   2> 	  "shard_state":"active",
   [junit4]   2> 	  "core":"nodes_used_collection_shard2_replica1",
   [junit4]   2> 	  "collection":"nodes_used_collection",
   [junit4]   2> 	  "shard_range":null,
   [junit4]   2> 	  "node_name":"127.0.0.1:32002_wli%2Fwq",
   [junit4]   2> 	  "base_url":"http://127.0.0.1:32002/wli/wq"}
   [junit4]   2> 1394072 T3272 oasc.Overseer$ClusterStateUpdater.updateState WARN Could not find collection node for nodes_used_collection, skipping publish state
   [junit4]   2> 1394073 T3272 oasc.Overseer$ClusterStateUpdater.updateState Update state numShards=2 message={
   [junit4]   2> 	  "operation":"state",
   [junit4]   2> 	  "core_node_name":"core_node3",
   [junit4]   2> 	  "numShards":"2",
   [junit4]   2> 	  "shard":"shard1",
   [junit4]   2> 	  "roles":null,
   [junit4]   2> 	  "state":"down",
   [junit4]   2> 	  "shard_state":"active",
   [junit4]   2> 	  "core":"nodes_used_collection_shard1_replica1",
   [junit4]   2> 	  "collection":"nodes_used_collection",
   [junit4]   2> 	  "shard_range":null,
   [junit4]   2> 	  "node_name":"127.0.0.1:31990_wli%2Fwq",
   [junit4]   2> 	  "base_url":"http://127.0.0.1:31990/wli/wq"}
   [junit4]   2> 1394076 T3272 oasc.Overseer$ClusterStateUpdater.updateState WARN Could not find collection node for nodes_used_collection, skipping publish state
   [junit4]   2> 1394076 T3272 oasc.Overseer$ClusterStateUpdater.updateState Update state numShards=2 message={
   [junit4]   2> 	  "operation":"state",
   [junit4]   2> 	  "core_node_name":"core_node4",
   [junit4]   2> 	  "numShards":"2",
   [junit4]   2> 	  "shard":"shard2",
   [junit4]   2> 	  "roles":null,
   [junit4]   2> 	  "state":"down",
   [junit4]   2> 	  "shard_state":"active",
   [junit4]   2> 	  "core":"nodes_used_collection_shard2_replica2",
   [junit4]   2> 	  "collection":"nodes_used_collection",
   [junit4]   2> 	  "shard_range":null,
   [junit4]   2> 	  "node_name":"127.0.0.1:31986_wli%2Fwq",
   [junit4]   2> 	  "base_url":"http://127.0.0.1:31986/wli/wq"}
   [junit4]   2> 1394080 T3331 oascc.ZkStateReader$2.process A cluster state change: WatchedEvent state:SyncConnected type:NodeDataChanged path:/clusterstate.json, has occurred - updating... (live nodes size: 5)
   [junit4]   2> 1394080 T3271 oascc.ZkStateReader$2.process A cluster state change: WatchedEvent state:SyncConnected type:NodeDataChanged path:/clusterstate.json, has occurred - updating... (live nodes size: 5)
   [junit4]   2> 1394080 T3289 oascc.ZkStateReader$2.process A cluster state change: WatchedEvent state:SyncConnected type:NodeDataChanged path:/clusterstate.json, has occurred - updating... (live nodes size: 5)
   [junit4]   2> 1394080 T3303 oascc.ZkStateReader$2.process A cluster state change: WatchedEvent state:SyncConnected type:NodeDataChanged path:/clusterstate.json, has occurred - updating... (live nodes size: 5)
   [junit4]   2> 1394080 T3276 oascc.ZkStateReader$2.process A cluster state change: WatchedEvent state:SyncConnected type:NodeDataChanged path:/clusterstate.json, has occurred - updating... (live nodes size: 5)
   [junit4]   2> 1394080 T3317 oascc.ZkStateReader$2.process A cluster state change: WatchedEvent state:SyncConnected type:NodeDataChanged path:/clusterstate.json, has occurred - updating... (live nodes size: 5)
   [junit4]   2> 1394561 T3321 oasc.ZkController.waitForShardId waiting to find shard id in clusterstate for nodes_used_collection_shard2_replica1
   [junit4]   2> 1394561 T3307 oasc.ZkController.waitForShardId waiting to find shard id in clusterstate for nodes_used_collection_shard1_replica2
   [junit4]   2> 1394561 T3280 oasc.ZkController.waitForShardId waiting to find shard id in clusterstate for nodes_used_collection_shard1_replica1
   [junit4]   2> 1394562 T3261 oasc.ZkController.waitForShardId waiting to find shard id in clusterstate for nodes_used_collection_shard2_replica2
   [junit4]   2> 1394562 T3307 oasc.CorePropertiesLocator.writePropertiesFile ERROR Couldn't persist core properties to /usr/home/hudson/hudson-slave/workspace/Lucene-Solr-Tests-4.x-Java6/solr/build/solr-core/test/J0/./org.apache.solr.cloud.CollectionsAPIDistributedZkTest-jetty3-1375341621795/nodes_used_collection_shard1_replica2/core.properties: java.io.FileNotFoundException: /usr/home/hudson/hudson-slave/workspace/Lucene-Solr-Tests-4.x-Java6/solr/build/solr-core/test/J0/./org.apache.solr.cloud.CollectionsAPIDistributedZkTest-jetty3-1375341621795/nodes_used_collection_shard1_replica2/core.properties (No such file or directory)
   [junit4]   2> 1394563 T3280 oasc.CorePropertiesLocator.writePropertiesFile ERROR Couldn't persist core properties to /usr/home/hudson/hudson-slave/workspace/Lucene-Solr-Tests-4.x-Java6/solr/build/solr-core/test/J0/./org.apache.solr.cloud.CollectionsAPIDistributedZkTest-jetty1-1375341618451/nodes_used_collection_shard1_replica1/core.properties: java.io.FileNotFoundException: /usr/home/hudson/hudson-slave/workspace/Lucene-Solr-Tests-4.x-Java6/solr/build/solr-core/test/J0/./org.apache.solr.cloud.CollectionsAPIDistributedZkTest-jetty1-1375341618451/nodes_used_collection_shard1_replica1/core.properties (No such file or directory)
   [junit4]   2> 1394562 T3321 oasc.CorePropertiesLocator.writePropertiesFile ERROR Couldn't persist core properties to /usr/home/hudson/hudson-slave/workspace/Lucene-Solr-Tests-4.x-Java6/solr/build/solr-core/test/J0/./org.apache.solr.cloud.CollectionsAPIDistributedZkTest-jetty4-1375341623480/nodes_used_collection_shard2_replica1/core.properties: java.io.FileNotFoundException: /usr/home/hudson/hudson-slave/workspace/Lucene-Solr-Tests-4.x-Java6/solr/build/solr-core/test/J0/./org.apache.solr.cloud.CollectionsAPIDistributedZkTest-jetty4-1375341623480/nodes_used_collection_shard2_replica1/core.properties (No such file or directory)
   [junit4]   2> 1394563 T3280 oasc.CoreContainer.create Creating SolrCore 'nodes_used_collection_shard1_replica1' using instanceDir: /usr/home/hudson/hudson-slave/workspace/Lucene-Solr-Tests-4.x-Java6/solr/build/solr-core/test/J0/./org.apache.solr.cloud.CollectionsAPIDistributedZkTest-jetty1-1375341618451/nodes_used_collection_shard1_replica1
   [junit4]   2> 1394564 T3280 oasc.ZkController.createCollectionZkNode Check for collection zkNode:nodes_used_collection
   [junit4]   2> 1394563 T3261 oasc.CorePropertiesLocator.writePropertiesFile ERROR Couldn't persist core properties to /usr/home/hudson/hudson-slave/workspace/Lucene-Solr-Tests-4.x-Java6/solr/build/solr-core/test/J0/./org.apache.solr.cloud.CollectionsAPIDistributedZkTest-controljetty-1375341617723/nodes_used_collection_shard2_replica2/core.properties: java.io.FileNotFoundException: /usr/home/hudson/hudson-slave/workspace/Lucene-Solr-Tests-4.x-Java6/solr/build/solr-core/test/J0/./org.apache.solr.cloud.CollectionsAPIDistributedZkTest-controljetty-1375341617723/nodes_used_collection_shard2_replica2/core.properties (No such file or directory)
   [junit4]   2> 1394563 T3307 oasc.CoreContainer.create Creating SolrCore 'nodes_used_collection_shard1_replica2' using instanceDir: /usr/home/hudson/hudson-slave/workspace/Lucene-Solr-Tests-4.x-Java6/solr/build/solr-core/test/J0/./org.apache.solr.cloud.CollectionsAPIDistributedZkTest-jetty3-1375341621795/nodes_used_collection_shard1_replica2
   [junit4]   2> 1394565 T3280 oasc.ZkController.createCollectionZkNode Creating collection in ZooKeeper:nodes_used_collection
   [junit4]   2> 1394565 T3261 oasc.CoreContainer.create Creating SolrCore 'nodes_used_collection_shard2_replica2' using instanceDir: /usr/home/hudson/hudson-slave/workspace/Lucene-Solr-Tests-4.x-Java6/solr/build/solr-core/test/J0/./org.apache.solr.cloud.CollectionsAPIDistributedZkTest-controljetty-1375341617723/nodes_used_collection_shard2_replica2
   [junit4]   2> 1394564 T3321 oasc.CoreContainer.create Creating SolrCore 'nodes_used_collection_shard2_replica1' using instanceDir: /usr/home/hudson/hudson-slave/workspace/Lucene-Solr-Tests-4.x-Java6/solr/build/solr-core/test/J0/./org.apache.solr.cloud.CollectionsAPIDistributedZkTest-jetty4-1375341623480/nodes_used_collection_shard2_replica1
   [junit4]   2> 1394566 T3261 oasc.ZkController.createCollectionZkNode Check for collection zkNode:nodes_used_collection
   [junit4]   2> 1394566 T3280 oasc.ZkController.getConfName Looking for collection configName
   [junit4]   2> 1394565 T3307 oasc.ZkController.createCollectionZkNode Check for collection zkNode:nodes_used_collection
   [junit4]   2> 1394567 T3261 oasc.ZkController.createCollectionZkNode Creating collection in ZooKeeper:nodes_used_collection
   [junit4]   2> 1394566 T3321 oasc.ZkController.createCollectionZkNode Check for collection zkNode:nodes_used_collection
   [junit4]   2> 1394568 T3261 oasc.ZkController.getConfName Looking for collection configName
   [junit4]   2> 1394569 T3321 oasc.ZkController.createCollectionZkNode Creating collection in ZooKeeper:nodes_used_collection
   [junit4]   2> 1394568 T3307 oasc.ZkController.createCollectionZkNode Creating collection in ZooKeeper:nodes_used_collection
   [junit4]   2> 1394569 T3261 oasc.ZkController.getConfName Only one config set found in zk - using it:conf1
   [junit4]   2> 1394568 T3280 oasc.ZkController.getConfName Only one config set found in zk - using it:conf1
   [junit4]   2> 1394570 T3261 oascc.SolrZkClient.makePath makePath: /collections/nodes_used_collection
   [junit4]   2> 1394569 T3307 oasc.ZkController.getConfName Looking for collection configName
   [junit4]   2> 1394569 T3321 oasc.ZkController.getConfName Looking for collection configName
   [junit4]   2> 1394570 T3280 oascc.SolrZkClient.makePath makePath: /collections/nodes_used_collection
   [junit4]   2> 1394571 T3307 oasc.ZkController.getConfName Only one config set found in zk - using it:conf1
   [junit4]   2> 1394572 T3307 oascc.SolrZkClient.makePath makePath: /collections/nodes_used_collection
   [junit4]   2> 1394572 T3321 oasc.ZkController.getConfName Only one config set found in zk - using it:conf1
   [junit4]   2> 1394573 T3261 oasc.ZkController.readConfigName Load collection config from:/collections/nodes_used_collection
   [junit4]   2> 1394573 T3321 oascc.SolrZkClient.makePath makePath: /collections/nodes_used_collection
   [junit4]   2> 1394574 T3280 oasc.ZkController.readConfigName Load collection config from:/collections/nodes_used_collection
   [junit4]   2> 1394584 T3307 oasc.ZkController.readConfigName Load collection config from:/collections/nodes_used_collection
   [junit4]   2> 1394584 T3261 oasc.SolrResourceLoader.<init> new SolrResourceLoader for directory: '/usr/home/hudson/hudson-slave/workspace/Lucene-Solr-Tests-4.x-Java6/solr/build/solr-core/test/J0/./org.apache.solr.cloud.CollectionsAPIDistributedZkTest-controljetty-1375341617723/nodes_used_collection_shard2_replica2/'
   [junit4]   2> 1394584 T3280 oasc.SolrResourceLoader.<init> new SolrResourceLoader for directory: '/usr/home/hudson/hudson-slave/workspace/Lucene-Solr-Tests-4.x-Java6/solr/build/solr-core/test/J0/./org.apache.solr.cloud.CollectionsAPIDistributedZkTest-jetty1-1375341618451/nodes_used_collection_shard1_replica1/'
   [junit4]   2> 1394585 T3321 oasc.ZkController.readConfigName Load collection config from:/collections/nodes_used_collection
   [junit4]   2> 1394585 T3307 oasc.SolrResourceLoader.<init> new SolrResourceLoader for directory: '/usr/home/hudson/hudson-slave/workspace/Lucene-Solr-Tests-4.x-Java6/solr/build/solr-core/test/J0/./org.apache.solr.cloud.CollectionsAPIDistributedZkTest-jetty3-1375341621795/nodes_used_collection_shard1_replica2/'
   [junit4]   2> 1394586 T3321 oasc.SolrResourceLoader.<init> new SolrResourceLoader for directory: '/usr/home/hudson/hudson-slave/workspace/Lucene-Solr-Tests-4.x-Java6/solr/build/solr-core/test/J0/./org.apache.solr.cloud.CollectionsAPIDistributedZkTest-jetty4-1375341623480/nodes_used_collection_shard2_replica1/'
   [junit4]   2> 1394702 T3307 oasc.SolrConfig.<init> Using Lucene MatchVersion: LUCENE_45
   [junit4]   2> 1394702 T3280 oasc.SolrConfig.<init> Using Lucene MatchVersion: LUCENE_45
   [junit4]   2> 1394702 T3261 oasc.SolrConfig.<init> Using Lucene MatchVersion: LUCENE_45
   [junit4]   2> 1394702 T3321 oasc.SolrConfig.<init> Using Lucene MatchVersion: LUCENE_45
   [junit4]   2> 1394783 T3307 oasc.SolrConfig.<init> Loaded SolrConfig: solrconfig.xml
   [junit4]   2> 1394784 T3280 oasc.SolrConfig.<init> Loaded SolrConfig: solrconfig.xml
   [junit4]   2> 1394784 T3261 oasc.SolrConfig.<init> Loaded SolrConfig: solrconfig.xml
   [junit4]   2> 1394785 T3321 oasc.SolrConfig.<init> Loaded SolrConfig: solrconfig.xml
   [junit4]   2> 1394885 T3307 oass.IndexSchema.readSchema Reading Solr Schema from schema.xml
   [junit4]   2> 1394886 T3280 oass.IndexSchema.readSchema Reading Solr Schema from schema.xml
   [junit4]   2> 1394886 T3321 oass.IndexSchema.readSchema Reading Solr Schema from schema.xml
   [junit4]   2> 1394886 T3261 oass.IndexSchema.readSchema Reading Solr Schema from schema.xml
   [junit4]   2> 1394896 T3307 oass.IndexSchema.readSchema [nodes_used_collection_shard1_replica2] Schema name=test
   [junit4]   2> 1394897 T3280 oass.IndexSchema.readSchema [nodes_used_collection_shard1_replica1] Schema name=test
   [junit4]   2> 1394898 T3261 oass.IndexSchema.readSchema [nodes_used_collection_shard2_replica2] Schema name=test
   [junit4]   2> 1394898 T3321 oass.IndexSchema.readSchema [nodes_used_collection_shard2_replica1] Schema name=test
   [junit4]   2> 1395687 T3321 oass.ByteField.init WARN ByteField is deprecated and will be removed in 5.0. You should use TrieIntField instead.
   [junit4]   2> 1395688 T3321 oass.ShortField.init WARN ShortField is deprecated and will be removed in 5.0. You should use TrieIntField instead.
   [junit4]   2> 1395689 T3307 oass.ByteField.init WARN ByteField is deprecated and will be removed in 5.0. You should use TrieIntField instead.
   [junit4]   2> 1395689 T3280 oass.ByteField.init WARN ByteField is deprecated and will be removed in 5.0. You should use TrieIntField instead.
   [junit4]   2> 1395689 T3321 oass.OpenExchangeRatesOrgProvider.init Initialized with rates=open-exchange-rates.json, refreshInterval=1440.
   [junit4]   2> 1395690 T3280 oass.ShortField.init WARN ShortField is deprecated and will be removed in 5.0. You should use TrieIntField instead.
   [junit4]   2> 1395690 T3307 oass.ShortField.init WARN ShortField is deprecated and will be removed in 5.0. You should use TrieIntField instead.
   [junit4]   2> 1395691 T3280 oass.OpenExchangeRatesOrgProvider.init Initialized with rates=open-exchange-rates.json, refreshInterval=1440.
   [junit4]   2> 1395692 T3307 oass.OpenExchangeRatesOrgProvider.init Initialized with rates=open-exchange-rates.json, refreshInterval=1440.
   [junit4]   2> 1395696 T3261 oass.ByteField.init WARN ByteField is deprecated and will be removed in 5.0. You should use TrieIntField instead.
   [junit4]   2> 1395697 T3261 oass.ShortField.init WARN ShortField is deprecated and will be removed in 5.0. You should use TrieIntField instead.
   [junit4]   2> 1395701 T3261 oass.OpenExchangeRatesOrgProvider.init Initialized with rates=open-exchange-rates.json, refreshInterval=1440.
   [junit4]   2> 1395703 T3321 oass.IndexSchema.readSchema default search field in schema is text
   [junit4]   2> 1395705 T3307 oass.IndexSchema.readSchema default search field in schema is text
   [junit4]   2> 1395705 T3280 oass.IndexSchema.readSchema default search field in schema is text
   [junit4]   2> 1395708 T3321 oass.IndexSchema.readSchema unique key field: id
   [junit4]   2> 1395710 T3261 oass.IndexSchema.readSchema default search field in schema is text
   [junit4]   2> 1395710 T3307 oass.IndexSchema.readSchema unique key field: id
   [junit4]   2> 1395711 T3280 oass.IndexSchema.readSchema unique key field: id
   [junit4]   2> 1395715 T3261 oass.IndexSchema.readSchema unique key field: id
   [junit4]   2> 1395724 T3321 oass.FileExchangeRateProvider.reload Reloading exchange rates from file currency.xml
   [junit4]   2> 1395726 T3307 oass.FileExchangeRateProvider.reload Reloading exchange rates from file currency.xml
   [junit4]   2> 1395727 T3280 oass.FileExchangeRateProvider.reload Reloading exchange rates from file currency.xml
   [junit4]   2> 1395730 T3261 oass.FileExchangeRateProvider.reload Reloading exchange rates from file currency.xml
   [junit4]   2> 1395730 T3321 oass.FileExchangeRateProvider.reload Reloading exchange rates from file currency.xml
   [junit4]   2> 1395731 T3307 oass.FileExchangeRateProvider.reload Reloading exchange rates from file currency.xml
   [junit4]   2> 1395732 T3280 oass.FileExchangeRateProvider.reload Reloading exchange rates from file currency.xml
   [junit4]   2> 1395735 T3261 oass.FileExchangeRateProvider.reload Reloading exchange rates from file currency.xml
   [junit4]   2> 1395735 T3321 oass.OpenExchangeRatesOrgProvider.reload Reloading exchange rates from open-exchange-rates.json
   [junit4]   2> 1395736 T3307 oass.OpenExchangeRatesOrgProvider.reload Reloading exchange rates from open-exchange-rates.json
   [junit4]   2> 1395736 T3321 oass.OpenExchangeRatesOrgProvider$OpenExchangeRates.<init> WARN Unknown key IMPORTANT NOTE
   [junit4]   2> 1395737 T3280 oass.OpenExchangeRatesOrgProvider.reload Reloading exchange rates from open-exchange-rates.json
   [junit4]   2> 1395737 T3307 oass.OpenExchangeRatesOrgProvider$OpenExchangeRates.<init> WARN Unknown key IMPORTANT NOTE
   [junit4]   2> 1395738 T3307 oass.OpenExchangeRatesOrgProvider$OpenExchangeRates.<init> WARN Expected key, got STRING
   [junit4]   2> 1395738 T3280 oass.OpenExchangeRatesOrgProvider$OpenExchangeRates.<init> WARN Unknown key IMPORTANT NOTE
   [junit4]   2> 1395737 T3321 oass.OpenExchangeRatesOrgProvider$OpenExchangeRates.<init> WARN Expected key, got STRING
   [junit4]   2> 1395738 T3280 oass.OpenExchangeRatesOrgProvider$OpenExchangeRates.<init> WARN Expected key, got STRING
   [junit4]   2> 1395738 T3307 oass.OpenExchangeRatesOrgProvider.reload Reloading exchange rates from open-exchange-rates.json
   [junit4]   2> 1395739 T3280 oass.OpenExchangeRatesOrgProvider.reload Reloading exchange rates from open-exchange-rates.json
   [junit4]   2> 1395739 T3321 oass.OpenExchangeRatesOrgProvider.reload Reloading exchange rates from open-exchange-rates.json
   [junit4]   2> 1395740 T3307 oass.OpenExchangeRatesOrgProvider$OpenExchangeRates.<init> WARN Unknown key IMPORTANT NOTE
   [junit4]   2> 1395741 T3280 oass.OpenExchangeRatesOrgProvider$OpenExchangeRates.<init> WARN Unknown key IMPORTANT NOTE
   [junit4]   2> 1395741 T3280 oass.OpenExchangeRatesOrgProvider$OpenExchangeRates.<init> WARN Expected key, got STRING
   [junit4]   2> 1395740 T3261 oass.OpenExchangeRatesOrgProvider.reload Reloading exchange rates from open-exchange-rates.json
   [junit4]   2> 1395742 T3280 oasc.SolrCore.initDirectoryFactory org.apache.solr.core.MockDirectoryFactory
   [junit4]   2> 1395741 T3321 oass.OpenExchangeRatesOrgProvider$OpenExchangeRates.<init> WARN Unknown key IMPORTANT NOTE
   [junit4]   2> 1395743 T3261 oass.OpenExchangeRatesOrgProvider$OpenExchangeRates.<init> WARN Unknown key IMPORTANT NOTE
   [junit4]   2> 1395743 T3261 oass.OpenExchangeRatesOrgProvider$OpenExchangeRates.<init> WARN Expected key, got STRING
   [junit4]   2> 1395741 T3307 oass.OpenExchangeRatesOrgProvider$OpenExchangeRates.<init> WARN Expected key, got STRING
   [junit4]   2> 1395744 T3261 oass.OpenExchangeRatesOrgProvider.reload Reloading exchange rates from open-exchange-rates.json
   [junit4]   2> 1395743 T3321 oass.OpenExchangeRatesOrgProvider$OpenExchangeRates.<init> WARN Expected key, got STRING
   [junit4]   2> 1395743 T3280 oasc.SolrCore.<init> [nodes_used_collection_shard1_replica1] Opening new SolrCore at /usr/home/hudson/hudson-slave/workspace/Lucene-Solr-Tests-4.x-Java6/solr/build/solr-core/test/J0/./org.apache.solr.cloud.CollectionsAPIDistributedZkTest-jetty1-1375341618451/nodes_used_collection_shard1_replica1/, dataDir=/usr/home/hudson/hudson-slave/workspace/Lucene-Solr-Tests-4.x-Java6/solr/build/solr-core/test/J0/./org.apache.solr.cloud.CollectionsAPIDistributedZkTest-jetty1-1375341618451//nodes_used_collection_shard1_replica1/data/
   [junit4]   2> 1395745 T3261 oass.OpenExchangeRatesOrgProvider$OpenExchangeRates.<init> WARN Unknown key IMPORTANT NOTE
   [junit4]   2> 1395746 T3261 oass.OpenExchangeRatesOrgProvider$OpenExchangeRates.<init> WARN Expected key, got STRING
   [junit4]   2> 1395745 T3321 oasc.SolrCore.initDirectoryFactory org.apache.solr.core.MockDirectoryFactory
   [junit4]   2> 1395744 T3307 oasc.SolrCore.initDirectoryFactory org.apache.solr.core.MockDirectoryFactory
   [junit4]   2> 1395747 T3321 oasc.SolrCore.<init> [nodes_used_collection_shard2_replica1] Opening new SolrCore at /usr/home/hudson/hudson-slave/workspace/Lucene-Solr-Tests-4.x-Java6/solr/build/solr-core/test/J0/./org.apache.solr.cloud.CollectionsAPIDistributedZkTest-jetty4-1375341623480/nodes_used_collection_shard2_replica1/, dataDir=/usr/home/hudson/hudson-slave/workspace/Lucene-Solr-Tests-4.x-Java6/solr/build/solr-core/test/J0/./org.apache.solr.cloud.CollectionsAPIDistributedZkTest-jetty4-1375341623480//nodes_used_collection_shard2_replica1/data/
   [junit4]   2> 1395746 T3261 oasc.SolrCore.initDirectoryFactory org.apache.solr.core.MockDirectoryFactory
   [junit4]   2> 1395745 T3280 oasc.JmxMonitoredMap.<init> JMX monitoring is enabled. Adding Solr mbeans to JMX Server: com.sun.jmx.mbeanserver.JmxMBeanServer@7446a09b
   [junit4]   2> 1395748 T3261 oasc.SolrCore.<init> [nodes_used_collection_shard2_replica2] Opening new SolrCore at /usr/home/hudson/hudson-slave/workspace/Lucene-Solr-Tests-4.x-Java6/solr/build/solr-core/test/J0/./org.apache.solr.cloud.CollectionsAPIDistributedZkTest-controljetty-1375341617723/nodes_used_collection_shard2_replica2/, dataDir=/usr/home/hudson/hudson-slave/workspace/Lucene-Solr-Tests-4.x-Java6/solr/build/solr-core/test/J0/./org.apache.solr.cloud.CollectionsAPIDistributedZkTest-controljetty-1375341617723//nodes_used_collection_shard2_replica2/data/
   [junit4]   2> 1395747 T3321 oasc.JmxMonitoredMap.<init> JMX monitoring is enabled. Adding Solr mbeans to JMX Server: com.sun.jmx.mbeanserver.JmxMBeanServer@7446a09b
   [junit4]   2> 1395747 T3307 oasc.SolrCore.<init> [nodes_used_collection_shard1_replica2] Opening new SolrCore at /usr/home/hudson/hudson-slave/workspace/Lucene-Solr-Tests-4.x-Java6/solr/build/solr-core/test/J0/./org.apache.solr.cloud.CollectionsAPIDistributedZkTest-jetty3-1375341621795/nodes_used_collection_shard1_replica2/, dataDir=/usr/home/hudson/hudson-slave/workspace/Lucene-Solr-Tests-4.x-Java6/solr/build/solr-core/test/J0/./org.apache.solr.cloud.CollectionsAPIDistributedZkTest-jetty3-1375341621795//nodes_used_collection_shard1_replica2/data/
   [junit4]   2> 1395749 T3280 oasc.CachingDirectoryFactory.get return new directory for /usr/home/hudson/hudson-slave/workspace/Lucene-Solr-Tests-4.x-Java6/solr/build/solr-core/test/J0/./org.apache.solr.cloud.CollectionsAPIDistributedZkTest-jetty1-1375341618451//nodes_used_collection_shard1_replica1/data
   [junit4]   2> 1395749 T3321 oasc.CachingDirectoryFactory.get return new directory for /usr/home/hudson/hudson-slave/workspace/Lucene-Solr-Tests-4.x-Java6/solr/build/solr-core/test/J0/./org.apache.solr.cloud.CollectionsAPIDistributedZkTest-jetty4-1375341623480//nodes_used_collection_shard2_replica1/data
   [junit4]   2> 1395748 T3261 oasc.JmxMonitoredMap.<init> JMX monitoring is enabled. Adding Solr mbeans to JMX Server: com.sun.jmx.mbeanserver.JmxMBeanServer@7446a09b
   [junit4]   2> 1395750 T3321 oasc.SolrCore.getNewIndexDir New index directory detected: old=null new=/usr/home/hudson/hudson-slave/workspace/Lucene-Solr-Tests-4.x-Java6/solr/build/solr-core/test/J0/./org.apache.solr.cloud.CollectionsAPIDistributedZkTest-jetty4-1375341623480//nodes_used_collection_shard2_replica1/data/index/
   [junit4]   2> 1395750 T3280 oasc.SolrCore.getNewIndexDir New index directory detected: old=null new=/usr/home/hudson/hudson-slave/workspace/Lucene-Solr-Tests-4.x-Java6/solr/build/solr-core/test/J0/./org.apache.solr.cloud.CollectionsAPIDistributedZkTest-jetty1-1375341618451//nodes_used_collection_shard1_replica1/data/index/
   [junit4]   2> 1395749 T3307 oasc.JmxMonitoredMap.<init> JMX monitoring is enabled. Adding Solr mbeans to JMX Server: com.sun.jmx.mbeanserver.JmxMBeanServer@7446a09b
   [junit4]   2> 1395751 T3280 oasc.SolrCore.initIndex WARN [nodes_used_collection_shard1_replica1] Solr index directory '/usr/home/hudson/hudson-slave/workspace/Lucene-Solr-Tests-4.x-Java6/solr/build/solr-core/test/J0/./org.apache.solr.cloud.CollectionsAPIDistributedZkTest-jetty1-1375341618451/nodes_used_collection_shard1_replica1/data/index' doesn't exist. Creating new index...
   [junit4]   2> 1395751 T3261 oasc.CachingDirectoryFactory.get return new directory for /usr/home/hudson/hudson-slave/workspace/Lucene-Solr-Tests-4.x-Java6/solr/build/solr-core/test/J0/./org.apache.solr.cloud.CollectionsAPIDistributedZkTest-controljetty-1375341617723//nodes_used_collection_shard2_replica2/data
   [junit4]   2> 1395751 T3321 oasc.SolrCore.initIndex WARN [nodes_used_collection_shard2_replica1] Solr index directory '/usr/home/hudson/hudson-slave/workspace/Lucene-Solr-Tests-4.x-Java6/solr/build/solr-core/test/J0/./org.apache.solr.cloud.CollectionsAPIDistributedZkTest-jetty4-1375341623480/nodes_used_collection_shard2_replica1/data/index' doesn't exist. Creating new index...
   [junit4]   2> 1395752 T3280 oasc.CachingDirectoryFactory.get return new directory for /usr/home/hudson/hudson-slave/workspace/Lucene-Solr-Tests-4.x-Java6/solr/build/solr-core/test/J0/./org.apache.solr.cloud.CollectionsAPIDistributedZkTest-jetty1-1375341618451//nodes_used_collection_shard1_replica1/data/index
   [junit4]   2> 1395752 T3261 oasc.SolrCore.getNewIndexDir New index directory detected: old=null new=/usr/home/hudson/hudson-slave/workspace/Lucene-Solr-Tests-4.x-Java6/solr/build/solr-core/test/J0/./org.apache.solr.cloud.CollectionsAPIDistributedZkTest-controljetty-1375341617723//nodes_used_collection_shard2_replica2/data/index/
   [junit4]   2> 1395752 T3307 oasc.CachingDirectoryFactory.get return new directory for /usr/home/hudson/hudson-slave/workspace/Lucene-Solr-Tests-4.x-Java6/solr/build/solr-core/test/J0/./org.apache.solr.cloud.CollectionsAPIDistributedZkTest-jetty3-1375341621795//nodes_used_collection_shard1_replica2/data
   [junit4]   2> 1395754 T3261 oasc.SolrCore.initIndex WARN [nodes_used_collection_shard2_replica2] Solr index directory '/usr/home/hudson/hudson-slave/workspace/Lucene-Solr-Tests-4.x-Java6/solr/build/solr-core/test/J0/./org.apache.solr.cloud.CollectionsAPIDistributedZkTest-controljetty-1375341617723/nodes_used_collection_shard2_replica2/data/index' doesn't exist. Creating new index...
   [junit4]   2> 1395753 T3321 oasc.CachingDirectoryFactory.get return new directory for /usr/home/hudson/hudson-slave/workspace/Lucene-Solr-Tests-4.x-Java6/solr/build/solr-core/test/J0/./org.apache.solr.cloud.CollectionsAPIDistributedZkTest-jetty4-1375341623480//nodes_used_collection_shard2_replica1/data/index
   [junit4]   2> 1395755 T3261 oasc.CachingDirectoryFactory.get return new directory for /usr/home/hudson/hudson-slave/workspace/Lucene-Solr-Tests-4.x-Java6/solr/build/solr-core/test/J0/./org.apache.solr.cloud.CollectionsAPIDistributedZkTest-controljetty-1375341617723//nodes_used_collection_shard2_replica2/data/index
   [junit4]   2> 1395754 T3307 oasc.SolrCore.getNewIndexDir New index directory detected: old=null new=/usr/home/hudson/hudson-slave/workspace/Lucene-Solr-Tests-4.x-Java6/solr/build/solr-core/test/J0/./org.apache.solr.cloud.CollectionsAPIDistributedZkTest-jetty3-1375341621795//nodes_used_collection_shard1_replica2/data/index/
   [junit4]   2> 1395756 T3307 oasc.SolrCore.initIndex WARN [nodes_used_collection_shard1_replica2] Solr index directory '/usr/home/hudson/hudson-slave/workspace/Lucene-Solr-Tests-4.x-Java6/solr/build/solr-core/test/J0/./org.apache.solr.cloud.CollectionsAPIDistributedZkTest-jetty3-1375341621795/nodes_used_collection_shard1_replica2/data/index' doesn't exist. Creating new index...
   [junit4]   2> 1395756 T3307 oasc.CachingDirectoryFactory.get return new directory for /usr/home/hudson/hudson-slave/workspace/Lucene-Solr-Tests-4.x-Java6/solr/build/solr-core/test/J0/./org.apache.solr.cloud.CollectionsAPIDistributedZkTest-jetty3-1375341621795//nodes_used_collection_shard1_replica2/data/index
   [junit4]   2> 1395759 T3280 oasc.SolrDeletionPolicy.onCommit SolrDeletionPolicy.onCommit: commits: num=1
   [junit4]   2> 		commit{dir=MockDirWrapper(org.apache.lucene.store.RAMDirectory@75d844ca lockFactory=org.apache.lucene.store.NativeFSLockFactory@a13606c),segFN=segments_1,generation=1}
   [junit4]   2> 1395759 T3280 oasc.SolrDeletionPolicy.updateCommits newest commit generation = 1
   [junit4]   2> 1395761 T3321 oasc.SolrDeletionPolicy.onCommit SolrDeletionPolicy.onCommit: commits: num=1
   [junit4]   2> 		commit{dir=MockDirWrapper(org.apache.lucene.store.RAMDirectory@3bb186c2 lockFactory=org.apache.lucene.store.NativeFSLockFactory@21ce5fee),segFN=segments_1,generation=1}
   [junit4]   2> 1395762 T3261 oasc.SolrDeletionPolicy.onCommit SolrDeletionPolicy.onCommit: commits: num=1
   [junit4]   2> 		commit{dir=MockDirWrapper(org.apache.lucene.store.RAMDirectory@2a6a9ba5 lockFactory=org.apache.lucene.store.NativeFSLockFactory@57f09d4a),segFN=segments_1,generation=1}
   [junit4]   2> 1395762 T3321 oasc.SolrDeletionPolicy.updateCommits newest commit generation = 1
   [junit4]   2> 1395762 T3261 oasc.SolrDeletionPolicy.updateCommits newest commit generation = 1
   [junit4]   2> 1395763 T3307 oasc.SolrDeletionPolicy.onCommit SolrDeletionPolicy.onCommit: commits: num=1
   [junit4]   2> 		commit{dir=MockDirWrapper(org.apache.lucene.store.RAMDirectory@74941918 lockFactory=org.apache.lucene.store.NativeFSLockFactory@1aa3c153),segFN=segments_1,generation=1}
   [junit4]   2> 1395763 T3307 oasc.SolrDeletionPolicy.updateCommits newest commit generation = 1
   [junit4]   2> 1395764 T3280 oasup.UpdateRequestProcessorChain.init inserting DistributedUpdateProcessorFactory into updateRequestProcessorChain "dedupe"
   [junit4]   2> 1395765 T3280 oasup.UpdateRequestProcessorChain.init inserting DistributedUpdateProcessorFactory into updateRequestProcessorChain "stored_sig"
   [junit4]   2> 1395766 T3280 oasup.UpdateRequestProcessorChain.init inserting DistributedUpdateProcessorFactory into updateRequestProcessorChain "distrib-dup-test-chain-implicit"
   [junit4]   2> 1395767 T3280 oasc.RequestHandlers.initHandlersFromConfig created standard: solr.StandardRequestHandler
   [junit4]   2> 1395767 T3280 oasc.RequestHandlers.initHandlersFromConfig created /get: solr.RealTimeGetHandler
   [junit4]   2> 1395768 T3280 oasc.RequestHandlers.initHandlersFromConfig adding lazy requestHandler: solr.ReplicationHandler
   [junit4]   2> 1395767 T3321 oasup.UpdateRequestProcessorChain.init inserting DistributedUpdateProcessorFactory into updateRequestProcessorChain "dedupe"
   [junit4]   2> 1395768 T3261 oasup.UpdateRequestProcessorChain.init inserting DistributedUpdateProcessorFactory into updateRequestProcessorChain "dedupe"
   [junit4]   2> 1395768 T3321 oasup.UpdateRequestProcessorChain.init inserting DistributedUpdateProcessorFactory into updateRequestProcessorChain "stored_sig"
   [junit4]   2> 1395768 T3280 oasc.RequestHandlers.initHandlersFromConfig created /replication: solr.ReplicationHandler
   [junit4]   2> 1395769 T3307 oasup.UpdateRequestProcessorChain.init inserting DistributedUpdateProcessorFactory into updateRequestProcessorChain "dedupe"
   [junit4]   2> 1395769 T3261 oasup.UpdateRequestProcessorChain.init inserting DistributedUpdateProcessorFactory into updateRequestProcessorChain "stored_sig"
   [junit4]   2> 1395770 T3307 oasup.UpdateRequestProcessorChain.init inserting DistributedUpdateProcessorFactory into updateRequestProcessorChain "stored_sig"
   [junit4]   2> 1395770 T3280 oasc.RequestHandlers.initHandlersFromConfig created /update: solr.UpdateRequestHandler
   [junit4]   2> 1395769 T3321 oasup.UpdateRequestProcessorChain.init inserting DistributedUpdateProcessorFactory into updateRequestProcessorChain "distrib-dup-test-chain-implicit"
   [junit4]   2> 1395771 T3280 oasc.RequestHandlers.initHandlersFromConfig created /admin/: org.apache.solr.handler.admin.AdminHandlers
   [junit4]   2> 1395772 T3321 oasc.RequestHandlers.initHandlersFromConfig created standard: solr.StandardRequestHandler
   [junit4]   2> 1395771 T3307 oasup.UpdateRequestProcessorChain.init inserting DistributedUpdateProcessorFactory into updateRequestProcessorChain "distrib-dup-test-chain-implicit"
   [junit4]   2> 1395771 T3261 oasup.UpdateRequestProcessorChain.init inserting DistributedUpdateProcessorFactory into updateRequestProcessorChain "distrib-dup-test-chain-implicit"
   [junit4]   2> 1395773 T3307 oasc.RequestHandlers.initHandlersFromConfig created standard: solr.StandardRequestHandler
   [junit4]   2> 1395772 T3321 oasc.RequestHandlers.initHandlersFromConfig created /get: solr.RealTimeGetHandler
   [junit4]   2> 1395774 T3307 oasc.RequestHandlers.initHandlersFromConfig created /get: solr.RealTimeGetHandler
   [junit4]   2> 1395774 T3307 oasc.RequestHandlers.initHandlersFromConfig adding lazy requestHandler: solr.ReplicationHandler
   [junit4]   2> 1395773 T3261 oasc.RequestHandlers.initHandlersFromConfig created standard: solr.StandardRequestHandler
   [junit4]   2> 1395775 T3307 oasc.RequestHandlers.initHandlersFromConfig created /replication: solr.ReplicationHandler
   [junit4]   2> 1395774 T3321 oasc.RequestHandlers.initHandlersFromConfig adding lazy requestHandler: solr.ReplicationHandler
   [junit4]   2> 1395775 T3307 oasc.RequestHandlers.initHandlersFromConfig created /update: solr.UpdateRequestHandler
   [junit4]   2> 1395775 T3261 oasc.RequestHandlers.initHandlersFromConfig created /get: solr.RealTimeGetHandler
   [junit4]   2> 1395776 T3307 oasc.RequestHandlers.initHandlersFromConfig created /admin/: org.apache.solr.handler.admin.AdminHandlers
   [junit4]   2> 1395776 T3321 oasc.RequestHandlers.initHandlersFromConfig created /replication: solr.ReplicationHandler
   [junit4]   2> 1395776 T3261 oasc.RequestHandlers.initHandlersFromConfig adding lazy requestHandler: solr.ReplicationHandler
   [junit4]   2> 1395777 T3321 oasc.RequestHandlers.initHandlersFromConfig created /update: solr.UpdateRequestHandler
   [junit4]   2> 1395777 T3261 oasc.RequestHandlers.initHandlersFromConfig created /replication: solr.ReplicationHandler
   [junit4]   2> 1395778 T3321 oasc.RequestHandlers.initHandlersFromConfig created /admin/: org.apache.solr.handler.admin.AdminHandlers
   [junit4]   2> 1395778 T3261 oasc.RequestHandlers.initHandlersFromConfig created /update: solr.UpdateRequestHandler
   [junit4]   2> 1395779 T3261 oasc.RequestHandlers.initHandlersFromConfig created /admin/: org.apache.solr.handler.admin.AdminHandlers
   [junit4]   2> 1395784 T3280 oashl.XMLLoader.init xsltCacheLifetimeSeconds=60
   [junit4]   2> 1395784 T3321 oashl.XMLLoader.init xsltCacheLifetimeSeconds=60
   [junit4]   2> 1395785 T3307 oashl.XMLLoader.init xsltCacheLifetimeSeconds=60
   [junit4]   2> 1395785 T3261 oashl.XMLLoader.init xsltCacheLifetimeSeconds=60
   [junit4]   2> 1395796 T3280 oass.SolrIndexSearcher.<init> Opening Searcher@a732f2d main
   [junit4]   2> 1395797 T3307 oass.SolrIndexSearcher.<init> Opening Searcher@4746ab08 main
   [junit4]   2> 1395796 T3261 oass.SolrIndexSearcher.<init> Opening Searcher@60659b50 main
   [junit4]   2> 1395797 T3321 oass.SolrIndexSearcher.<init> Opening Searcher@5e63a156 main
   [junit4]   2> 1395798 T3280 oasu.CommitTracker.<init> Hard AutoCommit: disabled
   [junit4]   2> 1395798 T3280 oasu.CommitTracker.<init> Soft AutoCommit: disabled
   [junit4]   2> 1395798 T3307 oasu.CommitTracker.<init> Hard AutoCommit: disabled
   [junit4]   2> 1395799 T3321 oasu.CommitTracker.<init> Hard AutoCommit: disabled
   [junit4]   2> 1395799 T3261 oasu.CommitTracker.<init> Hard AutoCommit: disabled
   [junit4]   2> 1395800 T3321 oasu.CommitTracker.<init> Soft AutoCommit: disabled
   [junit4]   2> 1395799 T3307 oasu.CommitTracker.<init> Soft AutoCommit: disabled
   [junit4]   2> 1395800 T3261 oasu.CommitTracker.<init> Soft AutoCommit: disabled
   [junit4]   2> 1395802 T3337 oasc.SolrCore.registerSearcher [nodes_used_collection_shard1_replica1] Registered new searcher Searcher@a732f2d main{StandardDirectoryReader(segments_1:1)}
   [junit4]   2> 1395804 T3340 oasc.SolrCore.registerSearcher [nodes_used_collection_shard2_replica1] Registered new searcher Searcher@5e63a156 main{StandardDirectoryReader(segments_1:1)}
   [junit4]   2> 1395804 T3339 oasc.SolrCore.registerSearcher [nodes_used_collection_shard1_replica2] Registered new searcher Searcher@4746ab08 main{StandardDirectoryReader(segments_1:1)}
   [junit4]   2> 1395804 T3338 oasc.SolrCore.registerSearcher [nodes_used_collection_shard2_replica2] Registered new searcher Searcher@60659b50 main{StandardDirectoryReader(segments_1:1)}
   [junit4]   2> 1395805 T3280 oasc.CoreContainer.registerCore registering core: nodes_used_collection_shard1_replica1
   [junit4]   2> 1395805 T3280 oasc.ZkController.register Register replica - core:nodes_used_collection_shard1_replica1 address:http://127.0.0.1:31990/wli/wq collection:nodes_used_collection shard:shard1
   [junit4]   2> 1395805 T3280 oascsi.HttpClientUtil.createClient Creating new http client, config:maxConnections=10000&maxConnectionsPerHost=20&connTimeout=15000&socketTimeout=30000&retry=false
   [junit4]   2> 1395806 T3321 oasc.CoreContainer.registerCore registering core: nodes_used_collection_shard2_replica1
   [junit4]   2> 1395806 T3307 oasc.CoreContainer.registerCore registering core: nodes_used_collection_shard1_replica2
   [junit4]   2> 1395806 T3261 oasc.CoreContainer.registerCore registering core: nodes_used_collection_shard2_replica2
   [junit4]   2> 1395806 T3321 oasc.ZkController.register Register replica - core:nodes_used_collection_shard2_replica1 address:http://127.0.0.1:32002/wli/wq collection:nodes_used_collection shard:shard2
   [junit4]   2> 1395807 T3261 oasc.ZkController.register Register replica - core:nodes_used_collection_shard2_replica2 address:http://127.0.0.1:31986/wli/wq collection:nodes_used_collection shard:shard2
   [junit4]   2> 1395807 T3307 oasc.ZkController.register Register replica - core:nodes_used_collection_shard1_replica2 address:http://127.0.0.1:31998/wli/wq collection:nodes_used_collection shard:shard1
   [junit4]   2> 1395808 T3261 oascsi.HttpClientUtil.createClient Creating new http client, config:maxConnections=10000&maxConnectionsPerHost=20&connTimeout=15000&socketTimeout=30000&retry=false
   [junit4]   2> 1395807 T3321 oascsi.HttpClientUtil.createClient Creating new http client, config:maxConnections=10000&maxConnectionsPerHost=20&connTimeout=15000&socketTimeout=30000&retry=false
   [junit4]   2> 1395808 T3307 oascsi.HttpClientUtil.createClient Creating new http client, config:maxConnections=10000&maxConnectionsPerHost=20&connTimeout=15000&socketTimeout=30000&retry=false
   [junit4]   2> 1395834 T3321 oascc.SolrZkClient.makePath makePath: /collections/nodes_used_collection/leader_elect/shard2/election
   [junit4]   2> 1395835 T3261 oascc.SolrZkClient.makePath makePath: /collections/nodes_used_collection/leader_elect/shard2/election
   [junit4]   2> 1395835 T3307 oascc.SolrZkClient.makePath makePath: /collections/nodes_used_collection/leader_elect/shard1/election
   [junit4]   2> 1395835 T3280 oascc.SolrZkClient.makePath makePath: /collections/nodes_used_collection/leader_elect/shard1/election
   [junit4]   2> 1395864 T3261 oasc.ShardLeaderElectionContext.runLeaderProcess Running the leader process for shard shard2
   [junit4]   2> 1395865 T3307 oasc.ShardLeaderElectionContext.runLeaderProcess Running the leader process for shard shard1
   [junit4]   2> 1395867 T3261 oasc.ShardLeaderElectionContext.waitForReplicasToComeUp Enough replicas found to continue.
   [junit4]   2> 1395868 T3307 oasc.ShardLeaderElectionContext.waitForReplicasToComeUp Enough replicas found to continue.
   [junit4]   2> 1395868 T3261 oasc.ShardLeaderElectionContext.runLeaderProcess I may be the new leader - try and sync
   [junit4]   2> 1395868 T3307 oasc.ShardLeaderElectionContext.runLeaderProcess I may be the new leader - try and sync
   [junit4]   2> 1395869 T3261 oasc.SyncStrategy.sync Sync replicas to http://127.0.0.1:31986/wli/wq/nodes_used_collection_shard2_replica2/
   [junit4]   2> 1395869 T3307 oasc.SyncStrategy.sync Sync replicas to http://127.0.0.1:31998/wli/wq/nodes_used_collection_shard1_replica2/
   [junit4]   2> 1395869 T3261 oasu.PeerSync.sync PeerSync: core=nodes_used_collection_shard2_replica2 url=http://127.0.0.1:31986/wli/wq START replicas=[http://127.0.0.1:32002/wli/wq/nodes_used_collection_shard2_replica1/] nUpdates=100
   [junit4]   2> 1395870 T3307 

[...truncated too long message...]

ore org.apache.solr.core.SolrCore@14c60b63
   [junit4]   2> 1542824 T3249 oasu.DirectUpdateHandler2.close closing DirectUpdateHandler2{commits=0,autocommits=0,soft autocommits=0,optimizes=0,rollbacks=0,expungeDeletes=0,docsPending=0,adds=0,deletesById=0,deletesByQuery=0,errors=0,cumulative_adds=0,cumulative_deletesById=0,cumulative_deletesByQuery=0,cumulative_errors=0}
   [junit4]   2> 1542824 T3249 oasu.SolrCoreState.decrefSolrCoreState Closing SolrCoreState
   [junit4]   2> 1542825 T3249 oasu.DefaultSolrCoreState.closeIndexWriter SolrCoreState ref count has reached 0 - closing IndexWriter
   [junit4]   2> 1542825 T3249 oasu.DefaultSolrCoreState.closeIndexWriter closing IndexWriter with IndexWriterCloser
   [junit4]   2> 1542826 T3249 oasc.SolrCore.closeSearcher [new_implicit_coll_1_b_replica3] Closing main searcher on request.
   [junit4]   2> 1542826 T3249 oasc.CachingDirectoryFactory.close Closing MockDirectoryFactory - 2 directories currently being tracked
   [junit4]   2> 1542826 T3249 oasc.CachingDirectoryFactory.closeCacheValue looking to close /usr/home/hudson/hudson-slave/workspace/Lucene-Solr-Tests-4.x-Java6/solr/build/solr-core/test/J0/./org.apache.solr.cloud.CollectionsAPIDistributedZkTest-jetty4-1375341623480//new_implicit_coll_1_b_replica3/data [CachedDir<<refCount=0;path=/usr/home/hudson/hudson-slave/workspace/Lucene-Solr-Tests-4.x-Java6/solr/build/solr-core/test/J0/./org.apache.solr.cloud.CollectionsAPIDistributedZkTest-jetty4-1375341623480//new_implicit_coll_1_b_replica3/data;done=false>>]
   [junit4]   2> 1542827 T3249 oasc.CachingDirectoryFactory.close Closing directory: /usr/home/hudson/hudson-slave/workspace/Lucene-Solr-Tests-4.x-Java6/solr/build/solr-core/test/J0/./org.apache.solr.cloud.CollectionsAPIDistributedZkTest-jetty4-1375341623480//new_implicit_coll_1_b_replica3/data
   [junit4]   2> 1542827 T3249 oasc.CachingDirectoryFactory.closeCacheValue looking to close /usr/home/hudson/hudson-slave/workspace/Lucene-Solr-Tests-4.x-Java6/solr/build/solr-core/test/J0/./org.apache.solr.cloud.CollectionsAPIDistributedZkTest-jetty4-1375341623480//new_implicit_coll_1_b_replica3/data/index [CachedDir<<refCount=0;path=/usr/home/hudson/hudson-slave/workspace/Lucene-Solr-Tests-4.x-Java6/solr/build/solr-core/test/J0/./org.apache.solr.cloud.CollectionsAPIDistributedZkTest-jetty4-1375341623480//new_implicit_coll_1_b_replica3/data/index;done=false>>]
   [junit4]   2> 1542828 T3249 oasc.CachingDirectoryFactory.close Closing directory: /usr/home/hudson/hudson-slave/workspace/Lucene-Solr-Tests-4.x-Java6/solr/build/solr-core/test/J0/./org.apache.solr.cloud.CollectionsAPIDistributedZkTest-jetty4-1375341623480//new_implicit_coll_1_b_replica3/data/index
   [junit4]   2> 1542831 T3911 oasc.Overseer$ClusterStateUpdater.amILeader According to ZK I (id=90134388239302668-127.0.0.1:32002_wli%2Fwq-n_0000000004) am no longer a leader.
   [junit4]   2> 1542833 T3249 oejsh.ContextHandler.doStop stopped o.e.j.s.ServletContextHandler{/wli/wq,null}
   [junit4]   2> 1542890 T3249 oas.SolrTestCaseJ4.tearDown ###Ending testDistribSearch
   [junit4]   2> 1542894 T3249 oasc.ZkTestServer.send4LetterWord connecting to 127.0.0.1:31983 31983
   [junit4]   1> client port:0.0.0.0/0.0.0.0:0
   [junit4]   2> NOTE: reproduce with: ant test  -Dtestcase=CollectionsAPIDistributedZkTest -Dtests.method=testDistribSearch -Dtests.seed=323929E81520CBE -Dtests.multiplier=3 -Dtests.slow=true -Dtests.locale=hi_IN -Dtests.timezone=Africa/Abidjan -Dtests.file.encoding=ISO8859-1
   [junit4] ERROR    159s J0 | CollectionsAPIDistributedZkTest.testDistribSearch <<<
   [junit4]    > Throwable #1: org.apache.solr.client.solrj.SolrServerException: IOException occured when talking to server at: http://127.0.0.1:31990/wli/wq
   [junit4]    > 	at __randomizedtesting.SeedInfo.seed([323929E81520CBE:82C51C86F60D6C82]:0)
   [junit4]    > 	at org.apache.solr.client.solrj.impl.HttpSolrServer.request(HttpSolrServer.java:435)
   [junit4]    > 	at org.apache.solr.client.solrj.impl.HttpSolrServer.request(HttpSolrServer.java:180)
   [junit4]    > 	at org.apache.solr.cloud.AbstractFullDistribZkTestBase.createCollection(AbstractFullDistribZkTestBase.java:1535)
   [junit4]    > 	at org.apache.solr.cloud.CollectionsAPIDistributedZkTest.testCustomCollectionsAPI(CollectionsAPIDistributedZkTest.java:677)
   [junit4]    > 	at org.apache.solr.cloud.CollectionsAPIDistributedZkTest.doTest(CollectionsAPIDistributedZkTest.java:159)
   [junit4]    > 	at org.apache.solr.BaseDistributedSearchTestCase.testDistribSearch(BaseDistributedSearchTestCase.java:835)
   [junit4]    > 	at java.lang.Thread.run(Thread.java:679)
   [junit4]    > Caused by: org.apache.http.conn.ConnectTimeoutException: Connect to 127.0.0.1:31990 timed out
   [junit4]    > 	at org.apache.http.conn.scheme.PlainSocketFactory.connectSocket(PlainSocketFactory.java:129)
   [junit4]    > 	at org.apache.http.impl.conn.DefaultClientConnectionOperator.openConnection(DefaultClientConnectionOperator.java:180)
   [junit4]    > 	at org.apache.http.impl.conn.ManagedClientConnectionImpl.open(ManagedClientConnectionImpl.java:294)
   [junit4]    > 	at org.apache.http.impl.client.DefaultRequestDirector.tryConnect(DefaultRequestDirector.java:645)
   [junit4]    > 	at org.apache.http.impl.client.DefaultRequestDirector.execute(DefaultRequestDirector.java:480)
   [junit4]    > 	at org.apache.http.impl.client.AbstractHttpClient.execute(AbstractHttpClient.java:906)
   [junit4]    > 	at org.apache.http.impl.client.AbstractHttpClient.execute(AbstractHttpClient.java:805)
   [junit4]    > 	at org.apache.http.impl.client.AbstractHttpClient.execute(AbstractHttpClient.java:784)
   [junit4]    > 	at org.apache.solr.client.solrj.impl.HttpSolrServer.request(HttpSolrServer.java:365)
   [junit4]    > 	... 45 more
   [junit4]   2> 1543145 T3249 oas.SolrTestCaseJ4.deleteCore ###deleteCore
   [junit4]   2> 158976 T3248 ccr.ThreadLeakControl.checkThreadLeaks WARNING Will linger awaiting termination of 2 leaked thread(s).
   [junit4]   2> 1544133 T3331 oascc.ZkStateReader$3.process WARN ZooKeeper watch triggered, but Solr cannot talk to ZK
   [junit4]   2> 1544133 T3331 oascc.ZkStateReader$2.process A cluster state change: WatchedEvent state:SyncConnected type:NodeChildrenChanged path:/live_nodes, has occurred - updating... (live nodes size: 1)
   [junit4]   2> 1544134 T3331 oascc.ZkStateReader$2.process WARN ZooKeeper watch triggered, but Solr cannot talk to ZK
   [junit4]   2> NOTE: test params are: codec=Lucene41, sim=RandomSimilarityProvider(queryNorm=true,coord=crazy): {}, locale=hi_IN, timezone=Africa/Abidjan
   [junit4]   2> NOTE: FreeBSD 9.1-RELEASE-p3 amd64/Sun Microsystems Inc. 1.6.0_32 (64-bit)/cpus=16,threads=4,free=215499792,total=444268544
   [junit4]   2> NOTE: All tests run in this JVM: [AlternateDirectoryTest, AutoCommitTest, TestSolrIndexConfig, CSVRequestHandlerTest, TestCoreContainer, MinimalSchemaTest, TestFieldTypeResource, HdfsChaosMonkeySafeLeaderTest, ZkControllerTest, TestRemoteStreaming, RecoveryZkTest, TestFieldTypeCollectionResource, TestPHPSerializedResponseWriter, TestFastLRUCache, SoftAutoCommitTest, AddSchemaFieldsUpdateProcessorFactoryTest, TestPluginEnable, TestSearchPerf, ChaosMonkeyNothingIsSafeTest, StatelessScriptUpdateProcessorFactoryTest, BasicFunctionalityTest, TestSolrQueryParserResource, PolyFieldTest, TestWriterPerf, SolrCoreTest, TestStressVersions, TestUniqueKeyFieldResource, OverseerTest, TermsComponentTest, TestShardHandlerFactory, TestSolrXmlPersistence, TestTrie, StressHdfsTest, UUIDFieldTest, MoreLikeThisHandlerTest, SuggesterFSTTest, FieldMutatingUpdateProcessorTest, DistributedSpellCheckComponentTest, TestFuzzyAnalyzedSuggestions, TestQuerySenderListener, SyncSliceTest, TestValueSourceCache, InfoHandlerTest, WordBreakSolrSpellCheckerTest, BadComponentTest, SpellingQueryConverterTest, LukeRequestHandlerTest, SOLR749Test, ResourceLoaderTest, CoreMergeIndexesAdminHandlerTest, DocValuesTest, TestExtendedDismaxParser, DateFieldTest, UpdateRequestProcessorFactoryTest, DistributedTermsComponentTest, SolrInfoMBeanTest, BinaryUpdateRequestHandlerTest, TestDocSet, TestSolrQueryParser, FileBasedSpellCheckerTest, ZkCLITest, PreAnalyzedFieldTest, ShowFileRequestHandlerTest, OverseerCollectionProcessorTest, QueryEqualityTest, TestFastWriter, TestCloudManagedSchemaAddField, TestDocumentBuilder, HdfsBasicDistributedZkTest, SimpleFacetsTest, DocumentBuilderTest, TestIBSimilarityFactory, TestPseudoReturnFields, CircularListTest, CachingDirectoryFactoryTest, TestPropInjectDefaults, TestFaceting, LeaderElectionTest, BasicDistributedZkTest, BasicDistributedZk2Test, CollectionsAPIDistributedZkTest]
   [junit4] Completed on J0 in 160.01s, 1 test, 1 error <<< FAILURES!

[...truncated 492 lines...]
BUILD FAILED
/usr/home/hudson/hudson-slave/workspace/Lucene-Solr-Tests-4.x-Java6/build.xml:395: The following error occurred while executing this line:
/usr/home/hudson/hudson-slave/workspace/Lucene-Solr-Tests-4.x-Java6/build.xml:375: The following error occurred while executing this line:
/usr/home/hudson/hudson-slave/workspace/Lucene-Solr-Tests-4.x-Java6/build.xml:39: The following error occurred while executing this line:
/usr/home/hudson/hudson-slave/workspace/Lucene-Solr-Tests-4.x-Java6/solr/build.xml:181: The following error occurred while executing this line:
/usr/home/hudson/hudson-slave/workspace/Lucene-Solr-Tests-4.x-Java6/solr/common-build.xml:449: The following error occurred while executing this line:
/usr/home/hudson/hudson-slave/workspace/Lucene-Solr-Tests-4.x-Java6/lucene/common-build.xml:1233: The following error occurred while executing this line:
/usr/home/hudson/hudson-slave/workspace/Lucene-Solr-Tests-4.x-Java6/lucene/common-build.xml:876: There were test failures: 321 suites, 1350 tests, 1 error, 34 ignored (6 assumptions)

Total time: 54 minutes 54 seconds
Build step 'Invoke Ant' marked build as failure
Archiving artifacts
Recording test results
Email was triggered for: Failure
Sending email for trigger: Failure



Mime
View raw message