lucene-dev mailing list archives

Site index · List index
Message view « Date » · « Thread »
Top « Date » · « Thread »
From Apache Jenkins Server <jenk...@builds.apache.org>
Subject [JENKINS] Lucene-Solr-Tests-4.x-Java7 - Build # 1467 - Still Failing
Date Thu, 01 Aug 2013 02:40:58 GMT
Build: https://builds.apache.org/job/Lucene-Solr-Tests-4.x-Java7/1467/

1 tests failed.
FAILED:  org.apache.solr.cloud.CollectionsAPIDistributedZkTest.testDistribSearch

Error Message:
IOException occured when talking to server at: http://127.0.0.1:48141

Stack Trace:
org.apache.solr.client.solrj.SolrServerException: IOException occured when talking to server at: http://127.0.0.1:48141
	at __randomizedtesting.SeedInfo.seed([B307A0B24796AA66:32E12EAA30C9CA5A]:0)
	at org.apache.solr.client.solrj.impl.HttpSolrServer.request(HttpSolrServer.java:435)
	at org.apache.solr.client.solrj.impl.HttpSolrServer.request(HttpSolrServer.java:180)
	at org.apache.solr.cloud.CollectionsAPIDistributedZkTest.testCustomCollectionsAPI(CollectionsAPIDistributedZkTest.java:764)
	at org.apache.solr.cloud.CollectionsAPIDistributedZkTest.doTest(CollectionsAPIDistributedZkTest.java:159)
	at org.apache.solr.BaseDistributedSearchTestCase.testDistribSearch(BaseDistributedSearchTestCase.java:835)
	at sun.reflect.NativeMethodAccessorImpl.invoke0(Native Method)
	at sun.reflect.NativeMethodAccessorImpl.invoke(NativeMethodAccessorImpl.java:57)
	at sun.reflect.DelegatingMethodAccessorImpl.invoke(DelegatingMethodAccessorImpl.java:43)
	at java.lang.reflect.Method.invoke(Method.java:606)
	at com.carrotsearch.randomizedtesting.RandomizedRunner.invoke(RandomizedRunner.java:1559)
	at com.carrotsearch.randomizedtesting.RandomizedRunner.access$600(RandomizedRunner.java:79)
	at com.carrotsearch.randomizedtesting.RandomizedRunner$6.evaluate(RandomizedRunner.java:737)
	at com.carrotsearch.randomizedtesting.RandomizedRunner$7.evaluate(RandomizedRunner.java:773)
	at com.carrotsearch.randomizedtesting.RandomizedRunner$8.evaluate(RandomizedRunner.java:787)
	at com.carrotsearch.randomizedtesting.rules.SystemPropertiesRestoreRule$1.evaluate(SystemPropertiesRestoreRule.java:53)
	at org.apache.lucene.util.TestRuleSetupTeardownChained$1.evaluate(TestRuleSetupTeardownChained.java:50)
	at org.apache.lucene.util.TestRuleFieldCacheSanity$1.evaluate(TestRuleFieldCacheSanity.java:51)
	at org.apache.lucene.util.AbstractBeforeAfterRule$1.evaluate(AbstractBeforeAfterRule.java:46)
	at com.carrotsearch.randomizedtesting.rules.SystemPropertiesInvariantRule$1.evaluate(SystemPropertiesInvariantRule.java:55)
	at org.apache.lucene.util.TestRuleThreadAndTestName$1.evaluate(TestRuleThreadAndTestName.java:49)
	at org.apache.lucene.util.TestRuleIgnoreAfterMaxFailures$1.evaluate(TestRuleIgnoreAfterMaxFailures.java:70)
	at org.apache.lucene.util.TestRuleMarkFailure$1.evaluate(TestRuleMarkFailure.java:48)
	at com.carrotsearch.randomizedtesting.rules.StatementAdapter.evaluate(StatementAdapter.java:36)
	at com.carrotsearch.randomizedtesting.ThreadLeakControl$StatementRunner.run(ThreadLeakControl.java:358)
	at com.carrotsearch.randomizedtesting.ThreadLeakControl.forkTimeoutingTask(ThreadLeakControl.java:782)
	at com.carrotsearch.randomizedtesting.ThreadLeakControl$3.evaluate(ThreadLeakControl.java:442)
	at com.carrotsearch.randomizedtesting.RandomizedRunner.runSingleTest(RandomizedRunner.java:746)
	at com.carrotsearch.randomizedtesting.RandomizedRunner$3.evaluate(RandomizedRunner.java:648)
	at com.carrotsearch.randomizedtesting.RandomizedRunner$4.evaluate(RandomizedRunner.java:682)
	at com.carrotsearch.randomizedtesting.RandomizedRunner$5.evaluate(RandomizedRunner.java:693)
	at com.carrotsearch.randomizedtesting.rules.StatementAdapter.evaluate(StatementAdapter.java:36)
	at com.carrotsearch.randomizedtesting.rules.SystemPropertiesRestoreRule$1.evaluate(SystemPropertiesRestoreRule.java:53)
	at org.apache.lucene.util.AbstractBeforeAfterRule$1.evaluate(AbstractBeforeAfterRule.java:46)
	at org.apache.lucene.util.TestRuleStoreClassName$1.evaluate(TestRuleStoreClassName.java:42)
	at com.carrotsearch.randomizedtesting.rules.SystemPropertiesInvariantRule$1.evaluate(SystemPropertiesInvariantRule.java:55)
	at com.carrotsearch.randomizedtesting.rules.NoShadowingOrOverridesOnMethodsRule$1.evaluate(NoShadowingOrOverridesOnMethodsRule.java:39)
	at com.carrotsearch.randomizedtesting.rules.NoShadowingOrOverridesOnMethodsRule$1.evaluate(NoShadowingOrOverridesOnMethodsRule.java:39)
	at com.carrotsearch.randomizedtesting.rules.StatementAdapter.evaluate(StatementAdapter.java:36)
	at org.apache.lucene.util.TestRuleAssertionsRequired$1.evaluate(TestRuleAssertionsRequired.java:43)
	at org.apache.lucene.util.TestRuleMarkFailure$1.evaluate(TestRuleMarkFailure.java:48)
	at org.apache.lucene.util.TestRuleIgnoreAfterMaxFailures$1.evaluate(TestRuleIgnoreAfterMaxFailures.java:70)
	at org.apache.lucene.util.TestRuleIgnoreTestSuites$1.evaluate(TestRuleIgnoreTestSuites.java:55)
	at com.carrotsearch.randomizedtesting.rules.StatementAdapter.evaluate(StatementAdapter.java:36)
	at com.carrotsearch.randomizedtesting.ThreadLeakControl$StatementRunner.run(ThreadLeakControl.java:358)
	at java.lang.Thread.run(Thread.java:724)
Caused by: org.apache.http.conn.ConnectTimeoutException: Connect to 127.0.0.1:48141 timed out
	at org.apache.http.conn.scheme.PlainSocketFactory.connectSocket(PlainSocketFactory.java:129)
	at org.apache.http.impl.conn.DefaultClientConnectionOperator.openConnection(DefaultClientConnectionOperator.java:180)
	at org.apache.http.impl.conn.ManagedClientConnectionImpl.open(ManagedClientConnectionImpl.java:294)
	at org.apache.http.impl.client.DefaultRequestDirector.tryConnect(DefaultRequestDirector.java:645)
	at org.apache.http.impl.client.DefaultRequestDirector.execute(DefaultRequestDirector.java:480)
	at org.apache.http.impl.client.AbstractHttpClient.execute(AbstractHttpClient.java:906)
	at org.apache.http.impl.client.AbstractHttpClient.execute(AbstractHttpClient.java:805)
	at org.apache.http.impl.client.AbstractHttpClient.execute(AbstractHttpClient.java:784)
	at org.apache.solr.client.solrj.impl.HttpSolrServer.request(HttpSolrServer.java:365)
	... 44 more




Build Log:
[...truncated 9708 lines...]
   [junit4] Suite: org.apache.solr.cloud.CollectionsAPIDistributedZkTest
   [junit4]   2> 610055 T1602 oas.BaseDistributedSearchTestCase.initHostContext Setting hostContext system property: /
   [junit4]   2> 610061 T1602 oas.SolrTestCaseJ4.setUp ###Starting testDistribSearch
   [junit4]   2> Creating dataDir: /usr/home/hudson/hudson-slave/workspace/Lucene-Solr-Tests-4.x-Java7/solr/build/solr-core/test/J1/./solrtest-CollectionsAPIDistributedZkTest-1375323322286
   [junit4]   2> 610063 T1602 oasc.ZkTestServer.run STARTING ZK TEST SERVER
   [junit4]   2> 610064 T1603 oasc.ZkTestServer$ZKServerMain.runFromConfig Starting server
   [junit4]   2> 610165 T1602 oasc.ZkTestServer.run start zk server on port:48134
   [junit4]   2> 610166 T1602 oascc.ConnectionManager.waitForConnected Waiting for client to connect to ZooKeeper
   [junit4]   2> 610170 T1609 oascc.ConnectionManager.process Watcher org.apache.solr.common.cloud.ConnectionManager@3dc4360d name:ZooKeeperConnection Watcher:127.0.0.1:48134 got event WatchedEvent state:SyncConnected type:None path:null path:null type:None
   [junit4]   2> 610170 T1602 oascc.ConnectionManager.waitForConnected Client is connected to ZooKeeper
   [junit4]   2> 610171 T1602 oascc.SolrZkClient.makePath makePath: /solr
   [junit4]   2> 610188 T1602 oascc.ConnectionManager.waitForConnected Waiting for client to connect to ZooKeeper
   [junit4]   2> 610190 T1611 oascc.ConnectionManager.process Watcher org.apache.solr.common.cloud.ConnectionManager@2d91242e name:ZooKeeperConnection Watcher:127.0.0.1:48134/solr got event WatchedEvent state:SyncConnected type:None path:null path:null type:None
   [junit4]   2> 610190 T1602 oascc.ConnectionManager.waitForConnected Client is connected to ZooKeeper
   [junit4]   2> 610191 T1602 oascc.SolrZkClient.makePath makePath: /collections/collection1
   [junit4]   2> 610196 T1602 oascc.SolrZkClient.makePath makePath: /collections/collection1/shards
   [junit4]   2> 610205 T1602 oascc.SolrZkClient.makePath makePath: /collections/control_collection
   [junit4]   2> 610209 T1602 oascc.SolrZkClient.makePath makePath: /collections/control_collection/shards
   [junit4]   2> 610213 T1602 oasc.AbstractZkTestCase.putConfig put /usr/home/hudson/hudson-slave/workspace/Lucene-Solr-Tests-4.x-Java7/solr/build/solr-core/test-files/solr/collection1/conf/solrconfig-tlog.xml to /configs/conf1/solrconfig.xml
   [junit4]   2> 610214 T1602 oascc.SolrZkClient.makePath makePath: /configs/conf1/solrconfig.xml
   [junit4]   2> 610221 T1602 oasc.AbstractZkTestCase.putConfig put /usr/home/hudson/hudson-slave/workspace/Lucene-Solr-Tests-4.x-Java7/solr/build/solr-core/test-files/solr/collection1/conf/schema.xml to /configs/conf1/schema.xml
   [junit4]   2> 610222 T1602 oascc.SolrZkClient.makePath makePath: /configs/conf1/schema.xml
   [junit4]   2> 610329 T1602 oasc.AbstractZkTestCase.putConfig put /usr/home/hudson/hudson-slave/workspace/Lucene-Solr-Tests-4.x-Java7/solr/build/solr-core/test-files/solr/collection1/conf/stopwords.txt to /configs/conf1/stopwords.txt
   [junit4]   2> 610330 T1602 oascc.SolrZkClient.makePath makePath: /configs/conf1/stopwords.txt
   [junit4]   2> 610334 T1602 oasc.AbstractZkTestCase.putConfig put /usr/home/hudson/hudson-slave/workspace/Lucene-Solr-Tests-4.x-Java7/solr/build/solr-core/test-files/solr/collection1/conf/protwords.txt to /configs/conf1/protwords.txt
   [junit4]   2> 610335 T1602 oascc.SolrZkClient.makePath makePath: /configs/conf1/protwords.txt
   [junit4]   2> 610339 T1602 oasc.AbstractZkTestCase.putConfig put /usr/home/hudson/hudson-slave/workspace/Lucene-Solr-Tests-4.x-Java7/solr/build/solr-core/test-files/solr/collection1/conf/currency.xml to /configs/conf1/currency.xml
   [junit4]   2> 610340 T1602 oascc.SolrZkClient.makePath makePath: /configs/conf1/currency.xml
   [junit4]   2> 610344 T1602 oasc.AbstractZkTestCase.putConfig put /usr/home/hudson/hudson-slave/workspace/Lucene-Solr-Tests-4.x-Java7/solr/build/solr-core/test-files/solr/collection1/conf/open-exchange-rates.json to /configs/conf1/open-exchange-rates.json
   [junit4]   2> 610344 T1602 oascc.SolrZkClient.makePath makePath: /configs/conf1/open-exchange-rates.json
   [junit4]   2> 610348 T1602 oasc.AbstractZkTestCase.putConfig put /usr/home/hudson/hudson-slave/workspace/Lucene-Solr-Tests-4.x-Java7/solr/build/solr-core/test-files/solr/collection1/conf/mapping-ISOLatin1Accent.txt to /configs/conf1/mapping-ISOLatin1Accent.txt
   [junit4]   2> 610349 T1602 oascc.SolrZkClient.makePath makePath: /configs/conf1/mapping-ISOLatin1Accent.txt
   [junit4]   2> 610353 T1602 oasc.AbstractZkTestCase.putConfig put /usr/home/hudson/hudson-slave/workspace/Lucene-Solr-Tests-4.x-Java7/solr/build/solr-core/test-files/solr/collection1/conf/old_synonyms.txt to /configs/conf1/old_synonyms.txt
   [junit4]   2> 610354 T1602 oascc.SolrZkClient.makePath makePath: /configs/conf1/old_synonyms.txt
   [junit4]   2> 610358 T1602 oasc.AbstractZkTestCase.putConfig put /usr/home/hudson/hudson-slave/workspace/Lucene-Solr-Tests-4.x-Java7/solr/build/solr-core/test-files/solr/collection1/conf/synonyms.txt to /configs/conf1/synonyms.txt
   [junit4]   2> 610359 T1602 oascc.SolrZkClient.makePath makePath: /configs/conf1/synonyms.txt
   [junit4]   2> 610644 T1602 oejs.Server.doStart jetty-8.1.10.v20130312
   [junit4]   2> 610649 T1602 oejs.AbstractConnector.doStart Started SocketConnector@127.0.0.1:48137
   [junit4]   2> 610650 T1602 oass.SolrDispatchFilter.init SolrDispatchFilter.init()
   [junit4]   2> 610651 T1602 oasc.SolrResourceLoader.locateSolrHome JNDI not configured for solr (NoInitialContextEx)
   [junit4]   2> 610651 T1602 oasc.SolrResourceLoader.locateSolrHome using system property solr.solr.home: /usr/home/hudson/hudson-slave/workspace/Lucene-Solr-Tests-4.x-Java7/solr/build/solr-core/test/J1/./org.apache.solr.cloud.CollectionsAPIDistributedZkTest-controljetty-1375323322589
   [junit4]   2> 610652 T1602 oasc.SolrResourceLoader.<init> new SolrResourceLoader for directory: '/usr/home/hudson/hudson-slave/workspace/Lucene-Solr-Tests-4.x-Java7/solr/build/solr-core/test/J1/./org.apache.solr.cloud.CollectionsAPIDistributedZkTest-controljetty-1375323322589/'
   [junit4]   2> 610692 T1602 oasc.ConfigSolr.fromFile Loading container configuration from /usr/home/hudson/hudson-slave/workspace/Lucene-Solr-Tests-4.x-Java7/solr/build/solr-core/test/J1/./org.apache.solr.cloud.CollectionsAPIDistributedZkTest-controljetty-1375323322589/solr.xml
   [junit4]   2> 610813 T1602 oasc.ConfigSolrXml.<init> Config-defined core root directory: 
   [junit4]   2> 610814 T1602 oasc.CoreContainer.<init> New CoreContainer 972130203
   [junit4]   2> 610815 T1602 oasc.CoreContainer.load Loading cores into CoreContainer [instanceDir=/usr/home/hudson/hudson-slave/workspace/Lucene-Solr-Tests-4.x-Java7/solr/build/solr-core/test/J1/./org.apache.solr.cloud.CollectionsAPIDistributedZkTest-controljetty-1375323322589/]
   [junit4]   2> 610817 T1602 oashc.HttpShardHandlerFactory.getParameter Setting socketTimeout to: 120000
   [junit4]   2> 610818 T1602 oashc.HttpShardHandlerFactory.getParameter Setting urlScheme to: http://
   [junit4]   2> 610818 T1602 oashc.HttpShardHandlerFactory.getParameter Setting connTimeout to: 15000
   [junit4]   2> 610819 T1602 oashc.HttpShardHandlerFactory.getParameter Setting maxConnectionsPerHost to: 20
   [junit4]   2> 610819 T1602 oashc.HttpShardHandlerFactory.getParameter Setting corePoolSize to: 0
   [junit4]   2> 610820 T1602 oashc.HttpShardHandlerFactory.getParameter Setting maximumPoolSize to: 2147483647
   [junit4]   2> 610820 T1602 oashc.HttpShardHandlerFactory.getParameter Setting maxThreadIdleTime to: 5
   [junit4]   2> 610821 T1602 oashc.HttpShardHandlerFactory.getParameter Setting sizeOfQueue to: -1
   [junit4]   2> 610821 T1602 oashc.HttpShardHandlerFactory.getParameter Setting fairnessPolicy to: false
   [junit4]   2> 610822 T1602 oascsi.HttpClientUtil.createClient Creating new http client, config:maxConnectionsPerHost=20&maxConnections=10000&socketTimeout=120000&connTimeout=15000&retry=false
   [junit4]   2> 610840 T1602 oasc.ZkContainer.initZooKeeper Zookeeper client=127.0.0.1:48134/solr
   [junit4]   2> 610841 T1602 oasc.ZkController.checkChrootPath zkHost includes chroot
   [junit4]   2> 610842 T1602 oascc.ConnectionManager.waitForConnected Waiting for client to connect to ZooKeeper
   [junit4]   2> 610856 T1622 oascc.ConnectionManager.process Watcher org.apache.solr.common.cloud.ConnectionManager@206d61a6 name:ZooKeeperConnection Watcher:127.0.0.1:48134 got event WatchedEvent state:SyncConnected type:None path:null path:null type:None
   [junit4]   2> 610856 T1602 oascc.ConnectionManager.waitForConnected Client is connected to ZooKeeper
   [junit4]   2> 610872 T1602 oascsi.HttpClientUtil.createClient Creating new http client, config:maxConnections=500&maxConnectionsPerHost=16&socketTimeout=120000&connTimeout=15000
   [junit4]   2> 610885 T1602 oascc.ConnectionManager.waitForConnected Waiting for client to connect to ZooKeeper
   [junit4]   2> 610887 T1624 oascc.ConnectionManager.process Watcher org.apache.solr.common.cloud.ConnectionManager@3cef3bd1 name:ZooKeeperConnection Watcher:127.0.0.1:48134/solr got event WatchedEvent state:SyncConnected type:None path:null path:null type:None
   [junit4]   2> 610888 T1602 oascc.ConnectionManager.waitForConnected Client is connected to ZooKeeper
   [junit4]   2> 610909 T1602 oascc.SolrZkClient.makePath makePath: /overseer/queue
   [junit4]   2> 611016 T1602 oascc.SolrZkClient.makePath makePath: /overseer/collection-queue-work
   [junit4]   2> 611032 T1602 oascc.SolrZkClient.makePath makePath: /live_nodes
   [junit4]   2> 611063 T1602 oasc.ZkController.createEphemeralLiveNode Register node as live in ZooKeeper:/live_nodes/127.0.0.1:48137_
   [junit4]   2> 611126 T1602 oascc.SolrZkClient.makePath makePath: /live_nodes/127.0.0.1:48137_
   [junit4]   2> 611154 T1602 oascc.SolrZkClient.makePath makePath: /overseer_elect/election
   [junit4]   2> 611215 T1602 oascc.SolrZkClient.makePath makePath: /overseer_elect/leader
   [junit4]   2> 611219 T1602 oasc.Overseer.start Overseer (id=90133189249859587-127.0.0.1:48137_-n_0000000000) starting
   [junit4]   2> 611230 T1602 oascc.SolrZkClient.makePath makePath: /overseer/queue-work
   [junit4]   2> 611241 T1626 oasc.OverseerCollectionProcessor.run Process current queue of collection creations
   [junit4]   2> 611243 T1602 oascc.SolrZkClient.makePath makePath: /clusterstate.json
   [junit4]   2> 611246 T1602 oascc.SolrZkClient.makePath makePath: /aliases.json
   [junit4]   2> 611249 T1602 oascc.ZkStateReader.createClusterStateWatchersAndUpdate Updating cluster state from ZooKeeper... 
   [junit4]   2> 611252 T1625 oasc.Overseer$ClusterStateUpdater.run Starting to work on the main queue
   [junit4]   2> 611256 T1602 oasc.CorePropertiesLocator.discover Looking for core definitions underneath /usr/home/hudson/hudson-slave/workspace/Lucene-Solr-Tests-4.x-Java7/solr/build/solr-core/test/J1/./org.apache.solr.cloud.CollectionsAPIDistributedZkTest-controljetty-1375323322589
   [junit4]   2> 611425 T1602 oasc.CorePropertiesLocator.discoverUnder Found core conf in /usr/home/hudson/hudson-slave/workspace/Lucene-Solr-Tests-4.x-Java7/solr/build/solr-core/test/J1/./org.apache.solr.cloud.CollectionsAPIDistributedZkTest-controljetty-1375323322589/conf/
   [junit4]   2> 611428 T1602 oasc.CorePropertiesLocator.discover Found 1 core definitions
   [junit4]   2> 611429 T1602 oass.SolrDispatchFilter.init user.dir=/usr/home/hudson/hudson-slave/workspace/Lucene-Solr-Tests-4.x-Java7/solr/build/solr-core/test/J1
   [junit4]   2> 611430 T1602 oass.SolrDispatchFilter.init SolrDispatchFilter.init() done
   [junit4]   2> 611430 T1602 oascsi.HttpClientUtil.createClient Creating new http client, config:maxConnections=128&maxConnectionsPerHost=32&followRedirects=false
   [junit4]   2> 611446 T1602 oascsi.HttpClientUtil.createClient Creating new http client, config:
   [junit4]   2> 611448 T1602 oascc.ConnectionManager.waitForConnected Waiting for client to connect to ZooKeeper
   [junit4]   2> 611456 T1629 oascc.ConnectionManager.process Watcher org.apache.solr.common.cloud.ConnectionManager@f9efef name:ZooKeeperConnection Watcher:127.0.0.1:48134/solr got event WatchedEvent state:SyncConnected type:None path:null path:null type:None
   [junit4]   2> 611457 T1602 oascc.ConnectionManager.waitForConnected Client is connected to ZooKeeper
   [junit4]   2> 611459 T1602 oascc.ZkStateReader.createClusterStateWatchersAndUpdate Updating cluster state from ZooKeeper... 
   [junit4]   2> 611462 T1602 oasc.ChaosMonkey.monkeyLog monkey: init - expire sessions:true cause connection loss:true
   [junit4]   2> 611743 T1602 oejs.Server.doStart jetty-8.1.10.v20130312
   [junit4]   2> 611747 T1602 oejs.AbstractConnector.doStart Started SocketConnector@127.0.0.1:48141
   [junit4]   2> 611747 T1602 oass.SolrDispatchFilter.init SolrDispatchFilter.init()
   [junit4]   2> 611748 T1602 oasc.SolrResourceLoader.locateSolrHome JNDI not configured for solr (NoInitialContextEx)
   [junit4]   2> 611749 T1602 oasc.SolrResourceLoader.locateSolrHome using system property solr.solr.home: /usr/home/hudson/hudson-slave/workspace/Lucene-Solr-Tests-4.x-Java7/solr/build/solr-core/test/J1/./org.apache.solr.cloud.CollectionsAPIDistributedZkTest-jetty1-1375323323686
   [junit4]   2> 611749 T1602 oasc.SolrResourceLoader.<init> new SolrResourceLoader for directory: '/usr/home/hudson/hudson-slave/workspace/Lucene-Solr-Tests-4.x-Java7/solr/build/solr-core/test/J1/./org.apache.solr.cloud.CollectionsAPIDistributedZkTest-jetty1-1375323323686/'
   [junit4]   2> 611790 T1602 oasc.ConfigSolr.fromFile Loading container configuration from /usr/home/hudson/hudson-slave/workspace/Lucene-Solr-Tests-4.x-Java7/solr/build/solr-core/test/J1/./org.apache.solr.cloud.CollectionsAPIDistributedZkTest-jetty1-1375323323686/solr.xml
   [junit4]   2> 611879 T1602 oasc.ConfigSolrXml.<init> Config-defined core root directory: 
   [junit4]   2> 611880 T1602 oasc.CoreContainer.<init> New CoreContainer 1095379916
   [junit4]   2> 611881 T1602 oasc.CoreContainer.load Loading cores into CoreContainer [instanceDir=/usr/home/hudson/hudson-slave/workspace/Lucene-Solr-Tests-4.x-Java7/solr/build/solr-core/test/J1/./org.apache.solr.cloud.CollectionsAPIDistributedZkTest-jetty1-1375323323686/]
   [junit4]   2> 611883 T1602 oashc.HttpShardHandlerFactory.getParameter Setting socketTimeout to: 120000
   [junit4]   2> 611883 T1602 oashc.HttpShardHandlerFactory.getParameter Setting urlScheme to: http://
   [junit4]   2> 611884 T1602 oashc.HttpShardHandlerFactory.getParameter Setting connTimeout to: 15000
   [junit4]   2> 611885 T1602 oashc.HttpShardHandlerFactory.getParameter Setting maxConnectionsPerHost to: 20
   [junit4]   2> 611885 T1602 oashc.HttpShardHandlerFactory.getParameter Setting corePoolSize to: 0
   [junit4]   2> 611886 T1602 oashc.HttpShardHandlerFactory.getParameter Setting maximumPoolSize to: 2147483647
   [junit4]   2> 611886 T1602 oashc.HttpShardHandlerFactory.getParameter Setting maxThreadIdleTime to: 5
   [junit4]   2> 611887 T1602 oashc.HttpShardHandlerFactory.getParameter Setting sizeOfQueue to: -1
   [junit4]   2> 611887 T1602 oashc.HttpShardHandlerFactory.getParameter Setting fairnessPolicy to: false
   [junit4]   2> 611888 T1602 oascsi.HttpClientUtil.createClient Creating new http client, config:maxConnectionsPerHost=20&maxConnections=10000&socketTimeout=120000&connTimeout=15000&retry=false
   [junit4]   2> 611904 T1602 oasc.ZkContainer.initZooKeeper Zookeeper client=127.0.0.1:48134/solr
   [junit4]   2> 611905 T1602 oasc.ZkController.checkChrootPath zkHost includes chroot
   [junit4]   2> 611906 T1602 oascc.ConnectionManager.waitForConnected Waiting for client to connect to ZooKeeper
   [junit4]   2> 611912 T1640 oascc.ConnectionManager.process Watcher org.apache.solr.common.cloud.ConnectionManager@2d7580fa name:ZooKeeperConnection Watcher:127.0.0.1:48134 got event WatchedEvent state:SyncConnected type:None path:null path:null type:None
   [junit4]   2> 611912 T1602 oascc.ConnectionManager.waitForConnected Client is connected to ZooKeeper
   [junit4]   2> 611927 T1602 oascsi.HttpClientUtil.createClient Creating new http client, config:maxConnections=500&maxConnectionsPerHost=16&socketTimeout=120000&connTimeout=15000
   [junit4]   2> 611938 T1602 oascc.ConnectionManager.waitForConnected Waiting for client to connect to ZooKeeper
   [junit4]   2> 611940 T1642 oascc.ConnectionManager.process Watcher org.apache.solr.common.cloud.ConnectionManager@23ec797d name:ZooKeeperConnection Watcher:127.0.0.1:48134/solr got event WatchedEvent state:SyncConnected type:None path:null path:null type:None
   [junit4]   2> 611941 T1602 oascc.ConnectionManager.waitForConnected Client is connected to ZooKeeper
   [junit4]   2> 611953 T1602 oascc.ZkStateReader.createClusterStateWatchersAndUpdate Updating cluster state from ZooKeeper... 
   [junit4]   2> 612957 T1602 oasc.ZkController.createEphemeralLiveNode Register node as live in ZooKeeper:/live_nodes/127.0.0.1:48141_
   [junit4]   2> 612959 T1602 oascc.SolrZkClient.makePath makePath: /live_nodes/127.0.0.1:48141_
   [junit4]   2> 612964 T1629 oascc.ZkStateReader$3.process Updating live nodes... (2)
   [junit4]   2> 612964 T1642 oascc.ZkStateReader$3.process Updating live nodes... (2)
   [junit4]   2> 612964 T1624 oascc.ZkStateReader$3.process Updating live nodes... (2)
   [junit4]   2> 612971 T1602 oasc.CorePropertiesLocator.discover Looking for core definitions underneath /usr/home/hudson/hudson-slave/workspace/Lucene-Solr-Tests-4.x-Java7/solr/build/solr-core/test/J1/./org.apache.solr.cloud.CollectionsAPIDistributedZkTest-jetty1-1375323323686
   [junit4]   2> 612977 T1602 oasc.CorePropertiesLocator.discoverUnder Found core conf in /usr/home/hudson/hudson-slave/workspace/Lucene-Solr-Tests-4.x-Java7/solr/build/solr-core/test/J1/./org.apache.solr.cloud.CollectionsAPIDistributedZkTest-jetty1-1375323323686/conf/
   [junit4]   2> 613142 T1602 oasc.CorePropertiesLocator.discover Found 1 core definitions
   [junit4]   2> 613144 T1602 oass.SolrDispatchFilter.init user.dir=/usr/home/hudson/hudson-slave/workspace/Lucene-Solr-Tests-4.x-Java7/solr/build/solr-core/test/J1
   [junit4]   2> 613144 T1602 oass.SolrDispatchFilter.init SolrDispatchFilter.init() done
   [junit4]   2> 613145 T1602 oascsi.HttpClientUtil.createClient Creating new http client, config:maxConnections=128&maxConnectionsPerHost=32&followRedirects=false
   [junit4]   2> 613441 T1602 oejs.Server.doStart jetty-8.1.10.v20130312
   [junit4]   2> 613444 T1602 oejs.AbstractConnector.doStart Started SocketConnector@127.0.0.1:48144
   [junit4]   2> 613445 T1602 oass.SolrDispatchFilter.init SolrDispatchFilter.init()
   [junit4]   2> 613445 T1602 oasc.SolrResourceLoader.locateSolrHome JNDI not configured for solr (NoInitialContextEx)
   [junit4]   2> 613446 T1602 oasc.SolrResourceLoader.locateSolrHome using system property solr.solr.home: /usr/home/hudson/hudson-slave/workspace/Lucene-Solr-Tests-4.x-Java7/solr/build/solr-core/test/J1/./org.apache.solr.cloud.CollectionsAPIDistributedZkTest-jetty2-1375323325385
   [junit4]   2> 613446 T1602 oasc.SolrResourceLoader.<init> new SolrResourceLoader for directory: '/usr/home/hudson/hudson-slave/workspace/Lucene-Solr-Tests-4.x-Java7/solr/build/solr-core/test/J1/./org.apache.solr.cloud.CollectionsAPIDistributedZkTest-jetty2-1375323325385/'
   [junit4]   2> 613487 T1602 oasc.ConfigSolr.fromFile Loading container configuration from /usr/home/hudson/hudson-slave/workspace/Lucene-Solr-Tests-4.x-Java7/solr/build/solr-core/test/J1/./org.apache.solr.cloud.CollectionsAPIDistributedZkTest-jetty2-1375323325385/solr.xml
   [junit4]   2> 613577 T1602 oasc.ConfigSolrXml.<init> Config-defined core root directory: 
   [junit4]   2> 613578 T1602 oasc.CoreContainer.<init> New CoreContainer 1549477308
   [junit4]   2> 613578 T1602 oasc.CoreContainer.load Loading cores into CoreContainer [instanceDir=/usr/home/hudson/hudson-slave/workspace/Lucene-Solr-Tests-4.x-Java7/solr/build/solr-core/test/J1/./org.apache.solr.cloud.CollectionsAPIDistributedZkTest-jetty2-1375323325385/]
   [junit4]   2> 613580 T1602 oashc.HttpShardHandlerFactory.getParameter Setting socketTimeout to: 120000
   [junit4]   2> 613581 T1602 oashc.HttpShardHandlerFactory.getParameter Setting urlScheme to: http://
   [junit4]   2> 613582 T1602 oashc.HttpShardHandlerFactory.getParameter Setting connTimeout to: 15000
   [junit4]   2> 613582 T1602 oashc.HttpShardHandlerFactory.getParameter Setting maxConnectionsPerHost to: 20
   [junit4]   2> 613583 T1602 oashc.HttpShardHandlerFactory.getParameter Setting corePoolSize to: 0
   [junit4]   2> 613583 T1602 oashc.HttpShardHandlerFactory.getParameter Setting maximumPoolSize to: 2147483647
   [junit4]   2> 613584 T1602 oashc.HttpShardHandlerFactory.getParameter Setting maxThreadIdleTime to: 5
   [junit4]   2> 613584 T1602 oashc.HttpShardHandlerFactory.getParameter Setting sizeOfQueue to: -1
   [junit4]   2> 613585 T1602 oashc.HttpShardHandlerFactory.getParameter Setting fairnessPolicy to: false
   [junit4]   2> 613585 T1602 oascsi.HttpClientUtil.createClient Creating new http client, config:maxConnectionsPerHost=20&maxConnections=10000&socketTimeout=120000&connTimeout=15000&retry=false
   [junit4]   2> 613602 T1602 oasc.ZkContainer.initZooKeeper Zookeeper client=127.0.0.1:48134/solr
   [junit4]   2> 613603 T1602 oasc.ZkController.checkChrootPath zkHost includes chroot
   [junit4]   2> 613604 T1602 oascc.ConnectionManager.waitForConnected Waiting for client to connect to ZooKeeper
   [junit4]   2> 613616 T1654 oascc.ConnectionManager.process Watcher org.apache.solr.common.cloud.ConnectionManager@45ca2fb0 name:ZooKeeperConnection Watcher:127.0.0.1:48134 got event WatchedEvent state:SyncConnected type:None path:null path:null type:None
   [junit4]   2> 613616 T1602 oascc.ConnectionManager.waitForConnected Client is connected to ZooKeeper
   [junit4]   2> 613620 T1602 oascsi.HttpClientUtil.createClient Creating new http client, config:maxConnections=500&maxConnectionsPerHost=16&socketTimeout=120000&connTimeout=15000
   [junit4]   2> 613632 T1602 oascc.ConnectionManager.waitForConnected Waiting for client to connect to ZooKeeper
   [junit4]   2> 613634 T1656 oascc.ConnectionManager.process Watcher org.apache.solr.common.cloud.ConnectionManager@4edaa2c1 name:ZooKeeperConnection Watcher:127.0.0.1:48134/solr got event WatchedEvent state:SyncConnected type:None path:null path:null type:None
   [junit4]   2> 613634 T1602 oascc.ConnectionManager.waitForConnected Client is connected to ZooKeeper
   [junit4]   2> 613647 T1602 oascc.ZkStateReader.createClusterStateWatchersAndUpdate Updating cluster state from ZooKeeper... 
   [junit4]   2> 614651 T1602 oasc.ZkController.createEphemeralLiveNode Register node as live in ZooKeeper:/live_nodes/127.0.0.1:48144_
   [junit4]   2> 614662 T1602 oascc.SolrZkClient.makePath makePath: /live_nodes/127.0.0.1:48144_
   [junit4]   2> 614666 T1629 oascc.ZkStateReader$3.process Updating live nodes... (3)
   [junit4]   2> 614666 T1642 oascc.ZkStateReader$3.process Updating live nodes... (3)
   [junit4]   2> 614666 T1656 oascc.ZkStateReader$3.process Updating live nodes... (3)
   [junit4]   2> 614666 T1624 oascc.ZkStateReader$3.process Updating live nodes... (3)
   [junit4]   2> 614682 T1602 oasc.CorePropertiesLocator.discover Looking for core definitions underneath /usr/home/hudson/hudson-slave/workspace/Lucene-Solr-Tests-4.x-Java7/solr/build/solr-core/test/J1/./org.apache.solr.cloud.CollectionsAPIDistributedZkTest-jetty2-1375323325385
   [junit4]   2> 614684 T1602 oasc.CorePropertiesLocator.discoverUnder Found core conf in /usr/home/hudson/hudson-slave/workspace/Lucene-Solr-Tests-4.x-Java7/solr/build/solr-core/test/J1/./org.apache.solr.cloud.CollectionsAPIDistributedZkTest-jetty2-1375323325385/conf/
   [junit4]   2> 614852 T1602 oasc.CorePropertiesLocator.discover Found 1 core definitions
   [junit4]   2> 614853 T1602 oass.SolrDispatchFilter.init user.dir=/usr/home/hudson/hudson-slave/workspace/Lucene-Solr-Tests-4.x-Java7/solr/build/solr-core/test/J1
   [junit4]   2> 614854 T1602 oass.SolrDispatchFilter.init SolrDispatchFilter.init() done
   [junit4]   2> 614854 T1602 oascsi.HttpClientUtil.createClient Creating new http client, config:maxConnections=128&maxConnectionsPerHost=32&followRedirects=false
   [junit4]   2> 615150 T1602 oejs.Server.doStart jetty-8.1.10.v20130312
   [junit4]   2> 615154 T1602 oejs.AbstractConnector.doStart Started SocketConnector@127.0.0.1:48147
   [junit4]   2> 615154 T1602 oass.SolrDispatchFilter.init SolrDispatchFilter.init()
   [junit4]   2> 615155 T1602 oasc.SolrResourceLoader.locateSolrHome JNDI not configured for solr (NoInitialContextEx)
   [junit4]   2> 615156 T1602 oasc.SolrResourceLoader.locateSolrHome using system property solr.solr.home: /usr/home/hudson/hudson-slave/workspace/Lucene-Solr-Tests-4.x-Java7/solr/build/solr-core/test/J1/./org.apache.solr.cloud.CollectionsAPIDistributedZkTest-jetty3-1375323327095
   [junit4]   2> 615156 T1602 oasc.SolrResourceLoader.<init> new SolrResourceLoader for directory: '/usr/home/hudson/hudson-slave/workspace/Lucene-Solr-Tests-4.x-Java7/solr/build/solr-core/test/J1/./org.apache.solr.cloud.CollectionsAPIDistributedZkTest-jetty3-1375323327095/'
   [junit4]   2> 615197 T1602 oasc.ConfigSolr.fromFile Loading container configuration from /usr/home/hudson/hudson-slave/workspace/Lucene-Solr-Tests-4.x-Java7/solr/build/solr-core/test/J1/./org.apache.solr.cloud.CollectionsAPIDistributedZkTest-jetty3-1375323327095/solr.xml
   [junit4]   2> 615256 T1602 oasc.ConfigSolrXml.<init> Config-defined core root directory: 
   [junit4]   2> 615257 T1602 oasc.CoreContainer.<init> New CoreContainer 1533905903
   [junit4]   2> 615258 T1602 oasc.CoreContainer.load Loading cores into CoreContainer [instanceDir=/usr/home/hudson/hudson-slave/workspace/Lucene-Solr-Tests-4.x-Java7/solr/build/solr-core/test/J1/./org.apache.solr.cloud.CollectionsAPIDistributedZkTest-jetty3-1375323327095/]
   [junit4]   2> 615259 T1602 oashc.HttpShardHandlerFactory.getParameter Setting socketTimeout to: 120000
   [junit4]   2> 615259 T1602 oashc.HttpShardHandlerFactory.getParameter Setting urlScheme to: http://
   [junit4]   2> 615260 T1602 oashc.HttpShardHandlerFactory.getParameter Setting connTimeout to: 15000
   [junit4]   2> 615260 T1602 oashc.HttpShardHandlerFactory.getParameter Setting maxConnectionsPerHost to: 20
   [junit4]   2> 615261 T1602 oashc.HttpShardHandlerFactory.getParameter Setting corePoolSize to: 0
   [junit4]   2> 615261 T1602 oashc.HttpShardHandlerFactory.getParameter Setting maximumPoolSize to: 2147483647
   [junit4]   2> 615261 T1602 oashc.HttpShardHandlerFactory.getParameter Setting maxThreadIdleTime to: 5
   [junit4]   2> 615262 T1602 oashc.HttpShardHandlerFactory.getParameter Setting sizeOfQueue to: -1
   [junit4]   2> 615262 T1602 oashc.HttpShardHandlerFactory.getParameter Setting fairnessPolicy to: false
   [junit4]   2> 615262 T1602 oascsi.HttpClientUtil.createClient Creating new http client, config:maxConnectionsPerHost=20&maxConnections=10000&socketTimeout=120000&connTimeout=15000&retry=false
   [junit4]   2> 615274 T1602 oasc.ZkContainer.initZooKeeper Zookeeper client=127.0.0.1:48134/solr
   [junit4]   2> 615275 T1602 oasc.ZkController.checkChrootPath zkHost includes chroot
   [junit4]   2> 615277 T1602 oascc.ConnectionManager.waitForConnected Waiting for client to connect to ZooKeeper
   [junit4]   2> 615279 T1668 oascc.ConnectionManager.process Watcher org.apache.solr.common.cloud.ConnectionManager@62721e36 name:ZooKeeperConnection Watcher:127.0.0.1:48134 got event WatchedEvent state:SyncConnected type:None path:null path:null type:None
   [junit4]   2> 615280 T1602 oascc.ConnectionManager.waitForConnected Client is connected to ZooKeeper
   [junit4]   2> 615283 T1602 oascsi.HttpClientUtil.createClient Creating new http client, config:maxConnections=500&maxConnectionsPerHost=16&socketTimeout=120000&connTimeout=15000
   [junit4]   2> 615296 T1602 oascc.ConnectionManager.waitForConnected Waiting for client to connect to ZooKeeper
   [junit4]   2> 615297 T1670 oascc.ConnectionManager.process Watcher org.apache.solr.common.cloud.ConnectionManager@3f467bb name:ZooKeeperConnection Watcher:127.0.0.1:48134/solr got event WatchedEvent state:SyncConnected type:None path:null path:null type:None
   [junit4]   2> 615298 T1602 oascc.ConnectionManager.waitForConnected Client is connected to ZooKeeper
   [junit4]   2> 615310 T1602 oascc.ZkStateReader.createClusterStateWatchersAndUpdate Updating cluster state from ZooKeeper... 
   [junit4]   2> 616314 T1602 oasc.ZkController.createEphemeralLiveNode Register node as live in ZooKeeper:/live_nodes/127.0.0.1:48147_
   [junit4]   2> 616319 T1602 oascc.SolrZkClient.makePath makePath: /live_nodes/127.0.0.1:48147_
   [junit4]   2> 616324 T1629 oascc.ZkStateReader$3.process Updating live nodes... (4)
   [junit4]   2> 616325 T1642 oascc.ZkStateReader$3.process Updating live nodes... (4)
   [junit4]   2> 616324 T1624 oascc.ZkStateReader$3.process Updating live nodes... (4)
   [junit4]   2> 616324 T1656 oascc.ZkStateReader$3.process Updating live nodes... (4)
   [junit4]   2> 616324 T1670 oascc.ZkStateReader$3.process Updating live nodes... (4)
   [junit4]   2> 616332 T1602 oasc.CorePropertiesLocator.discover Looking for core definitions underneath /usr/home/hudson/hudson-slave/workspace/Lucene-Solr-Tests-4.x-Java7/solr/build/solr-core/test/J1/./org.apache.solr.cloud.CollectionsAPIDistributedZkTest-jetty3-1375323327095
   [junit4]   2> 616500 T1602 oasc.CorePropertiesLocator.discoverUnder Found core conf in /usr/home/hudson/hudson-slave/workspace/Lucene-Solr-Tests-4.x-Java7/solr/build/solr-core/test/J1/./org.apache.solr.cloud.CollectionsAPIDistributedZkTest-jetty3-1375323327095/conf/
   [junit4]   2> 616501 T1602 oasc.CorePropertiesLocator.discover Found 1 core definitions
   [junit4]   2> 616502 T1602 oass.SolrDispatchFilter.init user.dir=/usr/home/hudson/hudson-slave/workspace/Lucene-Solr-Tests-4.x-Java7/solr/build/solr-core/test/J1
   [junit4]   2> 616503 T1602 oass.SolrDispatchFilter.init SolrDispatchFilter.init() done
   [junit4]   2> 616503 T1602 oascsi.HttpClientUtil.createClient Creating new http client, config:maxConnections=128&maxConnectionsPerHost=32&followRedirects=false
   [junit4]   2> 616799 T1602 oejs.Server.doStart jetty-8.1.10.v20130312
   [junit4]   2> 616802 T1602 oejs.AbstractConnector.doStart Started SocketConnector@127.0.0.1:48150
   [junit4]   2> 616803 T1602 oass.SolrDispatchFilter.init SolrDispatchFilter.init()
   [junit4]   2> 616804 T1602 oasc.SolrResourceLoader.locateSolrHome JNDI not configured for solr (NoInitialContextEx)
   [junit4]   2> 616804 T1602 oasc.SolrResourceLoader.locateSolrHome using system property solr.solr.home: /usr/home/hudson/hudson-slave/workspace/Lucene-Solr-Tests-4.x-Java7/solr/build/solr-core/test/J1/./org.apache.solr.cloud.CollectionsAPIDistributedZkTest-jetty4-1375323328743
   [junit4]   2> 616805 T1602 oasc.SolrResourceLoader.<init> new SolrResourceLoader for directory: '/usr/home/hudson/hudson-slave/workspace/Lucene-Solr-Tests-4.x-Java7/solr/build/solr-core/test/J1/./org.apache.solr.cloud.CollectionsAPIDistributedZkTest-jetty4-1375323328743/'
   [junit4]   2> 616845 T1602 oasc.ConfigSolr.fromFile Loading container configuration from /usr/home/hudson/hudson-slave/workspace/Lucene-Solr-Tests-4.x-Java7/solr/build/solr-core/test/J1/./org.apache.solr.cloud.CollectionsAPIDistributedZkTest-jetty4-1375323328743/solr.xml
   [junit4]   2> 616935 T1602 oasc.ConfigSolrXml.<init> Config-defined core root directory: 
   [junit4]   2> 616936 T1602 oasc.CoreContainer.<init> New CoreContainer 564627662
   [junit4]   2> 616936 T1602 oasc.CoreContainer.load Loading cores into CoreContainer [instanceDir=/usr/home/hudson/hudson-slave/workspace/Lucene-Solr-Tests-4.x-Java7/solr/build/solr-core/test/J1/./org.apache.solr.cloud.CollectionsAPIDistributedZkTest-jetty4-1375323328743/]
   [junit4]   2> 616938 T1602 oashc.HttpShardHandlerFactory.getParameter Setting socketTimeout to: 120000
   [junit4]   2> 616939 T1602 oashc.HttpShardHandlerFactory.getParameter Setting urlScheme to: http://
   [junit4]   2> 616939 T1602 oashc.HttpShardHandlerFactory.getParameter Setting connTimeout to: 15000
   [junit4]   2> 616940 T1602 oashc.HttpShardHandlerFactory.getParameter Setting maxConnectionsPerHost to: 20
   [junit4]   2> 616940 T1602 oashc.HttpShardHandlerFactory.getParameter Setting corePoolSize to: 0
   [junit4]   2> 616941 T1602 oashc.HttpShardHandlerFactory.getParameter Setting maximumPoolSize to: 2147483647
   [junit4]   2> 616942 T1602 oashc.HttpShardHandlerFactory.getParameter Setting maxThreadIdleTime to: 5
   [junit4]   2> 616942 T1602 oashc.HttpShardHandlerFactory.getParameter Setting sizeOfQueue to: -1
   [junit4]   2> 616943 T1602 oashc.HttpShardHandlerFactory.getParameter Setting fairnessPolicy to: false
   [junit4]   2> 616943 T1602 oascsi.HttpClientUtil.createClient Creating new http client, config:maxConnectionsPerHost=20&maxConnections=10000&socketTimeout=120000&connTimeout=15000&retry=false
   [junit4]   2> 616959 T1602 oasc.ZkContainer.initZooKeeper Zookeeper client=127.0.0.1:48134/solr
   [junit4]   2> 616960 T1602 oasc.ZkController.checkChrootPath zkHost includes chroot
   [junit4]   2> 616961 T1602 oascc.ConnectionManager.waitForConnected Waiting for client to connect to ZooKeeper
   [junit4]   2> 616989 T1682 oascc.ConnectionManager.process Watcher org.apache.solr.common.cloud.ConnectionManager@3b9d5030 name:ZooKeeperConnection Watcher:127.0.0.1:48134 got event WatchedEvent state:SyncConnected type:None path:null path:null type:None
   [junit4]   2> 616989 T1602 oascc.ConnectionManager.waitForConnected Client is connected to ZooKeeper
   [junit4]   2> 616993 T1602 oascsi.HttpClientUtil.createClient Creating new http client, config:maxConnections=500&maxConnectionsPerHost=16&socketTimeout=120000&connTimeout=15000
   [junit4]   2> 617005 T1602 oascc.ConnectionManager.waitForConnected Waiting for client to connect to ZooKeeper
   [junit4]   2> 617007 T1684 oascc.ConnectionManager.process Watcher org.apache.solr.common.cloud.ConnectionManager@5ca4d997 name:ZooKeeperConnection Watcher:127.0.0.1:48134/solr got event WatchedEvent state:SyncConnected type:None path:null path:null type:None
   [junit4]   2> 617008 T1602 oascc.ConnectionManager.waitForConnected Client is connected to ZooKeeper
   [junit4]   2> 617020 T1602 oascc.ZkStateReader.createClusterStateWatchersAndUpdate Updating cluster state from ZooKeeper... 
   [junit4]   2> 618024 T1602 oasc.ZkController.createEphemeralLiveNode Register node as live in ZooKeeper:/live_nodes/127.0.0.1:48150_
   [junit4]   2> 618036 T1602 oascc.SolrZkClient.makePath makePath: /live_nodes/127.0.0.1:48150_
   [junit4]   2> 618040 T1670 oascc.ZkStateReader$3.process Updating live nodes... (5)
   [junit4]   2> 618041 T1629 oascc.ZkStateReader$3.process Updating live nodes... (5)
   [junit4]   2> 618041 T1642 oascc.ZkStateReader$3.process Updating live nodes... (5)
   [junit4]   2> 618041 T1684 oascc.ZkStateReader$3.process Updating live nodes... (5)
   [junit4]   2> 618041 T1624 oascc.ZkStateReader$3.process Updating live nodes... (5)
   [junit4]   2> 618040 T1656 oascc.ZkStateReader$3.process Updating live nodes... (5)
   [junit4]   2> 618055 T1602 oasc.CorePropertiesLocator.discover Looking for core definitions underneath /usr/home/hudson/hudson-slave/workspace/Lucene-Solr-Tests-4.x-Java7/solr/build/solr-core/test/J1/./org.apache.solr.cloud.CollectionsAPIDistributedZkTest-jetty4-1375323328743
   [junit4]   2> 618058 T1602 oasc.CorePropertiesLocator.discoverUnder Found core conf in /usr/home/hudson/hudson-slave/workspace/Lucene-Solr-Tests-4.x-Java7/solr/build/solr-core/test/J1/./org.apache.solr.cloud.CollectionsAPIDistributedZkTest-jetty4-1375323328743/conf/
   [junit4]   2> 618225 T1602 oasc.CorePropertiesLocator.discover Found 1 core definitions
   [junit4]   2> 618226 T1602 oass.SolrDispatchFilter.init user.dir=/usr/home/hudson/hudson-slave/workspace/Lucene-Solr-Tests-4.x-Java7/solr/build/solr-core/test/J1
   [junit4]   2> 618227 T1602 oass.SolrDispatchFilter.init SolrDispatchFilter.init() done
   [junit4]   2> 618227 T1602 oascsi.HttpClientUtil.createClient Creating new http client, config:maxConnections=128&maxConnectionsPerHost=32&followRedirects=false
   [junit4]   2> 618243 T1602 oascsi.HttpClientUtil.createClient Creating new http client, config:maxConnections=128&maxConnectionsPerHost=32&followRedirects=false
   [junit4]   2> 618256 T1632 oasha.CollectionsHandler.handleCreateAction Creating Collection : numShards=2&name=nodes_used_collection&replicationFactor=2&action=CREATE&wt=javabin&version=2
   [junit4]   2> 618258 T1624 oasc.DistributedQueue$LatchChildWatcher.process Watcher fired on path: /overseer/collection-queue-work state: SyncConnected type NodeChildrenChanged
   [junit4]   2> 618260 T1626 oasc.OverseerCollectionProcessor.run Overseer Collection Processor: Get the message id:/overseer/collection-queue-work/qn-0000000000 message:{
   [junit4]   2> 	  "operation":"createcollection",
   [junit4]   2> 	  "numShards":"2",
   [junit4]   2> 	  "name":"nodes_used_collection",
   [junit4]   2> 	  "replicationFactor":"2"}
   [junit4]   2> 618261 T1626 oasc.OverseerCollectionProcessor.processMessage WARN OverseerCollectionProcessor.processMessage : createcollection , {
   [junit4]   2> 	  "operation":"createcollection",
   [junit4]   2> 	  "numShards":"2",
   [junit4]   2> 	  "name":"nodes_used_collection",
   [junit4]   2> 	  "replicationFactor":"2"}
   [junit4]   2> 618767 T1625 oascc.ZkStateReader.updateClusterState Updating cloud state from ZooKeeper... 
   [junit4]   2> 618768 T1625 oasc.Overseer$ClusterStateUpdater.buildCollection building a new collection: nodes_used_collection
   [junit4]   2> 618768 T1625 oasc.Overseer$ClusterStateUpdater.createCollection Create collection nodes_used_collection with shards [shard1, shard2]
   [junit4]   2> 618782 T1670 oascc.ZkStateReader$2.process A cluster state change: WatchedEvent state:SyncConnected type:NodeDataChanged path:/clusterstate.json, has occurred - updating... (live nodes size: 5)
   [junit4]   2> 618782 T1684 oascc.ZkStateReader$2.process A cluster state change: WatchedEvent state:SyncConnected type:NodeDataChanged path:/clusterstate.json, has occurred - updating... (live nodes size: 5)
   [junit4]   2> 618782 T1642 oascc.ZkStateReader$2.process A cluster state change: WatchedEvent state:SyncConnected type:NodeDataChanged path:/clusterstate.json, has occurred - updating... (live nodes size: 5)
   [junit4]   2> 618782 T1656 oascc.ZkStateReader$2.process A cluster state change: WatchedEvent state:SyncConnected type:NodeDataChanged path:/clusterstate.json, has occurred - updating... (live nodes size: 5)
   [junit4]   2> 618782 T1629 oascc.ZkStateReader$2.process A cluster state change: WatchedEvent state:SyncConnected type:NodeDataChanged path:/clusterstate.json, has occurred - updating... (live nodes size: 5)
   [junit4]   2> 618782 T1624 oascc.ZkStateReader$2.process A cluster state change: WatchedEvent state:SyncConnected type:NodeDataChanged path:/clusterstate.json, has occurred - updating... (live nodes size: 5)
   [junit4]   2> 618878 T1626 oasc.OverseerCollectionProcessor.createCollection going to create cores replicas shardNames [shard1, shard2] , repFactor : 2
   [junit4]   2> 618878 T1626 oasc.OverseerCollectionProcessor.createCollection Creating shard nodes_used_collection_shard1_replica1 as part of slice shard1 of collection nodes_used_collection on 127.0.0.1:48144_
   [junit4]   2> 618879 T1626 oasc.OverseerCollectionProcessor.createCollection Creating shard nodes_used_collection_shard1_replica2 as part of slice shard1 of collection nodes_used_collection on 127.0.0.1:48147_
   [junit4]   2> 618880 T1626 oasc.OverseerCollectionProcessor.createCollection Creating shard nodes_used_collection_shard2_replica1 as part of slice shard2 of collection nodes_used_collection on 127.0.0.1:48141_
   [junit4]   2> 618881 T1626 oasc.OverseerCollectionProcessor.createCollection Creating shard nodes_used_collection_shard2_replica2 as part of slice shard2 of collection nodes_used_collection on 127.0.0.1:48137_
   [junit4]   2> 618884 T1660 oasc.ZkController.publish publishing core=nodes_used_collection_shard1_replica2 state=down
   [junit4]   2> 618884 T1633 oasc.ZkController.publish publishing core=nodes_used_collection_shard2_replica1 state=down
   [junit4]   2> 618884 T1646 oasc.ZkController.publish publishing core=nodes_used_collection_shard1_replica1 state=down
   [junit4]   2> 618885 T1614 oasc.ZkController.publish publishing core=nodes_used_collection_shard2_replica2 state=down
   [junit4]   2> 618886 T1660 oasc.ZkController.waitForCoreNodeName look for our core node name
   [junit4]   2> 618886 T1633 oasc.ZkController.waitForCoreNodeName look for our core node name
   [junit4]   2> 618887 T1646 oasc.ZkController.waitForCoreNodeName look for our core node name
   [junit4]   2> 618887 T1614 oasc.ZkController.waitForCoreNodeName look for our core node name
   [junit4]   2> 620288 T1625 oascc.ZkStateReader.updateClusterState Updating cloud state from ZooKeeper... 
   [junit4]   2> 620290 T1625 oasc.Overseer$ClusterStateUpdater.updateState WARN Could not find collection node for nodes_used_collection, skipping publish state
   [junit4]   2> 620290 T1625 oasc.Overseer$ClusterStateUpdater.updateState Update state numShards=2 message={
   [junit4]   2> 	  "operation":"state",
   [junit4]   2> 	  "core_node_name":"core_node1",
   [junit4]   2> 	  "numShards":"2",
   [junit4]   2> 	  "shard":"shard1",
   [junit4]   2> 	  "roles":null,
   [junit4]   2> 	  "state":"down",
   [junit4]   2> 	  "shard_state":"active",
   [junit4]   2> 	  "core":"nodes_used_collection_shard1_replica2",
   [junit4]   2> 	  "collection":"nodes_used_collection",
   [junit4]   2> 	  "shard_range":null,
   [junit4]   2> 	  "node_name":"127.0.0.1:48147_",
   [junit4]   2> 	  "base_url":"http://127.0.0.1:48147"}
   [junit4]   2> 620295 T1625 oasc.Overseer$ClusterStateUpdater.updateState WARN Could not find collection node for nodes_used_collection, skipping publish state
   [junit4]   2> 620296 T1625 oasc.Overseer$ClusterStateUpdater.updateState Update state numShards=2 message={
   [junit4]   2> 	  "operation":"state",
   [junit4]   2> 	  "core_node_name":"core_node2",
   [junit4]   2> 	  "numShards":"2",
   [junit4]   2> 	  "shard":"shard2",
   [junit4]   2> 	  "roles":null,
   [junit4]   2> 	  "state":"down",
   [junit4]   2> 	  "shard_state":"active",
   [junit4]   2> 	  "core":"nodes_used_collection_shard2_replica1",
   [junit4]   2> 	  "collection":"nodes_used_collection",
   [junit4]   2> 	  "shard_range":null,
   [junit4]   2> 	  "node_name":"127.0.0.1:48141_",
   [junit4]   2> 	  "base_url":"http://127.0.0.1:48141"}
   [junit4]   2> 620307 T1625 oasc.Overseer$ClusterStateUpdater.updateState WARN Could not find collection node for nodes_used_collection, skipping publish state
   [junit4]   2> 620308 T1625 oasc.Overseer$ClusterStateUpdater.updateState Update state numShards=2 message={
   [junit4]   2> 	  "operation":"state",
   [junit4]   2> 	  "core_node_name":"core_node3",
   [junit4]   2> 	  "numShards":"2",
   [junit4]   2> 	  "shard":"shard1",
   [junit4]   2> 	  "roles":null,
   [junit4]   2> 	  "state":"down",
   [junit4]   2> 	  "shard_state":"active",
   [junit4]   2> 	  "core":"nodes_used_collection_shard1_replica1",
   [junit4]   2> 	  "collection":"nodes_used_collection",
   [junit4]   2> 	  "shard_range":null,
   [junit4]   2> 	  "node_name":"127.0.0.1:48144_",
   [junit4]   2> 	  "base_url":"http://127.0.0.1:48144"}
   [junit4]   2> 620313 T1625 oasc.Overseer$ClusterStateUpdater.updateState WARN Could not find collection node for nodes_used_collection, skipping publish state
   [junit4]   2> 620313 T1625 oasc.Overseer$ClusterStateUpdater.updateState Update state numShards=2 message={
   [junit4]   2> 	  "operation":"state",
   [junit4]   2> 	  "core_node_name":"core_node4",
   [junit4]   2> 	  "numShards":"2",
   [junit4]   2> 	  "shard":"shard2",
   [junit4]   2> 	  "roles":null,
   [junit4]   2> 	  "state":"down",
   [junit4]   2> 	  "shard_state":"active",
   [junit4]   2> 	  "core":"nodes_used_collection_shard2_replica2",
   [junit4]   2> 	  "collection":"nodes_used_collection",
   [junit4]   2> 	  "shard_range":null,
   [junit4]   2> 	  "node_name":"127.0.0.1:48137_",
   [junit4]   2> 	  "base_url":"http://127.0.0.1:48137"}
   [junit4]   2> 620325 T1656 oascc.ZkStateReader$2.process A cluster state change: WatchedEvent state:SyncConnected type:NodeDataChanged path:/clusterstate.json, has occurred - updating... (live nodes size: 5)
   [junit4]   2> 620325 T1642 oascc.ZkStateReader$2.process A cluster state change: WatchedEvent state:SyncConnected type:NodeDataChanged path:/clusterstate.json, has occurred - updating... (live nodes size: 5)
   [junit4]   2> 620325 T1684 oascc.ZkStateReader$2.process A cluster state change: WatchedEvent state:SyncConnected type:NodeDataChanged path:/clusterstate.json, has occurred - updating... (live nodes size: 5)
   [junit4]   2> 620325 T1629 oascc.ZkStateReader$2.process A cluster state change: WatchedEvent state:SyncConnected type:NodeDataChanged path:/clusterstate.json, has occurred - updating... (live nodes size: 5)
   [junit4]   2> 620325 T1624 oascc.ZkStateReader$2.process A cluster state change: WatchedEvent state:SyncConnected type:NodeDataChanged path:/clusterstate.json, has occurred - updating... (live nodes size: 5)
   [junit4]   2> 620325 T1670 oascc.ZkStateReader$2.process A cluster state change: WatchedEvent state:SyncConnected type:NodeDataChanged path:/clusterstate.json, has occurred - updating... (live nodes size: 5)
   [junit4]   2> 620889 T1660 oasc.ZkController.waitForShardId waiting to find shard id in clusterstate for nodes_used_collection_shard1_replica2
   [junit4]   2> 620889 T1633 oasc.ZkController.waitForShardId waiting to find shard id in clusterstate for nodes_used_collection_shard2_replica1
   [junit4]   2> 620889 T1646 oasc.ZkController.waitForShardId waiting to find shard id in clusterstate for nodes_used_collection_shard1_replica1
   [junit4]   2> 620891 T1614 oasc.ZkController.waitForShardId waiting to find shard id in clusterstate for nodes_used_collection_shard2_replica2
   [junit4]   2> 620891 T1646 oasc.CorePropertiesLocator.writePropertiesFile ERROR Couldn't persist core properties to /usr/home/hudson/hudson-slave/workspace/Lucene-Solr-Tests-4.x-Java7/solr/build/solr-core/test/J1/./org.apache.solr.cloud.CollectionsAPIDistributedZkTest-jetty2-1375323325385/nodes_used_collection_shard1_replica1/core.properties: java.io.FileNotFoundException: /usr/home/hudson/hudson-slave/workspace/Lucene-Solr-Tests-4.x-Java7/solr/build/solr-core/test/J1/./org.apache.solr.cloud.CollectionsAPIDistributedZkTest-jetty2-1375323325385/nodes_used_collection_shard1_replica1/core.properties (No such file or directory)
   [junit4]   2> 620891 T1633 oasc.CorePropertiesLocator.writePropertiesFile ERROR Couldn't persist core properties to /usr/home/hudson/hudson-slave/workspace/Lucene-Solr-Tests-4.x-Java7/solr/build/solr-core/test/J1/./org.apache.solr.cloud.CollectionsAPIDistributedZkTest-jetty1-1375323323686/nodes_used_collection_shard2_replica1/core.properties: java.io.FileNotFoundException: /usr/home/hudson/hudson-slave/workspace/Lucene-Solr-Tests-4.x-Java7/solr/build/solr-core/test/J1/./org.apache.solr.cloud.CollectionsAPIDistributedZkTest-jetty1-1375323323686/nodes_used_collection_shard2_replica1/core.properties (No such file or directory)
   [junit4]   2> 620891 T1660 oasc.CorePropertiesLocator.writePropertiesFile ERROR Couldn't persist core properties to /usr/home/hudson/hudson-slave/workspace/Lucene-Solr-Tests-4.x-Java7/solr/build/solr-core/test/J1/./org.apache.solr.cloud.CollectionsAPIDistributedZkTest-jetty3-1375323327095/nodes_used_collection_shard1_replica2/core.properties: java.io.FileNotFoundException: /usr/home/hudson/hudson-slave/workspace/Lucene-Solr-Tests-4.x-Java7/solr/build/solr-core/test/J1/./org.apache.solr.cloud.CollectionsAPIDistributedZkTest-jetty3-1375323327095/nodes_used_collection_shard1_replica2/core.properties (No such file or directory)
   [junit4]   2> 620892 T1633 oasc.CoreContainer.create Creating SolrCore 'nodes_used_collection_shard2_replica1' using instanceDir: /usr/home/hudson/hudson-slave/workspace/Lucene-Solr-Tests-4.x-Java7/solr/build/solr-core/test/J1/./org.apache.solr.cloud.CollectionsAPIDistributedZkTest-jetty1-1375323323686/nodes_used_collection_shard2_replica1
   [junit4]   2> 620892 T1614 oasc.CorePropertiesLocator.writePropertiesFile ERROR Couldn't persist core properties to /usr/home/hudson/hudson-slave/workspace/Lucene-Solr-Tests-4.x-Java7/solr/build/solr-core/test/J1/./org.apache.solr.cloud.CollectionsAPIDistributedZkTest-controljetty-1375323322589/nodes_used_collection_shard2_replica2/core.properties: java.io.FileNotFoundException: /usr/home/hudson/hudson-slave/workspace/Lucene-Solr-Tests-4.x-Java7/solr/build/solr-core/test/J1/./org.apache.solr.cloud.CollectionsAPIDistributedZkTest-controljetty-1375323322589/nodes_used_collection_shard2_replica2/core.properties (No such file or directory)
   [junit4]   2> 620892 T1646 oasc.CoreContainer.create Creating SolrCore 'nodes_used_collection_shard1_replica1' using instanceDir: /usr/home/hudson/hudson-slave/workspace/Lucene-Solr-Tests-4.x-Java7/solr/build/solr-core/test/J1/./org.apache.solr.cloud.CollectionsAPIDistributedZkTest-jetty2-1375323325385/nodes_used_collection_shard1_replica1
   [junit4]   2> 620894 T1614 oasc.CoreContainer.create Creating SolrCore 'nodes_used_collection_shard2_replica2' using instanceDir: /usr/home/hudson/hudson-slave/workspace/Lucene-Solr-Tests-4.x-Java7/solr/build/solr-core/test/J1/./org.apache.solr.cloud.CollectionsAPIDistributedZkTest-controljetty-1375323322589/nodes_used_collection_shard2_replica2
   [junit4]   2> 620893 T1633 oasc.ZkController.createCollectionZkNode Check for collection zkNode:nodes_used_collection
   [junit4]   2> 620893 T1660 oasc.CoreContainer.create Creating SolrCore 'nodes_used_collection_shard1_replica2' using instanceDir: /usr/home/hudson/hudson-slave/workspace/Lucene-Solr-Tests-4.x-Java7/solr/build/solr-core/test/J1/./org.apache.solr.cloud.CollectionsAPIDistributedZkTest-jetty3-1375323327095/nodes_used_collection_shard1_replica2
   [junit4]   2> 620896 T1660 oasc.ZkController.createCollectionZkNode Check for collection zkNode:nodes_used_collection
   [junit4]   2> 620895 T1614 oasc.ZkController.createCollectionZkNode Check for collection zkNode:nodes_used_collection
   [junit4]   2> 620894 T1646 oasc.ZkController.createCollectionZkNode Check for collection zkNode:nodes_used_collection
   [junit4]   2> 620897 T1660 oasc.ZkController.createCollectionZkNode Creating collection in ZooKeeper:nodes_used_collection
   [junit4]   2> 620896 T1633 oasc.ZkController.createCollectionZkNode Creating collection in ZooKeeper:nodes_used_collection
   [junit4]   2> 620898 T1646 oasc.ZkController.createCollectionZkNode Creating collection in ZooKeeper:nodes_used_collection
   [junit4]   2> 620898 T1660 oasc.ZkController.getConfName Looking for collection configName
   [junit4]   2> 620897 T1614 oasc.ZkController.createCollectionZkNode Creating collection in ZooKeeper:nodes_used_collection
   [junit4]   2> 620899 T1646 oasc.ZkController.getConfName Looking for collection configName
   [junit4]   2> 620898 T1633 oasc.ZkController.getConfName Looking for collection configName
   [junit4]   2> 620900 T1660 oasc.ZkController.getConfName Only one config set found in zk - using it:conf1
   [junit4]   2> 620900 T1614 oasc.ZkController.getConfName Looking for collection configName
   [junit4]   2> 620901 T1646 oasc.ZkController.getConfName Only one config set found in zk - using it:conf1
   [junit4]   2> 620901 T1660 oascc.SolrZkClient.makePath makePath: /collections/nodes_used_collection
   [junit4]   2> 620902 T1646 oascc.SolrZkClient.makePath makePath: /collections/nodes_used_collection
   [junit4]   2> 620901 T1633 oasc.ZkController.getConfName Only one config set found in zk - using it:conf1
   [junit4]   2> 620902 T1614 oasc.ZkController.getConfName Only one config set found in zk - using it:conf1
   [junit4]   2> 620903 T1633 oascc.SolrZkClient.makePath makePath: /collections/nodes_used_collection
   [junit4]   2> 620904 T1614 oascc.SolrZkClient.makePath makePath: /collections/nodes_used_collection
   [junit4]   2> 620905 T1646 oasc.ZkController.readConfigName Load collection config from:/collections/nodes_used_collection
   [junit4]   2> 620905 T1660 oasc.ZkController.readConfigName Load collection config from:/collections/nodes_used_collection
   [junit4]   2> 620907 T1633 oasc.ZkController.readConfigName Load collection config from:/collections/nodes_used_collection
   [junit4]   2> 620960 T1614 oasc.ZkController.readConfigName Load collection config from:/collections/nodes_used_collection
   [junit4]   2> 620960 T1646 oasc.SolrResourceLoader.<init> new SolrResourceLoader for directory: '/usr/home/hudson/hudson-slave/workspace/Lucene-Solr-Tests-4.x-Java7/solr/build/solr-core/test/J1/./org.apache.solr.cloud.CollectionsAPIDistributedZkTest-jetty2-1375323325385/nodes_used_collection_shard1_replica1/'
   [junit4]   2> 620961 T1633 oasc.SolrResourceLoader.<init> new SolrResourceLoader for directory: '/usr/home/hudson/hudson-slave/workspace/Lucene-Solr-Tests-4.x-Java7/solr/build/solr-core/test/J1/./org.apache.solr.cloud.CollectionsAPIDistributedZkTest-jetty1-1375323323686/nodes_used_collection_shard2_replica1/'
   [junit4]   2> 620961 T1660 oasc.SolrResourceLoader.<init> new SolrResourceLoader for directory: '/usr/home/hudson/hudson-slave/workspace/Lucene-Solr-Tests-4.x-Java7/solr/build/solr-core/test/J1/./org.apache.solr.cloud.CollectionsAPIDistributedZkTest-jetty3-1375323327095/nodes_used_collection_shard1_replica2/'
   [junit4]   2> 620962 T1614 oasc.SolrResourceLoader.<init> new SolrResourceLoader for directory: '/usr/home/hudson/hudson-slave/workspace/Lucene-Solr-Tests-4.x-Java7/solr/build/solr-core/test/J1/./org.apache.solr.cloud.CollectionsAPIDistributedZkTest-controljetty-1375323322589/nodes_used_collection_shard2_replica2/'
   [junit4]   2> 621135 T1614 oasc.SolrConfig.<init> Using Lucene MatchVersion: LUCENE_45
   [junit4]   2> 621136 T1633 oasc.SolrConfig.<init> Using Lucene MatchVersion: LUCENE_45
   [junit4]   2> 621136 T1660 oasc.SolrConfig.<init> Using Lucene MatchVersion: LUCENE_45
   [junit4]   2> 621137 T1646 oasc.SolrConfig.<init> Using Lucene MatchVersion: LUCENE_45
   [junit4]   2> 621215 T1614 oasc.SolrConfig.<init> Loaded SolrConfig: solrconfig.xml
   [junit4]   2> 621215 T1633 oasc.SolrConfig.<init> Loaded SolrConfig: solrconfig.xml
   [junit4]   2> 621216 T1660 oasc.SolrConfig.<init> Loaded SolrConfig: solrconfig.xml
   [junit4]   2> 621218 T1646 oasc.SolrConfig.<init> Loaded SolrConfig: solrconfig.xml
   [junit4]   2> 621318 T1633 oass.IndexSchema.readSchema Reading Solr Schema from schema.xml
   [junit4]   2> 621318 T1614 oass.IndexSchema.readSchema Reading Solr Schema from schema.xml
   [junit4]   2> 621319 T1660 oass.IndexSchema.readSchema Reading Solr Schema from schema.xml
   [junit4]   2> 621320 T1646 oass.IndexSchema.readSchema Reading Solr Schema from schema.xml
   [junit4]   2> 621352 T1633 oass.IndexSchema.readSchema [nodes_used_collection_shard2_replica1] Schema name=test
   [junit4]   2> 621352 T1614 oass.IndexSchema.readSchema [nodes_used_collection_shard2_replica2] Schema name=test
   [junit4]   2> 621353 T1646 oass.IndexSchema.readSchema [nodes_used_collection_shard1_replica1] Schema name=test
   [junit4]   2> 621353 T1660 oass.IndexSchema.readSchema [nodes_used_collection_shard1_replica2] Schema name=test
   [junit4]   2> 622240 T1633 oass.ByteField.init WARN ByteField is deprecated and will be removed in 5.0. You should use TrieIntField instead.
   [junit4]   2> 622240 T1614 oass.ByteField.init WARN ByteField is deprecated and will be removed in 5.0. You should use TrieIntField instead.
   [junit4]   2> 622241 T1633 oass.ShortField.init WARN ShortField is deprecated and will be removed in 5.0. You should use TrieIntField instead.
   [junit4]   2> 622242 T1646 oass.ByteField.init WARN ByteField is deprecated and will be removed in 5.0. You should use TrieIntField instead.
   [junit4]   2> 622242 T1614 oass.ShortField.init WARN ShortField is deprecated and will be removed in 5.0. You should use TrieIntField instead.
   [junit4]   2> 622243 T1633 oass.OpenExchangeRatesOrgProvider.init Initialized with rates=open-exchange-rates.json, refreshInterval=1440.
   [junit4]   2> 622243 T1646 oass.ShortField.init WARN ShortField is deprecated and will be removed in 5.0. You should use TrieIntField instead.
   [junit4]   2> 622242 T1660 oass.ByteField.init WARN ByteField is deprecated and will be removed in 5.0. You should use TrieIntField instead.
   [junit4]   2> 622245 T1646 oass.OpenExchangeRatesOrgProvider.init Initialized with rates=open-exchange-rates.json, refreshInterval=1440.
   [junit4]   2> 622245 T1660 oass.ShortField.init WARN ShortField is deprecated and will be removed in 5.0. You should use TrieIntField instead.
   [junit4]   2> 622244 T1614 oass.OpenExchangeRatesOrgProvider.init Initialized with rates=open-exchange-rates.json, refreshInterval=1440.
   [junit4]   2> 622246 T1660 oass.OpenExchangeRatesOrgProvider.init Initialized with rates=open-exchange-rates.json, refreshInterval=1440.
   [junit4]   2> 622256 T1633 oass.IndexSchema.readSchema default search field in schema is text
   [junit4]   2> 622257 T1660 oass.IndexSchema.readSchema default search field in schema is text
   [junit4]   2> 622258 T1614 oass.IndexSchema.readSchema default search field in schema is text
   [junit4]   2> 622259 T1646 oass.IndexSchema.readSchema default search field in schema is text
   [junit4]   2> 622261 T1633 oass.IndexSchema.readSchema unique key field: id
   [junit4]   2> 622262 T1660 oass.IndexSchema.readSchema unique key field: id
   [junit4]   2> 622262 T1614 oass.IndexSchema.readSchema unique key field: id
   [junit4]   2> 622263 T1646 oass.IndexSchema.readSchema unique key field: id
   [junit4]   2> 622282 T1633 oass.FileExchangeRateProvider.reload Reloading exchange rates from file currency.xml
   [junit4]   2> 622282 T1646 oass.FileExchangeRateProvider.reload Reloading exchange rates from file currency.xml
   [junit4]   2> 622282 T1660 oass.FileExchangeRateProvider.reload Reloading exchange rates from file currency.xml
   [junit4]   2> 622282 T1614 oass.FileExchangeRateProvider.reload Reloading exchange rates from file currency.xml
   [junit4]   2> 622288 T1633 oass.FileExchangeRateProvider.reload Reloading exchange rates from file currency.xml
   [junit4]   2> 622288 T1646 oass.FileExchangeRateProvider.reload Reloading exchange rates from file currency.xml
   [junit4]   2> 622289 T1660 oass.FileExchangeRateProvider.reload Reloading exchange rates from file currency.xml
   [junit4]   2> 622289 T1614 oass.FileExchangeRateProvider.reload Reloading exchange rates from file currency.xml
   [junit4]   2> 622315 T1633 oass.OpenExchangeRatesOrgProvider.reload Reloading exchange rates from open-exchange-rates.json
   [junit4]   2> 622316 T1646 oass.OpenExchangeRatesOrgProvider.reload Reloading exchange rates from open-exchange-rates.json
   [junit4]   2> 622316 T1614 oass.OpenExchangeRatesOrgProvider.reload Reloading exchange rates from open-exchange-rates.json
   [junit4]   2> 622316 T1660 oass.OpenExchangeRatesOrgProvider.reload Reloading exchange rates from open-exchange-rates.json
   [junit4]   2> 622317 T1633 oass.OpenExchangeRatesOrgProvider$OpenExchangeRates.<init> WARN Unknown key IMPORTANT NOTE
   [junit4]   2> 622318 T1646 oass.OpenExchangeRatesOrgProvider$OpenExchangeRates.<init> WARN Unknown key IMPORTANT NOTE
   [junit4]   2> 622318 T1614 oass.OpenExchangeRatesOrgProvider$OpenExchangeRates.<init> WARN Unknown key IMPORTANT NOTE
   [junit4]   2> 622319 T1614 oass.OpenExchangeRatesOrgProvider$OpenExchangeRates.<init> WARN Expected key, got STRING
   [junit4]   2> 622318 T1633 oass.OpenExchangeRatesOrgProvider$OpenExchangeRates.<init> WARN Expected key, got STRING
   [junit4]   2> 622320 T1614 oass.OpenExchangeRatesOrgProvider.reload Reloading exchange rates from open-exchange-rates.json
   [junit4]   2> 622319 T1660 oass.OpenExchangeRatesOrgProvider$OpenExchangeRates.<init> WARN Unknown key IMPORTANT NOTE
   [junit4]   2> 622321 T1660 oass.OpenExchangeRatesOrgProvider$OpenExchangeRates.<init> WARN Expected key, got STRING
   [junit4]   2> 622319 T1646 oass.OpenExchangeRatesOrgProvider$OpenExchangeRates.<init> WARN Expected key, got STRING
   [junit4]   2> 622322 T1614 oass.OpenExchangeRatesOrgProvider$OpenExchangeRates.<init> WARN Unknown key IMPORTANT NOTE
   [junit4]   2> 622323 T1614 oass.OpenExchangeRatesOrgProvider$OpenExchangeRates.<init> WARN Expected key, got STRING
   [junit4]   2> 622322 T1660 oass.OpenExchangeRatesOrgProvider.reload Reloading exchange rates from open-exchange-rates.json
   [junit4]   2> 622320 T1633 oass.OpenExchangeRatesOrgProvider.reload Reloading exchange rates from open-exchange-rates.json
   [junit4]   2> 622323 T1614 oasc.SolrCore.initDirectoryFactory org.apache.solr.core.MockDirectoryFactory
   [junit4]   2> 622322 T1646 oass.OpenExchangeRatesOrgProvider.reload Reloading exchange rates from open-exchange-rates.json
   [junit4]   2> 622325 T1660 oass.OpenExchangeRatesOrgProvider$OpenExchangeRates.<init> WARN Unknown key IMPORTANT NOTE
   [junit4]   2> 622326 T1660 oass.OpenExchangeRatesOrgProvider$OpenExchangeRates.<init> WARN Expected key, got STRING
   [junit4]   2> 622325 T1614 oasc.SolrCore.<init> [nodes_used_collection_shard2_replica2] Opening new SolrCore at /usr/home/hudson/hudson-slave/workspace/Lucene-Solr-Tests-4.x-Java7/solr/build/solr-core/test/J1/./org.apache.solr.cloud.CollectionsAPIDistributedZkTest-controljetty-1375323322589/nodes_used_collection_shard2_replica2/, dataDir=/usr/home/hudson/hudson-slave/workspace/Lucene-Solr-Tests-4.x-Java7/solr/build/solr-core/test/J1/./org.apache.solr.cloud.CollectionsAPIDistributedZkTest-controljetty-1375323322589//nodes_used_collection_shard2_replica2/data/
   [junit4]   2> 622326 T1646 oass.OpenExchangeRatesOrgProvider$OpenExchangeRates.<init> WARN Unknown key IMPORTANT NOTE
   [junit4]   2> 622327 T1646 oass.OpenExchangeRatesOrgProvider$OpenExchangeRates.<init> WARN Expected key, got STRING
   [junit4]   2> 622326 T1660 oasc.SolrCore.initDirectoryFactory org.apache.solr.core.MockDirectoryFactory
   [junit4]   2> 622325 T1633 oass.OpenExchangeRatesOrgProvider$OpenExchangeRates.<init> WARN Unknown key IMPORTANT NOTE
   [junit4]   2> 622328 T1660 oasc.SolrCore.<init> [nodes_used_collection_shard1_replica2] Opening new SolrCore at /usr/home/hudson/hudson-slave/workspace/Lucene-Solr-Tests-4.x-Java7/solr/build/solr-core/test/J1/./org.apache.solr.cloud.CollectionsAPIDistributedZkTest-jetty3-1375323327095/nodes_used_collection_shard1_replica2/, dataDir=/usr/home/hudson/hudson-slave/workspace/Lucene-Solr-Tests-4.x-Java7/solr/build/solr-core/test/J1/./org.apache.solr.cloud.CollectionsAPIDistributedZkTest-jetty3-1375323327095//nodes_used_collection_shard1_replica2/data/
   [junit4]   2> 622328 T1646 oasc.SolrCore.initDirectoryFactory org.apache.solr.core.MockDirectoryFactory
   [junit4]   2> 622327 T1614 oasc.JmxMonitoredMap.<init> JMX monitoring is enabled. Adding Solr mbeans to JMX Server: com.sun.jmx.mbeanserver.JmxMBeanServer@31a089a6
   [junit4]   2> 622330 T1646 oasc.SolrCore.<init> [nodes_used_collection_shard1_replica1] Opening new SolrCore at /usr/home/hudson/hudson-slave/workspace/Lucene-Solr-Tests-4.x-Java7/solr/build/solr-core/test/J1/./org.apache.solr.cloud.CollectionsAPIDistributedZkTest-jetty2-1375323325385/nodes_used_collection_shard1_replica1/, dataDir=/usr/home/hudson/hudson-slave/workspace/Lucene-Solr-Tests-4.x-Java7/solr/build/solr-core/test/J1/./org.apache.solr.cloud.CollectionsAPIDistributedZkTest-jetty2-1375323325385//nodes_used_collection_shard1_replica1/data/
   [junit4]   2> 622329 T1660 oasc.JmxMonitoredMap.<init> JMX monitoring is enabled. Adding Solr mbeans to JMX Server: com.sun.jmx.mbeanserver.JmxMBeanServer@31a089a6
   [junit4]   2> 622328 T1633 oass.OpenExchangeRatesOrgProvider$OpenExchangeRates.<init> WARN Expected key, got STRING
   [junit4]   2> 622331 T1614 oasc.CachingDirectoryFactory.get return new directory for /usr/home/hudson/hudson-slave/workspace/Lucene-Solr-Tests-4.x-Java7/solr/build/solr-core/test/J1/./org.apache.solr.cloud.CollectionsAPIDistributedZkTest-controljetty-1375323322589//nodes_used_collection_shard2_replica2/data
   [junit4]   2> 622330 T1646 oasc.JmxMonitoredMap.<init> JMX monitoring is enabled. Adding Solr mbeans to JMX Server: com.sun.jmx.mbeanserver.JmxMBeanServer@31a089a6
   [junit4]   2> 622332 T1614 oasc.SolrCore.getNewIndexDir New index directory detected: old=null new=/usr/home/hudson/hudson-slave/workspace/Lucene-Solr-Tests-4.x-Java7/solr/build/solr-core/test/J1/./org.apache.solr.cloud.CollectionsAPIDistributedZkTest-controljetty-1375323322589//nodes_used_collection_shard2_replica2/data/index/
   [junit4]   2> 622332 T1660 oasc.CachingDirectoryFactory.get return new directory for /usr/home/hudson/hudson-slave/workspace/Lucene-Solr-Tests-4.x-Java7/solr/build/solr-core/test/J1/./org.apache.solr.cloud.CollectionsAPIDistributedZkTest-jetty3-1375323327095//nodes_used_collection_shard1_replica2/data
   [junit4]   2> 622333 T1646 oasc.CachingDirectoryFactory.get return new directory for /usr/home/hudson/hudson-slave/workspace/Lucene-Solr-Tests-4.x-Java7/solr/build/solr-core/test/J1/./org.apache.solr.cloud.CollectionsAPIDistributedZkTest-jetty2-1375323325385//nodes_used_collection_shard1_replica1/data
   [junit4]   2> 622332 T1633 oasc.SolrCore.initDirectoryFactory org.apache.solr.core.MockDirectoryFactory
   [junit4]   2> 622334 T1646 oasc.SolrCore.getNewIndexDir New index directory detected: old=null new=/usr/home/hudson/hudson-slave/workspace/Lucene-Solr-Tests-4.x-Java7/solr/build/solr-core/test/J1/./org.apache.solr.cloud.CollectionsAPIDistributedZkTest-jetty2-1375323325385//nodes_used_collection_shard1_replica1/data/index/
   [junit4]   2> 622333 T1660 oasc.SolrCore.getNewIndexDir New index directory detected: old=null new=/usr/home/hudson/hudson-slave/workspace/Lucene-Solr-Tests-4.x-Java7/solr/build/solr-core/test/J1/./org.apache.solr.cloud.CollectionsAPIDistributedZkTest-jetty3-1375323327095//nodes_used_collection_shard1_replica2/data/index/
   [junit4]   2> 622333 T1614 oasc.SolrCore.initIndex WARN [nodes_used_collection_shard2_replica2] Solr index directory '/usr/home/hudson/hudson-slave/workspace/Lucene-Solr-Tests-4.x-Java7/solr/build/solr-core/test/J1/./org.apache.solr.cloud.CollectionsAPIDistributedZkTest-controljetty-1375323322589/nodes_used_collection_shard2_replica2/data/index' doesn't exist. Creating new index...
   [junit4]   2> 622335 T1660 oasc.SolrCore.initIndex WARN [nodes_used_collection_shard1_replica2] Solr index directory '/usr/home/hudson/hudson-slave/workspace/Lucene-Solr-Tests-4.x-Java7/solr/build/solr-core/test/J1/./org.apache.solr.cloud.CollectionsAPIDistributedZkTest-jetty3-1375323327095/nodes_used_collection_shard1_replica2/data/index' doesn't exist. Creating new index...
   [junit4]   2> 622335 T1646 oasc.SolrCore.initIndex WARN [nodes_used_collection_shard1_replica1] Solr index directory '/usr/home/hudson/hudson-slave/workspace/Lucene-Solr-Tests-4.x-Java7/solr/build/solr-core/test/J1/./org.apache.solr.cloud.CollectionsAPIDistributedZkTest-jetty2-1375323325385/nodes_used_collection_shard1_replica1/data/index' doesn't exist. Creating new index...
   [junit4]   2> 622334 T1633 oasc.SolrCore.<init> [nodes_used_collection_shard2_replica1] Opening new SolrCore at /usr/home/hudson/hudson-slave/workspace/Lucene-Solr-Tests-4.x-Java7/solr/build/solr-core/test/J1/./org.apache.solr.cloud.CollectionsAPIDistributedZkTest-jetty1-1375323323686/nodes_used_collection_shard2_replica1/, dataDir=/usr/home/hudson/hudson-slave/workspace/Lucene-Solr-Tests-4.x-Java7/solr/build/solr-core/test/J1/./org.apache.solr.cloud.CollectionsAPIDistributedZkTest-jetty1-1375323323686//nodes_used_collection_shard2_replica1/data/
   [junit4]   2> 622337 T1646 oasc.CachingDirectoryFactory.get return new directory for /usr/home/hudson/hudson-slave/workspace/Lucene-Solr-Tests-4.x-Java7/solr/build/solr-core/test/J1/./org.apache.solr.cloud.CollectionsAPIDistributedZkTest-jetty2-1375323325385//nodes_used_collection_shard1_replica1/data/index
   [junit4]   2> 622337 T1660 oasc.CachingDirectoryFactory.get return new directory for /usr/home/hudson/hudson-slave/workspace/Lucene-Solr-Tests-4.x-Java7/solr/build/solr-core/test/J1/./org.apache.solr.cloud.CollectionsAPIDistributedZkTest-jetty3-1375323327095//nodes_used_collection_shard1_replica2/data/index
   [junit4]   2> 622336 T1614 oasc.CachingDirectoryFactory.get return new directory for /usr/home/hudson/hudson-slave/workspace/Lucene-Solr-Tests-4.x-Java7/solr/build/solr-core/test/J1/./org.apache.solr.cloud.CollectionsAPIDistributedZkTest-controljetty-1375323322589//nodes_used_collection_shard2_replica2/data/index
   [junit4]   2> 622337 T1633 oasc.JmxMonitoredMap.<init> JMX monitoring is enabled. Adding Solr mbeans to JMX Server: com.sun.jmx.mbeanserver.JmxMBeanServer@31a089a6
   [junit4]   2> 622340 T1633 oasc.CachingDirectoryFactory.get return new directory for /usr/home/hudson/hudson-slave/workspace/Lucene-Solr-Tests-4.x-Java7/solr/build/solr-core/test/J1/./org.apache.solr.cloud.CollectionsAPIDistributedZkTest-jetty1-1375323323686//nodes_used_collection_shard2_replica1/data
   [junit4]   2> 622341 T1633 oasc.SolrCore.getNewIndexDir New index directory detected: old=null new=/usr/home/hudson/hudson-slave/workspace/Lucene-Solr-Tests-4.x-Java7/solr/build/solr-core/test/J1/./org.apache.solr.cloud.CollectionsAPIDistributedZkTest-jetty1-1375323323686//nodes_used_collection_shard2_replica1/data/index/
   [junit4]   2> 622341 T1633 oasc.SolrCore.initIndex WARN [nodes_used_collection_shard2_replica1] Solr index directory '/usr/home/hudson/hudson-slave/workspace/Lucene-Solr-Tests-4.x-Java7/solr/build/solr-core/test/J1/./org.apache.solr.cloud.CollectionsAPIDistributedZkTest-jetty1-1375323323686/nodes_used_collection_shard2_replica1/data/index' doesn't exist. Creating new index...
   [junit4]   2> 622342 T1633 oasc.CachingDirectoryFactory.get return new directory for /usr/home/hudson/hudson-slave/workspace/Lucene-Solr-Tests-4.x-Java7/solr/build/solr-core/test/J1/./org.apache.solr.cloud.CollectionsAPIDistributedZkTest-jetty1-1375323323686//nodes_used_collection_shard2_replica1/data/index
   [junit4]   2> 622345 T1646 oasc.SolrDeletionPolicy.onCommit SolrDeletionPolicy.onCommit: commits: num=1
   [junit4]   2> 		commit{dir=MockDirWrapper(org.apache.lucene.store.RAMDirectory@6494d9e5 lockFactory=org.apache.lucene.store.NativeFSLockFactory@3345872b),segFN=segments_1,generation=1}
   [junit4]   2> 622345 T1614 oasc.SolrDeletionPolicy.onCommit SolrDeletionPolicy.onCommit: commits: num=1
   [junit4]   2> 		commit{dir=MockDirWrapper(org.apache.lucene.store.RAMDirectory@630806a0 lockFactory=org.apache.lucene.store.NativeFSLockFactory@5d753dcc),segFN=segments_1,generation=1}
   [junit4]   2> 622345 T1660 oasc.SolrDeletionPolicy.onCommit SolrDeletionPolicy.onCommit: commits: num=1
   [junit4]   2> 		commit{dir=MockDirWrapper(org.apache.lucene.store.RAMDirectory@3277d2 lockFactory=org.apache.lucene.store.NativeFSLockFactory@7a8ccb4a),segFN=segments_1,generation=1}
   [junit4]   2> 622346 T1614 oasc.SolrDeletionPolicy.updateCommits newest commit generation = 1
   [junit4]   2> 622345 T1646 oasc.SolrDeletionPolicy.updateCommits newest commit generation = 1
   [junit4]   2> 622346 T1660 oasc.SolrDeletionPolicy.updateCommits newest commit generation = 1
   [junit4]   2> 622348 T1633 oasc.SolrDeletionPolicy.onCommit SolrDeletionPolicy.onCommit: commits: num=1
   [junit4]   2> 		commit{dir=MockDirWrapper(org.apache.lucene.store.RAMDirectory@4f0214df lockFactory=org.apache.lucene.store.NativeFSLockFactory@25e57459),segFN=segments_1,generation=1}
   [junit4]   2> 622349 T1633 oasc.SolrDeletionPolicy.updateCommits newest commit generation = 1
   [junit4]   2> 622353 T1614 oasup.UpdateRequestProcessorChain.init inserting DistributedUpdateProcessorFactory into updateRequestProcessorChain "dedupe"
   [junit4]   2> 622354 T1614 oasup.UpdateRequestProcessorChain.init inserting DistributedUpdateProcessorFactory into updateRequestProcessorChain "stored_sig"
   [junit4]   2> 622354 T1646 oasup.UpdateRequestProcessorChain.init inserting DistributedUpdateProcessorFactory into updateRequestProcessorChain "dedupe"
   [junit4]   2> 622355 T1660 oasup.UpdateRequestProcessorChain.init inserting DistributedUpdateProcessorFactory into updateRequestProcessorChain "dedupe"
   [junit4]   2> 622355 T1646 oasup.UpdateRequestProcessorChain.init inserting DistributedUpdateProcessorFactory into updateRequestProcessorChain "stored_sig"
   [junit4]   2> 622355 T1614 oasup.UpdateRequestProcessorChain.init inserting DistributedUpdateProcessorFactory into updateRequestProcessorChain "distrib-dup-test-chain-implicit"
   [junit4]   2> 622355 T1660 oasup.UpdateRequestProcessorChain.init inserting DistributedUpdateProcessorFactory into updateRequestProcessorChain "stored_sig"
   [junit4]   2> 622355 T1633 oasup.UpdateRequestProcessorChain.init inserting DistributedUpdateProcessorFactory into updateRequestProcessorChain "dedupe"
   [junit4]   2> 622357 T1614 oasc.RequestHandlers.initHandlersFromConfig created standard: solr.StandardRequestHandler
   [junit4]   2> 622356 T1646 oasup.UpdateRequestProcessorChain.init inserting DistributedUpdateProcessorFactory into updateRequestProcessorChain "distrib-dup-test-chain-implicit"
   [junit4]   2> 622358 T1614 oasc.RequestHandlers.initHandlersFromConfig created /get: solr.RealTimeGetHandler
   [junit4]   2> 622359 T1614 oasc.RequestHandlers.initHandlersFromConfig adding lazy requestHandler: solr.ReplicationHandler
   [junit4]   2> 622357 T1633 oasup.UpdateRequestProcessorChain.init inserting DistributedUpdateProcessorFactory into updateRequestProcessorChain "stored_sig"
   [junit4]   2> 622357 T1660 oasup.UpdateRequestProcessorChain.init inserting DistributedUpdateProcessorFactory into updateRequestProcessorChain "distrib-dup-test-chain-implicit"
   [junit4]   2> 622359 T1614 oasc.RequestHandlers.initHandlersFromConfig created /replication: solr.ReplicationHandler
   [junit4]   2> 622361 T1660 oasc.RequestHandlers.initHandlersFromConfig created standard: solr.StandardRequestHandler
   [junit4]   2> 622361 T1614 oasc.RequestHandlers.initHandlersFromConfig created /update: solr.UpdateRequestHandler
   [junit4]   2> 622361 T1660 oasc.RequestHandlers.initHandlersFromConfig created /get: solr.RealTimeGetHandler
   [junit4]   2> 622362 T1660 oasc.RequestHandlers.initHandlersFromConfig adding lazy requestHandler: solr.ReplicationHandler
   [junit4]   2> 622359 T1646 oasc.RequestHandlers.initHandlersFromConfig created standard: solr.StandardRequestHandler
   [junit4]   2> 622362 T1660 oasc.RequestHandlers.initHandlersFromConfig created /replication: solr.ReplicationHandler
   [junit4]   2> 622363 T1646 oasc.RequestHandlers.initHandlersFromConfig created /get: solr.RealTimeGetHandler
   [junit4]   2> 622364 T1646 oasc.RequestHandlers.initHandlersFromConfig adding lazy requestHandler: solr.ReplicationHandler
   [junit4]   2> 622362 T1614 oasc.RequestHandlers.initHandlersFromConfig created /admin/: org.apache.solr.handler.admin.AdminHandlers
   [junit4]   2> 622360 T1633 oasup.UpdateRequestProcessorChain.init inserting DistributedUpdateProcessorFactory into updateRequestProcessorChain "distrib-dup-test-chain-implicit"
   [junit4]   2> 622364 T1646 oasc.RequestHandlers.initHandlersFromConfig created /replication: solr.ReplicationHandler
   [junit4]   2> 622366 T1633 oasc.RequestHandlers.initHandlersFromConfig created standard: solr.StandardRequestHandler
   [junit4]   2> 622364 T1660 oasc.RequestHandlers.initHandlersFromConfig created /update: solr.UpdateRequestHandler
   [junit4]   2> 622366 T1633 oasc.RequestHandlers.initHandlersFromConfig created /get: solr.RealTimeGetHandler
   [junit4]   2> 622367 T1660 oasc.RequestHandlers.initHandlersFromConfig created /admin/: org.apache.solr.handler.admin.AdminHandlers
   [junit4]   2> 622366 T1646 oasc.RequestHandlers.initHandlersFromConfig created /update: solr.UpdateRequestHandler
   [junit4]   2> 622367 T1633 oasc.RequestHandlers.initHandlersFromConfig adding lazy requestHandler: solr.ReplicationHandler
   [junit4]   2> 622368 T1646 oasc.RequestHandlers.initHandlersFromConfig created /admin/: org.apache.solr.handler.admin.AdminHandlers
   [junit4]   2> 622368 T1633 oasc.RequestHandlers.initHandlersFromConfig created /replication: solr.ReplicationHandler
   [junit4]   2> 622370 T1633 oasc.RequestHandlers.initHandlersFromConfig created /update: solr.UpdateRequestHandler
   [junit4]   2> 622370 T1633 oasc.RequestHandlers.initHandlersFromConfig created /admin/: org.apache.solr.handler.admin.AdminHandlers
   [junit4]   2> 622394 T1660 oashl.XMLLoader.init xsltCacheLifetimeSeconds=60
   [junit4]   2> 622394 T1633 oashl.XMLLoader.init xsltCacheLifetimeSeconds=60
   [junit4]   2> 622394 T1646 oashl.XMLLoader.init xsltCacheLifetimeSeconds=60
   [junit4]   2> 622394 T1614 oashl.XMLLoader.init xsltCacheLifetimeSeconds=60
   [junit4]   2> 622407 T1660 oass.SolrIndexSearcher.<init> Opening Searcher@56662b1 main
   [junit4]   2> 622407 T1633 oass.SolrIndexSearcher.<init> Opening Searcher@3caa4963 main
   [junit4]   2> 622408 T1614 oass.SolrIndexSearcher.<init> Opening Searcher@1222312 main
   [junit4]   2> 622407 T1646 oass.SolrIndexSearcher.<init> Opening Searcher@19427d56 main
   [junit4]   2> 622409 T1660 oasu.CommitTracker.<init> Hard AutoCommit: disabled
   [junit4]   2> 622409 T1660 oasu.CommitTracker.<init> Soft AutoCommit: disabled
   [junit4]   2> 622410 T1614 oasu.CommitTracker.<init> Hard AutoCommit: disabled
   [junit4]   2> 622410 T1646 oasu.CommitTracker.<init> Hard AutoCommit: disabled
   [junit4]   2> 622410 T1614 oasu.CommitTracker.<init> Soft AutoCommit: disabled
   [junit4]   2> 622410 T1633 oasu.CommitTracker.<init> Hard AutoCommit: disabled
   [junit4]   2> 622411 T1646 oasu.CommitTracker.<init> Soft AutoCommit: disabled
   [junit4]   2> 622412 T1633 oasu.CommitTracker.<init> Soft AutoCommit: disabled
   [junit4]   2> 622415 T1691 oasc.SolrCore.registerSearcher [nodes_used_collection_shard1_replica2] Registered new searcher Searcher@56662b1 main{StandardDirectoryReader(segments_1:1)}
   [junit4]   2> 622416 T1694 oasc.SolrCore.registerSearcher [nodes_used_collection_shard2_replica2] Registered new searcher Searcher@1222312 main{StandardDirectoryReader(segments_1:1)}
   [junit4]   2> 622417 T1693 oasc.SolrCore.registerSearcher [nodes_used_collection_shard1_replica1] Registered new searcher Searcher@19427d56 main{StandardDirectoryReader(segments_1:1)}
   [junit4]   2> 622417 T1692 oasc.SolrCore.registerSearcher [nodes_used_collection_shard2_replica1] Registered new searcher Searcher@3caa4963 main{StandardDirectoryReader(segments_1:1)}
   [junit4]   2> 622418 T1660 oasc.CoreContainer.registerCore registering core: nodes_used_collection_shard1_replica2
   [junit4]   2> 622418 T1660 oasc.ZkController.register Register replica - core:nodes_used_collection_shard1_replica2 address:http://127.0.0.1:48147 collection:nodes_used_collection shard:shard1
   [junit4]   2> 622418 T1614 oasc.CoreContainer.registerCore registering core: nodes_used_collection_shard2_replica2
   [junit4]   2> 622419 T1660 oascsi.HttpClientUtil.createClient Creating new http client, config:maxConnections=10000&maxConnectionsPerHost=20&connTimeout=15000&socketTimeout=30000&retry=false
   [junit4]   2> 622419 T1614 oasc.ZkController.register Register replica - core:nodes_used_collection_shard2_replica2 address:http://127.0.0.1:48137 collection:nodes_used_collection shard:shard2
   [junit4]   2> 622420 T1633 oasc.CoreContainer.registerCore registering core: nodes_used_collection_shard2_replica1
   [junit4]   2> 622419 T1646 oasc.CoreContainer.registerCore registering core: nodes_used_collection_shard1_replica1
   [junit4]   2> 622420 T1633 oasc.ZkController.register Register replica - core:nodes_used_collection_shard2_replica1 address:http://127.0.0.1:48141 collection:nodes_used_collection shard:shard2
   [junit4]   2> 622420 T1614 oascsi.HttpClientUtil.createClient Creating new http client, config:maxConnections=10000&maxConnectionsPerHost=20&connTimeout=15000&socketTimeout=30000&retry=false
   [junit4]   2> 622421 T1633 oascsi.HttpClientUtil.createClient Creating new http client, config:maxConnections=10000&maxConnectionsPerHost=20&connTimeout=15000&socketTimeout=30000&retry=false
   [junit4]   2> 622421 T1646 oasc.ZkController.register Register replica - core:nodes_used_collection_shard1_replica1 address:http://127.0.0.1:48144 collection:nodes_used_collection shard:shard1
   [junit4]   2> 622423 T1646 oascsi.HttpClientUtil.createClient Creating new http client, config:maxConnections=10000&maxConnectionsPerHost=20&connTimeout=15000&socketTimeout=30000&retry=false
   [junit4]   2> 622450 T1614 oascc.SolrZkClient.makePath makePath: /collections/nodes_used_collection/leader_elect/shard2/election
   [junit4]   2> 622451 T1633 oascc.SolrZkClient.makePath makePath: /collections/nodes_used_collection/leader_elect/shard2/election
   [junit4]   2> 622451 T1646 oascc.SolrZkClient.makePath makePath: /collections/nodes_used_collection/leader_elect/shard1/election
   [junit4]   2> 622450 T1660 oascc.SolrZkClient.makePath makePath: /collections/nodes_used_collection/leader_elect/shard1/election
   [junit4]   2> 622504 T1660 oasc.ShardLeaderElectionContext.runLeaderProcess Running the leader process for shard shard1
   [junit4]   2> 622504 T1633 oasc.ShardLeaderElectionContext.runLeaderProcess Running the leader process for shard shard2
   [junit4]   2> 622517 T1660 oasc.ShardLeaderElectionContext.waitForReplicasToComeUp Enough replicas found to continue.
   [junit4]   2> 622517 T1633 oasc.ShardLeaderElectionContext.waitForReplicasToComeUp Enough replicas found to continue.
   [junit4]   2> 622518 T1660 oasc.ShardLeaderElectionContext.runLeaderProcess I may be the new leader - try and sync
   [junit4]   2> 622518 T1633 oasc.ShardLeaderElectionContext.runLeaderProcess I may be the new leader - try and sync
   [junit4]   2> 622518 T1660 oasc.SyncStrategy.sync Sync replicas to http://127.0.0.1:48147/nodes_used_collection_shard1_replica2/
   [junit4]   2> 622519 T1633 oasc.SyncStrategy.sync Sync replicas to http://127.0.0.1:48141/nodes_used_collection_shard2_replica1/
   [junit4]   2> 622519 T1660 oasu.PeerSync.sync PeerSync: core=nodes_used_collection_shard1_replica2 url=http://127.0.0.1:48147 START replicas=[http://127.0.0.1:48144/nodes_used_collection_shard1_replica1/] nUpdates=100
   [junit4]   2> 622520 T1633 oasu.PeerSync.sync PeerSync: core=nodes_used_collection_shard2_replica1 url=http://127.0.0.1:48141 START replicas=[http://127.0.0.1:48137/nodes_used_collection_shard2_replica2/] nUpdates=100
   [junit4]   2> 622521 T1660 oasu.PeerSync.sync PeerSync: core=nodes_used_collection_shard1_replica2 url=http://127.0.0.1:48147 DONE.  We have no versions.  sync failed.
   [junit4]   2> 622521 T1633 oasu.PeerSync.sync PeerSync: core=nodes_used_collection_shard2_replica1 url=http://127.0.0.1:48141 DONE.  We have no versions.  sync failed.
   [junit4]   2> 622522 T1633 oasc.SyncStrategy.syncReplicas Leader's attempt to sync with shard failed, moving to the next candidate
   [junit4]   2> 622521 T1660 oasc.SyncStrategy.syncReplicas Leader's attempt to sync with shard failed, moving to the next candidate
   [junit4]   2> 622523 T1633 oasc.ShardLeaderElectionContext.runLeaderProcess We failed sync, b

[...truncated too long message...]

unit4]   2> 	at org.apache.zookeeper.ClientCnxn$EventThread.run(ClientCnxn.java:495)
   [junit4]   2> 
   [junit4]   2> 797181 T1684 oasc.LeaderElector$1.process WARN  org.apache.zookeeper.KeeperException$SessionExpiredException: KeeperErrorCode = Session expired for /collections/awholynewcollection_2/leader_elect/shard3/election
   [junit4]   2> 	at org.apache.zookeeper.KeeperException.create(KeeperException.java:127)
   [junit4]   2> 	at org.apache.zookeeper.KeeperException.create(KeeperException.java:51)
   [junit4]   2> 	at org.apache.zookeeper.ZooKeeper.getChildren(ZooKeeper.java:1468)
   [junit4]   2> 	at org.apache.solr.common.cloud.SolrZkClient$6.execute(SolrZkClient.java:235)
   [junit4]   2> 	at org.apache.solr.common.cloud.SolrZkClient$6.execute(SolrZkClient.java:232)
   [junit4]   2> 	at org.apache.solr.common.cloud.ZkCmdExecutor.retryOperation(ZkCmdExecutor.java:65)
   [junit4]   2> 	at org.apache.solr.common.cloud.SolrZkClient.getChildren(SolrZkClient.java:232)
   [junit4]   2> 	at org.apache.solr.cloud.LeaderElector.checkIfIamLeader(LeaderElector.java:84)
   [junit4]   2> 	at org.apache.solr.cloud.LeaderElector.access$000(LeaderElector.java:55)
   [junit4]   2> 	at org.apache.solr.cloud.LeaderElector$1.process(LeaderElector.java:129)
   [junit4]   2> 	at org.apache.zookeeper.ClientCnxn$EventThread.processEvent(ClientCnxn.java:519)
   [junit4]   2> 	at org.apache.zookeeper.ClientCnxn$EventThread.run(ClientCnxn.java:495)
   [junit4]   2> 
   [junit4]   2> 797181 T1684 oascc.ZkStateReader$3.process WARN ZooKeeper watch triggered, but Solr cannot talk to ZK
   [junit4]   2> 797182 T1684 oascc.ZkStateReader$2.process A cluster state change: WatchedEvent state:SyncConnected type:NodeChildrenChanged path:/live_nodes, has occurred - updating... (live nodes size: 2)
   [junit4]   2> 797182 T1684 oascc.ZkStateReader$2.process WARN ZooKeeper watch triggered, but Solr cannot talk to ZK
   [junit4]   2> 797182 T1684 oasc.LeaderElector$1.process WARN  org.apache.zookeeper.KeeperException$SessionExpiredException: KeeperErrorCode = Session expired for /collections/new_implicit_coll_0/leader_elect/d/election
   [junit4]   2> 	at org.apache.zookeeper.KeeperException.create(KeeperException.java:127)
   [junit4]   2> 	at org.apache.zookeeper.KeeperException.create(KeeperException.java:51)
   [junit4]   2> 	at org.apache.zookeeper.ZooKeeper.getChildren(ZooKeeper.java:1468)
   [junit4]   2> 	at org.apache.solr.common.cloud.SolrZkClient$6.execute(SolrZkClient.java:235)
   [junit4]   2> 	at org.apache.solr.common.cloud.SolrZkClient$6.execute(SolrZkClient.java:232)
   [junit4]   2> 	at org.apache.solr.common.cloud.ZkCmdExecutor.retryOperation(ZkCmdExecutor.java:65)
   [junit4]   2> 	at org.apache.solr.common.cloud.SolrZkClient.getChildren(SolrZkClient.java:232)
   [junit4]   2> 	at org.apache.solr.cloud.LeaderElector.checkIfIamLeader(LeaderElector.java:84)
   [junit4]   2> 	at org.apache.solr.cloud.LeaderElector.access$000(LeaderElector.java:55)
   [junit4]   2> 	at org.apache.solr.cloud.LeaderElector$1.process(LeaderElector.java:129)
   [junit4]   2> 	at org.apache.zookeeper.ClientCnxn$EventThread.processEvent(ClientCnxn.java:519)
   [junit4]   2> 	at org.apache.zookeeper.ClientCnxn$EventThread.run(ClientCnxn.java:495)
   [junit4]   2> 
   [junit4]   2> 797183 T1684 oasc.LeaderElector$1.process WARN  org.apache.zookeeper.KeeperException$SessionExpiredException: KeeperErrorCode = Session expired for /overseer_elect/election
   [junit4]   2> 	at org.apache.zookeeper.KeeperException.create(KeeperException.java:127)
   [junit4]   2> 	at org.apache.zookeeper.KeeperException.create(KeeperException.java:51)
   [junit4]   2> 	at org.apache.zookeeper.ZooKeeper.getChildren(ZooKeeper.java:1468)
   [junit4]   2> 	at org.apache.solr.common.cloud.SolrZkClient$6.execute(SolrZkClient.java:235)
   [junit4]   2> 	at org.apache.solr.common.cloud.SolrZkClient$6.execute(SolrZkClient.java:232)
   [junit4]   2> 	at org.apache.solr.common.cloud.ZkCmdExecutor.retryOperation(ZkCmdExecutor.java:65)
   [junit4]   2> 	at org.apache.solr.common.cloud.SolrZkClient.getChildren(SolrZkClient.java:232)
   [junit4]   2> 	at org.apache.solr.cloud.LeaderElector.checkIfIamLeader(LeaderElector.java:84)
   [junit4]   2> 	at org.apache.solr.cloud.LeaderElector.access$000(LeaderElector.java:55)
   [junit4]   2> 	at org.apache.solr.cloud.LeaderElector$1.process(LeaderElector.java:129)
   [junit4]   2> 	at org.apache.zookeeper.ClientCnxn$EventThread.processEvent(ClientCnxn.java:519)
   [junit4]   2> 	at org.apache.zookeeper.ClientCnxn$EventThread.run(ClientCnxn.java:495)
   [junit4]   2> 
   [junit4]   2> 797184 T1684 oasc.LeaderElector$1.process WARN  org.apache.zookeeper.KeeperException$SessionExpiredException: KeeperErrorCode = Session expired for /collections/new_implicit_coll_1/leader_elect/b/election
   [junit4]   2> 	at org.apache.zookeeper.KeeperException.create(KeeperException.java:127)
   [junit4]   2> 	at org.apache.zookeeper.KeeperException.create(KeeperException.java:51)
   [junit4]   2> 	at org.apache.zookeeper.ZooKeeper.getChildren(ZooKeeper.java:1468)
   [junit4]   2> 	at org.apache.solr.common.cloud.SolrZkClient$6.execute(SolrZkClient.java:235)
   [junit4]   2> 	at org.apache.solr.common.cloud.SolrZkClient$6.execute(SolrZkClient.java:232)
   [junit4]   2> 	at org.apache.solr.common.cloud.ZkCmdExecutor.retryOperation(ZkCmdExecutor.java:65)
   [junit4]   2> 	at org.apache.solr.common.cloud.SolrZkClient.getChildren(SolrZkClient.java:232)
   [junit4]   2> 	at org.apache.solr.cloud.LeaderElector.checkIfIamLeader(LeaderElector.java:84)
   [junit4]   2> 	at org.apache.solr.cloud.LeaderElector.access$000(LeaderElector.java:55)
   [junit4]   2> 	at org.apache.solr.cloud.LeaderElector$1.process(LeaderElector.java:129)
   [junit4]   2> 	at org.apache.zookeeper.ClientCnxn$EventThread.processEvent(ClientCnxn.java:519)
   [junit4]   2> 	at org.apache.zookeeper.ClientCnxn$EventThread.run(ClientCnxn.java:495)
   [junit4]   2> 
   [junit4]   2> NOTE: test params are: codec=Lucene42: {_route_=PostingsFormat(name=Memory doPackFST= true), range_facet_l=PostingsFormat(name=TestBloomFilteredLucene41Postings), text=PostingsFormat(name=Memory doPackFST= true), _version_=MockFixedIntBlock(blockSize=1663), intDefault=MockFixedIntBlock(blockSize=1663), id=Pulsing41(freqCutoff=12 minBlockSize=13 maxBlockSize=88), timestamp=PostingsFormat(name=TestBloomFilteredLucene41Postings), a_t=PostingsFormat(name=TestBloomFilteredLucene41Postings), range_facet_sl=Pulsing41(freqCutoff=12 minBlockSize=13 maxBlockSize=88), range_facet_si=PostingsFormat(name=TestBloomFilteredLucene41Postings), other_tl1=MockFixedIntBlock(blockSize=1663), multiDefault=PostingsFormat(name=TestBloomFilteredLucene41Postings), a_si=MockFixedIntBlock(blockSize=1663)}, docValues:{}, sim=DefaultSimilarity, locale=fr_CA, timezone=Mideast/Riyadh88
   [junit4]   2> NOTE: FreeBSD 9.1-RELEASE-p3 amd64/Oracle Corporation 1.7.0_25 (64-bit)/cpus=16,threads=2,free=342212984,total=529530880
   [junit4]   2> NOTE: All tests run in this JVM: [SpatialFilterTest, NumericFieldsTest, TestLazyCores, TestReload, TestLFUCache, TestClassNameShortening, DistributedSpellCheckComponentTest, TestDynamicFieldCollectionResource, TestCSVResponseWriter, FileUtilsTest, ChaosMonkeyNothingIsSafeTest, TestMergePolicyConfig, DateMathParserTest, TestInfoStreamLogging, TestSurroundQueryParser, TestReloadAndDeleteDocs, TestFastOutputStream, TestShardHandlerFactory, DistributedTermsComponentTest, FieldAnalysisRequestHandlerTest, TestRemoteStreaming, TestFaceting, PrimUtilsTest, HdfsUnloadDistributedZkTest, OpenExchangeRatesOrgProviderTest, TestFuzzyAnalyzedSuggestions, TestDistributedGrouping, TestSchemaResource, QueryEqualityTest, AnalysisAfterCoreReloadTest, AssignTest, SynonymTokenizerTest, SolrInfoMBeanTest, MinimalSchemaTest, TestLRUCache, TestTrie, HdfsBasicDistributedZk2Test, TestSearchPerf, TestJmxMonitoredMap, TestRecoveryHdfs, TestFieldTypeResource, DebugComponentTest, ExternalFileFieldSortTest, RequiredFieldsTest, BlockDirectoryTest, LukeRequestHandlerTest, DirectSolrConnectionTest, CachingDirectoryFactoryTest, TimeZoneUtilsTest, TestQueryTypes, TestLMJelinekMercerSimilarityFactory, LoggingHandlerTest, TestPropInjectDefaults, XsltUpdateRequestHandlerTest, TestBadConfig, TestCollationField, TestSolrXml, IndexReaderFactoryTest, ShowFileRequestHandlerTest, TermsComponentTest, AddSchemaFieldsUpdateProcessorFactoryTest, QueryElevationComponentTest, SolrCoreTest, ReturnFieldsTest, MultiTermTest, TestCoreDiscovery, TestCoreContainer, CurrencyFieldXmlFileTest, BasicDistributedZk2Test, CollectionsAPIDistributedZkTest]
   [junit4] Completed on J1 in 187.89s, 1 test, 1 error <<< FAILURES!

[...truncated 586 lines...]
BUILD FAILED
/usr/home/hudson/hudson-slave/workspace/Lucene-Solr-Tests-4.x-Java7/build.xml:395: The following error occurred while executing this line:
/usr/home/hudson/hudson-slave/workspace/Lucene-Solr-Tests-4.x-Java7/build.xml:375: The following error occurred while executing this line:
/usr/home/hudson/hudson-slave/workspace/Lucene-Solr-Tests-4.x-Java7/build.xml:39: The following error occurred while executing this line:
/usr/home/hudson/hudson-slave/workspace/Lucene-Solr-Tests-4.x-Java7/solr/build.xml:181: The following error occurred while executing this line:
/usr/home/hudson/hudson-slave/workspace/Lucene-Solr-Tests-4.x-Java7/solr/common-build.xml:449: The following error occurred while executing this line:
/usr/home/hudson/hudson-slave/workspace/Lucene-Solr-Tests-4.x-Java7/lucene/common-build.xml:1233: The following error occurred while executing this line:
/usr/home/hudson/hudson-slave/workspace/Lucene-Solr-Tests-4.x-Java7/lucene/common-build.xml:876: There were test failures: 321 suites, 1350 tests, 1 error, 34 ignored (6 assumptions)

Total time: 56 minutes 40 seconds
Build step 'Invoke Ant' marked build as failure
Archiving artifacts
Recording test results
Email was triggered for: Failure
Sending email for trigger: Failure



Mime
View raw message