lucene-dev mailing list archives

Site index · List index
Message view « Date » · « Thread »
Top « Date » · « Thread »
From Policeman Jenkins Server <jenk...@thetaphi.de>
Subject [JENKINS] Lucene-Solr-trunk-Linux (32bit/jdk1.7.0_25) - Build # 6823 - Still Failing!
Date Thu, 01 Aug 2013 05:14:38 GMT
Build: http://jenkins.thetaphi.de/job/Lucene-Solr-trunk-Linux/6823/
Java: 32bit/jdk1.7.0_25 -server -XX:+UseSerialGC

1 tests failed.
FAILED:  org.apache.solr.cloud.CollectionsAPIDistributedZkTest.testDistribSearch

Error Message:
Server refused connection at: http://127.0.0.1:45694

Stack Trace:
org.apache.solr.client.solrj.SolrServerException: Server refused connection at: http://127.0.0.1:45694
	at __randomizedtesting.SeedInfo.seed([7F46CD7550B5AC0D:FEA0436D27EACC31]:0)
	at org.apache.solr.client.solrj.impl.HttpSolrServer.request(HttpSolrServer.java:428)
	at org.apache.solr.client.solrj.impl.HttpSolrServer.request(HttpSolrServer.java:180)
	at org.apache.solr.cloud.CollectionsAPIDistributedZkTest.testCustomCollectionsAPI(CollectionsAPIDistributedZkTest.java:764)
	at org.apache.solr.cloud.CollectionsAPIDistributedZkTest.doTest(CollectionsAPIDistributedZkTest.java:159)
	at org.apache.solr.BaseDistributedSearchTestCase.testDistribSearch(BaseDistributedSearchTestCase.java:835)
	at sun.reflect.NativeMethodAccessorImpl.invoke0(Native Method)
	at sun.reflect.NativeMethodAccessorImpl.invoke(NativeMethodAccessorImpl.java:57)
	at sun.reflect.DelegatingMethodAccessorImpl.invoke(DelegatingMethodAccessorImpl.java:43)
	at java.lang.reflect.Method.invoke(Method.java:606)
	at com.carrotsearch.randomizedtesting.RandomizedRunner.invoke(RandomizedRunner.java:1559)
	at com.carrotsearch.randomizedtesting.RandomizedRunner.access$600(RandomizedRunner.java:79)
	at com.carrotsearch.randomizedtesting.RandomizedRunner$6.evaluate(RandomizedRunner.java:737)
	at com.carrotsearch.randomizedtesting.RandomizedRunner$7.evaluate(RandomizedRunner.java:773)
	at com.carrotsearch.randomizedtesting.RandomizedRunner$8.evaluate(RandomizedRunner.java:787)
	at com.carrotsearch.randomizedtesting.rules.SystemPropertiesRestoreRule$1.evaluate(SystemPropertiesRestoreRule.java:53)
	at org.apache.lucene.util.TestRuleSetupTeardownChained$1.evaluate(TestRuleSetupTeardownChained.java:50)
	at org.apache.lucene.util.TestRuleFieldCacheSanity$1.evaluate(TestRuleFieldCacheSanity.java:51)
	at org.apache.lucene.util.AbstractBeforeAfterRule$1.evaluate(AbstractBeforeAfterRule.java:46)
	at com.carrotsearch.randomizedtesting.rules.SystemPropertiesInvariantRule$1.evaluate(SystemPropertiesInvariantRule.java:55)
	at org.apache.lucene.util.TestRuleThreadAndTestName$1.evaluate(TestRuleThreadAndTestName.java:49)
	at org.apache.lucene.util.TestRuleIgnoreAfterMaxFailures$1.evaluate(TestRuleIgnoreAfterMaxFailures.java:70)
	at org.apache.lucene.util.TestRuleMarkFailure$1.evaluate(TestRuleMarkFailure.java:48)
	at com.carrotsearch.randomizedtesting.rules.StatementAdapter.evaluate(StatementAdapter.java:36)
	at com.carrotsearch.randomizedtesting.ThreadLeakControl$StatementRunner.run(ThreadLeakControl.java:358)
	at com.carrotsearch.randomizedtesting.ThreadLeakControl.forkTimeoutingTask(ThreadLeakControl.java:782)
	at com.carrotsearch.randomizedtesting.ThreadLeakControl$3.evaluate(ThreadLeakControl.java:442)
	at com.carrotsearch.randomizedtesting.RandomizedRunner.runSingleTest(RandomizedRunner.java:746)
	at com.carrotsearch.randomizedtesting.RandomizedRunner$3.evaluate(RandomizedRunner.java:648)
	at com.carrotsearch.randomizedtesting.RandomizedRunner$4.evaluate(RandomizedRunner.java:682)
	at com.carrotsearch.randomizedtesting.RandomizedRunner$5.evaluate(RandomizedRunner.java:693)
	at com.carrotsearch.randomizedtesting.rules.StatementAdapter.evaluate(StatementAdapter.java:36)
	at com.carrotsearch.randomizedtesting.rules.SystemPropertiesRestoreRule$1.evaluate(SystemPropertiesRestoreRule.java:53)
	at org.apache.lucene.util.AbstractBeforeAfterRule$1.evaluate(AbstractBeforeAfterRule.java:46)
	at org.apache.lucene.util.TestRuleStoreClassName$1.evaluate(TestRuleStoreClassName.java:42)
	at com.carrotsearch.randomizedtesting.rules.SystemPropertiesInvariantRule$1.evaluate(SystemPropertiesInvariantRule.java:55)
	at com.carrotsearch.randomizedtesting.rules.NoShadowingOrOverridesOnMethodsRule$1.evaluate(NoShadowingOrOverridesOnMethodsRule.java:39)
	at com.carrotsearch.randomizedtesting.rules.NoShadowingOrOverridesOnMethodsRule$1.evaluate(NoShadowingOrOverridesOnMethodsRule.java:39)
	at com.carrotsearch.randomizedtesting.rules.StatementAdapter.evaluate(StatementAdapter.java:36)
	at org.apache.lucene.util.TestRuleAssertionsRequired$1.evaluate(TestRuleAssertionsRequired.java:43)
	at org.apache.lucene.util.TestRuleMarkFailure$1.evaluate(TestRuleMarkFailure.java:48)
	at org.apache.lucene.util.TestRuleIgnoreAfterMaxFailures$1.evaluate(TestRuleIgnoreAfterMaxFailures.java:70)
	at org.apache.lucene.util.TestRuleIgnoreTestSuites$1.evaluate(TestRuleIgnoreTestSuites.java:55)
	at com.carrotsearch.randomizedtesting.rules.StatementAdapter.evaluate(StatementAdapter.java:36)
	at com.carrotsearch.randomizedtesting.ThreadLeakControl$StatementRunner.run(ThreadLeakControl.java:358)
	at java.lang.Thread.run(Thread.java:724)
Caused by: org.apache.http.conn.HttpHostConnectException: Connection to http://127.0.0.1:45694 refused
	at org.apache.http.impl.conn.DefaultClientConnectionOperator.openConnection(DefaultClientConnectionOperator.java:190)
	at org.apache.http.impl.conn.ManagedClientConnectionImpl.open(ManagedClientConnectionImpl.java:294)
	at org.apache.http.impl.client.DefaultRequestDirector.tryConnect(DefaultRequestDirector.java:645)
	at org.apache.http.impl.client.DefaultRequestDirector.execute(DefaultRequestDirector.java:480)
	at org.apache.http.impl.client.AbstractHttpClient.execute(AbstractHttpClient.java:906)
	at org.apache.http.impl.client.AbstractHttpClient.execute(AbstractHttpClient.java:805)
	at org.apache.http.impl.client.AbstractHttpClient.execute(AbstractHttpClient.java:784)
	at org.apache.solr.client.solrj.impl.HttpSolrServer.request(HttpSolrServer.java:365)
	... 44 more
Caused by: java.net.ConnectException: Connection refused
	at java.net.PlainSocketImpl.socketConnect(Native Method)
	at java.net.AbstractPlainSocketImpl.doConnect(AbstractPlainSocketImpl.java:339)
	at java.net.AbstractPlainSocketImpl.connectToAddress(AbstractPlainSocketImpl.java:200)
	at java.net.AbstractPlainSocketImpl.connect(AbstractPlainSocketImpl.java:182)
	at java.net.SocksSocketImpl.connect(SocksSocketImpl.java:392)
	at java.net.Socket.connect(Socket.java:579)
	at org.apache.http.conn.scheme.PlainSocketFactory.connectSocket(PlainSocketFactory.java:127)
	at org.apache.http.impl.conn.DefaultClientConnectionOperator.openConnection(DefaultClientConnectionOperator.java:180)
	... 51 more




Build Log:
[...truncated 9771 lines...]
   [junit4] Suite: org.apache.solr.cloud.CollectionsAPIDistributedZkTest
   [junit4]   2> 732844 T2497 oas.BaseDistributedSearchTestCase.initHostContext Setting hostContext system property: /
   [junit4]   2> 732849 T2497 oas.SolrTestCaseJ4.setUp ###Starting testDistribSearch
   [junit4]   2> Creating dataDir: /mnt/ssd/jenkins/workspace/Lucene-Solr-trunk-Linux/solr/build/solr-core/test/J0/./solrtest-CollectionsAPIDistributedZkTest-1375333481404
   [junit4]   2> 732850 T2497 oasc.ZkTestServer.run STARTING ZK TEST SERVER
   [junit4]   2> 732850 T2498 oasc.ZkTestServer$ZKServerMain.runFromConfig Starting server
   [junit4]   2> 732950 T2497 oasc.ZkTestServer.run start zk server on port:58454
   [junit4]   2> 732951 T2497 oascc.ConnectionManager.waitForConnected Waiting for client to connect to ZooKeeper
   [junit4]   2> 733372 T2504 oascc.ConnectionManager.process Watcher org.apache.solr.common.cloud.ConnectionManager@185b01 name:ZooKeeperConnection Watcher:127.0.0.1:58454 got event WatchedEvent state:SyncConnected type:None path:null path:null type:None
   [junit4]   2> 733372 T2497 oascc.ConnectionManager.waitForConnected Client is connected to ZooKeeper
   [junit4]   2> 733372 T2497 oascc.SolrZkClient.makePath makePath: /solr
   [junit4]   2> 733376 T2497 oascc.ConnectionManager.waitForConnected Waiting for client to connect to ZooKeeper
   [junit4]   2> 733380 T2506 oascc.ConnectionManager.process Watcher org.apache.solr.common.cloud.ConnectionManager@15ffb7 name:ZooKeeperConnection Watcher:127.0.0.1:58454/solr got event WatchedEvent state:SyncConnected type:None path:null path:null type:None
   [junit4]   2> 733380 T2497 oascc.ConnectionManager.waitForConnected Client is connected to ZooKeeper
   [junit4]   2> 733380 T2497 oascc.SolrZkClient.makePath makePath: /collections/collection1
   [junit4]   2> 733383 T2497 oascc.SolrZkClient.makePath makePath: /collections/collection1/shards
   [junit4]   2> 733384 T2497 oascc.SolrZkClient.makePath makePath: /collections/control_collection
   [junit4]   2> 733386 T2497 oascc.SolrZkClient.makePath makePath: /collections/control_collection/shards
   [junit4]   2> 733388 T2497 oasc.AbstractZkTestCase.putConfig put /mnt/ssd/jenkins/workspace/Lucene-Solr-trunk-Linux/solr/build/solr-core/test-files/solr/collection1/conf/solrconfig-tlog.xml to /configs/conf1/solrconfig.xml
   [junit4]   2> 733389 T2497 oascc.SolrZkClient.makePath makePath: /configs/conf1/solrconfig.xml
   [junit4]   2> 733394 T2497 oasc.AbstractZkTestCase.putConfig put /mnt/ssd/jenkins/workspace/Lucene-Solr-trunk-Linux/solr/build/solr-core/test-files/solr/collection1/conf/schema.xml to /configs/conf1/schema.xml
   [junit4]   2> 733394 T2497 oascc.SolrZkClient.makePath makePath: /configs/conf1/schema.xml
   [junit4]   2> 733397 T2497 oasc.AbstractZkTestCase.putConfig put /mnt/ssd/jenkins/workspace/Lucene-Solr-trunk-Linux/solr/build/solr-core/test-files/solr/collection1/conf/stopwords.txt to /configs/conf1/stopwords.txt
   [junit4]   2> 733397 T2497 oascc.SolrZkClient.makePath makePath: /configs/conf1/stopwords.txt
   [junit4]   2> 733399 T2497 oasc.AbstractZkTestCase.putConfig put /mnt/ssd/jenkins/workspace/Lucene-Solr-trunk-Linux/solr/build/solr-core/test-files/solr/collection1/conf/protwords.txt to /configs/conf1/protwords.txt
   [junit4]   2> 733399 T2497 oascc.SolrZkClient.makePath makePath: /configs/conf1/protwords.txt
   [junit4]   2> 733401 T2497 oasc.AbstractZkTestCase.putConfig put /mnt/ssd/jenkins/workspace/Lucene-Solr-trunk-Linux/solr/build/solr-core/test-files/solr/collection1/conf/currency.xml to /configs/conf1/currency.xml
   [junit4]   2> 733401 T2497 oascc.SolrZkClient.makePath makePath: /configs/conf1/currency.xml
   [junit4]   2> 733404 T2497 oasc.AbstractZkTestCase.putConfig put /mnt/ssd/jenkins/workspace/Lucene-Solr-trunk-Linux/solr/build/solr-core/test-files/solr/collection1/conf/open-exchange-rates.json to /configs/conf1/open-exchange-rates.json
   [junit4]   2> 733404 T2497 oascc.SolrZkClient.makePath makePath: /configs/conf1/open-exchange-rates.json
   [junit4]   2> 733406 T2497 oasc.AbstractZkTestCase.putConfig put /mnt/ssd/jenkins/workspace/Lucene-Solr-trunk-Linux/solr/build/solr-core/test-files/solr/collection1/conf/mapping-ISOLatin1Accent.txt to /configs/conf1/mapping-ISOLatin1Accent.txt
   [junit4]   2> 733406 T2497 oascc.SolrZkClient.makePath makePath: /configs/conf1/mapping-ISOLatin1Accent.txt
   [junit4]   2> 733408 T2497 oasc.AbstractZkTestCase.putConfig put /mnt/ssd/jenkins/workspace/Lucene-Solr-trunk-Linux/solr/build/solr-core/test-files/solr/collection1/conf/old_synonyms.txt to /configs/conf1/old_synonyms.txt
   [junit4]   2> 733409 T2497 oascc.SolrZkClient.makePath makePath: /configs/conf1/old_synonyms.txt
   [junit4]   2> 733410 T2497 oasc.AbstractZkTestCase.putConfig put /mnt/ssd/jenkins/workspace/Lucene-Solr-trunk-Linux/solr/build/solr-core/test-files/solr/collection1/conf/synonyms.txt to /configs/conf1/synonyms.txt
   [junit4]   2> 733410 T2497 oascc.SolrZkClient.makePath makePath: /configs/conf1/synonyms.txt
   [junit4]   2> 733482 T2497 oejs.Server.doStart jetty-8.1.10.v20130312
   [junit4]   2> 733484 T2497 oejs.AbstractConnector.doStart Started SelectChannelConnector@127.0.0.1:41390
   [junit4]   2> 733484 T2497 oass.SolrDispatchFilter.init SolrDispatchFilter.init()
   [junit4]   2> 733485 T2497 oasc.SolrResourceLoader.locateSolrHome JNDI not configured for solr (NoInitialContextEx)
   [junit4]   2> 733485 T2497 oasc.SolrResourceLoader.locateSolrHome using system property solr.solr.home: /mnt/ssd/jenkins/workspace/Lucene-Solr-trunk-Linux/solr/build/solr-core/test/J0/./org.apache.solr.cloud.CollectionsAPIDistributedZkTest-controljetty-1375333481967
   [junit4]   2> 733485 T2497 oasc.SolrResourceLoader.<init> new SolrResourceLoader for directory: '/mnt/ssd/jenkins/workspace/Lucene-Solr-trunk-Linux/solr/build/solr-core/test/J0/./org.apache.solr.cloud.CollectionsAPIDistributedZkTest-controljetty-1375333481967/'
   [junit4]   2> 733494 T2497 oasc.ConfigSolr.fromFile Loading container configuration from /mnt/ssd/jenkins/workspace/Lucene-Solr-trunk-Linux/solr/build/solr-core/test/J0/./org.apache.solr.cloud.CollectionsAPIDistributedZkTest-controljetty-1375333481967/solr.xml
   [junit4]   2> 733525 T2497 oasc.ConfigSolrXml.<init> Config-defined core root directory: 
   [junit4]   2> 733526 T2497 oasc.CoreContainer.<init> New CoreContainer 24286377
   [junit4]   2> 733526 T2497 oasc.CoreContainer.load Loading cores into CoreContainer [instanceDir=/mnt/ssd/jenkins/workspace/Lucene-Solr-trunk-Linux/solr/build/solr-core/test/J0/./org.apache.solr.cloud.CollectionsAPIDistributedZkTest-controljetty-1375333481967/]
   [junit4]   2> 733527 T2497 oashc.HttpShardHandlerFactory.getParameter Setting socketTimeout to: 120000
   [junit4]   2> 733527 T2497 oashc.HttpShardHandlerFactory.getParameter Setting urlScheme to: http://
   [junit4]   2> 733527 T2497 oashc.HttpShardHandlerFactory.getParameter Setting connTimeout to: 15000
   [junit4]   2> 733528 T2497 oashc.HttpShardHandlerFactory.getParameter Setting maxConnectionsPerHost to: 20
   [junit4]   2> 733528 T2497 oashc.HttpShardHandlerFactory.getParameter Setting corePoolSize to: 0
   [junit4]   2> 733528 T2497 oashc.HttpShardHandlerFactory.getParameter Setting maximumPoolSize to: 2147483647
   [junit4]   2> 733528 T2497 oashc.HttpShardHandlerFactory.getParameter Setting maxThreadIdleTime to: 5
   [junit4]   2> 733529 T2497 oashc.HttpShardHandlerFactory.getParameter Setting sizeOfQueue to: -1
   [junit4]   2> 733529 T2497 oashc.HttpShardHandlerFactory.getParameter Setting fairnessPolicy to: false
   [junit4]   2> 733529 T2497 oascsi.HttpClientUtil.createClient Creating new http client, config:maxConnectionsPerHost=20&maxConnections=10000&socketTimeout=120000&connTimeout=15000&retry=false
   [junit4]   2> 733532 T2497 oasc.ZkContainer.initZooKeeper Zookeeper client=127.0.0.1:58454/solr
   [junit4]   2> 733533 T2497 oasc.ZkController.checkChrootPath zkHost includes chroot
   [junit4]   2> 733533 T2497 oascc.ConnectionManager.waitForConnected Waiting for client to connect to ZooKeeper
   [junit4]   2> 733535 T2517 oascc.ConnectionManager.process Watcher org.apache.solr.common.cloud.ConnectionManager@c18a3e name:ZooKeeperConnection Watcher:127.0.0.1:58454 got event WatchedEvent state:SyncConnected type:None path:null path:null type:None
   [junit4]   2> 733535 T2497 oascc.ConnectionManager.waitForConnected Client is connected to ZooKeeper
   [junit4]   2> 733536 T2497 oascsi.HttpClientUtil.createClient Creating new http client, config:maxConnections=500&maxConnectionsPerHost=16&socketTimeout=120000&connTimeout=15000
   [junit4]   2> 733539 T2497 oascc.ConnectionManager.waitForConnected Waiting for client to connect to ZooKeeper
   [junit4]   2> 733540 T2519 oascc.ConnectionManager.process Watcher org.apache.solr.common.cloud.ConnectionManager@1222ee1 name:ZooKeeperConnection Watcher:127.0.0.1:58454/solr got event WatchedEvent state:SyncConnected type:None path:null path:null type:None
   [junit4]   2> 733540 T2497 oascc.ConnectionManager.waitForConnected Client is connected to ZooKeeper
   [junit4]   2> 733541 T2497 oascc.SolrZkClient.makePath makePath: /overseer/queue
   [junit4]   2> 733543 T2497 oascc.SolrZkClient.makePath makePath: /overseer/collection-queue-work
   [junit4]   2> 733545 T2497 oascc.SolrZkClient.makePath makePath: /live_nodes
   [junit4]   2> 733546 T2497 oasc.ZkController.createEphemeralLiveNode Register node as live in ZooKeeper:/live_nodes/127.0.0.1:41390_
   [junit4]   2> 733547 T2497 oascc.SolrZkClient.makePath makePath: /live_nodes/127.0.0.1:41390_
   [junit4]   2> 733548 T2497 oascc.SolrZkClient.makePath makePath: /overseer_elect/election
   [junit4]   2> 733552 T2497 oascc.SolrZkClient.makePath makePath: /overseer_elect/leader
   [junit4]   2> 733554 T2497 oasc.Overseer.start Overseer (id=90133855037423619-127.0.0.1:41390_-n_0000000000) starting
   [junit4]   2> 733556 T2497 oascc.SolrZkClient.makePath makePath: /overseer/queue-work
   [junit4]   2> 733558 T2521 oasc.OverseerCollectionProcessor.run Process current queue of collection creations
   [junit4]   2> 733559 T2497 oascc.SolrZkClient.makePath makePath: /clusterstate.json
   [junit4]   2> 733560 T2497 oascc.SolrZkClient.makePath makePath: /aliases.json
   [junit4]   2> 733561 T2497 oascc.ZkStateReader.createClusterStateWatchersAndUpdate Updating cluster state from ZooKeeper... 
   [junit4]   2> 733563 T2520 oasc.Overseer$ClusterStateUpdater.run Starting to work on the main queue
   [junit4]   2> 733565 T2497 oasc.CorePropertiesLocator.discover Looking for core definitions underneath /mnt/ssd/jenkins/workspace/Lucene-Solr-trunk-Linux/solr/build/solr-core/test/J0/./org.apache.solr.cloud.CollectionsAPIDistributedZkTest-controljetty-1375333481967
   [junit4]   2> 733589 T2497 oasc.CorePropertiesLocator.discoverUnder Found core conf in /mnt/ssd/jenkins/workspace/Lucene-Solr-trunk-Linux/solr/build/solr-core/test/J0/./org.apache.solr.cloud.CollectionsAPIDistributedZkTest-controljetty-1375333481967/conf/
   [junit4]   2> 733589 T2497 oasc.CorePropertiesLocator.discover Found 1 core definitions
   [junit4]   2> 733590 T2497 oass.SolrDispatchFilter.init user.dir=/mnt/ssd/jenkins/workspace/Lucene-Solr-trunk-Linux/solr/build/solr-core/test/J0
   [junit4]   2> 733590 T2497 oass.SolrDispatchFilter.init SolrDispatchFilter.init() done
   [junit4]   2> 733590 T2497 oascsi.HttpClientUtil.createClient Creating new http client, config:maxConnections=128&maxConnectionsPerHost=32&followRedirects=false
   [junit4]   2> 733593 T2497 oascsi.HttpClientUtil.createClient Creating new http client, config:
   [junit4]   2> 733594 T2497 oascc.ConnectionManager.waitForConnected Waiting for client to connect to ZooKeeper
   [junit4]   2> 733595 T2524 oascc.ConnectionManager.process Watcher org.apache.solr.common.cloud.ConnectionManager@f60024 name:ZooKeeperConnection Watcher:127.0.0.1:58454/solr got event WatchedEvent state:SyncConnected type:None path:null path:null type:None
   [junit4]   2> 733595 T2497 oascc.ConnectionManager.waitForConnected Client is connected to ZooKeeper
   [junit4]   2> 733596 T2497 oascc.ZkStateReader.createClusterStateWatchersAndUpdate Updating cluster state from ZooKeeper... 
   [junit4]   2> 733598 T2497 oasc.ChaosMonkey.monkeyLog monkey: init - expire sessions:true cause connection loss:true
   [junit4]   2> 733675 T2497 oejs.Server.doStart jetty-8.1.10.v20130312
   [junit4]   2> 733676 T2497 oejs.AbstractConnector.doStart Started SelectChannelConnector@127.0.0.1:45694
   [junit4]   2> 733677 T2497 oass.SolrDispatchFilter.init SolrDispatchFilter.init()
   [junit4]   2> 733677 T2497 oasc.SolrResourceLoader.locateSolrHome JNDI not configured for solr (NoInitialContextEx)
   [junit4]   2> 733677 T2497 oasc.SolrResourceLoader.locateSolrHome using system property solr.solr.home: /mnt/ssd/jenkins/workspace/Lucene-Solr-trunk-Linux/solr/build/solr-core/test/J0/./org.apache.solr.cloud.CollectionsAPIDistributedZkTest-jetty1-1375333482152
   [junit4]   2> 733678 T2497 oasc.SolrResourceLoader.<init> new SolrResourceLoader for directory: '/mnt/ssd/jenkins/workspace/Lucene-Solr-trunk-Linux/solr/build/solr-core/test/J0/./org.apache.solr.cloud.CollectionsAPIDistributedZkTest-jetty1-1375333482152/'
   [junit4]   2> 733687 T2497 oasc.ConfigSolr.fromFile Loading container configuration from /mnt/ssd/jenkins/workspace/Lucene-Solr-trunk-Linux/solr/build/solr-core/test/J0/./org.apache.solr.cloud.CollectionsAPIDistributedZkTest-jetty1-1375333482152/solr.xml
   [junit4]   2> 733714 T2497 oasc.ConfigSolrXml.<init> Config-defined core root directory: 
   [junit4]   2> 733715 T2497 oasc.CoreContainer.<init> New CoreContainer 33117375
   [junit4]   2> 733715 T2497 oasc.CoreContainer.load Loading cores into CoreContainer [instanceDir=/mnt/ssd/jenkins/workspace/Lucene-Solr-trunk-Linux/solr/build/solr-core/test/J0/./org.apache.solr.cloud.CollectionsAPIDistributedZkTest-jetty1-1375333482152/]
   [junit4]   2> 733716 T2497 oashc.HttpShardHandlerFactory.getParameter Setting socketTimeout to: 120000
   [junit4]   2> 733716 T2497 oashc.HttpShardHandlerFactory.getParameter Setting urlScheme to: http://
   [junit4]   2> 733717 T2497 oashc.HttpShardHandlerFactory.getParameter Setting connTimeout to: 15000
   [junit4]   2> 733717 T2497 oashc.HttpShardHandlerFactory.getParameter Setting maxConnectionsPerHost to: 20
   [junit4]   2> 733717 T2497 oashc.HttpShardHandlerFactory.getParameter Setting corePoolSize to: 0
   [junit4]   2> 733717 T2497 oashc.HttpShardHandlerFactory.getParameter Setting maximumPoolSize to: 2147483647
   [junit4]   2> 733718 T2497 oashc.HttpShardHandlerFactory.getParameter Setting maxThreadIdleTime to: 5
   [junit4]   2> 733718 T2497 oashc.HttpShardHandlerFactory.getParameter Setting sizeOfQueue to: -1
   [junit4]   2> 733718 T2497 oashc.HttpShardHandlerFactory.getParameter Setting fairnessPolicy to: false
   [junit4]   2> 733718 T2497 oascsi.HttpClientUtil.createClient Creating new http client, config:maxConnectionsPerHost=20&maxConnections=10000&socketTimeout=120000&connTimeout=15000&retry=false
   [junit4]   2> 733721 T2497 oasc.ZkContainer.initZooKeeper Zookeeper client=127.0.0.1:58454/solr
   [junit4]   2> 733721 T2497 oasc.ZkController.checkChrootPath zkHost includes chroot
   [junit4]   2> 733722 T2497 oascc.ConnectionManager.waitForConnected Waiting for client to connect to ZooKeeper
   [junit4]   2> 733723 T2535 oascc.ConnectionManager.process Watcher org.apache.solr.common.cloud.ConnectionManager@83a735 name:ZooKeeperConnection Watcher:127.0.0.1:58454 got event WatchedEvent state:SyncConnected type:None path:null path:null type:None
   [junit4]   2> 733724 T2497 oascc.ConnectionManager.waitForConnected Client is connected to ZooKeeper
   [junit4]   2> 733725 T2497 oascsi.HttpClientUtil.createClient Creating new http client, config:maxConnections=500&maxConnectionsPerHost=16&socketTimeout=120000&connTimeout=15000
   [junit4]   2> 733728 T2497 oascc.ConnectionManager.waitForConnected Waiting for client to connect to ZooKeeper
   [junit4]   2> 733729 T2537 oascc.ConnectionManager.process Watcher org.apache.solr.common.cloud.ConnectionManager@d99b49 name:ZooKeeperConnection Watcher:127.0.0.1:58454/solr got event WatchedEvent state:SyncConnected type:None path:null path:null type:None
   [junit4]   2> 733729 T2497 oascc.ConnectionManager.waitForConnected Client is connected to ZooKeeper
   [junit4]   2> 733732 T2497 oascc.ZkStateReader.createClusterStateWatchersAndUpdate Updating cluster state from ZooKeeper... 
   [junit4]   2> 734734 T2497 oasc.ZkController.createEphemeralLiveNode Register node as live in ZooKeeper:/live_nodes/127.0.0.1:45694_
   [junit4]   2> 734737 T2497 oascc.SolrZkClient.makePath makePath: /live_nodes/127.0.0.1:45694_
   [junit4]   2> 734740 T2519 oascc.ZkStateReader$3.process Updating live nodes... (2)
   [junit4]   2> 734740 T2524 oascc.ZkStateReader$3.process Updating live nodes... (2)
   [junit4]   2> 734740 T2537 oascc.ZkStateReader$3.process Updating live nodes... (2)
   [junit4]   2> 734744 T2497 oasc.CorePropertiesLocator.discover Looking for core definitions underneath /mnt/ssd/jenkins/workspace/Lucene-Solr-trunk-Linux/solr/build/solr-core/test/J0/./org.apache.solr.cloud.CollectionsAPIDistributedZkTest-jetty1-1375333482152
   [junit4]   2> 734766 T2497 oasc.CorePropertiesLocator.discoverUnder Found core conf in /mnt/ssd/jenkins/workspace/Lucene-Solr-trunk-Linux/solr/build/solr-core/test/J0/./org.apache.solr.cloud.CollectionsAPIDistributedZkTest-jetty1-1375333482152/conf/
   [junit4]   2> 734766 T2497 oasc.CorePropertiesLocator.discover Found 1 core definitions
   [junit4]   2> 734767 T2497 oass.SolrDispatchFilter.init user.dir=/mnt/ssd/jenkins/workspace/Lucene-Solr-trunk-Linux/solr/build/solr-core/test/J0
   [junit4]   2> 734767 T2497 oass.SolrDispatchFilter.init SolrDispatchFilter.init() done
   [junit4]   2> 734767 T2497 oascsi.HttpClientUtil.createClient Creating new http client, config:maxConnections=128&maxConnectionsPerHost=32&followRedirects=false
   [junit4]   2> 734833 T2497 oejs.Server.doStart jetty-8.1.10.v20130312
   [junit4]   2> 734834 T2497 oejs.AbstractConnector.doStart Started SelectChannelConnector@127.0.0.1:58903
   [junit4]   2> 734834 T2497 oass.SolrDispatchFilter.init SolrDispatchFilter.init()
   [junit4]   2> 734835 T2497 oasc.SolrResourceLoader.locateSolrHome JNDI not configured for solr (NoInitialContextEx)
   [junit4]   2> 734835 T2497 oasc.SolrResourceLoader.locateSolrHome using system property solr.solr.home: /mnt/ssd/jenkins/workspace/Lucene-Solr-trunk-Linux/solr/build/solr-core/test/J0/./org.apache.solr.cloud.CollectionsAPIDistributedZkTest-jetty2-1375333483324
   [junit4]   2> 734835 T2497 oasc.SolrResourceLoader.<init> new SolrResourceLoader for directory: '/mnt/ssd/jenkins/workspace/Lucene-Solr-trunk-Linux/solr/build/solr-core/test/J0/./org.apache.solr.cloud.CollectionsAPIDistributedZkTest-jetty2-1375333483324/'
   [junit4]   2> 734844 T2497 oasc.ConfigSolr.fromFile Loading container configuration from /mnt/ssd/jenkins/workspace/Lucene-Solr-trunk-Linux/solr/build/solr-core/test/J0/./org.apache.solr.cloud.CollectionsAPIDistributedZkTest-jetty2-1375333483324/solr.xml
   [junit4]   2> 734887 T2497 oasc.ConfigSolrXml.<init> Config-defined core root directory: 
   [junit4]   2> 734887 T2497 oasc.CoreContainer.<init> New CoreContainer 22806590
   [junit4]   2> 734888 T2497 oasc.CoreContainer.load Loading cores into CoreContainer [instanceDir=/mnt/ssd/jenkins/workspace/Lucene-Solr-trunk-Linux/solr/build/solr-core/test/J0/./org.apache.solr.cloud.CollectionsAPIDistributedZkTest-jetty2-1375333483324/]
   [junit4]   2> 734889 T2497 oashc.HttpShardHandlerFactory.getParameter Setting socketTimeout to: 120000
   [junit4]   2> 734889 T2497 oashc.HttpShardHandlerFactory.getParameter Setting urlScheme to: http://
   [junit4]   2> 734889 T2497 oashc.HttpShardHandlerFactory.getParameter Setting connTimeout to: 15000
   [junit4]   2> 734889 T2497 oashc.HttpShardHandlerFactory.getParameter Setting maxConnectionsPerHost to: 20
   [junit4]   2> 734890 T2497 oashc.HttpShardHandlerFactory.getParameter Setting corePoolSize to: 0
   [junit4]   2> 734890 T2497 oashc.HttpShardHandlerFactory.getParameter Setting maximumPoolSize to: 2147483647
   [junit4]   2> 734890 T2497 oashc.HttpShardHandlerFactory.getParameter Setting maxThreadIdleTime to: 5
   [junit4]   2> 734890 T2497 oashc.HttpShardHandlerFactory.getParameter Setting sizeOfQueue to: -1
   [junit4]   2> 734891 T2497 oashc.HttpShardHandlerFactory.getParameter Setting fairnessPolicy to: false
   [junit4]   2> 734891 T2497 oascsi.HttpClientUtil.createClient Creating new http client, config:maxConnectionsPerHost=20&maxConnections=10000&socketTimeout=120000&connTimeout=15000&retry=false
   [junit4]   2> 734894 T2497 oasc.ZkContainer.initZooKeeper Zookeeper client=127.0.0.1:58454/solr
   [junit4]   2> 734894 T2497 oasc.ZkController.checkChrootPath zkHost includes chroot
   [junit4]   2> 734895 T2497 oascc.ConnectionManager.waitForConnected Waiting for client to connect to ZooKeeper
   [junit4]   2> 734896 T2549 oascc.ConnectionManager.process Watcher org.apache.solr.common.cloud.ConnectionManager@16342a1 name:ZooKeeperConnection Watcher:127.0.0.1:58454 got event WatchedEvent state:SyncConnected type:None path:null path:null type:None
   [junit4]   2> 734896 T2497 oascc.ConnectionManager.waitForConnected Client is connected to ZooKeeper
   [junit4]   2> 734898 T2497 oascsi.HttpClientUtil.createClient Creating new http client, config:maxConnections=500&maxConnectionsPerHost=16&socketTimeout=120000&connTimeout=15000
   [junit4]   2> 734901 T2497 oascc.ConnectionManager.waitForConnected Waiting for client to connect to ZooKeeper
   [junit4]   2> 734902 T2551 oascc.ConnectionManager.process Watcher org.apache.solr.common.cloud.ConnectionManager@166624f name:ZooKeeperConnection Watcher:127.0.0.1:58454/solr got event WatchedEvent state:SyncConnected type:None path:null path:null type:None
   [junit4]   2> 734902 T2497 oascc.ConnectionManager.waitForConnected Client is connected to ZooKeeper
   [junit4]   2> 734904 T2497 oascc.ZkStateReader.createClusterStateWatchersAndUpdate Updating cluster state from ZooKeeper... 
   [junit4]   2> 735907 T2497 oasc.ZkController.createEphemeralLiveNode Register node as live in ZooKeeper:/live_nodes/127.0.0.1:58903_
   [junit4]   2> 735908 T2497 oascc.SolrZkClient.makePath makePath: /live_nodes/127.0.0.1:58903_
   [junit4]   2> 735910 T2519 oascc.ZkStateReader$3.process Updating live nodes... (3)
   [junit4]   2> 735910 T2524 oascc.ZkStateReader$3.process Updating live nodes... (3)
   [junit4]   2> 735910 T2551 oascc.ZkStateReader$3.process Updating live nodes... (3)
   [junit4]   2> 735911 T2537 oascc.ZkStateReader$3.process Updating live nodes... (3)
   [junit4]   2> 735914 T2497 oasc.CorePropertiesLocator.discover Looking for core definitions underneath /mnt/ssd/jenkins/workspace/Lucene-Solr-trunk-Linux/solr/build/solr-core/test/J0/./org.apache.solr.cloud.CollectionsAPIDistributedZkTest-jetty2-1375333483324
   [junit4]   2> 735936 T2497 oasc.CorePropertiesLocator.discoverUnder Found core conf in /mnt/ssd/jenkins/workspace/Lucene-Solr-trunk-Linux/solr/build/solr-core/test/J0/./org.apache.solr.cloud.CollectionsAPIDistributedZkTest-jetty2-1375333483324/conf/
   [junit4]   2> 735936 T2497 oasc.CorePropertiesLocator.discover Found 1 core definitions
   [junit4]   2> 735937 T2497 oass.SolrDispatchFilter.init user.dir=/mnt/ssd/jenkins/workspace/Lucene-Solr-trunk-Linux/solr/build/solr-core/test/J0
   [junit4]   2> 735937 T2497 oass.SolrDispatchFilter.init SolrDispatchFilter.init() done
   [junit4]   2> 735937 T2497 oascsi.HttpClientUtil.createClient Creating new http client, config:maxConnections=128&maxConnectionsPerHost=32&followRedirects=false
   [junit4]   2> 736002 T2497 oejs.Server.doStart jetty-8.1.10.v20130312
   [junit4]   2> 736004 T2497 oejs.AbstractConnector.doStart Started SelectChannelConnector@127.0.0.1:48322
   [junit4]   2> 736005 T2497 oass.SolrDispatchFilter.init SolrDispatchFilter.init()
   [junit4]   2> 736005 T2497 oasc.SolrResourceLoader.locateSolrHome JNDI not configured for solr (NoInitialContextEx)
   [junit4]   2> 736005 T2497 oasc.SolrResourceLoader.locateSolrHome using system property solr.solr.home: /mnt/ssd/jenkins/workspace/Lucene-Solr-trunk-Linux/solr/build/solr-core/test/J0/./org.apache.solr.cloud.CollectionsAPIDistributedZkTest-jetty3-1375333484494
   [junit4]   2> 736005 T2497 oasc.SolrResourceLoader.<init> new SolrResourceLoader for directory: '/mnt/ssd/jenkins/workspace/Lucene-Solr-trunk-Linux/solr/build/solr-core/test/J0/./org.apache.solr.cloud.CollectionsAPIDistributedZkTest-jetty3-1375333484494/'
   [junit4]   2> 736014 T2497 oasc.ConfigSolr.fromFile Loading container configuration from /mnt/ssd/jenkins/workspace/Lucene-Solr-trunk-Linux/solr/build/solr-core/test/J0/./org.apache.solr.cloud.CollectionsAPIDistributedZkTest-jetty3-1375333484494/solr.xml
   [junit4]   2> 736054 T2497 oasc.ConfigSolrXml.<init> Config-defined core root directory: 
   [junit4]   2> 736054 T2497 oasc.CoreContainer.<init> New CoreContainer 22852821
   [junit4]   2> 736055 T2497 oasc.CoreContainer.load Loading cores into CoreContainer [instanceDir=/mnt/ssd/jenkins/workspace/Lucene-Solr-trunk-Linux/solr/build/solr-core/test/J0/./org.apache.solr.cloud.CollectionsAPIDistributedZkTest-jetty3-1375333484494/]
   [junit4]   2> 736055 T2497 oashc.HttpShardHandlerFactory.getParameter Setting socketTimeout to: 120000
   [junit4]   2> 736056 T2497 oashc.HttpShardHandlerFactory.getParameter Setting urlScheme to: http://
   [junit4]   2> 736056 T2497 oashc.HttpShardHandlerFactory.getParameter Setting connTimeout to: 15000
   [junit4]   2> 736056 T2497 oashc.HttpShardHandlerFactory.getParameter Setting maxConnectionsPerHost to: 20
   [junit4]   2> 736057 T2497 oashc.HttpShardHandlerFactory.getParameter Setting corePoolSize to: 0
   [junit4]   2> 736057 T2497 oashc.HttpShardHandlerFactory.getParameter Setting maximumPoolSize to: 2147483647
   [junit4]   2> 736057 T2497 oashc.HttpShardHandlerFactory.getParameter Setting maxThreadIdleTime to: 5
   [junit4]   2> 736057 T2497 oashc.HttpShardHandlerFactory.getParameter Setting sizeOfQueue to: -1
   [junit4]   2> 736058 T2497 oashc.HttpShardHandlerFactory.getParameter Setting fairnessPolicy to: false
   [junit4]   2> 736058 T2497 oascsi.HttpClientUtil.createClient Creating new http client, config:maxConnectionsPerHost=20&maxConnections=10000&socketTimeout=120000&connTimeout=15000&retry=false
   [junit4]   2> 736061 T2497 oasc.ZkContainer.initZooKeeper Zookeeper client=127.0.0.1:58454/solr
   [junit4]   2> 736061 T2497 oasc.ZkController.checkChrootPath zkHost includes chroot
   [junit4]   2> 736062 T2497 oascc.ConnectionManager.waitForConnected Waiting for client to connect to ZooKeeper
   [junit4]   2> 736063 T2563 oascc.ConnectionManager.process Watcher org.apache.solr.common.cloud.ConnectionManager@6a5b5b name:ZooKeeperConnection Watcher:127.0.0.1:58454 got event WatchedEvent state:SyncConnected type:None path:null path:null type:None
   [junit4]   2> 736063 T2497 oascc.ConnectionManager.waitForConnected Client is connected to ZooKeeper
   [junit4]   2> 736065 T2497 oascsi.HttpClientUtil.createClient Creating new http client, config:maxConnections=500&maxConnectionsPerHost=16&socketTimeout=120000&connTimeout=15000
   [junit4]   2> 736068 T2497 oascc.ConnectionManager.waitForConnected Waiting for client to connect to ZooKeeper
   [junit4]   2> 736069 T2565 oascc.ConnectionManager.process Watcher org.apache.solr.common.cloud.ConnectionManager@1e8386d name:ZooKeeperConnection Watcher:127.0.0.1:58454/solr got event WatchedEvent state:SyncConnected type:None path:null path:null type:None
   [junit4]   2> 736069 T2497 oascc.ConnectionManager.waitForConnected Client is connected to ZooKeeper
   [junit4]   2> 736072 T2497 oascc.ZkStateReader.createClusterStateWatchersAndUpdate Updating cluster state from ZooKeeper... 
   [junit4]   2> 737074 T2497 oasc.ZkController.createEphemeralLiveNode Register node as live in ZooKeeper:/live_nodes/127.0.0.1:48322_
   [junit4]   2> 737075 T2497 oascc.SolrZkClient.makePath makePath: /live_nodes/127.0.0.1:48322_
   [junit4]   2> 737078 T2519 oascc.ZkStateReader$3.process Updating live nodes... (4)
   [junit4]   2> 737078 T2524 oascc.ZkStateReader$3.process Updating live nodes... (4)
   [junit4]   2> 737078 T2551 oascc.ZkStateReader$3.process Updating live nodes... (4)
   [junit4]   2> 737078 T2565 oascc.ZkStateReader$3.process Updating live nodes... (4)
   [junit4]   2> 737078 T2537 oascc.ZkStateReader$3.process Updating live nodes... (4)
   [junit4]   2> 737082 T2497 oasc.CorePropertiesLocator.discover Looking for core definitions underneath /mnt/ssd/jenkins/workspace/Lucene-Solr-trunk-Linux/solr/build/solr-core/test/J0/./org.apache.solr.cloud.CollectionsAPIDistributedZkTest-jetty3-1375333484494
   [junit4]   2> 737104 T2497 oasc.CorePropertiesLocator.discoverUnder Found core conf in /mnt/ssd/jenkins/workspace/Lucene-Solr-trunk-Linux/solr/build/solr-core/test/J0/./org.apache.solr.cloud.CollectionsAPIDistributedZkTest-jetty3-1375333484494/conf/
   [junit4]   2> 737104 T2497 oasc.CorePropertiesLocator.discover Found 1 core definitions
   [junit4]   2> 737105 T2497 oass.SolrDispatchFilter.init user.dir=/mnt/ssd/jenkins/workspace/Lucene-Solr-trunk-Linux/solr/build/solr-core/test/J0
   [junit4]   2> 737105 T2497 oass.SolrDispatchFilter.init SolrDispatchFilter.init() done
   [junit4]   2> 737105 T2497 oascsi.HttpClientUtil.createClient Creating new http client, config:maxConnections=128&maxConnectionsPerHost=32&followRedirects=false
   [junit4]   2> 737170 T2497 oejs.Server.doStart jetty-8.1.10.v20130312
   [junit4]   2> 737171 T2497 oejs.AbstractConnector.doStart Started SelectChannelConnector@127.0.0.1:56006
   [junit4]   2> 737172 T2497 oass.SolrDispatchFilter.init SolrDispatchFilter.init()
   [junit4]   2> 737172 T2497 oasc.SolrResourceLoader.locateSolrHome JNDI not configured for solr (NoInitialContextEx)
   [junit4]   2> 737172 T2497 oasc.SolrResourceLoader.locateSolrHome using system property solr.solr.home: /mnt/ssd/jenkins/workspace/Lucene-Solr-trunk-Linux/solr/build/solr-core/test/J0/./org.apache.solr.cloud.CollectionsAPIDistributedZkTest-jetty4-1375333485662
   [junit4]   2> 737173 T2497 oasc.SolrResourceLoader.<init> new SolrResourceLoader for directory: '/mnt/ssd/jenkins/workspace/Lucene-Solr-trunk-Linux/solr/build/solr-core/test/J0/./org.apache.solr.cloud.CollectionsAPIDistributedZkTest-jetty4-1375333485662/'
   [junit4]   2> 737181 T2497 oasc.ConfigSolr.fromFile Loading container configuration from /mnt/ssd/jenkins/workspace/Lucene-Solr-trunk-Linux/solr/build/solr-core/test/J0/./org.apache.solr.cloud.CollectionsAPIDistributedZkTest-jetty4-1375333485662/solr.xml
   [junit4]   2> 737209 T2497 oasc.ConfigSolrXml.<init> Config-defined core root directory: 
   [junit4]   2> 737209 T2497 oasc.CoreContainer.<init> New CoreContainer 12194963
   [junit4]   2> 737209 T2497 oasc.CoreContainer.load Loading cores into CoreContainer [instanceDir=/mnt/ssd/jenkins/workspace/Lucene-Solr-trunk-Linux/solr/build/solr-core/test/J0/./org.apache.solr.cloud.CollectionsAPIDistributedZkTest-jetty4-1375333485662/]
   [junit4]   2> 737210 T2497 oashc.HttpShardHandlerFactory.getParameter Setting socketTimeout to: 120000
   [junit4]   2> 737210 T2497 oashc.HttpShardHandlerFactory.getParameter Setting urlScheme to: http://
   [junit4]   2> 737211 T2497 oashc.HttpShardHandlerFactory.getParameter Setting connTimeout to: 15000
   [junit4]   2> 737211 T2497 oashc.HttpShardHandlerFactory.getParameter Setting maxConnectionsPerHost to: 20
   [junit4]   2> 737211 T2497 oashc.HttpShardHandlerFactory.getParameter Setting corePoolSize to: 0
   [junit4]   2> 737211 T2497 oashc.HttpShardHandlerFactory.getParameter Setting maximumPoolSize to: 2147483647
   [junit4]   2> 737212 T2497 oashc.HttpShardHandlerFactory.getParameter Setting maxThreadIdleTime to: 5
   [junit4]   2> 737212 T2497 oashc.HttpShardHandlerFactory.getParameter Setting sizeOfQueue to: -1
   [junit4]   2> 737212 T2497 oashc.HttpShardHandlerFactory.getParameter Setting fairnessPolicy to: false
   [junit4]   2> 737212 T2497 oascsi.HttpClientUtil.createClient Creating new http client, config:maxConnectionsPerHost=20&maxConnections=10000&socketTimeout=120000&connTimeout=15000&retry=false
   [junit4]   2> 737215 T2497 oasc.ZkContainer.initZooKeeper Zookeeper client=127.0.0.1:58454/solr
   [junit4]   2> 737216 T2497 oasc.ZkController.checkChrootPath zkHost includes chroot
   [junit4]   2> 737216 T2497 oascc.ConnectionManager.waitForConnected Waiting for client to connect to ZooKeeper
   [junit4]   2> 737228 T2577 oascc.ConnectionManager.process Watcher org.apache.solr.common.cloud.ConnectionManager@be288e name:ZooKeeperConnection Watcher:127.0.0.1:58454 got event WatchedEvent state:SyncConnected type:None path:null path:null type:None
   [junit4]   2> 737228 T2497 oascc.ConnectionManager.waitForConnected Client is connected to ZooKeeper
   [junit4]   2> 737230 T2497 oascsi.HttpClientUtil.createClient Creating new http client, config:maxConnections=500&maxConnectionsPerHost=16&socketTimeout=120000&connTimeout=15000
   [junit4]   2> 737233 T2497 oascc.ConnectionManager.waitForConnected Waiting for client to connect to ZooKeeper
   [junit4]   2> 737234 T2579 oascc.ConnectionManager.process Watcher org.apache.solr.common.cloud.ConnectionManager@5dd48f name:ZooKeeperConnection Watcher:127.0.0.1:58454/solr got event WatchedEvent state:SyncConnected type:None path:null path:null type:None
   [junit4]   2> 737234 T2497 oascc.ConnectionManager.waitForConnected Client is connected to ZooKeeper
   [junit4]   2> 737237 T2497 oascc.ZkStateReader.createClusterStateWatchersAndUpdate Updating cluster state from ZooKeeper... 
   [junit4]   2> 738239 T2497 oasc.ZkController.createEphemeralLiveNode Register node as live in ZooKeeper:/live_nodes/127.0.0.1:56006_
   [junit4]   2> 738241 T2497 oascc.SolrZkClient.makePath makePath: /live_nodes/127.0.0.1:56006_
   [junit4]   2> 738242 T2551 oascc.ZkStateReader$3.process Updating live nodes... (5)
   [junit4]   2> 738243 T2519 oascc.ZkStateReader$3.process Updating live nodes... (5)
   [junit4]   2> 738243 T2524 oascc.ZkStateReader$3.process Updating live nodes... (5)
   [junit4]   2> 738243 T2537 oascc.ZkStateReader$3.process Updating live nodes... (5)
   [junit4]   2> 738243 T2565 oascc.ZkStateReader$3.process Updating live nodes... (5)
   [junit4]   2> 738244 T2579 oascc.ZkStateReader$3.process Updating live nodes... (5)
   [junit4]   2> 738247 T2497 oasc.CorePropertiesLocator.discover Looking for core definitions underneath /mnt/ssd/jenkins/workspace/Lucene-Solr-trunk-Linux/solr/build/solr-core/test/J0/./org.apache.solr.cloud.CollectionsAPIDistributedZkTest-jetty4-1375333485662
   [junit4]   2> 738270 T2497 oasc.CorePropertiesLocator.discoverUnder Found core conf in /mnt/ssd/jenkins/workspace/Lucene-Solr-trunk-Linux/solr/build/solr-core/test/J0/./org.apache.solr.cloud.CollectionsAPIDistributedZkTest-jetty4-1375333485662/conf/
   [junit4]   2> 738271 T2497 oasc.CorePropertiesLocator.discover Found 1 core definitions
   [junit4]   2> 738271 T2497 oass.SolrDispatchFilter.init user.dir=/mnt/ssd/jenkins/workspace/Lucene-Solr-trunk-Linux/solr/build/solr-core/test/J0
   [junit4]   2> 738271 T2497 oass.SolrDispatchFilter.init SolrDispatchFilter.init() done
   [junit4]   2> 738272 T2497 oascsi.HttpClientUtil.createClient Creating new http client, config:maxConnections=128&maxConnectionsPerHost=32&followRedirects=false
   [junit4]   2> 738276 T2497 oascsi.HttpClientUtil.createClient Creating new http client, config:maxConnections=128&maxConnectionsPerHost=32&followRedirects=false
   [junit4]   2> 738280 T2532 oasha.CollectionsHandler.handleCreateAction Creating Collection : numShards=2&name=nodes_used_collection&replicationFactor=2&action=CREATE&wt=javabin&version=2
   [junit4]   2> 738282 T2519 oasc.DistributedQueue$LatchChildWatcher.process Watcher fired on path: /overseer/collection-queue-work state: SyncConnected type NodeChildrenChanged
   [junit4]   2> 738284 T2521 oasc.OverseerCollectionProcessor.run Overseer Collection Processor: Get the message id:/overseer/collection-queue-work/qn-0000000000 message:{
   [junit4]   2> 	  "operation":"createcollection",
   [junit4]   2> 	  "numShards":"2",
   [junit4]   2> 	  "name":"nodes_used_collection",
   [junit4]   2> 	  "replicationFactor":"2"}
   [junit4]   2> 738284 T2521 oasc.OverseerCollectionProcessor.processMessage WARN OverseerCollectionProcessor.processMessage : createcollection , {
   [junit4]   2> 	  "operation":"createcollection",
   [junit4]   2> 	  "numShards":"2",
   [junit4]   2> 	  "name":"nodes_used_collection",
   [junit4]   2> 	  "replicationFactor":"2"}
   [junit4]   2> 739570 T2520 oascc.ZkStateReader.updateClusterState Updating cloud state from ZooKeeper... 
   [junit4]   2> 739570 T2520 oasc.Overseer$ClusterStateUpdater.buildCollection building a new collection: nodes_used_collection
   [junit4]   2> 739570 T2520 oasc.Overseer$ClusterStateUpdater.createCollection Create collection nodes_used_collection with shards [shard1, shard2]
   [junit4]   2> 739575 T2537 oascc.ZkStateReader$2.process A cluster state change: WatchedEvent state:SyncConnected type:NodeDataChanged path:/clusterstate.json, has occurred - updating... (live nodes size: 5)
   [junit4]   2> 739575 T2565 oascc.ZkStateReader$2.process A cluster state change: WatchedEvent state:SyncConnected type:NodeDataChanged path:/clusterstate.json, has occurred - updating... (live nodes size: 5)
   [junit4]   2> 739575 T2551 oascc.ZkStateReader$2.process A cluster state change: WatchedEvent state:SyncConnected type:NodeDataChanged path:/clusterstate.json, has occurred - updating... (live nodes size: 5)
   [junit4]   2> 739575 T2524 oascc.ZkStateReader$2.process A cluster state change: WatchedEvent state:SyncConnected type:NodeDataChanged path:/clusterstate.json, has occurred - updating... (live nodes size: 5)
   [junit4]   2> 739575 T2579 oascc.ZkStateReader$2.process A cluster state change: WatchedEvent state:SyncConnected type:NodeDataChanged path:/clusterstate.json, has occurred - updating... (live nodes size: 5)
   [junit4]   2> 739575 T2519 oascc.ZkStateReader$2.process A cluster state change: WatchedEvent state:SyncConnected type:NodeDataChanged path:/clusterstate.json, has occurred - updating... (live nodes size: 5)
   [junit4]   2> 739588 T2521 oasc.OverseerCollectionProcessor.createCollection going to create cores replicas shardNames [shard1, shard2] , repFactor : 2
   [junit4]   2> 739588 T2521 oasc.OverseerCollectionProcessor.createCollection Creating shard nodes_used_collection_shard1_replica1 as part of slice shard1 of collection nodes_used_collection on 127.0.0.1:58903_
   [junit4]   2> 739589 T2521 oasc.OverseerCollectionProcessor.createCollection Creating shard nodes_used_collection_shard1_replica2 as part of slice shard1 of collection nodes_used_collection on 127.0.0.1:48322_
   [junit4]   2> 739590 T2521 oasc.OverseerCollectionProcessor.createCollection Creating shard nodes_used_collection_shard2_replica1 as part of slice shard2 of collection nodes_used_collection on 127.0.0.1:56006_
   [junit4]   2> 739590 T2521 oasc.OverseerCollectionProcessor.createCollection Creating shard nodes_used_collection_shard2_replica2 as part of slice shard2 of collection nodes_used_collection on 127.0.0.1:41390_
   [junit4]   2> 739591 T2546 oasc.ZkController.publish publishing core=nodes_used_collection_shard1_replica1 state=down
   [junit4]   2> 739591 T2513 oasc.ZkController.publish publishing core=nodes_used_collection_shard2_replica2 state=down
   [junit4]   2> 739591 T2560 oasc.ZkController.publish publishing core=nodes_used_collection_shard1_replica2 state=down
   [junit4]   2> 739592 T2573 oasc.ZkController.publish publishing core=nodes_used_collection_shard2_replica1 state=down
   [junit4]   2> 739592 T2546 oasc.ZkController.waitForCoreNodeName look for our core node name
   [junit4]   2> 739593 T2513 oasc.ZkController.waitForCoreNodeName look for our core node name
   [junit4]   2> 739593 T2560 oasc.ZkController.waitForCoreNodeName look for our core node name
   [junit4]   2> 739593 T2573 oasc.ZkController.waitForCoreNodeName look for our core node name
   [junit4]   2> 741079 T2520 oascc.ZkStateReader.updateClusterState Updating cloud state from ZooKeeper... 
   [junit4]   2> 741080 T2520 oasc.Overseer$ClusterStateUpdater.updateState WARN Could not find collection node for nodes_used_collection, skipping publish state
   [junit4]   2> 741081 T2520 oasc.Overseer$ClusterStateUpdater.updateState Update state numShards=2 message={
   [junit4]   2> 	  "operation":"state",
   [junit4]   2> 	  "core_node_name":"core_node1",
   [junit4]   2> 	  "numShards":"2",
   [junit4]   2> 	  "shard":"shard1",
   [junit4]   2> 	  "roles":null,
   [junit4]   2> 	  "state":"down",
   [junit4]   2> 	  "shard_state":"active",
   [junit4]   2> 	  "core":"nodes_used_collection_shard1_replica1",
   [junit4]   2> 	  "collection":"nodes_used_collection",
   [junit4]   2> 	  "shard_range":null,
   [junit4]   2> 	  "node_name":"127.0.0.1:58903_",
   [junit4]   2> 	  "base_url":"http://127.0.0.1:58903"}
   [junit4]   2> 741085 T2520 oasc.Overseer$ClusterStateUpdater.updateState WARN Could not find collection node for nodes_used_collection, skipping publish state
   [junit4]   2> 741085 T2520 oasc.Overseer$ClusterStateUpdater.updateState Update state numShards=2 message={
   [junit4]   2> 	  "operation":"state",
   [junit4]   2> 	  "core_node_name":"core_node2",
   [junit4]   2> 	  "numShards":"2",
   [junit4]   2> 	  "shard":"shard2",
   [junit4]   2> 	  "roles":null,
   [junit4]   2> 	  "state":"down",
   [junit4]   2> 	  "shard_state":"active",
   [junit4]   2> 	  "core":"nodes_used_collection_shard2_replica2",
   [junit4]   2> 	  "collection":"nodes_used_collection",
   [junit4]   2> 	  "shard_range":null,
   [junit4]   2> 	  "node_name":"127.0.0.1:41390_",
   [junit4]   2> 	  "base_url":"http://127.0.0.1:41390"}
   [junit4]   2> 741088 T2520 oasc.Overseer$ClusterStateUpdater.updateState WARN Could not find collection node for nodes_used_collection, skipping publish state
   [junit4]   2> 741088 T2520 oasc.Overseer$ClusterStateUpdater.updateState Update state numShards=2 message={
   [junit4]   2> 	  "operation":"state",
   [junit4]   2> 	  "core_node_name":"core_node3",
   [junit4]   2> 	  "numShards":"2",
   [junit4]   2> 	  "shard":"shard1",
   [junit4]   2> 	  "roles":null,
   [junit4]   2> 	  "state":"down",
   [junit4]   2> 	  "shard_state":"active",
   [junit4]   2> 	  "core":"nodes_used_collection_shard1_replica2",
   [junit4]   2> 	  "collection":"nodes_used_collection",
   [junit4]   2> 	  "shard_range":null,
   [junit4]   2> 	  "node_name":"127.0.0.1:48322_",
   [junit4]   2> 	  "base_url":"http://127.0.0.1:48322"}
   [junit4]   2> 741092 T2520 oasc.Overseer$ClusterStateUpdater.updateState WARN Could not find collection node for nodes_used_collection, skipping publish state
   [junit4]   2> 741092 T2520 oasc.Overseer$ClusterStateUpdater.updateState Update state numShards=2 message={
   [junit4]   2> 	  "operation":"state",
   [junit4]   2> 	  "core_node_name":"core_node4",
   [junit4]   2> 	  "numShards":"2",
   [junit4]   2> 	  "shard":"shard2",
   [junit4]   2> 	  "roles":null,
   [junit4]   2> 	  "state":"down",
   [junit4]   2> 	  "shard_state":"active",
   [junit4]   2> 	  "core":"nodes_used_collection_shard2_replica1",
   [junit4]   2> 	  "collection":"nodes_used_collection",
   [junit4]   2> 	  "shard_range":null,
   [junit4]   2> 	  "node_name":"127.0.0.1:56006_",
   [junit4]   2> 	  "base_url":"http://127.0.0.1:56006"}
   [junit4]   2> 741096 T2551 oascc.ZkStateReader$2.process A cluster state change: WatchedEvent state:SyncConnected type:NodeDataChanged path:/clusterstate.json, has occurred - updating... (live nodes size: 5)
   [junit4]   2> 741096 T2579 oascc.ZkStateReader$2.process A cluster state change: WatchedEvent state:SyncConnected type:NodeDataChanged path:/clusterstate.json, has occurred - updating... (live nodes size: 5)
   [junit4]   2> 741096 T2524 oascc.ZkStateReader$2.process A cluster state change: WatchedEvent state:SyncConnected type:NodeDataChanged path:/clusterstate.json, has occurred - updating... (live nodes size: 5)
   [junit4]   2> 741096 T2565 oascc.ZkStateReader$2.process A cluster state change: WatchedEvent state:SyncConnected type:NodeDataChanged path:/clusterstate.json, has occurred - updating... (live nodes size: 5)
   [junit4]   2> 741096 T2537 oascc.ZkStateReader$2.process A cluster state change: WatchedEvent state:SyncConnected type:NodeDataChanged path:/clusterstate.json, has occurred - updating... (live nodes size: 5)
   [junit4]   2> 741096 T2519 oascc.ZkStateReader$2.process A cluster state change: WatchedEvent state:SyncConnected type:NodeDataChanged path:/clusterstate.json, has occurred - updating... (live nodes size: 5)
   [junit4]   2> 741593 T2546 oasc.ZkController.waitForShardId waiting to find shard id in clusterstate for nodes_used_collection_shard1_replica1
   [junit4]   2> 741593 T2513 oasc.ZkController.waitForShardId waiting to find shard id in clusterstate for nodes_used_collection_shard2_replica2
   [junit4]   2> 741593 T2560 oasc.ZkController.waitForShardId waiting to find shard id in clusterstate for nodes_used_collection_shard1_replica2
   [junit4]   2> 741594 T2513 oasc.CorePropertiesLocator.writePropertiesFile ERROR Couldn't persist core properties to /mnt/ssd/jenkins/workspace/Lucene-Solr-trunk-Linux/solr/build/solr-core/test/J0/./org.apache.solr.cloud.CollectionsAPIDistributedZkTest-controljetty-1375333481967/nodes_used_collection_shard2_replica2/core.properties: java.io.FileNotFoundException: /mnt/ssd/jenkins/workspace/Lucene-Solr-trunk-Linux/solr/build/solr-core/test/J0/./org.apache.solr.cloud.CollectionsAPIDistributedZkTest-controljetty-1375333481967/nodes_used_collection_shard2_replica2/core.properties (No such file or directory)
   [junit4]   2> 741594 T2513 oasc.CoreContainer.create Creating SolrCore 'nodes_used_collection_shard2_replica2' using instanceDir: /mnt/ssd/jenkins/workspace/Lucene-Solr-trunk-Linux/solr/build/solr-core/test/J0/./org.apache.solr.cloud.CollectionsAPIDistributedZkTest-controljetty-1375333481967/nodes_used_collection_shard2_replica2
   [junit4]   2> 741595 T2513 oasc.ZkController.createCollectionZkNode Check for collection zkNode:nodes_used_collection
   [junit4]   2> 741594 T2573 oasc.ZkController.waitForShardId waiting to find shard id in clusterstate for nodes_used_collection_shard2_replica1
   [junit4]   2> 741593 T2546 oasc.CorePropertiesLocator.writePropertiesFile ERROR Couldn't persist core properties to /mnt/ssd/jenkins/workspace/Lucene-Solr-trunk-Linux/solr/build/solr-core/test/J0/./org.apache.solr.cloud.CollectionsAPIDistributedZkTest-jetty2-1375333483324/nodes_used_collection_shard1_replica1/core.properties: java.io.FileNotFoundException: /mnt/ssd/jenkins/workspace/Lucene-Solr-trunk-Linux/solr/build/solr-core/test/J0/./org.apache.solr.cloud.CollectionsAPIDistributedZkTest-jetty2-1375333483324/nodes_used_collection_shard1_replica1/core.properties (No such file or directory)
   [junit4]   2> 741596 T2573 oasc.CorePropertiesLocator.writePropertiesFile ERROR Couldn't persist core properties to /mnt/ssd/jenkins/workspace/Lucene-Solr-trunk-Linux/solr/build/solr-core/test/J0/./org.apache.solr.cloud.CollectionsAPIDistributedZkTest-jetty4-1375333485662/nodes_used_collection_shard2_replica1/core.properties: java.io.FileNotFoundException: /mnt/ssd/jenkins/workspace/Lucene-Solr-trunk-Linux/solr/build/solr-core/test/J0/./org.apache.solr.cloud.CollectionsAPIDistributedZkTest-jetty4-1375333485662/nodes_used_collection_shard2_replica1/core.properties (No such file or directory)
   [junit4]   2> 741596 T2513 oasc.ZkController.createCollectionZkNode Creating collection in ZooKeeper:nodes_used_collection
   [junit4]   2> 741596 T2546 oasc.CoreContainer.create Creating SolrCore 'nodes_used_collection_shard1_replica1' using instanceDir: /mnt/ssd/jenkins/workspace/Lucene-Solr-trunk-Linux/solr/build/solr-core/test/J0/./org.apache.solr.cloud.CollectionsAPIDistributedZkTest-jetty2-1375333483324/nodes_used_collection_shard1_replica1
   [junit4]   2> 741597 T2546 oasc.ZkController.createCollectionZkNode Check for collection zkNode:nodes_used_collection
   [junit4]   2> 741594 T2560 oasc.CorePropertiesLocator.writePropertiesFile ERROR Couldn't persist core properties to /mnt/ssd/jenkins/workspace/Lucene-Solr-trunk-Linux/solr/build/solr-core/test/J0/./org.apache.solr.cloud.CollectionsAPIDistributedZkTest-jetty3-1375333484494/nodes_used_collection_shard1_replica2/core.properties: java.io.FileNotFoundException: /mnt/ssd/jenkins/workspace/Lucene-Solr-trunk-Linux/solr/build/solr-core/test/J0/./org.apache.solr.cloud.CollectionsAPIDistributedZkTest-jetty3-1375333484494/nodes_used_collection_shard1_replica2/core.properties (No such file or directory)
   [junit4]   2> 741596 T2513 oasc.ZkController.getConfName Looking for collection configName
   [junit4]   2> 741596 T2573 oasc.CoreContainer.create Creating SolrCore 'nodes_used_collection_shard2_replica1' using instanceDir: /mnt/ssd/jenkins/workspace/Lucene-Solr-trunk-Linux/solr/build/solr-core/test/J0/./org.apache.solr.cloud.CollectionsAPIDistributedZkTest-jetty4-1375333485662/nodes_used_collection_shard2_replica1
   [junit4]   2> 741597 T2560 oasc.CoreContainer.create Creating SolrCore 'nodes_used_collection_shard1_replica2' using instanceDir: /mnt/ssd/jenkins/workspace/Lucene-Solr-trunk-Linux/solr/build/solr-core/test/J0/./org.apache.solr.cloud.CollectionsAPIDistributedZkTest-jetty3-1375333484494/nodes_used_collection_shard1_replica2
   [junit4]   2> 741598 T2560 oasc.ZkController.createCollectionZkNode Check for collection zkNode:nodes_used_collection
   [junit4]   2> 741597 T2546 oasc.ZkController.createCollectionZkNode Creating collection in ZooKeeper:nodes_used_collection
   [junit4]   2> 741599 T2546 oasc.ZkController.getConfName Looking for collection configName
   [junit4]   2> 741598 T2573 oasc.ZkController.createCollectionZkNode Check for collection zkNode:nodes_used_collection
   [junit4]   2> 741599 T2513 oasc.ZkController.getConfName Only one config set found in zk - using it:conf1
   [junit4]   2> 741599 T2560 oasc.ZkController.createCollectionZkNode Creating collection in ZooKeeper:nodes_used_collection
   [junit4]   2> 741599 T2573 oasc.ZkController.createCollectionZkNode Creating collection in ZooKeeper:nodes_used_collection
   [junit4]   2> 741599 T2546 oasc.ZkController.getConfName Only one config set found in zk - using it:conf1
   [junit4]   2> 741599 T2513 oascc.SolrZkClient.makePath makePath: /collections/nodes_used_collection
   [junit4]   2> 741600 T2546 oascc.SolrZkClient.makePath makePath: /collections/nodes_used_collection
   [junit4]   2> 741600 T2573 oasc.ZkController.getConfName Looking for collection configName
   [junit4]   2> 741600 T2560 oasc.ZkController.getConfName Looking for collection configName
   [junit4]   2> 741602 T2573 oasc.ZkController.getConfName Only one config set found in zk - using it:conf1
   [junit4]   2> 741602 T2573 oascc.SolrZkClient.makePath makePath: /collections/nodes_used_collection
   [junit4]   2> 741602 T2513 oasc.ZkController.readConfigName Load collection config from:/collections/nodes_used_collection
   [junit4]   2> 741602 T2546 oasc.ZkController.readConfigName Load collection config from:/collections/nodes_used_collection
   [junit4]   2> 741602 T2560 oasc.ZkController.getConfName Only one config set found in zk - using it:conf1
   [junit4]   2> 741603 T2560 oascc.SolrZkClient.makePath makePath: /collections/nodes_used_collection
   [junit4]   2> 741604 T2573 oasc.ZkController.readConfigName Load collection config from:/collections/nodes_used_collection
   [junit4]   2> 741604 T2513 oasc.SolrResourceLoader.<init> new SolrResourceLoader for directory: '/mnt/ssd/jenkins/workspace/Lucene-Solr-trunk-Linux/solr/build/solr-core/test/J0/./org.apache.solr.cloud.CollectionsAPIDistributedZkTest-controljetty-1375333481967/nodes_used_collection_shard2_replica2/'
   [junit4]   2> 741604 T2546 oasc.SolrResourceLoader.<init> new SolrResourceLoader for directory: '/mnt/ssd/jenkins/workspace/Lucene-Solr-trunk-Linux/solr/build/solr-core/test/J0/./org.apache.solr.cloud.CollectionsAPIDistributedZkTest-jetty2-1375333483324/nodes_used_collection_shard1_replica1/'
   [junit4]   2> 741605 T2560 oasc.ZkController.readConfigName Load collection config from:/collections/nodes_used_collection
   [junit4]   2> 741605 T2573 oasc.SolrResourceLoader.<init> new SolrResourceLoader for directory: '/mnt/ssd/jenkins/workspace/Lucene-Solr-trunk-Linux/solr/build/solr-core/test/J0/./org.apache.solr.cloud.CollectionsAPIDistributedZkTest-jetty4-1375333485662/nodes_used_collection_shard2_replica1/'
   [junit4]   2> 741611 T2560 oasc.SolrResourceLoader.<init> new SolrResourceLoader for directory: '/mnt/ssd/jenkins/workspace/Lucene-Solr-trunk-Linux/solr/build/solr-core/test/J0/./org.apache.solr.cloud.CollectionsAPIDistributedZkTest-jetty3-1375333484494/nodes_used_collection_shard1_replica2/'
   [junit4]   2> 741647 T2513 oasc.SolrConfig.<init> Using Lucene MatchVersion: LUCENE_50
   [junit4]   2> 741657 T2573 oasc.SolrConfig.<init> Using Lucene MatchVersion: LUCENE_50
   [junit4]   2> 741658 T2560 oasc.SolrConfig.<init> Using Lucene MatchVersion: LUCENE_50
   [junit4]   2> 741662 T2546 oasc.SolrConfig.<init> Using Lucene MatchVersion: LUCENE_50
   [junit4]   2> 741688 T2513 oasc.SolrConfig.<init> Loaded SolrConfig: solrconfig.xml
   [junit4]   2> 741689 T2513 oass.IndexSchema.readSchema Reading Solr Schema from schema.xml
   [junit4]   2> 741703 T2513 oass.IndexSchema.readSchema [nodes_used_collection_shard2_replica2] Schema name=test
   [junit4]   2> 741732 T2560 oasc.SolrConfig.<init> Loaded SolrConfig: solrconfig.xml
   [junit4]   2> 741732 T2573 oasc.SolrConfig.<init> Loaded SolrConfig: solrconfig.xml
   [junit4]   2> 741734 T2573 oass.IndexSchema.readSchema Reading Solr Schema from schema.xml
   [junit4]   2> 741734 T2560 oass.IndexSchema.readSchema Reading Solr Schema from schema.xml
   [junit4]   2> 741735 T2546 oasc.SolrConfig.<init> Loaded SolrConfig: solrconfig.xml
   [junit4]   2> 741737 T2546 oass.IndexSchema.readSchema Reading Solr Schema from schema.xml
   [junit4]   2> 741743 T2560 oass.IndexSchema.readSchema [nodes_used_collection_shard1_replica2] Schema name=test
   [junit4]   2> 741743 T2573 oass.IndexSchema.readSchema [nodes_used_collection_shard2_replica1] Schema name=test
   [junit4]   2> 741746 T2546 oass.IndexSchema.readSchema [nodes_used_collection_shard1_replica1] Schema name=test
   [junit4]   2> 742186 T2546 oass.OpenExchangeRatesOrgProvider.init Initialized with rates=open-exchange-rates.json, refreshInterval=1440.
   [junit4]   2> 742197 T2546 oass.IndexSchema.readSchema default search field in schema is text
   [junit4]   2> 742199 T2546 oass.IndexSchema.readSchema unique key field: id
   [junit4]   2> 742201 T2560 oass.OpenExchangeRatesOrgProvider.init Initialized with rates=open-exchange-rates.json, refreshInterval=1440.
   [junit4]   2> 742206 T2560 oass.IndexSchema.readSchema default search field in schema is text
   [junit4]   2> 742209 T2560 oass.IndexSchema.readSchema unique key field: id
   [junit4]   2> 742209 T2546 oass.FileExchangeRateProvider.reload Reloading exchange rates from file currency.xml
   [junit4]   2> 742212 T2546 oass.FileExchangeRateProvider.reload Reloading exchange rates from file currency.xml
   [junit4]   2> 742215 T2546 oass.OpenExchangeRatesOrgProvider.reload Reloading exchange rates from open-exchange-rates.json
   [junit4]   2> 742217 T2546 oass.OpenExchangeRatesOrgProvider$OpenExchangeRates.<init> WARN Unknown key IMPORTANT NOTE
   [junit4]   2> 742217 T2546 oass.OpenExchangeRatesOrgProvider$OpenExchangeRates.<init> WARN Expected key, got STRING
   [junit4]   2> 742217 T2546 oass.OpenExchangeRatesOrgProvider.reload Reloading exchange rates from open-exchange-rates.json
   [junit4]   2> 742218 T2546 oass.OpenExchangeRatesOrgProvider$OpenExchangeRates.<init> WARN Unknown key IMPORTANT NOTE
   [junit4]   2> 742219 T2546 oass.OpenExchangeRatesOrgProvider$OpenExchangeRates.<init> WARN Expected key, got STRING
   [junit4]   2> 742219 T2560 oass.FileExchangeRateProvider.reload Reloading exchange rates from file currency.xml
   [junit4]   2> 742219 T2546 oasc.SolrCore.initDirectoryFactory org.apache.solr.core.MockDirectoryFactory
   [junit4]   2> 742219 T2546 oasc.SolrCore.<init> [nodes_used_collection_shard1_replica1] Opening new SolrCore at /mnt/ssd/jenkins/workspace/Lucene-Solr-trunk-Linux/solr/build/solr-core/test/J0/./org.apache.solr.cloud.CollectionsAPIDistributedZkTest-jetty2-1375333483324/nodes_used_collection_shard1_replica1/, dataDir=/mnt/ssd/jenkins/workspace/Lucene-Solr-trunk-Linux/solr/build/solr-core/test/J0/./org.apache.solr.cloud.CollectionsAPIDistributedZkTest-jetty2-1375333483324//nodes_used_collection_shard1_replica1/data/
   [junit4]   2> 742220 T2546 oasc.JmxMonitoredMap.<init> JMX monitoring is enabled. Adding Solr mbeans to JMX Server: com.sun.jmx.mbeanserver.JmxMBeanServer@1081f28
   [junit4]   2> 742221 T2546 oasc.CachingDirectoryFactory.get return new directory for /mnt/ssd/jenkins/workspace/Lucene-Solr-trunk-Linux/solr/build/solr-core/test/J0/./org.apache.solr.cloud.CollectionsAPIDistributedZkTest-jetty2-1375333483324//nodes_used_collection_shard1_replica1/data
   [junit4]   2> 742228 T2546 oasc.SolrCore.getNewIndexDir New index directory detected: old=null new=/mnt/ssd/jenkins/workspace/Lucene-Solr-trunk-Linux/solr/build/solr-core/test/J0/./org.apache.solr.cloud.CollectionsAPIDistributedZkTest-jetty2-1375333483324//nodes_used_collection_shard1_replica1/data/index/
   [junit4]   2> 742228 T2546 oasc.SolrCore.initIndex WARN [nodes_used_collection_shard1_replica1] Solr index directory '/mnt/ssd/jenkins/workspace/Lucene-Solr-trunk-Linux/solr/build/solr-core/test/J0/./org.apache.solr.cloud.CollectionsAPIDistributedZkTest-jetty2-1375333483324/nodes_used_collection_shard1_replica1/data/index' doesn't exist. Creating new index...
   [junit4]   2> 742228 T2546 oasc.CachingDirectoryFactory.get return new directory for /mnt/ssd/jenkins/workspace/Lucene-Solr-trunk-Linux/solr/build/solr-core/test/J0/./org.apache.solr.cloud.CollectionsAPIDistributedZkTest-jetty2-1375333483324//nodes_used_collection_shard1_replica1/data/index
   [junit4]   2> 742229 T2560 oass.FileExchangeRateProvider.reload Reloading exchange rates from file currency.xml
   [junit4]   2> 742230 T2546 oasc.SolrDeletionPolicy.onCommit SolrDeletionPolicy.onCommit: commits: num=1
   [junit4]   2> 		commit{dir=MockDirWrapper(org.apache.lucene.store.RAMDirectory@17a0709 lockFactory=org.apache.lucene.store.NativeFSLockFactory@701fb),segFN=segments_1,generation=1}
   [junit4]   2> 742231 T2546 oasc.SolrDeletionPolicy.updateCommits newest commit generation = 1
   [junit4]   2> 742232 T2560 oass.OpenExchangeRatesOrgProvider.reload Reloading exchange rates from open-exchange-rates.json
   [junit4]   2> 742233 T2560 oass.OpenExchangeRatesOrgProvider$OpenExchangeRates.<init> WARN Unknown key IMPORTANT NOTE
   [junit4]   2> 742234 T2560 oass.OpenExchangeRatesOrgProvider$OpenExchangeRates.<init> WARN Expected key, got STRING
   [junit4]   2> 742234 T2546 oasup.UpdateRequestProcessorChain.init inserting DistributedUpdateProcessorFactory into updateRequestProcessorChain "dedupe"
   [junit4]   2> 742234 T2513 oass.OpenExchangeRatesOrgProvider.init Initialized with rates=open-exchange-rates.json, refreshInterval=1440.
   [junit4]   2> 742234 T2560 oass.OpenExchangeRatesOrgProvider.reload Reloading exchange rates from open-exchange-rates.json
   [junit4]   2> 742234 T2546 oasup.UpdateRequestProcessorChain.init inserting DistributedUpdateProcessorFactory into updateRequestProcessorChain "stored_sig"
   [junit4]   2> 742236 T2546 oasup.UpdateRequestProcessorChain.init inserting DistributedUpdateProcessorFactory into updateRequestProcessorChain "distrib-dup-test-chain-implicit"
   [junit4]   2> 742236 T2560 oass.OpenExchangeRatesOrgProvider$OpenExchangeRates.<init> WARN Unknown key IMPORTANT NOTE
   [junit4]   2> 742236 T2560 oass.OpenExchangeRatesOrgProvider$OpenExchangeRates.<init> WARN Expected key, got STRING
   [junit4]   2> 742236 T2546 oasc.RequestHandlers.initHandlersFromConfig created standard: solr.StandardRequestHandler
   [junit4]   2> 742236 T2560 oasc.SolrCore.initDirectoryFactory org.apache.solr.core.MockDirectoryFactory
   [junit4]   2> 742237 T2546 oasc.RequestHandlers.initHandlersFromConfig created /get: solr.RealTimeGetHandler
   [junit4]   2> 742237 T2546 oasc.RequestHandlers.initHandlersFromConfig adding lazy requestHandler: solr.ReplicationHandler
   [junit4]   2> 742237 T2560 oasc.SolrCore.<init> [nodes_used_collection_shard1_replica2] Opening new SolrCore at /mnt/ssd/jenkins/workspace/Lucene-Solr-trunk-Linux/solr/build/solr-core/test/J0/./org.apache.solr.cloud.CollectionsAPIDistributedZkTest-jetty3-1375333484494/nodes_used_collection_shard1_replica2/, dataDir=/mnt/ssd/jenkins/workspace/Lucene-Solr-trunk-Linux/solr/build/solr-core/test/J0/./org.apache.solr.cloud.CollectionsAPIDistributedZkTest-jetty3-1375333484494//nodes_used_collection_shard1_replica2/data/
   [junit4]   2> 742237 T2546 oasc.RequestHandlers.initHandlersFromConfig created /replication: solr.ReplicationHandler
   [junit4]   2> 742238 T2560 oasc.JmxMonitoredMap.<init> JMX monitoring is enabled. Adding Solr mbeans to JMX Server: com.sun.jmx.mbeanserver.JmxMBeanServer@1081f28
   [junit4]   2> 742238 T2546 oasc.RequestHandlers.initHandlersFromConfig created /update: solr.UpdateRequestHandler
   [junit4]   2> 742238 T2546 oasc.RequestHandlers.initHandlersFromConfig created /admin/: org.apache.solr.handler.admin.AdminHandlers
   [junit4]   2> 742239 T2560 oasc.CachingDirectoryFactory.get return new directory for /mnt/ssd/jenkins/workspace/Lucene-Solr-trunk-Linux/solr/build/solr-core/test/J0/./org.apache.solr.cloud.CollectionsAPIDistributedZkTest-jetty3-1375333484494//nodes_used_collection_shard1_replica2/data
   [junit4]   2> 742239 T2560 oasc.SolrCore.getNewIndexDir New index directory detected: old=null new=/mnt/ssd/jenkins/workspace/Lucene-Solr-trunk-Linux/solr/build/solr-core/test/J0/./org.apache.solr.cloud.CollectionsAPIDistributedZkTest-jetty3-1375333484494//nodes_used_collection_shard1_replica2/data/index/
   [junit4]   2> 742239 T2560 oasc.SolrCore.initIndex WARN [nodes_used_collection_shard1_replica2] Solr index directory '/mnt/ssd/jenkins/workspace/Lucene-Solr-trunk-Linux/solr/build/solr-core/test/J0/./org.apache.solr.cloud.CollectionsAPIDistributedZkTest-jetty3-1375333484494/nodes_used_collection_shard1_replica2/data/index' doesn't exist. Creating new index...
   [junit4]   2> 742239 T2560 oasc.CachingDirectoryFactory.get return new directory for /mnt/ssd/jenkins/workspace/Lucene-Solr-trunk-Linux/solr/build/solr-core/test/J0/./org.apache.solr.cloud.CollectionsAPIDistributedZkTest-jetty3-1375333484494//nodes_used_collection_shard1_replica2/data/index
   [junit4]   2> 742241 T2546 oashl.XMLLoader.init xsltCacheLifetimeSeconds=60
   [junit4]   2> 742241 T2560 oasc.SolrDeletionPolicy.onCommit SolrDeletionPolicy.onCommit: commits: num=1
   [junit4]   2> 		commit{dir=MockDirWrapper(org.apache.lucene.store.RAMDirectory@e164b1 lockFactory=org.apache.lucene.store.NativeFSLockFactory@867e05),segFN=segments_1,generation=1}
   [junit4]   2> 742241 T2560 oasc.SolrDeletionPolicy.updateCommits newest commit generation = 1
   [junit4]   2> 742241 T2513 oass.IndexSchema.readSchema default search field in schema is text
   [junit4]   2> 742243 T2546 oass.SolrIndexSearcher.<init> Opening Searcher@293f1d main
   [junit4]   2> 742243 T2546 oasu.CommitTracker.<init> Hard AutoCommit: disabled
   [junit4]   2> 742243 T2546 oasu.CommitTracker.<init> Soft AutoCommit: disabled
   [junit4]   2> 742244 T2560 oasup.UpdateRequestProcessorChain.init inserting DistributedUpdateProcessorFactory into updateRequestProcessorChain "dedupe"
   [junit4]   2> 742244 T2560 oasup.UpdateRequestProcessorChain.init inserting DistributedUpdateProcessorFactory into updateRequestProcessorChain "stored_sig"
   [junit4]   2> 742244 T2560 oasup.UpdateRequestProcessorChain.init inserting DistributedUpdateProcessorFactory into updateRequestProcessorChain "distrib-dup-test-chain-implicit"
   [junit4]   2> 742245 T2513 oass.IndexSchema.readSchema unique key field: id
   [junit4]   2> 742245 T2560 oasc.RequestHandlers.initHandlersFromConfig created standard: solr.StandardRequestHandler
   [junit4]   2> 742245 T2560 oasc.RequestHandlers.initHandlersFromConfig created /get: solr.RealTimeGetHandler
   [junit4]   2> 742246 T2560 oasc.RequestHandlers.initHandlersFromConfig adding lazy requestHandler: solr.ReplicationHandler
   [junit4]   2> 742246 T2560 oasc.RequestHandlers.initHandlersFromConfig created /replication: solr.ReplicationHandler
   [junit4]   2> 742246 T2560 oasc.RequestHandlers.initHandlersFromConfig created /update: solr.UpdateRequestHandler
   [junit4]   2> 742247 T2585 oasc.SolrCore.registerSearcher [nodes_used_collection_shard1_replica1] Registered new searcher Searcher@293f1d main{StandardDirectoryReader(segments_1:1)}
   [junit4]   2> 742247 T2560 oasc.RequestHandlers.initHandlersFromConfig created /admin/: org.apache.solr.handler.admin.AdminHandlers
   [junit4]   2> 742248 T2546 oasc.CoreContainer.registerCore registering core: nodes_used_collection_shard1_replica1
   [junit4]   2> 742248 T2546 oasc.ZkController.register Register replica - core:nodes_used_collection_shard1_replica1 address:http://127.0.0.1:58903 collection:nodes_used_collection shard:shard1
   [junit4]   2> 742248 T2546 oascsi.HttpClientUtil.createClient Creating new http client, config:maxConnections=10000&maxConnectionsPerHost=20&connTimeout=15000&socketTimeout=30000&retry=false
   [junit4]   2> 742250 T2560 oashl.XMLLoader.init xsltCacheLifetimeSeconds=60
   [junit4]   2> 742251 T2546 oascc.SolrZkClient.makePath makePath: /collections/nodes_used_collection/leader_elect/shard1/election
   [junit4]   2> 742252 T2560 oass.SolrIndexSearcher.<init> Opening Searcher@2fb5cd main
   [junit4]   2> 742253 T2560 oasu.CommitTracker.<init> Hard AutoCommit: disabled
   [junit4]   2> 742254 T2560 oasu.CommitTracker.<init> Soft AutoCommit: disabled
   [junit4]   2> 742257 T2546 oasc.ShardLeaderElectionContext.runLeaderProcess Running the leader process for shard shard1
   [junit4]   2> 742257 T2586 oasc.SolrCore.registerSearcher [nodes_used_collection_shard1_replica2] Registered new searcher Searcher@2fb5cd main{StandardDirectoryReader(segments_1:1)}
   [junit4]   2> 742258 T2513 oass.FileExchangeRateProvider.reload Reloading exchange rates from file currency.xml
   [junit4]   2> 742259 T2546 oasc.ShardLeaderElectionContext.waitForReplicasToComeUp Waiting until we see more replicas up for shard shard1: total=2 found=1 timeoutin=179999
   [junit4]   2> 742259 T2560 oasc.CoreContainer.registerCore registering core: nodes_used_collection_shard1_replica2
   [junit4]   2> 742259 T2560 oasc.ZkController.register Register replica - core:nodes_used_collection_shard1_replica2 address:http://127.0.0.1:48322 collection:nodes_used_collection shard:shard1
   [junit4]   2> 742260 T2560 oascsi.HttpClientUtil.createClient Creating new http client, config:maxConnections=10000&maxConnectionsPerHost=20&connTimeout=15000&socketTimeout=30000&retry=false
   [junit4]   2> 742262 T2513 oass.FileExchangeRateProvider.reload Reloading exchange rates from file currency.xml
   [junit4]   2> 742266 T2513 oass.OpenExchangeRatesOrgProvider.reload Reloading exchange rates from open-exchange-rates.json
   [junit4]   2> 742267 T2513 oass.OpenExchangeRatesOrgProvider$OpenExchangeRates.<init> WARN Unknown key IMPORTANT NOTE
   [junit4]   2> 742267 T2513 oass.OpenExchangeRatesOrgProvider$OpenExchangeRates.<init> WARN Expected key, got STRING
   [junit4]   2> 742267 T2513 oass.OpenExchangeRatesOrgProvider.reload Reloading exchange rates from open-exchange-rates.json
   [junit4]   2> 742268 T2513 oass.OpenExchangeRatesOrgProvider$OpenExchangeRates.<init> WARN Unknown key IMPORTANT NOTE
   [junit4]   2> 742268 T2513 oass.OpenExchangeRatesOrgProvider$OpenExchangeRates.<init> WARN Expected key, got STRING
   [junit4]   2> 742268 T2513 oasc.SolrCore.initDirectoryFactory org.apache.solr.core.MockDirectoryFactory
   [junit4]   2> 742269 T2513 oasc.SolrCore.<init> [nodes_used_collection_shard2_replica2] Opening new SolrCore at /mnt/ssd/jenkins/workspace/Lucene-Solr-trunk-Linux/solr/build/solr-core/test/J0/./org.apache.solr.cloud.CollectionsAPIDistributedZkTest-controljetty-1375333481967/nodes_used_collection_shard2_replica2/, dataDir=/mnt/ssd/jenkins/workspace/Lucene-Solr-trunk-Linux/solr/build/solr-core/test/J0/./org.apache.solr.cloud.CollectionsAPIDistributedZkTest-controljetty-1375333481967//nodes_used_collection_shard2_replica2/data/
   [junit4]   2> 742269 T2513 oasc.JmxMonitoredMap.<init> JMX monitoring is enabled. Adding Solr mbeans to JMX Server: com.sun.jmx.mbeanserver.JmxMBeanServer@1081f28
   [junit4]   2> 742270 T2513 oasc.CachingDirectoryFactory.get return new directory for /mnt/ssd/jenkins/workspace/Lucene-Solr-trunk-Linux/solr/build/solr-core/test/J0/./org.apache.solr.cloud.CollectionsAPIDistributedZkTest-controljetty-1375333481967//nodes_used_collection_shard2_replica2/data
   [junit4]   2> 742270 T2513 oasc.SolrCore.getNewIndexDir New index directory detected: old=null new=/mnt/ssd/jenkins/workspace/Lucene-Solr-trunk-Linux/solr/build/solr-core/test/J0/./org.apache.solr.cloud.CollectionsAPIDistributedZkTest-controljetty-1375333481967//nodes_used_collection_shard2_replica2/data/index/
   [junit4]   2> 742270 T2513 oasc.SolrCore.initIndex WARN [nodes_used_collection_shard2_replica2] Solr index directory '/mnt/ssd/jenkins/workspace/Lucene-Solr-trunk-Linux/solr/build/solr-core/test/J0/./org.apache.solr.cloud.CollectionsAPIDistributedZkTest-controljetty-1375333481967/nodes_used_collection_shard2_replica2/data/index' doesn't exist. Creating new index...
   [junit4]   2> 742270 T2513 oasc.CachingDirectoryFactory.get return new directory for /mnt/ssd/jenkins/workspace/Lucene-Solr-trunk-Linux/solr/build/solr-core/test/J0/./org.apache.solr.cloud.CollectionsAPIDistributedZkTest-controljetty-1375333481967//nodes_used_collection_shard2_replica2/data/index
   [junit4]   2> 742272 T2513 oasc.SolrDeletionPolicy.onCommit SolrDeletionPolicy.onCommit: commits: num=1
   [junit4]   2> 		commit{dir=MockDirWrapper(org.apache.lucene.store.RAMDirectory@b9c50e lockFactory=org.apache.lucene.store.NativeFSLockFactory@105a389),segFN=segments_1,generation=1}
   [junit4]   2> 742272 T2513 oasc.SolrDeletionPolicy.updateCommits newest commit generation = 1
   [junit4]   2> 742275 T2513 oasup.UpdateRequestProcessorChain.init inserting DistributedUpdateProcessorFactory into updateRequestProcessorChain "dedupe"
   [junit4]   2> 742275 T2513 oasup.UpdateRequestProcessorChain.init inserting DistributedUpdateProcessorFactory into updateRequestProcessorChain "stored_sig"
   [junit4]   2> 742275 T2513 oasup.UpdateRequestProcessorChain.init inserting DistributedUpdateProcessorFactory into updateRequestProcessorChain "distrib-dup-test-chain-implicit"
   [junit4]   2> 742276 T2513 oasc.RequestHandlers.initHandlersFromConfig created standard: solr.StandardRequestHandler
   [junit4]   2> 742276 T2513 oasc.RequestHandlers.initHandlersFromConfig created /get: solr.RealTimeGetHandler
   [junit4]   2> 742284 T2513 oasc.RequestHandlers.initHandlersFromConfig adding lazy requestHandler: solr.ReplicationHandler
   [junit4]   2> 742284 T2513 oasc.RequestHandlers.initHandlersFromConfig created /replication: solr.ReplicationHandler
   [junit4]   2> 742285 T2513 oasc.RequestHandlers.initHandlersFromConfig created /update: solr.UpdateRequestHandler
   [junit4]   2> 742285 T2513 oasc.RequestHandlers.initHandlersFromConfig created /admin/: org.apache.solr.handler.admin.AdminHandlers
   [junit4]   2> 742287 T2513 oashl.XMLLoader.init xsltCacheLifetimeSeconds=60
   [junit4]   2> 742289 T2513 oass.SolrIndexSearcher.<init> Opening Searcher@1fbaadf main
   [junit4]   2> 742290 T2513 oasu.CommitTracker.<init> Hard AutoCommit: disabled
   [junit4]   2> 742290 T2513 oasu.CommitTracker.<init> Soft AutoCommit: disabled
   [junit4]   2> 742294 T2587 oasc.SolrCore.registerSearcher [nodes_used_collection_shard2_replica2] Registered new searcher Searcher@1fbaadf main{StandardDirectoryReader(segments_1:1)}
   [junit4]   2> 742296 T2513 oasc.CoreContainer.registerCore registering core: nodes_used_collection_shard2_replica2
   [junit4]   2> 742296 T2513 oasc.ZkController.register Register replica - core:nodes_used_collection_shard2_replica2 address:http://127.0.0.1:41390 collection:nodes_used_collection shard:shard2
   [junit4]   2> 742296 T2513 oascsi.HttpClientUtil.createClient Creating new http client, config:maxConnections=10000&maxConnectionsPerHost=20&connTimeout=15000&socketTimeout=30000&retry=false
   [junit4]   2> 742301 T2513 oascc.SolrZkClient.makePath makePath: /collections/nodes_used_collection/leader_elect/shard2/election
   [junit4]   2> 742306 T2513 oasc.ShardLeaderElectionContext.runLeaderProcess Running the leader process for shard shard2
   [junit4]   2> 742308 T2513 oasc.ShardLeaderElectionContext.waitForReplicasToComeUp Waiting until we see more replicas up for shard shard2: total=2 found=1 timeoutin=180000
   [junit4]   2> 742328 T2573 oass.OpenExchangeRatesOrgProvider.init Initialized with rates=open-exchange-rates.json, refreshInterval=1440.
   [junit4]   2> 742336 T2573 oass.IndexSchema.readSchema default search field in schema is text
   [junit4]   2> 742339 T2573 oass.IndexSchema.readSchema unique key field: id
   [junit4]   2> 742351 T2573 oass.FileExchangeRateProvider.reload Reloading exchange rates from file currency.xml
   [junit4]   2> 742357 T2573 oass.FileExchangeRateProvider.reload Reloading exchange rates from file currency.xml
   [junit4]   2> 742359 T2573 oass.OpenExchangeRatesOrgProvider.reload Reloading exchange rates from open-exchange-rates.json
   [junit4]   2> 742360 T2573 oass.OpenExchangeRatesOrgProvider$OpenExchangeRates.<init> WARN Unknown key IMPORTANT NOTE
   [junit4]   2> 742361 T2573 oass.OpenExchangeRatesOrgProvider$OpenExchangeRates.<init> WARN Expected key, got STRING
   [junit4]   2> 742361 T2573 oass.OpenExchangeRatesOrgProvider.reload Reloading exchange rates from open-exchange-rates.json
   [junit4]   2> 742362 T2573 oass.OpenExchangeRatesOrgProvider$OpenExchangeRates.<init> WARN Unknown key IMPORTANT NOTE
   [junit4]   2> 742362 T2573 oass.OpenExchangeRatesOrgProvider$OpenExchangeRates.<init> WARN Expected key, got STRING
   [junit4]   2> 742362 T2573 oasc.SolrCore.initDirectoryFactory org.apache.solr.core.MockDirectoryFactory
   [junit4]   2> 742362 T2573 oasc.SolrCore.<init> [nodes_used_collection_shard2_replica1] Opening new SolrCore at /mnt/ssd/jenkins/workspace/Lucene-Solr-trunk-Linux/solr/build/solr-core/test/J0/./org.apache.solr.cloud.CollectionsAPIDistributedZkTest-jetty4-1375333485662/nodes_used_collection_shard2_replica1/, dataDir=/mnt/ssd/jenkins/workspace/Lucene-Solr-trunk-Linux/solr/build/solr-core/test/J0/./org.apache.solr.cloud.CollectionsAPIDistributedZkTest-jetty4-1375333485662//nodes_used_collection_shard2_replica1/data/
   [junit4]   2> 742363 T2573 oasc.JmxMonitoredMap.<init> JMX monitoring is enabled. Adding Solr mbeans to JMX Server: com.sun.jmx.mbeanserver.JmxMBeanServer@1081f28
   [junit4]   2> 742364 T2573 oasc.CachingDirectoryFactory.get return new directory for /mnt/ssd/jenkins/workspace/Lucene-Solr-trunk-Linux/solr/build/solr-core/test/J0/./org.apache.solr.cloud.CollectionsAPIDistributedZkTest-jetty4-1375333485662//nodes_used_collection_shard2_replica1/data
   [junit4]   2> 742364 T2573 oasc.SolrCore.getNewIndexDir New index directory detected: old=null new=/mnt/ssd/jenkins/workspace/Lucene-Solr-trunk-Linux/solr/build/solr-core/test/J0/./org.apache.solr.cloud.CollectionsAPIDistributedZkTest-jetty4-1375333485662//nodes_used_collection_shard2_replica1/data/index/
   [junit4]   2> 742364 T2573 oasc.SolrCore.initIndex WARN [nodes_used_collection_shard2_replica1] Solr index directory '/mnt/ssd/jenkins/workspace/Lucene-Solr-trunk-Linux/solr/build/solr-core/test/J0/./org.apache.solr.cloud.CollectionsAPIDistributedZkTest-jetty4-1375333485662/nodes_used_collection_shard2_replica1/data/index' doesn't exist. Creating new index...
   [junit4]   2> 742364 T2573 oasc.CachingDirectoryFactory.get return new directory for /mnt/ssd/jenkins/workspace/Lucene-Solr-trunk-Linux/solr/build/solr-core/test/J0/./org.apache.solr.cloud.CollectionsAPIDistributedZkTest-jetty4-1375333485662//nodes_used_collection_shard2_replica1/data/index
   [junit4]   2> 742366 T2573 oasc.SolrDeletionPolicy.onCommit SolrDeletionPolicy.onCommit: commits: num=1
   [junit4]   2> 		commit{dir=MockDirWrapper(org.apache.lucene.store.RAMDirectory@1751f00 lockFactory=org.apache.lucene.store.NativeFSLockFactory@1bef74d),segFN=segments_1,generation=1}
   [junit4]   2> 742366 T2573 oasc.SolrDeletionPolicy.updateCommits newest commit generation = 1
   [junit4]   2> 742368 T2573 oasup.UpdateRequestProcessorChain.init inserting DistributedUpdateProcessorFactory into updateRequestProcessorChain "dedupe"
   [junit4]   2> 742369 T2573 oasup.UpdateRequestProcessorChain.init inserting DistributedUpdateProcessorFactory into updateRequestProcessorChain "stored_sig"
   [junit4]   2> 742369 T2573 oasup.UpdateRequestProcessorChain.init inserting DistributedUpdateProcessorFactory into updateRequestProcessorChain "distrib-dup-test-chain-implicit"
   [junit4]   2> 742370 T2573 oasc.RequestHandlers.initHandlersFromConfig created standard: solr.StandardRequestHandler
   [junit4]   2> 742370 T2573 oasc.RequestHandlers.initHandlersFromConfig created /get: solr.RealTimeGetHandler
   [junit4]   2> 742370 T2573 oasc.RequestHandlers.initHandlersFromConfig adding lazy requestHandler: solr.ReplicationHandler
   [junit4]   2> 742370 T2573 oasc.RequestHandlers.initHandlersFromConfig created /replication: solr.ReplicationHandler
   [junit4]   2> 742371 T2573 oasc.RequestHandlers.initHandlersFromConfig created /update: solr.UpdateRequestHandler
   [junit4]   2> 742371 T2573 oasc.RequestHandlers.initHandlersFromConfig created /admin/: org.apache.solr.handler.admin.AdminHandlers
   [junit4]   2> 742373 T2573 oashl.XMLLoader.init xsltCacheLifetimeSeconds=60
   [junit4]   2> 742375 T2573 oass.SolrIndexSearcher.<init> Opening Searcher@c8d3b3 main
   [junit4]   2> 742376 T2573 oasu.CommitTracker.<init> Hard AutoCommit: disabled
   [junit4]   2> 742376 T2573 oasu.CommitTracker.<init> Soft AutoCommit: disabled
   [junit4]   2> 742379 T2588 oasc.SolrCore.registerSearcher [nodes_used_collection_shard2_replica1] Registered new searcher Searcher@c8d3b3 main{StandardDirectoryReader(segments_1:1)}
   [junit4]   2> 742380 T2573 oasc.CoreContainer.registerCore registering core: nodes_used_collection_shard2_replica1
   [junit4]   2> 742380 T2573 oasc.ZkController.register Register replica - core:nodes_used_collection_shard2_replica1 address:http://127.0.0.1:56006 collection:nodes_used_collection shard:shard2
   [junit4]   2> 742381 T2573 oascsi.HttpClientUtil.createClient Creating new http client, config:maxConnections=10000&maxConnectionsPerHost=20&connTimeout=15000&socketTimeout=30000&retry=false
   [junit4]   2> 742603 T2520 oascc.ZkStateReader.updateClusterState Updating cloud state from ZooKeeper... 
   [junit4]   2> 742612 T2551 oascc.ZkStateReader$2.process A cluster state change: WatchedEvent state:SyncConnected type:NodeDataChanged path:/clusterstate.json, has occurred - updating... (live nodes size: 5)
   [junit4]   2> 742612 T2579 oascc.ZkStateReader$2.process A cluster state change: WatchedEvent state:SyncConnected type:NodeDataChanged path:/clusterstate.json, has occurred - updating... (live nodes size: 5)
   [junit4]   2> 742612 T2524 oascc.ZkStateReader$2.process A cluster state change: WatchedEvent state:SyncConnected type:NodeDataChanged path:/clusterstate.json, has occurred - updating... (live nodes size: 5)
   [junit4]   2> 742612 T2565 oascc.ZkStateReader$2.process A cluster state change: WatchedEvent state:SyncConnected type:NodeDataChanged path:/clusterstate.json, has occurred - updating... (live nodes size: 5)
   [junit4]   2> 742612 T2519 oascc.ZkStateReader$2.process A cluster state change: WatchedEvent state:SyncConnected type:NodeDataChanged path:/clusterstate.json, has occurred - updating... (live nodes size: 5)
   [junit4]   2> 742612 T2537 oascc.ZkStateReader$2.process A cluster state change: WatchedEvent state:SyncConnected type:NodeDataChanged path:/clusterstate.json, has occurred - updating... (live nodes size: 5)
   [junit4]   2> 742760 T2546 oasc.ShardLeaderElectionContext.waitForReplicasToComeUp Enough replicas found to continue.
   [junit4]   2> 742760 T2546 oasc.ShardLeaderElectionContext.runLeaderProcess I may be the new leader - try and sync
   [junit4]   2> 742760 T2546 oasc.SyncStrategy.sync Sync replicas to http://127.0.0.1:58903/nodes_used_collection_shard1_replica1/
   [junit4]   2> 742761 T2546 oasu.PeerSync.sync PeerSync: core=nodes_used_collection_shard1_replica1 url=http://127.0.0.1:58903 START replicas=[http://127.0.0.1:48322/nodes_used_collection_shard1_replica2/] nUpdates=100
   [junit4]   2> 742761 T2546 oasu.PeerSync.sync PeerSync: core=nodes_used_collection_shard1_replica1 url=http://127.0.0.1:58903 DONE.  We have no versions.  sync failed.
   [junit4]   2> 742761 T2546 oasc.SyncStrategy.syncReplicas Leader's attempt to sync with shard failed, moving to the next candidate
   [junit4]   2> 742762 T2546 oasc.ShardLeaderElectionContext.runLeaderProcess We failed sync, but we have no versions - we can't sync in that case - we were active before, so become leader anyway
   [junit4]   2> 742762 T2546 oasc.ShardLeaderElectionContext.runLeaderProcess I am the new leader: http://127.0.0.1:58903/nodes_used_collection_shard1_replica1/ shard1
   [junit4]   2> 742762 T2546 oascc.SolrZkClient.makePath makePath: /collections/nodes_used_collection/leaders/shard1
   [junit4]   2> ASYNC  NEW_CORE C3257 name=nodes_used_collection_shard1_replica2 org.apache.solr.core.SolrCore@4d5a87 url=http://127.0.0.1:48322/nodes_used_collection_shard1_replica2 node=127.0.0.1:48322_ C3257_STATE=coll:nodes_used_collection core:nodes_used_collection_shard1_replica2 props:{state=down, core=nodes_used_collection_shard1_replica2, node_name=127.0.0.1:48322_, base_url=http://127.0.0.1:48322}
   [junit4]   2> 742767 T2561 C3257 P48322 oasc.SolrCore.execute [nodes_used_collection_shard1_replica2] webapp= path=/get params={getVersions=100&distrib=false&wt=javabin&qt=/get&version=2} status=0 QTime=1 
   [junit4]   2> 742809 T2513 oasc.ShardLeaderElectionContext.waitForReplicasToComeUp Enough replicas found to continue.
   [junit4]   2> 742809 T2513 oasc.ShardLeaderElectionContext.runLeaderProcess I may be the new leader - try and sync
   [junit4]   2> 742810 T2513 oasc.SyncStrategy.sync Sync replicas to http://127.0.0.1:41390/nodes_used_collection_shard2_replica2/
   [junit4]   2> 742810 T2513 oasu.PeerSync.sync

[...truncated too long message...]

: reproduce with: ant test  -Dtestcase=CollectionsAPIDistributedZkTest -Dtests.method=testDistribSearch -Dtests.seed=7F46CD7550B5AC0D -Dtests.multiplier=3 -Dtests.slow=true -Dtests.locale=uk -Dtests.timezone=America/Dawson -Dtests.file.encoding=UTF-8
   [junit4] ERROR    133s J0 | CollectionsAPIDistributedZkTest.testDistribSearch <<<
   [junit4]    > Throwable #1: org.apache.solr.client.solrj.SolrServerException: Server refused connection at: http://127.0.0.1:45694
   [junit4]    > 	at __randomizedtesting.SeedInfo.seed([7F46CD7550B5AC0D:FEA0436D27EACC31]:0)
   [junit4]    > 	at org.apache.solr.client.solrj.impl.HttpSolrServer.request(HttpSolrServer.java:428)
   [junit4]    > 	at org.apache.solr.client.solrj.impl.HttpSolrServer.request(HttpSolrServer.java:180)
   [junit4]    > 	at org.apache.solr.cloud.CollectionsAPIDistributedZkTest.testCustomCollectionsAPI(CollectionsAPIDistributedZkTest.java:764)
   [junit4]    > 	at org.apache.solr.cloud.CollectionsAPIDistributedZkTest.doTest(CollectionsAPIDistributedZkTest.java:159)
   [junit4]    > 	at org.apache.solr.BaseDistributedSearchTestCase.testDistribSearch(BaseDistributedSearchTestCase.java:835)
   [junit4]    > 	at java.lang.Thread.run(Thread.java:724)
   [junit4]    > Caused by: org.apache.http.conn.HttpHostConnectException: Connection to http://127.0.0.1:45694 refused
   [junit4]    > 	at org.apache.http.impl.conn.DefaultClientConnectionOperator.openConnection(DefaultClientConnectionOperator.java:190)
   [junit4]    > 	at org.apache.http.impl.conn.ManagedClientConnectionImpl.open(ManagedClientConnectionImpl.java:294)
   [junit4]    > 	at org.apache.http.impl.client.DefaultRequestDirector.tryConnect(DefaultRequestDirector.java:645)
   [junit4]    > 	at org.apache.http.impl.client.DefaultRequestDirector.execute(DefaultRequestDirector.java:480)
   [junit4]    > 	at org.apache.http.impl.client.AbstractHttpClient.execute(AbstractHttpClient.java:906)
   [junit4]    > 	at org.apache.http.impl.client.AbstractHttpClient.execute(AbstractHttpClient.java:805)
   [junit4]    > 	at org.apache.http.impl.client.AbstractHttpClient.execute(AbstractHttpClient.java:784)
   [junit4]    > 	at org.apache.solr.client.solrj.impl.HttpSolrServer.request(HttpSolrServer.java:365)
   [junit4]    > 	... 44 more
   [junit4]    > Caused by: java.net.ConnectException: Connection refused
   [junit4]    > 	at java.net.PlainSocketImpl.socketConnect(Native Method)
   [junit4]    > 	at java.net.AbstractPlainSocketImpl.doConnect(AbstractPlainSocketImpl.java:339)
   [junit4]    > 	at java.net.AbstractPlainSocketImpl.connectToAddress(AbstractPlainSocketImpl.java:200)
   [junit4]    > 	at java.net.AbstractPlainSocketImpl.connect(AbstractPlainSocketImpl.java:182)
   [junit4]    > 	at java.net.SocksSocketImpl.connect(SocksSocketImpl.java:392)
   [junit4]    > 	at java.net.Socket.connect(Socket.java:579)
   [junit4]    > 	at org.apache.http.conn.scheme.PlainSocketFactory.connectSocket(PlainSocketFactory.java:127)
   [junit4]    > 	at org.apache.http.impl.conn.DefaultClientConnectionOperator.openConnection(DefaultClientConnectionOperator.java:180)
   [junit4]    > 	... 51 more
   [junit4]   2> 866017 T2497 oas.SolrTestCaseJ4.deleteCore ###deleteCore
   [junit4]   2> 133178 T2496 ccr.ThreadLeakControl.checkThreadLeaks WARNING Will linger awaiting termination of 3 leaked thread(s).
   [junit4]   2> 867229 T2579 oasc.LeaderElector$1.process WARN  org.apache.zookeeper.KeeperException$SessionExpiredException: KeeperErrorCode = Session expired for /collections/new_implicit_coll_0/leader_elect/c/election
   [junit4]   2> 	at org.apache.zookeeper.KeeperException.create(KeeperException.java:127)
   [junit4]   2> 	at org.apache.zookeeper.KeeperException.create(KeeperException.java:51)
   [junit4]   2> 	at org.apache.zookeeper.ZooKeeper.getChildren(ZooKeeper.java:1468)
   [junit4]   2> 	at org.apache.solr.common.cloud.SolrZkClient$6.execute(SolrZkClient.java:235)
   [junit4]   2> 	at org.apache.solr.common.cloud.SolrZkClient$6.execute(SolrZkClient.java:232)
   [junit4]   2> 	at org.apache.solr.common.cloud.ZkCmdExecutor.retryOperation(ZkCmdExecutor.java:65)
   [junit4]   2> 	at org.apache.solr.common.cloud.SolrZkClient.getChildren(SolrZkClient.java:232)
   [junit4]   2> 	at org.apache.solr.cloud.LeaderElector.checkIfIamLeader(LeaderElector.java:84)
   [junit4]   2> 	at org.apache.solr.cloud.LeaderElector.access$000(LeaderElector.java:55)
   [junit4]   2> 	at org.apache.solr.cloud.LeaderElector$1.process(LeaderElector.java:129)
   [junit4]   2> 	at org.apache.zookeeper.ClientCnxn$EventThread.processEvent(ClientCnxn.java:519)
   [junit4]   2> 	at org.apache.zookeeper.ClientCnxn$EventThread.run(ClientCnxn.java:495)
   [junit4]   2> 
   [junit4]   2> 867230 T2579 oascc.ZkStateReader$2.process A cluster state change: WatchedEvent state:SyncConnected type:NodeChildrenChanged path:/live_nodes, has occurred - updating... (live nodes size: 1)
   [junit4]   2> 867230 T2579 oascc.ZkStateReader$2.process WARN ZooKeeper watch triggered, but Solr cannot talk to ZK
   [junit4]   2> 867230 T2579 oascc.ZkStateReader$3.process WARN ZooKeeper watch triggered, but Solr cannot talk to ZK
   [junit4]   2> 867230 T2579 oasc.LeaderElector$1.process WARN  org.apache.zookeeper.KeeperException$SessionExpiredException: KeeperErrorCode = Session expired for /collections/new_implicit_coll_0/leader_elect/b/election
   [junit4]   2> 	at org.apache.zookeeper.KeeperException.create(KeeperException.java:127)
   [junit4]   2> 	at org.apache.zookeeper.KeeperException.create(KeeperException.java:51)
   [junit4]   2> 	at org.apache.zookeeper.ZooKeeper.getChildren(ZooKeeper.java:1468)
   [junit4]   2> 	at org.apache.solr.common.cloud.SolrZkClient$6.execute(SolrZkClient.java:235)
   [junit4]   2> 	at org.apache.solr.common.cloud.SolrZkClient$6.execute(SolrZkClient.java:232)
   [junit4]   2> 	at org.apache.solr.common.cloud.ZkCmdExecutor.retryOperation(ZkCmdExecutor.java:65)
   [junit4]   2> 	at org.apache.solr.common.cloud.SolrZkClient.getChildren(SolrZkClient.java:232)
   [junit4]   2> 	at org.apache.solr.cloud.LeaderElector.checkIfIamLeader(LeaderElector.java:84)
   [junit4]   2> 	at org.apache.solr.cloud.LeaderElector.access$000(LeaderElector.java:55)
   [junit4]   2> 	at org.apache.solr.cloud.LeaderElector$1.process(LeaderElector.java:129)
   [junit4]   2> 	at org.apache.zookeeper.ClientCnxn$EventThread.processEvent(ClientCnxn.java:519)
   [junit4]   2> 	at org.apache.zookeeper.ClientCnxn$EventThread.run(ClientCnxn.java:495)
   [junit4]   2> 
   [junit4]   2> NOTE: test params are: codec=Lucene41, sim=RandomSimilarityProvider(queryNorm=true,coord=yes): {}, locale=uk, timezone=America/Dawson
   [junit4]   2> NOTE: Linux 3.2.0-51-generic i386/Oracle Corporation 1.7.0_25 (32-bit)/cpus=8,threads=7,free=50941400,total=260849664
   [junit4]   2> NOTE: All tests run in this JVM: [FileBasedSpellCheckerTest, PrimUtilsTest, ResourceLoaderTest, HdfsChaosMonkeySafeLeaderTest, TestSchemaVersionResource, TestSolrDeletionPolicy2, BadComponentTest, ChaosMonkeyNothingIsSafeTest, TestSchemaNameResource, TestDefaultSearchFieldResource, TestStressRecovery, QueryParsingTest, AnalysisAfterCoreReloadTest, SliceStateTest, ShowFileRequestHandlerTest, TestBadConfig, CircularListTest, SynonymTokenizerTest, RecoveryZkTest, TestDynamicFieldResource, LegacyHTMLStripCharFilterTest, TestSweetSpotSimilarityFactory, SimpleFacetsTest, SpellingQueryConverterTest, IndexSchemaTest, RegexBoostProcessorTest, ExternalFileFieldSortTest, ResponseLogComponentTest, UpdateRequestProcessorFactoryTest, BasicDistributedZkTest, DirectSolrConnectionTest, TestSolrCoreProperties, QueryElevationComponentTest, ZkControllerTest, AlternateDirectoryTest, SearchHandlerTest, TestReversedWildcardFilterFactory, StressHdfsTest, TestTrie, SolrTestCaseJ4Test, TestFieldTypeCollectionResource, TestValueSourceCache, SystemInfoHandlerTest, AutoCommitTest, TestLRUCache, OverseerCollectionProcessorTest, TestMaxScoreQueryParser, TestSolrQueryParserDefaultOperatorResource, TestDynamicFieldCollectionResource, DirectUpdateHandlerOptimizeTest, ReturnFieldsTest, SolrIndexSplitterTest, TestConfig, TestSolrDeletionPolicy1, PolyFieldTest, BasicFunctionalityTest, TestDocSet, WordBreakSolrSpellCheckerTest, SchemaVersionSpecificBehaviorTest, TestFieldResource, TestQuerySenderListener, TestFastLRUCache, TestReplicationHandler, TestPhraseSuggestions, TestGroupingSearch, PeerSyncTest, TestPluginEnable, TestSolrXml, TestSolrQueryParserResource, CoreMergeIndexesAdminHandlerTest, TestFunctionQuery, MBeansHandlerTest, JsonLoaderTest, SolrCoreTest, FieldMutatingUpdateProcessorTest, TestPropInjectDefaults, ChaosMonkeySafeLeaderTest, CollectionsAPIDistributedZkTest]
   [junit4] Completed on J0 in 134.48s, 1 test, 1 error <<< FAILURES!

[...truncated 485 lines...]
BUILD FAILED
/mnt/ssd/jenkins/workspace/Lucene-Solr-trunk-Linux/build.xml:389: The following error occurred while executing this line:
/mnt/ssd/jenkins/workspace/Lucene-Solr-trunk-Linux/build.xml:369: The following error occurred while executing this line:
/mnt/ssd/jenkins/workspace/Lucene-Solr-trunk-Linux/build.xml:39: The following error occurred while executing this line:
/mnt/ssd/jenkins/workspace/Lucene-Solr-trunk-Linux/solr/build.xml:181: The following error occurred while executing this line:
/mnt/ssd/jenkins/workspace/Lucene-Solr-trunk-Linux/solr/common-build.xml:449: The following error occurred while executing this line:
/mnt/ssd/jenkins/workspace/Lucene-Solr-trunk-Linux/lucene/common-build.xml:1230: The following error occurred while executing this line:
/mnt/ssd/jenkins/workspace/Lucene-Solr-trunk-Linux/lucene/common-build.xml:873: There were test failures: 320 suites, 1345 tests, 1 error, 34 ignored (6 assumptions)

Total time: 41 minutes 20 seconds
Build step 'Invoke Ant' marked build as failure
Description set: Java: 32bit/jdk1.7.0_25 -server -XX:+UseSerialGC
Archiving artifacts
Recording test results
Email was triggered for: Failure
Sending email for trigger: Failure



Mime
View raw message