lucene-dev mailing list archives

Site index · List index
Message view « Date » · « Thread »
Top « Date » · « Thread »
From Policeman Jenkins Server <jenk...@thetaphi.de>
Subject [JENKINS] Lucene-Solr-trunk-MacOSX (64bit/jdk1.7.0) - Build # 695 - Still Failing!
Date Thu, 01 Aug 2013 01:20:58 GMT
Build: http://jenkins.thetaphi.de/job/Lucene-Solr-trunk-MacOSX/695/
Java: 64bit/jdk1.7.0 -XX:+UseCompressedOops -XX:+UseParallelGC

2 tests failed.
REGRESSION:  org.apache.solr.handler.TestReplicationHandler.doTestStressReplication

Error Message:
timed out waiting for collection1 startAt time to exceed: Wed Jul 31 19:38:57 CDT 2013

Stack Trace:
java.lang.AssertionError: timed out waiting for collection1 startAt time to exceed: Wed Jul 31 19:38:57 CDT 2013
	at __randomizedtesting.SeedInfo.seed([E0A70BE6B4CEE449:3B0C0B20B1E68DFA]:0)
	at org.junit.Assert.fail(Assert.java:93)
	at org.apache.solr.handler.TestReplicationHandler.watchCoreStartAt(TestReplicationHandler.java:1507)
	at org.apache.solr.handler.TestReplicationHandler.doTestStressReplication(TestReplicationHandler.java:811)
	at sun.reflect.NativeMethodAccessorImpl.invoke0(Native Method)
	at sun.reflect.NativeMethodAccessorImpl.invoke(NativeMethodAccessorImpl.java:57)
	at sun.reflect.DelegatingMethodAccessorImpl.invoke(DelegatingMethodAccessorImpl.java:43)
	at java.lang.reflect.Method.invoke(Method.java:606)
	at com.carrotsearch.randomizedtesting.RandomizedRunner.invoke(RandomizedRunner.java:1559)
	at com.carrotsearch.randomizedtesting.RandomizedRunner.access$600(RandomizedRunner.java:79)
	at com.carrotsearch.randomizedtesting.RandomizedRunner$6.evaluate(RandomizedRunner.java:737)
	at com.carrotsearch.randomizedtesting.RandomizedRunner$7.evaluate(RandomizedRunner.java:773)
	at com.carrotsearch.randomizedtesting.RandomizedRunner$8.evaluate(RandomizedRunner.java:787)
	at com.carrotsearch.randomizedtesting.rules.SystemPropertiesRestoreRule$1.evaluate(SystemPropertiesRestoreRule.java:53)
	at org.apache.lucene.util.TestRuleSetupTeardownChained$1.evaluate(TestRuleSetupTeardownChained.java:50)
	at org.apache.lucene.util.TestRuleFieldCacheSanity$1.evaluate(TestRuleFieldCacheSanity.java:51)
	at org.apache.lucene.util.AbstractBeforeAfterRule$1.evaluate(AbstractBeforeAfterRule.java:46)
	at com.carrotsearch.randomizedtesting.rules.SystemPropertiesInvariantRule$1.evaluate(SystemPropertiesInvariantRule.java:55)
	at org.apache.lucene.util.TestRuleThreadAndTestName$1.evaluate(TestRuleThreadAndTestName.java:49)
	at org.apache.lucene.util.TestRuleIgnoreAfterMaxFailures$1.evaluate(TestRuleIgnoreAfterMaxFailures.java:70)
	at org.apache.lucene.util.TestRuleMarkFailure$1.evaluate(TestRuleMarkFailure.java:48)
	at com.carrotsearch.randomizedtesting.rules.StatementAdapter.evaluate(StatementAdapter.java:36)
	at com.carrotsearch.randomizedtesting.ThreadLeakControl$StatementRunner.run(ThreadLeakControl.java:358)
	at com.carrotsearch.randomizedtesting.ThreadLeakControl.forkTimeoutingTask(ThreadLeakControl.java:782)
	at com.carrotsearch.randomizedtesting.ThreadLeakControl$3.evaluate(ThreadLeakControl.java:442)
	at com.carrotsearch.randomizedtesting.RandomizedRunner.runSingleTest(RandomizedRunner.java:746)
	at com.carrotsearch.randomizedtesting.RandomizedRunner$3.evaluate(RandomizedRunner.java:648)
	at com.carrotsearch.randomizedtesting.RandomizedRunner$4.evaluate(RandomizedRunner.java:682)
	at com.carrotsearch.randomizedtesting.RandomizedRunner$5.evaluate(RandomizedRunner.java:693)
	at com.carrotsearch.randomizedtesting.rules.StatementAdapter.evaluate(StatementAdapter.java:36)
	at com.carrotsearch.randomizedtesting.rules.SystemPropertiesRestoreRule$1.evaluate(SystemPropertiesRestoreRule.java:53)
	at org.apache.lucene.util.AbstractBeforeAfterRule$1.evaluate(AbstractBeforeAfterRule.java:46)
	at org.apache.lucene.util.TestRuleStoreClassName$1.evaluate(TestRuleStoreClassName.java:42)
	at com.carrotsearch.randomizedtesting.rules.SystemPropertiesInvariantRule$1.evaluate(SystemPropertiesInvariantRule.java:55)
	at com.carrotsearch.randomizedtesting.rules.NoShadowingOrOverridesOnMethodsRule$1.evaluate(NoShadowingOrOverridesOnMethodsRule.java:39)
	at com.carrotsearch.randomizedtesting.rules.NoShadowingOrOverridesOnMethodsRule$1.evaluate(NoShadowingOrOverridesOnMethodsRule.java:39)
	at com.carrotsearch.randomizedtesting.rules.StatementAdapter.evaluate(StatementAdapter.java:36)
	at org.apache.lucene.util.TestRuleAssertionsRequired$1.evaluate(TestRuleAssertionsRequired.java:43)
	at org.apache.lucene.util.TestRuleMarkFailure$1.evaluate(TestRuleMarkFailure.java:48)
	at org.apache.lucene.util.TestRuleIgnoreAfterMaxFailures$1.evaluate(TestRuleIgnoreAfterMaxFailures.java:70)
	at org.apache.lucene.util.TestRuleIgnoreTestSuites$1.evaluate(TestRuleIgnoreTestSuites.java:55)
	at com.carrotsearch.randomizedtesting.rules.StatementAdapter.evaluate(StatementAdapter.java:36)
	at com.carrotsearch.randomizedtesting.ThreadLeakControl$StatementRunner.run(ThreadLeakControl.java:358)
	at java.lang.Thread.run(Thread.java:724)


FAILED:  org.apache.solr.cloud.CollectionsAPIDistributedZkTest.testDistribSearch

Error Message:
Server refused connection at: http://127.0.0.1:50452

Stack Trace:
org.apache.solr.client.solrj.SolrServerException: Server refused connection at: http://127.0.0.1:50452
	at __randomizedtesting.SeedInfo.seed([E0A70BE6B4CEE449:614185FEC3918475]:0)
	at org.apache.solr.client.solrj.impl.HttpSolrServer.request(HttpSolrServer.java:428)
	at org.apache.solr.client.solrj.impl.HttpSolrServer.request(HttpSolrServer.java:180)
	at org.apache.solr.cloud.CollectionsAPIDistributedZkTest.testCustomCollectionsAPI(CollectionsAPIDistributedZkTest.java:764)
	at org.apache.solr.cloud.CollectionsAPIDistributedZkTest.doTest(CollectionsAPIDistributedZkTest.java:159)
	at org.apache.solr.BaseDistributedSearchTestCase.testDistribSearch(BaseDistributedSearchTestCase.java:835)
	at sun.reflect.NativeMethodAccessorImpl.invoke0(Native Method)
	at sun.reflect.NativeMethodAccessorImpl.invoke(NativeMethodAccessorImpl.java:57)
	at sun.reflect.DelegatingMethodAccessorImpl.invoke(DelegatingMethodAccessorImpl.java:43)
	at java.lang.reflect.Method.invoke(Method.java:606)
	at com.carrotsearch.randomizedtesting.RandomizedRunner.invoke(RandomizedRunner.java:1559)
	at com.carrotsearch.randomizedtesting.RandomizedRunner.access$600(RandomizedRunner.java:79)
	at com.carrotsearch.randomizedtesting.RandomizedRunner$6.evaluate(RandomizedRunner.java:737)
	at com.carrotsearch.randomizedtesting.RandomizedRunner$7.evaluate(RandomizedRunner.java:773)
	at com.carrotsearch.randomizedtesting.RandomizedRunner$8.evaluate(RandomizedRunner.java:787)
	at com.carrotsearch.randomizedtesting.rules.SystemPropertiesRestoreRule$1.evaluate(SystemPropertiesRestoreRule.java:53)
	at org.apache.lucene.util.TestRuleSetupTeardownChained$1.evaluate(TestRuleSetupTeardownChained.java:50)
	at org.apache.lucene.util.TestRuleFieldCacheSanity$1.evaluate(TestRuleFieldCacheSanity.java:51)
	at org.apache.lucene.util.AbstractBeforeAfterRule$1.evaluate(AbstractBeforeAfterRule.java:46)
	at com.carrotsearch.randomizedtesting.rules.SystemPropertiesInvariantRule$1.evaluate(SystemPropertiesInvariantRule.java:55)
	at org.apache.lucene.util.TestRuleThreadAndTestName$1.evaluate(TestRuleThreadAndTestName.java:49)
	at org.apache.lucene.util.TestRuleIgnoreAfterMaxFailures$1.evaluate(TestRuleIgnoreAfterMaxFailures.java:70)
	at org.apache.lucene.util.TestRuleMarkFailure$1.evaluate(TestRuleMarkFailure.java:48)
	at com.carrotsearch.randomizedtesting.rules.StatementAdapter.evaluate(StatementAdapter.java:36)
	at com.carrotsearch.randomizedtesting.ThreadLeakControl$StatementRunner.run(ThreadLeakControl.java:358)
	at com.carrotsearch.randomizedtesting.ThreadLeakControl.forkTimeoutingTask(ThreadLeakControl.java:782)
	at com.carrotsearch.randomizedtesting.ThreadLeakControl$3.evaluate(ThreadLeakControl.java:442)
	at com.carrotsearch.randomizedtesting.RandomizedRunner.runSingleTest(RandomizedRunner.java:746)
	at com.carrotsearch.randomizedtesting.RandomizedRunner$3.evaluate(RandomizedRunner.java:648)
	at com.carrotsearch.randomizedtesting.RandomizedRunner$4.evaluate(RandomizedRunner.java:682)
	at com.carrotsearch.randomizedtesting.RandomizedRunner$5.evaluate(RandomizedRunner.java:693)
	at com.carrotsearch.randomizedtesting.rules.StatementAdapter.evaluate(StatementAdapter.java:36)
	at com.carrotsearch.randomizedtesting.rules.SystemPropertiesRestoreRule$1.evaluate(SystemPropertiesRestoreRule.java:53)
	at org.apache.lucene.util.AbstractBeforeAfterRule$1.evaluate(AbstractBeforeAfterRule.java:46)
	at org.apache.lucene.util.TestRuleStoreClassName$1.evaluate(TestRuleStoreClassName.java:42)
	at com.carrotsearch.randomizedtesting.rules.SystemPropertiesInvariantRule$1.evaluate(SystemPropertiesInvariantRule.java:55)
	at com.carrotsearch.randomizedtesting.rules.NoShadowingOrOverridesOnMethodsRule$1.evaluate(NoShadowingOrOverridesOnMethodsRule.java:39)
	at com.carrotsearch.randomizedtesting.rules.NoShadowingOrOverridesOnMethodsRule$1.evaluate(NoShadowingOrOverridesOnMethodsRule.java:39)
	at com.carrotsearch.randomizedtesting.rules.StatementAdapter.evaluate(StatementAdapter.java:36)
	at org.apache.lucene.util.TestRuleAssertionsRequired$1.evaluate(TestRuleAssertionsRequired.java:43)
	at org.apache.lucene.util.TestRuleMarkFailure$1.evaluate(TestRuleMarkFailure.java:48)
	at org.apache.lucene.util.TestRuleIgnoreAfterMaxFailures$1.evaluate(TestRuleIgnoreAfterMaxFailures.java:70)
	at org.apache.lucene.util.TestRuleIgnoreTestSuites$1.evaluate(TestRuleIgnoreTestSuites.java:55)
	at com.carrotsearch.randomizedtesting.rules.StatementAdapter.evaluate(StatementAdapter.java:36)
	at com.carrotsearch.randomizedtesting.ThreadLeakControl$StatementRunner.run(ThreadLeakControl.java:358)
	at java.lang.Thread.run(Thread.java:724)
Caused by: org.apache.http.conn.HttpHostConnectException: Connection to http://127.0.0.1:50452 refused
	at org.apache.http.impl.conn.DefaultClientConnectionOperator.openConnection(DefaultClientConnectionOperator.java:190)
	at org.apache.http.impl.conn.ManagedClientConnectionImpl.open(ManagedClientConnectionImpl.java:294)
	at org.apache.http.impl.client.DefaultRequestDirector.tryConnect(DefaultRequestDirector.java:645)
	at org.apache.http.impl.client.DefaultRequestDirector.execute(DefaultRequestDirector.java:480)
	at org.apache.http.impl.client.AbstractHttpClient.execute(AbstractHttpClient.java:906)
	at org.apache.http.impl.client.AbstractHttpClient.execute(AbstractHttpClient.java:805)
	at org.apache.http.impl.client.AbstractHttpClient.execute(AbstractHttpClient.java:784)
	at org.apache.solr.client.solrj.impl.HttpSolrServer.request(HttpSolrServer.java:365)
	... 44 more
Caused by: java.net.ConnectException: Connection refused
	at java.net.PlainSocketImpl.socketConnect(Native Method)
	at java.net.AbstractPlainSocketImpl.doConnect(AbstractPlainSocketImpl.java:339)
	at java.net.AbstractPlainSocketImpl.connectToAddress(AbstractPlainSocketImpl.java:200)
	at java.net.AbstractPlainSocketImpl.connect(AbstractPlainSocketImpl.java:182)
	at java.net.SocksSocketImpl.connect(SocksSocketImpl.java:392)
	at java.net.Socket.connect(Socket.java:579)
	at org.apache.http.conn.scheme.PlainSocketFactory.connectSocket(PlainSocketFactory.java:127)
	at org.apache.http.impl.conn.DefaultClientConnectionOperator.openConnection(DefaultClientConnectionOperator.java:180)
	... 51 more




Build Log:
[...truncated 9519 lines...]
   [junit4] Suite: org.apache.solr.handler.TestReplicationHandler
   [junit4]   2> 1567403 T2795 oas.SolrTestCaseJ4.setUp ###Starting doTestRepeater
   [junit4]   2> 1567417 T2795 oejs.Server.doStart jetty-8.1.10.v20130312
   [junit4]   2> 1567426 T2795 oejs.AbstractConnector.doStart Started SelectChannelConnector@127.0.0.1:50164
   [junit4]   2> 1567429 T2795 oass.SolrDispatchFilter.init SolrDispatchFilter.init()
   [junit4]   2> 1567432 T2795 oasc.SolrResourceLoader.locateSolrHome JNDI not configured for solr (NoInitialContextEx)
   [junit4]   2> 1567433 T2795 oasc.SolrResourceLoader.locateSolrHome using system property solr.solr.home: ./org.apache.solr.handler.TestReplicationHandler$SolrInstance-1375317471379/master
   [junit4]   2> 1567433 T2795 oasc.SolrResourceLoader.<init> new SolrResourceLoader for directory: './org.apache.solr.handler.TestReplicationHandler$SolrInstance-1375317471379/master/'
   [junit4]   2> 1567474 T2795 oasc.ConfigSolr.fromFile Loading container configuration from /Users/jenkins/jenkins-slave/workspace/Lucene-Solr-trunk-MacOSX/solr/build/solr-core/test/J0/./org.apache.solr.handler.TestReplicationHandler$SolrInstance-1375317471379/master/solr.xml
   [junit4]   2> 1567476 T2795 oasc.ConfigSolr.fromFile /Users/jenkins/jenkins-slave/workspace/Lucene-Solr-trunk-MacOSX/solr/build/solr-core/test/J0/./org.apache.solr.handler.TestReplicationHandler$SolrInstance-1375317471379/master/solr.xml does not exist, using default configuration
   [junit4]   2> 1567591 T2795 oasc.CoreContainer.<init> New CoreContainer 1097413001
   [junit4]   2> 1567591 T2795 oasc.CoreContainer.load Loading cores into CoreContainer [instanceDir=./org.apache.solr.handler.TestReplicationHandler$SolrInstance-1375317471379/master/]
   [junit4]   2> 1567594 T2795 oashc.HttpShardHandlerFactory.getParameter Setting socketTimeout to: 0
   [junit4]   2> 1567594 T2795 oashc.HttpShardHandlerFactory.getParameter Setting urlScheme to: http://
   [junit4]   2> 1567595 T2795 oashc.HttpShardHandlerFactory.getParameter Setting connTimeout to: 0
   [junit4]   2> 1567595 T2795 oashc.HttpShardHandlerFactory.getParameter Setting maxConnectionsPerHost to: 20
   [junit4]   2> 1567595 T2795 oashc.HttpShardHandlerFactory.getParameter Setting corePoolSize to: 0
   [junit4]   2> 1567596 T2795 oashc.HttpShardHandlerFactory.getParameter Setting maximumPoolSize to: 2147483647
   [junit4]   2> 1567596 T2795 oashc.HttpShardHandlerFactory.getParameter Setting maxThreadIdleTime to: 5
   [junit4]   2> 1567596 T2795 oashc.HttpShardHandlerFactory.getParameter Setting sizeOfQueue to: -1
   [junit4]   2> 1567597 T2795 oashc.HttpShardHandlerFactory.getParameter Setting fairnessPolicy to: false
   [junit4]   2> 1567598 T2795 oascsi.HttpClientUtil.createClient Creating new http client, config:maxConnectionsPerHost=20&maxConnections=10000&socketTimeout=0&connTimeout=0&retry=false
   [junit4]   2> 1567631 T2805 oasc.CoreContainer.create Creating SolrCore 'collection1' using instanceDir: ./org.apache.solr.handler.TestReplicationHandler$SolrInstance-1375317471379/master/collection1
   [junit4]   2> 1567631 T2805 oasc.SolrResourceLoader.<init> new SolrResourceLoader for directory: './org.apache.solr.handler.TestReplicationHandler$SolrInstance-1375317471379/master/collection1/'
   [junit4]   2> 1567695 T2805 oasc.SolrConfig.<init> Using Lucene MatchVersion: LUCENE_50
   [junit4]   2> 1567777 T2805 oasc.SolrConfig.<init> Loaded SolrConfig: solrconfig.xml
   [junit4]   2> 1567777 T2805 oass.IndexSchema.readSchema Reading Solr Schema from schema.xml
   [junit4]   2> 1567785 T2805 oass.IndexSchema.readSchema [collection1] Schema name=test
   [junit4]   2> 1567812 T2805 oass.IndexSchema.readSchema unique key field: id
   [junit4]   2> 1567814 T2805 oasc.SolrCore.initDirectoryFactory org.apache.solr.core.MockDirectoryFactory
   [junit4]   2> 1567815 T2805 oasc.SolrCore.<init> [collection1] Opening new SolrCore at ./org.apache.solr.handler.TestReplicationHandler$SolrInstance-1375317471379/master/collection1/, dataDir=/Users/jenkins/jenkins-slave/workspace/Lucene-Solr-trunk-MacOSX/solr/build/solr-core/test/J0/./org.apache.solr.handler.TestReplicationHandler$SolrInstance-1375317471379/master/collection1/data/
   [junit4]   2> 1567815 T2805 oasc.SolrCore.<init> JMX monitoring not detected for core: collection1
   [junit4]   2> 1567816 T2805 oasc.CachingDirectoryFactory.get return new directory for /Users/jenkins/jenkins-slave/workspace/Lucene-Solr-trunk-MacOSX/solr/build/solr-core/test/J0/./org.apache.solr.handler.TestReplicationHandler$SolrInstance-1375317471379/master/collection1/data
   [junit4]   2> 1567816 T2805 oasc.SolrCore.getNewIndexDir New index directory detected: old=null new=/Users/jenkins/jenkins-slave/workspace/Lucene-Solr-trunk-MacOSX/solr/build/solr-core/test/J0/./org.apache.solr.handler.TestReplicationHandler$SolrInstance-1375317471379/master/collection1/data/index/
   [junit4]   2> 1567817 T2805 oasc.SolrCore.initIndex WARN [collection1] Solr index directory '/Users/jenkins/jenkins-slave/workspace/Lucene-Solr-trunk-MacOSX/solr/build/solr-core/test/J0/./org.apache.solr.handler.TestReplicationHandler$SolrInstance-1375317471379/master/collection1/data/index' doesn't exist. Creating new index...
   [junit4]   2> 1567818 T2805 oasc.CachingDirectoryFactory.get return new directory for /Users/jenkins/jenkins-slave/workspace/Lucene-Solr-trunk-MacOSX/solr/build/solr-core/test/J0/./org.apache.solr.handler.TestReplicationHandler$SolrInstance-1375317471379/master/collection1/data/index
   [junit4]   2> 1567820 T2805 oasc.SolrDeletionPolicy.onCommit SolrDeletionPolicy.onCommit: commits: num=1
   [junit4]   2> 		commit{dir=MockDirWrapper(org.apache.lucene.store.RAMDirectory@2aba58c8 lockFactory=org.apache.lucene.store.SingleInstanceLockFactory@2dcb43c),segFN=segments_1,generation=1}
   [junit4]   2> 1567820 T2805 oasc.SolrDeletionPolicy.updateCommits newest commit generation = 1
   [junit4]   2> 1567821 T2805 oasc.RequestHandlers.initHandlersFromConfig created standard: solr.StandardRequestHandler
   [junit4]   2> 1567822 T2805 oasc.RequestHandlers.initHandlersFromConfig created /replication: solr.ReplicationHandler
   [junit4]   2> 1567822 T2805 oasc.RequestHandlers.initHandlersFromConfig created defaults: solr.StandardRequestHandler
   [junit4]   2> 1567822 T2805 oasc.RequestHandlers.initHandlersFromConfig adding lazy requestHandler: solr.StandardRequestHandler
   [junit4]   2> 1567823 T2805 oasc.RequestHandlers.initHandlersFromConfig created lazy: solr.StandardRequestHandler
   [junit4]   2> 1567824 T2805 oasc.RequestHandlers.initHandlersFromConfig created /update: solr.UpdateRequestHandler
   [junit4]   2> 1567843 T2805 oashl.XMLLoader.init xsltCacheLifetimeSeconds=60
   [junit4]   2> 1567850 T2805 oass.SolrIndexSearcher.<init> Opening Searcher@2a414e61 main
   [junit4]   2> 1567851 T2805 oasu.CommitTracker.<init> Hard AutoCommit: disabled
   [junit4]   2> 1567851 T2805 oasu.CommitTracker.<init> Soft AutoCommit: disabled
   [junit4]   2> 1567851 T2805 oash.ReplicationHandler.inform Replication enabled for following config files: schema.xml,xslt/dummy.xsl
   [junit4]   2> 1567852 T2805 oash.ReplicationHandler.inform Commits will be reserved for  10000
   [junit4]   2> 1567852 T2805 oasc.CoreContainer.registerCore registering core: collection1
   [junit4]   2> 1567852 T2806 oasc.SolrCore.registerSearcher [collection1] Registered new searcher Searcher@2a414e61 main{StandardDirectoryReader(segments_1:1)}
   [junit4]   2> 1567853 T2795 oass.SolrDispatchFilter.init user.dir=/Users/jenkins/jenkins-slave/workspace/Lucene-Solr-trunk-MacOSX/solr/build/solr-core/test/J0
   [junit4]   2> 1567854 T2795 oass.SolrDispatchFilter.init SolrDispatchFilter.init() done
   [junit4]   2> 1567854 T2795 oascsi.HttpClientUtil.createClient Creating new http client, config:maxConnections=128&maxConnectionsPerHost=32&followRedirects=false
   [junit4]   2> 1567880 T2795 oejs.Server.doStart jetty-8.1.10.v20130312
   [junit4]   2> 1567894 T2795 oejs.AbstractConnector.doStart Started SelectChannelConnector@127.0.0.1:50165
   [junit4]   2> 1567895 T2795 oass.SolrDispatchFilter.init SolrDispatchFilter.init()
   [junit4]   2> 1567895 T2795 oasc.SolrResourceLoader.locateSolrHome JNDI not configured for solr (NoInitialContextEx)
   [junit4]   2> 1567896 T2795 oasc.SolrResourceLoader.locateSolrHome using system property solr.solr.home: ./org.apache.solr.handler.TestReplicationHandler$SolrInstance-1375317471844/slave
   [junit4]   2> 1567896 T2795 oasc.SolrResourceLoader.<init> new SolrResourceLoader for directory: './org.apache.solr.handler.TestReplicationHandler$SolrInstance-1375317471844/slave/'
   [junit4]   2> 1567920 T2795 oasc.ConfigSolr.fromFile Loading container configuration from /Users/jenkins/jenkins-slave/workspace/Lucene-Solr-trunk-MacOSX/solr/build/solr-core/test/J0/./org.apache.solr.handler.TestReplicationHandler$SolrInstance-1375317471844/slave/solr.xml
   [junit4]   2> 1567921 T2795 oasc.ConfigSolr.fromFile /Users/jenkins/jenkins-slave/workspace/Lucene-Solr-trunk-MacOSX/solr/build/solr-core/test/J0/./org.apache.solr.handler.TestReplicationHandler$SolrInstance-1375317471844/slave/solr.xml does not exist, using default configuration
   [junit4]   2> 1568026 T2795 oasc.CoreContainer.<init> New CoreContainer 811950643
   [junit4]   2> 1568027 T2795 oasc.CoreContainer.load Loading cores into CoreContainer [instanceDir=./org.apache.solr.handler.TestReplicationHandler$SolrInstance-1375317471844/slave/]
   [junit4]   2> 1568029 T2795 oashc.HttpShardHandlerFactory.getParameter Setting socketTimeout to: 0
   [junit4]   2> 1568029 T2795 oashc.HttpShardHandlerFactory.getParameter Setting urlScheme to: http://
   [junit4]   2> 1568030 T2795 oashc.HttpShardHandlerFactory.getParameter Setting connTimeout to: 0
   [junit4]   2> 1568030 T2795 oashc.HttpShardHandlerFactory.getParameter Setting maxConnectionsPerHost to: 20
   [junit4]   2> 1568031 T2795 oashc.HttpShardHandlerFactory.getParameter Setting corePoolSize to: 0
   [junit4]   2> 1568031 T2795 oashc.HttpShardHandlerFactory.getParameter Setting maximumPoolSize to: 2147483647
   [junit4]   2> 1568032 T2795 oashc.HttpShardHandlerFactory.getParameter Setting maxThreadIdleTime to: 5
   [junit4]   2> 1568032 T2795 oashc.HttpShardHandlerFactory.getParameter Setting sizeOfQueue to: -1
   [junit4]   2> 1568033 T2795 oashc.HttpShardHandlerFactory.getParameter Setting fairnessPolicy to: false
   [junit4]   2> 1568033 T2795 oascsi.HttpClientUtil.createClient Creating new http client, config:maxConnectionsPerHost=20&maxConnections=10000&socketTimeout=0&connTimeout=0&retry=false
   [junit4]   2> 1568062 T2819 oasc.CoreContainer.create Creating SolrCore 'collection1' using instanceDir: ./org.apache.solr.handler.TestReplicationHandler$SolrInstance-1375317471844/slave/collection1
   [junit4]   2> 1568062 T2819 oasc.SolrResourceLoader.<init> new SolrResourceLoader for directory: './org.apache.solr.handler.TestReplicationHandler$SolrInstance-1375317471844/slave/collection1/'
   [junit4]   2> 1568154 T2819 oasc.SolrConfig.<init> Using Lucene MatchVersion: LUCENE_50
   [junit4]   2> 1568230 T2819 oasc.SolrConfig.<init> Loaded SolrConfig: solrconfig.xml
   [junit4]   2> 1568231 T2819 oass.IndexSchema.readSchema Reading Solr Schema from schema.xml
   [junit4]   2> 1568239 T2819 oass.IndexSchema.readSchema [collection1] Schema name=test
   [junit4]   2> 1568270 T2819 oass.IndexSchema.readSchema unique key field: id
   [junit4]   2> 1568272 T2819 oasc.SolrCore.initDirectoryFactory org.apache.solr.core.MockDirectoryFactory
   [junit4]   2> 1568274 T2819 oasc.SolrCore.<init> [collection1] Opening new SolrCore at ./org.apache.solr.handler.TestReplicationHandler$SolrInstance-1375317471844/slave/collection1/, dataDir=/Users/jenkins/jenkins-slave/workspace/Lucene-Solr-trunk-MacOSX/solr/build/solr-core/test/J0/./org.apache.solr.handler.TestReplicationHandler$SolrInstance-1375317471844/slave/collection1/data/
   [junit4]   2> 1568274 T2819 oasc.SolrCore.<init> JMX monitoring not detected for core: collection1
   [junit4]   2> 1568275 T2819 oasc.CachingDirectoryFactory.get return new directory for /Users/jenkins/jenkins-slave/workspace/Lucene-Solr-trunk-MacOSX/solr/build/solr-core/test/J0/./org.apache.solr.handler.TestReplicationHandler$SolrInstance-1375317471844/slave/collection1/data
   [junit4]   2> 1568276 T2819 oasc.SolrCore.getNewIndexDir New index directory detected: old=null new=/Users/jenkins/jenkins-slave/workspace/Lucene-Solr-trunk-MacOSX/solr/build/solr-core/test/J0/./org.apache.solr.handler.TestReplicationHandler$SolrInstance-1375317471844/slave/collection1/data/index/
   [junit4]   2> 1568277 T2819 oasc.SolrCore.initIndex WARN [collection1] Solr index directory '/Users/jenkins/jenkins-slave/workspace/Lucene-Solr-trunk-MacOSX/solr/build/solr-core/test/J0/./org.apache.solr.handler.TestReplicationHandler$SolrInstance-1375317471844/slave/collection1/data/index' doesn't exist. Creating new index...
   [junit4]   2> 1568279 T2819 oasc.CachingDirectoryFactory.get return new directory for /Users/jenkins/jenkins-slave/workspace/Lucene-Solr-trunk-MacOSX/solr/build/solr-core/test/J0/./org.apache.solr.handler.TestReplicationHandler$SolrInstance-1375317471844/slave/collection1/data/index
   [junit4]   2> 1568281 T2819 oasc.SolrDeletionPolicy.onCommit SolrDeletionPolicy.onCommit: commits: num=1
   [junit4]   2> 		commit{dir=MockDirWrapper(org.apache.lucene.store.RAMDirectory@7aff0999 lockFactory=org.apache.lucene.store.SingleInstanceLockFactory@35f0b49b),segFN=segments_1,generation=1}
   [junit4]   2> 1568282 T2819 oasc.SolrDeletionPolicy.updateCommits newest commit generation = 1
   [junit4]   2> 1568284 T2819 oasc.RequestHandlers.initHandlersFromConfig created standard: solr.StandardRequestHandler
   [junit4]   2> 1568285 T2819 oasc.RequestHandlers.initHandlersFromConfig created defaults: solr.StandardRequestHandler
   [junit4]   2> 1568285 T2819 oasc.RequestHandlers.initHandlersFromConfig adding lazy requestHandler: solr.StandardRequestHandler
   [junit4]   2> 1568286 T2819 oasc.RequestHandlers.initHandlersFromConfig created lazy: solr.StandardRequestHandler
   [junit4]   2> 1568286 T2819 oasc.RequestHandlers.initHandlersFromConfig created /update: solr.UpdateRequestHandler
   [junit4]   2> 1568288 T2819 oasc.RequestHandlers.initHandlersFromConfig created /replication: solr.ReplicationHandler
   [junit4]   2> 1568291 T2819 oashl.XMLLoader.init xsltCacheLifetimeSeconds=60
   [junit4]   2> 1568296 T2819 oass.SolrIndexSearcher.<init> Opening Searcher@38827132 main
   [junit4]   2> 1568297 T2819 oasu.CommitTracker.<init> Hard AutoCommit: disabled
   [junit4]   2> 1568297 T2819 oasu.CommitTracker.<init> Soft AutoCommit: disabled
   [junit4]   2> 1568397 T2819 oash.SnapPuller.startExecutorService Poll Scheduled at an interval of 1000ms
   [junit4]   2> 1568398 T2819 oasc.CoreContainer.registerCore registering core: collection1
   [junit4]   2> 1568398 T2820 oasc.SolrCore.registerSearcher [collection1] Registered new searcher Searcher@38827132 main{StandardDirectoryReader(segments_1:1)}
   [junit4]   2> 1568400 T2795 oass.SolrDispatchFilter.init user.dir=/Users/jenkins/jenkins-slave/workspace/Lucene-Solr-trunk-MacOSX/solr/build/solr-core/test/J0
   [junit4]   2> 1568400 T2795 oass.SolrDispatchFilter.init SolrDispatchFilter.init() done
   [junit4]   2> 1568401 T2795 oascsi.HttpClientUtil.createClient Creating new http client, config:maxConnections=128&maxConnectionsPerHost=32&followRedirects=false
   [junit4]   2> 1568434 T2795 oasc.CoreContainer.shutdown Shutting down CoreContainer instance=811950643
   [junit4]   2> 1568435 T2795 oasc.SolrCore.close [collection1]  CLOSING SolrCore org.apache.solr.core.SolrCore@156a880c
   [junit4]   2> 1568436 T2795 oasu.DirectUpdateHandler2.close closing DirectUpdateHandler2{commits=0,autocommits=0,soft autocommits=0,optimizes=0,rollbacks=0,expungeDeletes=0,docsPending=0,adds=0,deletesById=0,deletesByQuery=0,errors=0,cumulative_adds=0,cumulative_deletesById=0,cumulative_deletesByQuery=0,cumulative_errors=0}
   [junit4]   2> 1568437 T2795 oasu.SolrCoreState.decrefSolrCoreState Closing SolrCoreState
   [junit4]   2> 1568437 T2795 oasu.DefaultSolrCoreState.closeIndexWriter SolrCoreState ref count has reached 0 - closing IndexWriter
   [junit4]   2> 1568438 T2795 oasu.DefaultSolrCoreState.closeIndexWriter closing IndexWriter with IndexWriterCloser
   [junit4]   2> 1568439 T2795 oasc.SolrCore.closeSearcher [collection1] Closing main searcher on request.
   [junit4]   2> 1568440 T2795 oasc.CachingDirectoryFactory.close Closing MockDirectoryFactory - 2 directories currently being tracked
   [junit4]   2> 1568441 T2795 oasc.CachingDirectoryFactory.closeCacheValue looking to close /Users/jenkins/jenkins-slave/workspace/Lucene-Solr-trunk-MacOSX/solr/build/solr-core/test/J0/./org.apache.solr.handler.TestReplicationHandler$SolrInstance-1375317471844/slave/collection1/data/index [CachedDir<<refCount=0;path=/Users/jenkins/jenkins-slave/workspace/Lucene-Solr-trunk-MacOSX/solr/build/solr-core/test/J0/./org.apache.solr.handler.TestReplicationHandler$SolrInstance-1375317471844/slave/collection1/data/index;done=false>>]
   [junit4]   2> 1568442 T2795 oasc.CachingDirectoryFactory.close Closing directory: /Users/jenkins/jenkins-slave/workspace/Lucene-Solr-trunk-MacOSX/solr/build/solr-core/test/J0/./org.apache.solr.handler.TestReplicationHandler$SolrInstance-1375317471844/slave/collection1/data/index
   [junit4]   2> 1568442 T2795 oasc.CachingDirectoryFactory.closeCacheValue looking to close /Users/jenkins/jenkins-slave/workspace/Lucene-Solr-trunk-MacOSX/solr/build/solr-core/test/J0/./org.apache.solr.handler.TestReplicationHandler$SolrInstance-1375317471844/slave/collection1/data [CachedDir<<refCount=0;path=/Users/jenkins/jenkins-slave/workspace/Lucene-Solr-trunk-MacOSX/solr/build/solr-core/test/J0/./org.apache.solr.handler.TestReplicationHandler$SolrInstance-1375317471844/slave/collection1/data;done=false>>]
   [junit4]   2> 1568443 T2795 oasc.CachingDirectoryFactory.close Closing directory: /Users/jenkins/jenkins-slave/workspace/Lucene-Solr-trunk-MacOSX/solr/build/solr-core/test/J0/./org.apache.solr.handler.TestReplicationHandler$SolrInstance-1375317471844/slave/collection1/data
   [junit4]   2> 1568446 T2795 oejsh.ContextHandler.doStop stopped o.e.j.s.ServletContextHandler{/solr,null}
   [junit4]   2> 1568500 T2795 oejs.Server.doStart jetty-8.1.10.v20130312
   [junit4]   2> 1568507 T2795 oejs.AbstractConnector.doStart Started SelectChannelConnector@127.0.0.1:50166
   [junit4]   2> 1568508 T2795 oass.SolrDispatchFilter.init SolrDispatchFilter.init()
   [junit4]   2> 1568508 T2795 oasc.SolrResourceLoader.locateSolrHome JNDI not configured for solr (NoInitialContextEx)
   [junit4]   2> 1568509 T2795 oasc.SolrResourceLoader.locateSolrHome using system property solr.solr.home: ./org.apache.solr.handler.TestReplicationHandler$SolrInstance-1375317471844/slave
   [junit4]   2> 1568509 T2795 oasc.SolrResourceLoader.<init> new SolrResourceLoader for directory: './org.apache.solr.handler.TestReplicationHandler$SolrInstance-1375317471844/slave/'
   [junit4]   2> 1568531 T2795 oasc.ConfigSolr.fromFile Loading container configuration from /Users/jenkins/jenkins-slave/workspace/Lucene-Solr-trunk-MacOSX/solr/build/solr-core/test/J0/./org.apache.solr.handler.TestReplicationHandler$SolrInstance-1375317471844/slave/solr.xml
   [junit4]   2> 1568532 T2795 oasc.ConfigSolr.fromFile /Users/jenkins/jenkins-slave/workspace/Lucene-Solr-trunk-MacOSX/solr/build/solr-core/test/J0/./org.apache.solr.handler.TestReplicationHandler$SolrInstance-1375317471844/slave/solr.xml does not exist, using default configuration
   [junit4]   2> 1568637 T2795 oasc.CoreContainer.<init> New CoreContainer 1744188826
   [junit4]   2> 1568638 T2795 oasc.CoreContainer.load Loading cores into CoreContainer [instanceDir=./org.apache.solr.handler.TestReplicationHandler$SolrInstance-1375317471844/slave/]
   [junit4]   2> 1568640 T2795 oashc.HttpShardHandlerFactory.getParameter Setting socketTimeout to: 0
   [junit4]   2> 1568640 T2795 oashc.HttpShardHandlerFactory.getParameter Setting urlScheme to: http://
   [junit4]   2> 1568641 T2795 oashc.HttpShardHandlerFactory.getParameter Setting connTimeout to: 0
   [junit4]   2> 1568641 T2795 oashc.HttpShardHandlerFactory.getParameter Setting maxConnectionsPerHost to: 20
   [junit4]   2> 1568642 T2795 oashc.HttpShardHandlerFactory.getParameter Setting corePoolSize to: 0
   [junit4]   2> 1568642 T2795 oashc.HttpShardHandlerFactory.getParameter Setting maximumPoolSize to: 2147483647
   [junit4]   2> 1568642 T2795 oashc.HttpShardHandlerFactory.getParameter Setting maxThreadIdleTime to: 5
   [junit4]   2> 1568643 T2795 oashc.HttpShardHandlerFactory.getParameter Setting sizeOfQueue to: -1
   [junit4]   2> 1568643 T2795 oashc.HttpShardHandlerFactory.getParameter Setting fairnessPolicy to: false
   [junit4]   2> 1568644 T2795 oascsi.HttpClientUtil.createClient Creating new http client, config:maxConnectionsPerHost=20&maxConnections=10000&socketTimeout=0&connTimeout=0&retry=false
   [junit4]   2> 1568665 T2832 oasc.CoreContainer.create Creating SolrCore 'collection1' using instanceDir: ./org.apache.solr.handler.TestReplicationHandler$SolrInstance-1375317471844/slave/collection1
   [junit4]   2> 1568665 T2832 oasc.SolrResourceLoader.<init> new SolrResourceLoader for directory: './org.apache.solr.handler.TestReplicationHandler$SolrInstance-1375317471844/slave/collection1/'
   [junit4]   2> 1568736 T2832 oasc.SolrConfig.<init> Using Lucene MatchVersion: LUCENE_50
   [junit4]   2> 1568812 T2832 oasc.SolrConfig.<init> Loaded SolrConfig: solrconfig.xml
   [junit4]   2> 1568813 T2832 oass.IndexSchema.readSchema Reading Solr Schema from schema.xml
   [junit4]   2> 1568826 T2832 oass.IndexSchema.readSchema [collection1] Schema name=test
   [junit4]   2> 1568850 T2832 oass.IndexSchema.readSchema unique key field: id
   [junit4]   2> 1568852 T2832 oasc.SolrCore.initDirectoryFactory org.apache.solr.core.MockDirectoryFactory
   [junit4]   2> 1568853 T2832 oasc.SolrCore.<init> [collection1] Opening new SolrCore at ./org.apache.solr.handler.TestReplicationHandler$SolrInstance-1375317471844/slave/collection1/, dataDir=/Users/jenkins/jenkins-slave/workspace/Lucene-Solr-trunk-MacOSX/solr/build/solr-core/test/J0/./org.apache.solr.handler.TestReplicationHandler$SolrInstance-1375317471844/slave/collection1/data/
   [junit4]   2> 1568853 T2832 oasc.SolrCore.<init> JMX monitoring not detected for core: collection1
   [junit4]   2> 1568854 T2832 oasc.CachingDirectoryFactory.get return new directory for /Users/jenkins/jenkins-slave/workspace/Lucene-Solr-trunk-MacOSX/solr/build/solr-core/test/J0/./org.apache.solr.handler.TestReplicationHandler$SolrInstance-1375317471844/slave/collection1/data
   [junit4]   2> 1568854 T2832 oasc.SolrCore.getNewIndexDir New index directory detected: old=null new=/Users/jenkins/jenkins-slave/workspace/Lucene-Solr-trunk-MacOSX/solr/build/solr-core/test/J0/./org.apache.solr.handler.TestReplicationHandler$SolrInstance-1375317471844/slave/collection1/data/index/
   [junit4]   2> 1568854 T2832 oasc.SolrCore.initIndex WARN [collection1] Solr index directory '/Users/jenkins/jenkins-slave/workspace/Lucene-Solr-trunk-MacOSX/solr/build/solr-core/test/J0/./org.apache.solr.handler.TestReplicationHandler$SolrInstance-1375317471844/slave/collection1/data/index' doesn't exist. Creating new index...
   [junit4]   2> 1568855 T2832 oasc.CachingDirectoryFactory.get return new directory for /Users/jenkins/jenkins-slave/workspace/Lucene-Solr-trunk-MacOSX/solr/build/solr-core/test/J0/./org.apache.solr.handler.TestReplicationHandler$SolrInstance-1375317471844/slave/collection1/data/index
   [junit4]   2> 1568856 T2832 oasc.SolrDeletionPolicy.onCommit SolrDeletionPolicy.onCommit: commits: num=1
   [junit4]   2> 		commit{dir=MockDirWrapper(org.apache.lucene.store.RAMDirectory@436e55df lockFactory=org.apache.lucene.store.SingleInstanceLockFactory@7f95213b),segFN=segments_1,generation=1}
   [junit4]   2> 1568857 T2832 oasc.SolrDeletionPolicy.updateCommits newest commit generation = 1
   [junit4]   2> 1568858 T2832 oasc.RequestHandlers.initHandlersFromConfig created standard: solr.StandardRequestHandler
   [junit4]   2> 1568858 T2832 oasc.RequestHandlers.initHandlersFromConfig created defaults: solr.StandardRequestHandler
   [junit4]   2> 1568859 T2832 oasc.RequestHandlers.initHandlersFromConfig adding lazy requestHandler: solr.StandardRequestHandler
   [junit4]   2> 1568859 T2832 oasc.RequestHandlers.initHandlersFromConfig created lazy: solr.StandardRequestHandler
   [junit4]   2> 1568859 T2832 oasc.RequestHandlers.initHandlersFromConfig created /update: solr.UpdateRequestHandler
   [junit4]   2> 1568860 T2832 oasc.RequestHandlers.initHandlersFromConfig created /replication: solr.ReplicationHandler
   [junit4]   2> 1568863 T2832 oashl.XMLLoader.init xsltCacheLifetimeSeconds=60
   [junit4]   2> 1568867 T2832 oass.SolrIndexSearcher.<init> Opening Searcher@34e49e92 main
   [junit4]   2> 1568867 T2832 oasu.CommitTracker.<init> Hard AutoCommit: disabled
   [junit4]   2> 1568868 T2832 oasu.CommitTracker.<init> Soft AutoCommit: disabled
   [junit4]   2> 1568868 T2832 oash.ReplicationHandler.inform Commits will be reserved for  10000
   [junit4]   2> 1568868 T2832 oasc.CoreContainer.registerCore registering core: collection1
   [junit4]   2> 1568868 T2833 oasc.SolrCore.registerSearcher [collection1] Registered new searcher Searcher@34e49e92 main{StandardDirectoryReader(segments_1:1)}
   [junit4]   2> 1568870 T2795 oass.SolrDispatchFilter.init user.dir=/Users/jenkins/jenkins-slave/workspace/Lucene-Solr-trunk-MacOSX/solr/build/solr-core/test/J0
   [junit4]   2> 1568872 T2795 oass.SolrDispatchFilter.init SolrDispatchFilter.init() done
   [junit4]   2> 1568873 T2795 oascsi.HttpClientUtil.createClient Creating new http client, config:maxConnections=128&maxConnectionsPerHost=32&followRedirects=false
   [junit4]   2> 1568913 T2795 oejs.Server.doStart jetty-8.1.10.v20130312
   [junit4]   2> 1568918 T2795 oejs.AbstractConnector.doStart Started SelectChannelConnector@127.0.0.1:50167
   [junit4]   2> 1568919 T2795 oass.SolrDispatchFilter.init SolrDispatchFilter.init()
   [junit4]   2> 1568920 T2795 oasc.SolrResourceLoader.locateSolrHome JNDI not configured for solr (NoInitialContextEx)
   [junit4]   2> 1568920 T2795 oasc.SolrResourceLoader.locateSolrHome using system property solr.solr.home: ./org.apache.solr.handler.TestReplicationHandler$SolrInstance-1375317472875/repeater
   [junit4]   2> 1568920 T2795 oasc.SolrResourceLoader.<init> new SolrResourceLoader for directory: './org.apache.solr.handler.TestReplicationHandler$SolrInstance-1375317472875/repeater/'
   [junit4]   2> 1568938 T2795 oasc.ConfigSolr.fromFile Loading container configuration from /Users/jenkins/jenkins-slave/workspace/Lucene-Solr-trunk-MacOSX/solr/build/solr-core/test/J0/./org.apache.solr.handler.TestReplicationHandler$SolrInstance-1375317472875/repeater/solr.xml
   [junit4]   2> 1568939 T2795 oasc.ConfigSolr.fromFile /Users/jenkins/jenkins-slave/workspace/Lucene-Solr-trunk-MacOSX/solr/build/solr-core/test/J0/./org.apache.solr.handler.TestReplicationHandler$SolrInstance-1375317472875/repeater/solr.xml does not exist, using default configuration
   [junit4]   2> 1569025 T2795 oasc.CoreContainer.<init> New CoreContainer 1349035407
   [junit4]   2> 1569026 T2795 oasc.CoreContainer.load Loading cores into CoreContainer [instanceDir=./org.apache.solr.handler.TestReplicationHandler$SolrInstance-1375317472875/repeater/]
   [junit4]   2> 1569028 T2795 oashc.HttpShardHandlerFactory.getParameter Setting socketTimeout to: 0
   [junit4]   2> 1569029 T2795 oashc.HttpShardHandlerFactory.getParameter Setting urlScheme to: http://
   [junit4]   2> 1569029 T2795 oashc.HttpShardHandlerFactory.getParameter Setting connTimeout to: 0
   [junit4]   2> 1569030 T2795 oashc.HttpShardHandlerFactory.getParameter Setting maxConnectionsPerHost to: 20
   [junit4]   2> 1569030 T2795 oashc.HttpShardHandlerFactory.getParameter Setting corePoolSize to: 0
   [junit4]   2> 1569031 T2795 oashc.HttpShardHandlerFactory.getParameter Setting maximumPoolSize to: 2147483647
   [junit4]   2> 1569031 T2795 oashc.HttpShardHandlerFactory.getParameter Setting maxThreadIdleTime to: 5
   [junit4]   2> 1569032 T2795 oashc.HttpShardHandlerFactory.getParameter Setting sizeOfQueue to: -1
   [junit4]   2> 1569032 T2795 oashc.HttpShardHandlerFactory.getParameter Setting fairnessPolicy to: false
   [junit4]   2> 1569033 T2795 oascsi.HttpClientUtil.createClient Creating new http client, config:maxConnectionsPerHost=20&maxConnections=10000&socketTimeout=0&connTimeout=0&retry=false
   [junit4]   2> 1569058 T2844 oasc.CoreContainer.create Creating SolrCore 'collection1' using instanceDir: ./org.apache.solr.handler.TestReplicationHandler$SolrInstance-1375317472875/repeater/collection1
   [junit4]   2> 1569059 T2844 oasc.SolrResourceLoader.<init> new SolrResourceLoader for directory: './org.apache.solr.handler.TestReplicationHandler$SolrInstance-1375317472875/repeater/collection1/'
   [junit4]   2> 1569138 T2844 oasc.SolrConfig.<init> Using Lucene MatchVersion: LUCENE_50
   [junit4]   2> 1569222 T2844 oasc.SolrConfig.<init> Loaded SolrConfig: solrconfig.xml
   [junit4]   2> 1569223 T2844 oass.IndexSchema.readSchema Reading Solr Schema from schema.xml
   [junit4]   2> 1569233 T2844 oass.IndexSchema.readSchema [collection1] Schema name=test
   [junit4]   2> 1569257 T2844 oass.IndexSchema.readSchema unique key field: id
   [junit4]   2> 1569259 T2844 oasc.SolrCore.initDirectoryFactory org.apache.solr.core.MockDirectoryFactory
   [junit4]   2> 1569260 T2844 oasc.SolrCore.<init> [collection1] Opening new SolrCore at ./org.apache.solr.handler.TestReplicationHandler$SolrInstance-1375317472875/repeater/collection1/, dataDir=/Users/jenkins/jenkins-slave/workspace/Lucene-Solr-trunk-MacOSX/solr/build/solr-core/test/J0/./org.apache.solr.handler.TestReplicationHandler$SolrInstance-1375317472875/repeater/collection1/data/
   [junit4]   2> 1569260 T2844 oasc.SolrCore.<init> JMX monitoring not detected for core: collection1
   [junit4]   2> 1569261 T2844 oasc.CachingDirectoryFactory.get return new directory for /Users/jenkins/jenkins-slave/workspace/Lucene-Solr-trunk-MacOSX/solr/build/solr-core/test/J0/./org.apache.solr.handler.TestReplicationHandler$SolrInstance-1375317472875/repeater/collection1/data
   [junit4]   2> 1569261 T2844 oasc.SolrCore.getNewIndexDir New index directory detected: old=null new=/Users/jenkins/jenkins-slave/workspace/Lucene-Solr-trunk-MacOSX/solr/build/solr-core/test/J0/./org.apache.solr.handler.TestReplicationHandler$SolrInstance-1375317472875/repeater/collection1/data/index/
   [junit4]   2> 1569261 T2844 oasc.SolrCore.initIndex WARN [collection1] Solr index directory '/Users/jenkins/jenkins-slave/workspace/Lucene-Solr-trunk-MacOSX/solr/build/solr-core/test/J0/./org.apache.solr.handler.TestReplicationHandler$SolrInstance-1375317472875/repeater/collection1/data/index' doesn't exist. Creating new index...
   [junit4]   2> 1569262 T2844 oasc.CachingDirectoryFactory.get return new directory for /Users/jenkins/jenkins-slave/workspace/Lucene-Solr-trunk-MacOSX/solr/build/solr-core/test/J0/./org.apache.solr.handler.TestReplicationHandler$SolrInstance-1375317472875/repeater/collection1/data/index
   [junit4]   2> 1569263 T2844 oasc.SolrDeletionPolicy.onCommit SolrDeletionPolicy.onCommit: commits: num=1
   [junit4]   2> 		commit{dir=MockDirWrapper(org.apache.lucene.store.RAMDirectory@6b5a4b37 lockFactory=org.apache.lucene.store.SingleInstanceLockFactory@5f817a17),segFN=segments_1,generation=1}
   [junit4]   2> 1569263 T2844 oasc.SolrDeletionPolicy.updateCommits newest commit generation = 1
   [junit4]   2> 1569265 T2844 oasc.RequestHandlers.initHandlersFromConfig created standard: solr.StandardRequestHandler
   [junit4]   2> 1569265 T2844 oasc.RequestHandlers.initHandlersFromConfig created defaults: solr.StandardRequestHandler
   [junit4]   2> 1569265 T2844 oasc.RequestHandlers.initHandlersFromConfig adding lazy requestHandler: solr.StandardRequestHandler
   [junit4]   2> 1569266 T2844 oasc.RequestHandlers.initHandlersFromConfig created lazy: solr.StandardRequestHandler
   [junit4]   2> 1569267 T2844 oasc.RequestHandlers.initHandlersFromConfig created /update: solr.UpdateRequestHandler
   [junit4]   2> 1569267 T2844 oasc.RequestHandlers.initHandlersFromConfig created /replication: solr.ReplicationHandler
   [junit4]   2> 1569277 T2844 oashl.XMLLoader.init xsltCacheLifetimeSeconds=60
   [junit4]   2> 1569281 T2844 oass.SolrIndexSearcher.<init> Opening Searcher@66f929fb main
   [junit4]   2> 1569282 T2844 oasu.CommitTracker.<init> Hard AutoCommit: disabled
   [junit4]   2> 1569282 T2844 oasu.CommitTracker.<init> Soft AutoCommit: disabled
   [junit4]   2> 1569282 T2844 oash.SnapPuller.<init> WARN 'masterUrl' must be specified without the /replication suffix
   [junit4]   2> 1569283 T2844 oash.SnapPuller.<init>  No value set for 'pollInterval'. Timer Task not started.
   [junit4]   2> 1569283 T2844 oash.ReplicationHandler.inform Replication enabled for following config files: schema.xml
   [junit4]   2> 1569283 T2844 oash.ReplicationHandler.inform Commits will be reserved for  10000
   [junit4]   2> 1569284 T2844 oasc.CoreContainer.registerCore registering core: collection1
   [junit4]   2> 1569284 T2845 oasc.SolrCore.registerSearcher [collection1] Registered new searcher Searcher@66f929fb main{StandardDirectoryReader(segments_1:1)}
   [junit4]   2> 1569285 T2795 oass.SolrDispatchFilter.init user.dir=/Users/jenkins/jenkins-slave/workspace/Lucene-Solr-trunk-MacOSX/solr/build/solr-core/test/J0
   [junit4]   2> 1569285 T2795 oass.SolrDispatchFilter.init SolrDispatchFilter.init() done
   [junit4]   2> 1569286 T2795 oascsi.HttpClientUtil.createClient Creating new http client, config:maxConnections=128&maxConnectionsPerHost=32&followRedirects=false
   [junit4]   2> ASYNC  NEW_CORE C413 name=collection1 org.apache.solr.core.SolrCore@3075d539
   [junit4]   2> 1569322 T2803 C413 oasc.SolrDeletionPolicy.onInit SolrDeletionPolicy.onInit: commits: num=1
   [junit4]   2> 		commit{dir=MockDirWrapper(org.apache.lucene.store.RAMDirectory@2aba58c8 lockFactory=org.apache.lucene.store.SingleInstanceLockFactory@2dcb43c),segFN=segments_1,generation=1}
   [junit4]   2> 1569324 T2803 C413 oasc.SolrDeletionPolicy.updateCommits newest commit generation = 1
   [junit4]   2> 1569324 T2803 C413 oasup.LogUpdateProcessor.finish [collection1] webapp=/solr path=/update params={wt=javabin&version=2} {add=[0]} 0 4
   [junit4]   2> 1569328 T2804 C413 oasup.LogUpdateProcessor.finish [collection1] webapp=/solr path=/update params={wt=javabin&version=2} {add=[1]} 0 0
   [junit4]   2> 1569332 T2799 C413 oasup.LogUpdateProcessor.finish [collection1] webapp=/solr path=/update params={wt=javabin&version=2} {add=[2]} 0 0
   [junit4]   2> 1569335 T2800 C413 oasu.DirectUpdateHandler2.commit start commit{,optimize=false,openSearcher=true,waitSearcher=true,expungeDeletes=false,softCommit=false,prepareCommit=false}
   [junit4]   2> 1569338 T2800 C413 oasc.SolrDeletionPolicy.onCommit SolrDeletionPolicy.onCommit: commits: num=2
   [junit4]   2> 		commit{dir=MockDirWrapper(org.apache.lucene.store.RAMDirectory@2aba58c8 lockFactory=org.apache.lucene.store.SingleInstanceLockFactory@2dcb43c),segFN=segments_1,generation=1}
   [junit4]   2> 		commit{dir=MockDirWrapper(org.apache.lucene.store.RAMDirectory@2aba58c8 lockFactory=org.apache.lucene.store.SingleInstanceLockFactory@2dcb43c),segFN=segments_2,generation=2}
   [junit4]   2> 1569338 T2800 C413 oasc.SolrDeletionPolicy.updateCommits newest commit generation = 2
   [junit4]   2> 1569340 T2800 C413 oass.SolrIndexSearcher.<init> Opening Searcher@41005cff main
   [junit4]   2> 1569340 T2800 C413 oasu.DirectUpdateHandler2.commit end_commit_flush
   [junit4]   2> 1569340 T2806 oasc.SolrCore.registerSearcher [collection1] Registered new searcher Searcher@41005cff main{StandardDirectoryReader(segments_2:3:nrt _0(5.0):C3)}
   [junit4]   2> 1569341 T2800 C413 oasup.LogUpdateProcessor.finish [collection1] webapp=/solr path=/update params={waitSearcher=true&commit=true&wt=javabin&version=2&softCommit=false} {commit=} 0 6
   [junit4]   2> 1569359 T2847 oash.SnapPuller.<init> WARN 'masterUrl' must be specified without the /replication suffix
   [junit4]   2> 1569360 T2847 oash.SnapPuller.<init>  No value set for 'pollInterval'. Timer Task not started.
   [junit4]   2> 1569363 T2801 C413 oasc.SolrCore.execute [collection1] webapp=/solr path=/replication params={command=indexversion&qt=/replication&wt=javabin&version=2} status=0 QTime=1 
   [junit4]   2> 1569364 T2847 oash.SnapPuller.fetchLatestIndex Master's generation: 2
   [junit4]   2> 1569364 T2847 oash.SnapPuller.fetchLatestIndex Slave's generation: 1
   [junit4]   2> 1569364 T2847 oash.SnapPuller.fetchLatestIndex Starting replication process
   [junit4]   2> 1569386 T2802 C413 oasc.SolrCore.execute [collection1] webapp=/solr path=/replication params={command=filelist&qt=/replication&wt=javabin&generation=2&version=2} status=0 QTime=19 
   [junit4]   2> 1569388 T2847 oash.SnapPuller.fetchLatestIndex Number of files in latest index in master: 10
   [junit4]   2> 1569390 T2847 oasc.CachingDirectoryFactory.get return new directory for /Users/jenkins/jenkins-slave/workspace/Lucene-Solr-trunk-MacOSX/solr/build/solr-core/test/J0/./org.apache.solr.handler.TestReplicationHandler$SolrInstance-1375317472875/repeater/collection1/data/index.20130731193753363
   [junit4]   2> 1569390 T2847 oash.SnapPuller.fetchLatestIndex Starting download to MockDirWrapper(org.apache.lucene.store.RAMDirectory@72b5fb0d lockFactory=org.apache.lucene.store.SingleInstanceLockFactory@2de6a163) fullCopy=false
   [junit4]   2> 1569393 T2803 C413 oasc.SolrCore.execute [collection1] webapp=/solr path=/replication params={file=_0.cbnd&command=filecontent&checksum=true&wt=filestream&qt=/replication&generation=2} status=0 QTime=0 
   [junit4]   2> 1569399 T2804 C413 oasc.SolrCore.execute [collection1] webapp=/solr path=/replication params={file=_0.fnm&command=filecontent&checksum=true&wt=filestream&qt=/replication&generation=2} status=0 QTime=1 
   [junit4]   2> 1569404 T2799 C413 oasc.SolrCore.execute [collection1] webapp=/solr path=/replication params={file=_0.tim&command=filecontent&checksum=true&wt=filestream&qt=/replication&generation=2} status=0 QTime=1 
   [junit4]   2> 1569409 T2800 C413 oasc.SolrCore.execute [collection1] webapp=/solr path=/replication params={file=segments_2&command=filecontent&checksum=true&wt=filestream&qt=/replication&generation=2} status=0 QTime=0 
   [junit4]   2> 1569428 T2801 C413 oasc.SolrCore.execute [collection1] webapp=/solr path=/replication params={file=_0.fdx&command=filecontent&checksum=true&wt=filestream&qt=/replication&generation=2} status=0 QTime=0 
   [junit4]   2> 1569440 T2803 C413 oasc.SolrCore.execute [collection1] webapp=/solr path=/replication params={file=_0.cbnm&command=filecontent&checksum=true&wt=filestream&qt=/replication&generation=2} status=0 QTime=1 
   [junit4]   2> 1569446 T2804 C413 oasc.SolrCore.execute [collection1] webapp=/solr path=/replication params={file=_0.si&command=filecontent&checksum=true&wt=filestream&qt=/replication&generation=2} status=0 QTime=0 
   [junit4]   2> 1569451 T2799 C413 oasc.SolrCore.execute [collection1] webapp=/solr path=/replication params={file=_0.tip&command=filecontent&checksum=true&wt=filestream&qt=/replication&generation=2} status=0 QTime=0 
   [junit4]   2> 1569456 T2800 C413 oasc.SolrCore.execute [collection1] webapp=/solr path=/replication params={file=_0.doc&command=filecontent&checksum=true&wt=filestream&qt=/replication&generation=2} status=0 QTime=0 
   [junit4]   2> 1569462 T2801 C413 oasc.SolrCore.execute [collection1] webapp=/solr path=/replication params={file=_0.fdt&command=filecontent&checksum=true&wt=filestream&qt=/replication&generation=2} status=0 QTime=1 
   [junit4]   2> 1569464 T2847 oash.SnapPuller.fetchLatestIndex Total time taken for download : 0 secs
   [junit4]   2> 1569465 T2847 oasu.DefaultSolrCoreState.closeIndexWriter Closing IndexWriter...
   [junit4]   2> 1569465 T2847 oasu.DefaultSolrCoreState.closeIndexWriter Waiting until IndexWriter is unused... core=collection1
   [junit4]   2> 1569466 T2847 oasu.DefaultSolrCoreState.openIndexWriter Creating new IndexWriter...
   [junit4]   2> 1569468 T2847 oasc.SolrDeletionPolicy.onInit SolrDeletionPolicy.onInit: commits: num=2
   [junit4]   2> 		commit{dir=MockDirWrapper(org.apache.lucene.store.RAMDirectory@6b5a4b37 lockFactory=org.apache.lucene.store.SingleInstanceLockFactory@5f817a17),segFN=segments_1,generation=1}
   [junit4]   2> 		commit{dir=MockDirWrapper(org.apache.lucene.store.RAMDirectory@6b5a4b37 lockFactory=org.apache.lucene.store.SingleInstanceLockFactory@5f817a17),segFN=segments_2,generation=2}
   [junit4]   2> 1569469 T2847 oasc.SolrDeletionPolicy.updateCommits newest commit generation = 2
   [junit4]   2> 1569469 T2847 oasu.DefaultSolrCoreState.openIndexWriter New IndexWriter is ready to be used.
   [junit4]   2> 1569470 T2847 oass.SolrIndexSearcher.<init> Opening Searcher@60cce2ea main
   [junit4]   2> 1569471 T2845 oasc.SolrCore.registerSearcher [collection1] Registered new searcher Searcher@60cce2ea main{StandardDirectoryReader(segments_2:3:nrt _0(5.0):C3)}
   [junit4]   2> 1569471 T2847 oasc.CachingDirectoryFactory.closeCacheValue looking to close /Users/jenkins/jenkins-slave/workspace/Lucene-Solr-trunk-MacOSX/solr/build/solr-core/test/J0/./org.apache.solr.handler.TestReplicationHandler$SolrInstance-1375317472875/repeater/collection1/data/index.20130731193753363 [CachedDir<<refCount=0;path=/Users/jenkins/jenkins-slave/workspace/Lucene-Solr-trunk-MacOSX/solr/build/solr-core/test/J0/./org.apache.solr.handler.TestReplicationHandler$SolrInstance-1375317472875/repeater/collection1/data/index.20130731193753363;done=true>>]
   [junit4]   2> 1569471 T2847 oasc.CachingDirectoryFactory.close Closing directory: /Users/jenkins/jenkins-slave/workspace/Lucene-Solr-trunk-MacOSX/solr/build/solr-core/test/J0/./org.apache.solr.handler.TestReplicationHandler$SolrInstance-1375317472875/repeater/collection1/data/index.20130731193753363
   [junit4]   2> ASYNC  NEW_CORE C414 name=collection1 org.apache.solr.core.SolrCore@5043cc65
   [junit4]   2> 1569472 T2839 C414 oasc.SolrCore.execute [collection1] webapp=/solr path=/replication params={masterUrl=http://127.0.0.1:50164/solr/replication&command=fetchindex&wait=true} status=0 QTime=115 
   [junit4]   2> 1569478 T2840 C414 oasc.SolrCore.execute [collection1] webapp=/solr path=/select params={sort=id+desc&q=*:*&wt=javabin&version=2} hits=3 status=0 QTime=1 
   [junit4]   2> 1569491 T2850 oash.SnapPuller.<init> WARN 'masterUrl' must be specified without the /replication suffix
   [junit4]   2> 1569494 T2850 oash.SnapPuller.<init>  No value set for 'pollInterval'. Timer Task not started.
   [junit4]   2> 1569499 T2841 C414 oasc.SolrCore.execute [collection1] webapp=/solr path=/replication params={command=indexversion&qt=/replication&wt=javabin&version=2} status=0 QTime=0 
   [junit4]   2> 1569500 T2850 oash.SnapPuller.fetchLatestIndex Master's generation: 2
   [junit4]   2> 1569501 T2850 oash.SnapPuller.fetchLatestIndex Slave's generation: 1
   [junit4]   2> 1569501 T2850 oash.SnapPuller.fetchLatestIndex Starting replication process
   [junit4]   2> 1569504 T2842 C414 oasc.SolrCore.execute [collection1] webapp=/solr path=/replication params={command=filelist&qt=/replication&wt=javabin&generation=2&version=2} status=0 QTime=1 
   [junit4]   2> 1569505 T2850 oash.SnapPuller.fetchLatestIndex Number of files in latest index in master: 10
   [junit4]   2> 1569507 T2850 oasc.CachingDirectoryFactory.get return new directory for /Users/jenkins/jenkins-slave/workspace/Lucene-Solr-trunk-MacOSX/solr/build/solr-core/test/J0/./org.apache.solr.handler.TestReplicationHandler$SolrInstance-1375317471844/slave/collection1/data/index.20130731193753481
   [junit4]   2> 1569507 T2850 oash.SnapPuller.fetchLatestIndex Starting download to MockDirWrapper(org.apache.lucene.store.RAMDirectory@50fa5a22 lockFactory=org.apache.lucene.store.SingleInstanceLockFactory@444335b2) fullCopy=false
   [junit4]   2> 1569510 T2843 C414 oasc.SolrCore.execute [collection1] webapp=/solr path=/replication params={file=_0.cbnd&command=filecontent&checksum=true&wt=filestream&qt=/replication&generation=2} status=0 QTime=0 
   [junit4]   2> 1569517 T2838 C414 oasc.SolrCore.execute [collection1] webapp=/solr path=/replication params={file=_0.fnm&command=filecontent&checksum=true&wt=filestream&qt=/replication&generation=2} status=0 QTime=0 
   [junit4]   2> 1569522 T2839 C414 oasc.SolrCore.execute [collection1] webapp=/solr path=/replication params={file=_0.tim&command=filecontent&checksum=true&wt=filestream&qt=/replication&generation=2} status=0 QTime=1 
   [junit4]   2> 1569526 T2840 C414 oasc.SolrCore.execute [collection1] webapp=/solr path=/replication params={file=segments_2&command=filecontent&checksum=true&wt=filestream&qt=/replication&generation=2} status=0 QTime=0 
   [junit4]   2> 1569530 T2841 C414 oasc.SolrCore.execute [collection1] webapp=/solr path=/replication params={file=_0.fdx&command=filecontent&checksum=true&wt=filestream&qt=/replication&generation=2} status=0 QTime=0 
   [junit4]   2> 1569535 T2842 C414 oasc.SolrCore.execute [collection1] webapp=/solr path=/replication params={file=_0.cbnm&command=filecontent&checksum=true&wt=filestream&qt=/replication&generation=2} status=0 QTime=1 
   [junit4]   2> 1569539 T2843 C414 oasc.SolrCore.execute [collection1] webapp=/solr path=/replication params={file=_0.si&command=filecontent&checksum=true&wt=filestream&qt=/replication&generation=2} status=0 QTime=0 
   [junit4]   2> 1569543 T2838 C414 oasc.SolrCore.execute [collection1] webapp=/solr path=/replication params={file=_0.doc&command=filecontent&checksum=true&wt=filestream&qt=/replication&generation=2} status=0 QTime=0 
   [junit4]   2> 1569547 T2839 C414 oasc.SolrCore.execute [collection1] webapp=/solr path=/replication params={file=_0.tip&command=filecontent&checksum=true&wt=filestream&qt=/replication&generation=2} status=0 QTime=0 
   [junit4]   2> 1569551 T2840 C414 oasc.SolrCore.execute [collection1] webapp=/solr path=/replication params={file=_0.fdt&command=filecontent&checksum=true&wt=filestream&qt=/replication&generation=2} status=0 QTime=1 
   [junit4]   2> 1569552 T2850 oash.SnapPuller.fetchLatestIndex Total time taken for download : 0 secs
   [junit4]   2> 1569554 T2850 oasu.DefaultSolrCoreState.closeIndexWriter Closing IndexWriter...
   [junit4]   2> 1569554 T2850 oasu.DefaultSolrCoreState.closeIndexWriter Waiting until IndexWriter is unused... core=collection1
   [junit4]   2> 1569556 T2850 oasu.DefaultSolrCoreState.openIndexWriter Creating new IndexWriter...
   [junit4]   2> 1569558 T2850 oasc.SolrDeletionPolicy.onInit SolrDeletionPolicy.onInit: commits: num=2
   [junit4]   2> 		commit{dir=MockDirWrapper(org.apache.lucene.store.RAMDirectory@436e55df lockFactory=org.apache.lucene.store.SingleInstanceLockFactory@7f95213b),segFN=segments_1,generation=1}
   [junit4]   2> 		commit{dir=MockDirWrapper(org.apache.lucene.store.RAMDirectory@436e55df lockFactory=org.apache.lucene.store.SingleInstanceLockFactory@7f95213b),segFN=segments_2,generation=2}
   [junit4]   2> 1569564 T2850 oasc.SolrDeletionPolicy.updateCommits newest commit generation = 2
   [junit4]   2> 1569564 T2850 oasu.DefaultSolrCoreState.openIndexWriter New IndexWriter is ready to be used.
   [junit4]   2> 1569565 T2850 oass.SolrIndexSearcher.<init> Opening Searcher@362f8031 main
   [junit4]   2> 1569566 T2833 oasc.SolrCore.registerSearcher [collection1] Registered new searcher Searcher@362f8031 main{StandardDirectoryReader(segments_2:3:nrt _0(5.0):C3)}
   [junit4]   2> 1569566 T2850 oasc.CachingDirectoryFactory.closeCacheValue looking to close /Users/jenkins/jenkins-slave/workspace/Lucene-Solr-trunk-MacOSX/solr/build/solr-core/test/J0/./org.apache.solr.handler.TestReplicationHandler$SolrInstance-1375317471844/slave/collection1/data/index.20130731193753481 [CachedDir<<refCount=0;path=/Users/jenkins/jenkins-slave/workspace/Lucene-Solr-trunk-MacOSX/solr/build/solr-core/test/J0/./org.apache.solr.handler.TestReplicationHandler$SolrInstance-1375317471844/slave/collection1/data/index.20130731193753481;done=true>>]
   [junit4]   2> 1569566 T2850 oasc.CachingDirectoryFactory.close Closing directory: /Users/jenkins/jenkins-slave/workspace/Lucene-Solr-trunk-MacOSX/solr/build/solr-core/test/J0/./org.apache.solr.handler.TestReplicationHandler$SolrInstance-1375317471844/slave/collection1/data/index.20130731193753481
   [junit4]   2> ASYNC  NEW_CORE C415 name=collection1 org.apache.solr.core.SolrCore@7831ca93
   [junit4]   2> 1569567 T2828 C415 oasc.SolrCore.execute [collection1] webapp=/solr path=/replication params={masterUrl=http://127.0.0.1:50167/solr/replication&command=fetchindex&wait=true} status=0 QTime=78 
   [junit4]   2> 1569573 T2829 C415 oasc.SolrCore.execute [collection1] webapp=/solr path=/select params={sort=id+desc&q=*:*&wt=javabin&version=2} hits=3 status=0 QTime=1 
   [junit4]   2> 1569578 T2802 C413 oasc.SolrCore.execute [collection1] webapp=/solr path=/replication params={command=details&_trace=getDetails&wt=javabin&qt=/replication&version=2} status=0 QTime=0 
   [junit4]   2> 1569583 T2803 C413 oasc.SolrCore.execute [collection1] webapp=/solr path=/replication params={command=details&_trace=getDetails&wt=javabin&qt=/replication&version=2} status=0 QTime=1 
   [junit4]   2> 1569588 T2841 C414 oash.ReplicationHandler.getReplicationDetails WARN Exception while invoking 'details' method for replication on master  org.apache.solr.client.solrj.SolrServerException: Server refused connection at: http://127.0.0.1:TEST_PORT/solr
   [junit4]   2> 	at org.apache.solr.client.solrj.impl.HttpSolrServer.request(HttpSolrServer.java:428)
   [junit4]   2> 	at org.apache.solr.client.solrj.impl.HttpSolrServer.request(HttpSolrServer.java:180)
   [junit4]   2> 	at org.apache.solr.handler.SnapPuller.getDetails(SnapPuller.java:1596)
   [junit4]   2> 	at org.apache.solr.handler.ReplicationHandler.getReplicationDetails(ReplicationHandler.java:639)
   [junit4]   2> 	at org.apache.solr.handler.ReplicationHandler.handleRequestBody(ReplicationHandler.java:256)
   [junit4]   2> 	at org.apache.solr.handler.RequestHandlerBase.handleRequest(RequestHandlerBase.java:135)
   [junit4]   2> 	at org.apache.solr.core.SolrCore.execute(SolrCore.java:1845)
   [junit4]   2> 	at org.apache.solr.servlet.SolrDispatchFilter.execute(SolrDispatchFilter.java:666)
   [junit4]   2> 	at org.apache.solr.servlet.SolrDispatchFilter.doFilter(SolrDispatchFilter.java:369)
   [junit4]   2> 	at org.apache.solr.servlet.SolrDispatchFilter.doFilter(SolrDispatchFilter.java:158)
   [junit4]   2> 	at org.eclipse.jetty.servlet.ServletHandler$CachedChain.doFilter(ServletHandler.java:1419)
   [junit4]   2> 	at org.apache.solr.client.solrj.embedded.JettySolrRunner$DebugFilter.doFilter(JettySolrRunner.java:136)
   [junit4]   2> 	at org.eclipse.jetty.servlet.ServletHandler$CachedChain.doFilter(ServletHandler.java:1419)
   [junit4]   2> 	at org.eclipse.jetty.servlet.ServletHandler.doHandle(ServletHandler.java:455)
   [junit4]   2> 	at org.eclipse.jetty.server.session.SessionHandler.doHandle(SessionHandler.java:229)
   [junit4]   2> 	at org.eclipse.jetty.server.handler.ScopedHandler.handle(ScopedHandler.java:137)
   [junit4]   2> 	at org.eclipse.jetty.server.handler.GzipHandler.handle(GzipHandler.java:301)
   [junit4]   2> 	at org.eclipse.jetty.server.handler.ContextHandler.doHandle(ContextHandler.java:1077)
   [junit4]   2> 	at org.eclipse.jetty.servlet.ServletHandler.doScope(ServletHandler.java:384)
   [junit4]   2> 	at org.eclipse.jetty.server.session.SessionHandler.doScope(SessionHandler.java:193)
   [junit4]   2> 	at org.eclipse.jetty.server.handler.ContextHandler.doScope(ContextHandler.java:1009)
   [junit4]   2> 	at org.eclipse.jetty.server.handler.ScopedHandler.handle(ScopedHandler.java:135)
   [junit4]   2> 	at org.eclipse.jetty.server.handler.HandlerWrapper.handle(HandlerWrapper.java:116)
   [junit4]   2> 	at org.eclipse.jetty.server.Server.handle(Server.java:368)
   [junit4]   2> 	at org.eclipse.jetty.server.AbstractHttpConnection.handleRequest(AbstractHttpConnection.java:489)
   [junit4]   2> 	at org.eclipse.jetty.server.AbstractHttpConnection.headerComplete(AbstractHttpConnection.java:942)
   [junit4]   2> 	at org.eclipse.jetty.server.AbstractHttpConnection$RequestHandler.headerComplete(AbstractHttpConnection.java:1004)
   [junit4]   2> 	at org.eclipse.jetty.http.HttpParser.parseNext(HttpParser.java:640)
   [junit4]   2> 	at org.eclipse.jetty.http.HttpParser.parseAvailable(HttpParser.java:235)
   [junit4]   2> 	at org.eclipse.jetty.server.AsyncHttpConnection.handle(AsyncHttpConnection.java:82)
   [junit4]   2> 	at org.eclipse.jetty.io.nio.SelectChannelEndPoint.handle(SelectChannelEndPoint.java:628)
   [junit4]   2> 	at org.eclipse.jetty.io.nio.SelectChannelEndPoint$1.run(SelectChannelEndPoint.java:52)
   [junit4]   2> 	at org.eclipse.jetty.util.thread.QueuedThreadPool.runJob(QueuedThreadPool.java:608)
   [junit4]   2> 	at org.eclipse.jetty.util.thread.QueuedThreadPool$3.run(QueuedThreadPool.java:543)
   [junit4]   2> 	at java.lang.Thread.run(Thread.java:724)
   [junit4]   2> Caused by: org.apache.http.conn.HttpHostConnectException: Connection to http://127.0.0.1 refused
   [junit4]   2> 	at org.apache.http.impl.conn.DefaultClientConnectionOperator.openConnection(DefaultClientConnectionOperator.java:190)
   [junit4]   2> 	at org.apache.http.impl.conn.ManagedClientConnectionImpl.open(ManagedClientConnectionImpl.java:294)
   [junit4]   2> 	at org.apache.http.impl.client.DefaultRequestDirector.tryConnect(DefaultRequestDirector.java:645)
   [junit4]   2> 	at org.apache.http.impl.client.DefaultRequestDirector.execute(DefaultRequestDirector.java:480)
   [junit4]   2> 	at org.apache.http.impl.client.AbstractHttpClient.execute(AbstractHttpClient.java:906)
   [junit4]   2> 	at org.apache.http.impl.client.AbstractHttpClient.execute(AbstractHttpClient.java:805)
   [junit4]   2> 	at org.apache.http.impl.client.AbstractHttpClient.execute(AbstractHttpClient.java:784)
   [junit4]   2> 	at org.apache.solr.client.solrj.impl.HttpSolrServer.request(HttpSolrServer.java:365)
   [junit4]   2> 	... 34 more
   [junit4]   2> Caused by: java.net.ConnectException: Connection refused
   [junit4]   2> 	at java.net.PlainSocketImpl.socketConnect(Native Method)
   [junit4]   2> 	at java.net.AbstractPlainSocketImpl.doConnect(AbstractPlainSocketImpl.java:339)
   [junit4]   2> 	at java.net.AbstractPlainSocketImpl.connectToAddress(AbstractPlainSocketImpl.java:200)
   [junit4]   2> 	at java.net.AbstractPlainSocketImpl.connect(AbstractPlainSocketImpl.java:182)
   [junit4]   2> 	at java.net.SocksSocketImpl.connect(SocksSocketImpl.java:392)
   [junit4]   2> 	at java.net.Socket.connect(Socket.java:579)
   [junit4]   2> 	at org.apache.http.conn.scheme.PlainSocketFactory.connectSocket(PlainSocketFactory.java:127)
   [junit4]   2> 	at org.apache.http.impl.conn.DefaultClientConnectionOperator.openConnection(DefaultClientConnectionOperator.java:180)
   [junit4]   2> 	... 41 more
   [junit4]   2> 
   [junit4]   2> 1569591 T2841 C414 oasc.SolrCore.execute [collection1] webapp=/solr path=/replication params={command=details&_trace=getDetails&wt=javabin&qt=/replication&version=2} status=0 QTime=5 
   [junit4]   2> 1569594 T2804 C413 oasc.SolrCore.execute [collection1] webapp=/solr path=/replication params={command=indexversion&_trace=assertVersions&wt=javabin&qt=/replication&version=2} status=0 QTime=0 
   [junit4]   2> 1569597 T2842 C414 oasc.SolrCore.execute [collection1] webapp=/solr path=/replication params={command=indexversion&_trace=assertVersions&wt=javabin&qt=/replication&version=2} status=0 QTime=0 
   [junit4]   2> 1569602 T2843 C414 oash.ReplicationHandler.getReplicationDetails WARN Exception while invoking 'details' method for replication on master  org.apache.solr.client.solrj.SolrServerException: Server refused connection at: http://127.0.0.1:TEST_PORT/solr
   [junit4]   2> 	at org.apache.solr.client.solrj.impl.HttpSolrServer.request(HttpSolrServer.java:428)
   [junit4]   2> 	at org.apache.solr.client.solrj.impl.HttpSolrServer.request(HttpSolrServer.java:180)
   [junit4]   2> 	at org.apache.solr.handler.SnapPuller.getDetails(SnapPuller.java:1596)
   [junit4]   2> 	at org.apache.solr.handler.ReplicationHandler.getReplicationDetails(ReplicationHandler.java:639)
   [junit4]   2> 	at org.apache.solr.handler.ReplicationHandler.handleRequestBody(ReplicationHandler.java:256)
   [junit4]   2> 	at org.apache.solr.handler.RequestHandlerBase.handleRequest(RequestHandlerBase.java:135)
   [junit4]   2> 	at org.apache.solr.core.SolrCore.execute(SolrCore.java:1845)
   [junit4]   2> 	at org.apache.solr.servlet.SolrDispatchFilter.execute(SolrDispatchFilter.java:666)
   [junit4]   2> 	at org.apache.solr.servlet.SolrDispatchFilter.doFilter(SolrDispatchFilter.java:369)
   [junit4]   2> 	at org.apache.solr.servlet.SolrDispatchFilter.doFilter(SolrDispatchFilter.java:158)
   [junit4]   2> 	at org.eclipse.jetty.servlet.ServletHandler$CachedChain.doFilter(ServletHandler.java:1419)
   [junit4]   2> 	at org.apache.solr.client.solrj.embedded.JettySolrRunner$DebugFilter.doFilter(JettySolrRunner.java:136)
   [junit4]   2> 	at org.eclipse.jetty.servlet.ServletHandler$CachedChain.doFilter(ServletHandler.java:1419)
   [junit4]   2> 	at org.eclipse.jetty.servlet.ServletHandler.doHandle(ServletHandler.java:455)
   [junit4]   2> 	at org.eclipse.jetty.server.session.SessionHandler.doHandle(SessionHandler.java:229)
   [junit4]   2> 	at org.eclipse.jetty.server.handler.ScopedHandler.handle(ScopedHandler.java:137)
   [junit4]   2> 	at org.eclipse.jetty.server.handler.GzipHandler.handle(GzipHandler.java:301)
   [junit4]   2> 	at org.eclipse.jetty.server.handler.ContextHandler.doHandle(ContextHandler.java:1077)
   [junit4]   2> 	at org.eclipse.jetty.servlet.ServletHandler.doScope(ServletHandler.java:384)
   [junit4]   2> 	at org.eclipse.jetty.server.session.SessionHandler.doScope(SessionHandler.java:193)
   [junit4]   2> 	at org.eclipse.jetty.server.handler.ContextHandler.doScope(ContextHandler.java:1009)
   [junit4]   2> 	at org.eclipse.jetty.server.handler.ScopedHandler.handle(ScopedHandler.java:135)
   [junit4]   2> 	at org.eclipse.jetty.server.handler.HandlerWrapper.handle(HandlerWrapper.java:116)
   [junit4]   2> 	at org.eclipse.jetty.server.Server.handle(Server.java:368)
   [junit4]   2> 	at org.eclipse.jetty.server.AbstractHttpConnection.handleRequest(AbstractHttpConnection.java:489)
   [junit4]   2> 	at org.eclipse.jetty.server.AbstractHttpConnection.headerComplete(AbstractHttpConnection.java:942)
   [junit4]   2> 	at org.eclipse.jetty.server.AbstractHttpConnection$RequestHandler.headerComplete(AbstractHttpConnection.java:1004)
   [junit4]   2> 	at org.eclipse.jetty.http.HttpParser.parseNext(HttpParser.java:640)
   [junit4]   2> 	at org.eclipse.jetty.http.HttpParser.parseAvailable(HttpParser.java:235)
   [junit4]   2> 	at org.eclipse.jetty.server.AsyncHttpConnection.handle(AsyncHttpConnection.java:82)
   [junit4]   2> 	at org.eclipse.jetty.io.nio.SelectChannelEndPoint.handle(SelectChannelEndPoint.java:628)
   [junit4]   2> 	at org.eclipse.jetty.io.nio.SelectChannelEndPoint$1.run(SelectChannelEndPoint.java:52)
   [junit4]   2> 	at org.eclipse.jetty.util.thread.QueuedThreadPool.runJob(QueuedThreadPool.java:608)
   [junit4]   2> 	at org.eclipse.jetty.util.thread.QueuedThreadPool$3.run(QueuedThreadPool.java:543)
   [junit4]   2> 	at java.lang.Thread.run(Thread.java:724)
   [junit4]   2> Caused by: org.apache.http.conn.HttpHostConnectException: Connection to http://127.0.0.1 refused
   [junit4]   2> 	at org.apache.http.impl.conn.DefaultClientConnectionOperator.openConnection(DefaultClientConnectionOperator.java:190)
   [junit4]   2> 	at org.apache.http.impl.conn.ManagedClientConnectionImpl.open(ManagedClientConnectionImpl.java:294)
   [junit4]   2> 	at org.apache.http.impl.client.DefaultRequestDirector.tryConnect(DefaultRequestDirector.java:645)
   [junit4]   2> 	at org.apache.http.impl.client.DefaultRequestDirector.execute(DefaultRequestDirector.java:480)
   [junit4]   2> 	at org.apache.http.impl.client.AbstractHttpClient.execute(AbstractHttpClient.java:906)
   [junit4]   2> 	at org.apache.http.impl.client.AbstractHttpClient.execute(AbstractHttpClient.java:805)
   [junit4]   2> 	at org.apache.http.impl.client.AbstractHttpClient.execute(AbstractHttpClient.java:784)
   [junit4]   2> 	at org.apache.solr.client.solrj.impl.HttpSolrServer.request(HttpSolrServer.java:365)
   [junit4]   2> 	... 34 more
   [junit4]   2> Caused by: java.net.ConnectException: Connection refused
   [junit4]   2> 	at java.net.PlainSocketImpl.socketConnect(Native Method)
   [junit4]   2> 	at java.net.AbstractPlainSocketImpl.doConnect(AbstractPlainSocketImpl.java:339)
   [junit4]   2> 	at java.net.AbstractPlainSocketImpl.connectToAddress(AbstractPlainSocketImpl.java:200)
   [junit4]   2> 	at java.net.AbstractPlainSocketImpl.connect(AbstractPlainSocketImpl.java:182)
   [junit4]   2> 	at java.net.SocksSocketImpl.connect(SocksSocketImpl.java:392)
   [junit4]   2> 	at java.net.Socket.connect(Socket.java:579)
   [junit4]   2> 	at org.apache.http.conn.scheme.PlainSocketFactory.connectSocket(PlainSocketFactory.java:127)
   [junit4]   2> 	at org.apache.http.impl.conn.DefaultClientConnectionOperator.openConnection(DefaultClientConnectionOperator.java:180)
   [junit4]   2> 	... 41 more
   [junit4]   2> 
   [junit4]   2> 1569604 T2843 C414 oasc.SolrCore.execute [collection1] webapp=/solr path=/replication params={command=details&_trace=getDetails&wt=javabin&qt=/replication&version=2} status=0 QTime=4 
   [junit4]   2> 1569608 T2838 C414 oash.ReplicationHandler.getReplicationDetails WARN Exception while invoking 'details' method for replication on master  org.apache.solr.client.solrj.SolrServerException: Server refused connection at: http://127.0.0.1:TEST_PORT/solr
   [junit4]   2> 	at org.apache.solr.client.solrj.impl.HttpSolrServer.request(HttpSolrServer.java:428)
   [junit4]   2> 	at org.apache.solr.client.solrj.impl.HttpSolrServer.request(HttpSolrServer.java:180)
   [junit4]   2> 	at org.apache.solr.handler.SnapPuller.getDetails(SnapPuller.java:1596)
   [junit4]   2> 	at org.apache.solr.handler.ReplicationHandler.getReplicationDetails(ReplicationHandler.java:639)
   [junit4]   2> 	at org.apache.solr.handler.ReplicationHandler.handleRequestBody(ReplicationHandler.java:256)
   [junit4]   2> 	at org.apache.solr.handler.RequestHandlerBase.handleRequest(RequestHandlerBase.java:135)
   [junit4]   2> 	at org.apache.solr.core.SolrCore.execute(SolrCore.java:1845)
   [junit4]   2> 	at org.apache.solr.servlet.SolrDispatchFilter.execute(SolrDispatchFilter.java:666)
   [junit4]   2> 	at org.apache.solr.servlet.SolrDispatchFilter.doFilter(SolrDispatchFilter.java:369)
   [junit4]   2> 	at org.apache.solr.servlet.SolrDispatchFilter.doFilter(SolrDispatchFilter.java:158)
   [junit4]   2> 	at org.eclipse.jetty.servlet.ServletHandler$CachedChain.doFilter(ServletHandler.java:1419)
   [junit4]   2> 	at org.apache.solr.client.solrj.embedded.JettySolrRunner$DebugFilter.doFilter(JettySolrRunner.java:136)
   [junit4]   2> 	at org.eclipse.jetty.servlet.ServletHandler$CachedChain.doFilter(ServletHandler.java:1419)
   [junit4]   2> 	at org.eclipse.jetty.servlet.ServletHandler.doHandle(ServletHandler.java:455)
   [junit4]   2> 	at org.eclipse.jetty.server.session.SessionHandler.doHandle(SessionHandler.java:229)
   [junit4]   2> 	at org.eclipse.jetty.server.handler.ScopedHandler.handle(ScopedHandler.java:137)
   [junit4]   2> 	at org.eclipse.jetty.server.handler.GzipHandler.handle(GzipHandler.java:301)
   [junit4]   2> 	at org.eclipse.jetty.server.handler.ContextHandler.doHandle(ContextHandler.java:1077)
   [junit4]   2> 	at org.eclipse.jetty.servlet.ServletHandler.doScope(ServletHandler.java:384)
   [junit4]   2> 	at org.eclipse.jetty.server.session.SessionHandler.doScope(SessionHandler.java:193)
   [junit4]   2> 	at org.eclipse.jetty.server.handler.ContextHandler.doScope(ContextHandler.java:1009)
   [junit4]   2> 	at org.eclipse.jetty.server.handler.ScopedHandler.handle(ScopedHandler.java:135)
   [junit4]   2> 	at org.eclipse.jetty.server.handler.HandlerWrapper.handle(HandlerWrapper.java:116)
   [junit4]   2> 	at org.eclipse.jetty.server.Server.handle(Server.java:368)
   [junit4]   2> 	at org.eclipse.jetty.server.AbstractHttpConnection.handleRequest(AbstractHttpConnection.java:489)
   [junit4]   2> 	at org.eclipse.jetty.server.AbstractHttpConnection.headerComplete(AbstractHttpConnection.java:942)
   [junit4]   2> 	at org.eclipse.jetty.server.AbstractHttpConnection$RequestHandler.headerComplete(AbstractHttpConnection.java:1004)
   [junit4]   2> 	at org.eclipse.jetty.http.HttpParser.parseNext(HttpParser.java:640)
   [junit4]   2> 	at org.eclipse.jetty.http.HttpParser.parseAvailable(HttpParser.java:235)
   [junit4]   2> 	at org.eclipse.jetty.server.AsyncHttpConnection.handle(AsyncHttpConnection.java:82)
   [junit4]   2> 	at org.eclipse.jetty.io.nio.SelectChannelEndPoint.handle(SelectChannelEndPoint.java:628)
   [junit4]   2> 	at org.eclipse.jetty.io.nio.SelectChannelEndPoint$1.run(SelectChannelEndPoint.java:52)
   [junit4]   2> 	at org.eclipse.jetty.util.thread.QueuedThreadPool.runJob(QueuedThreadPool.java:608)
   [junit4]   2> 	at org.eclipse.jetty.util.thread.QueuedThreadPool$3.run(QueuedThreadPool.java:543)
   [junit4]   2> 	at java.lang.Thread.run(Thread.java:724)
   [junit4]   2> Caused by: org.apache.http.conn.HttpHostConnectException: Connection to http://127.0.0.1 refused
   [junit4]   2> 	at org.apache.http.impl.conn.DefaultClientConnectionOperator.openConnection(DefaultClientConnectionOperator.java:190)
   [junit4]   2> 	at org.apache.http.impl.conn.ManagedClientConnectionImpl.open(ManagedClientConnectionImpl.java:294)
   [junit4]   2> 	at org.apache.http.impl.client.DefaultRequestDirector.tryConnect(DefaultRequestDirector.java:645)
   [junit4]   2> 	at org.apache.http.impl.client.DefaultRequestDirector.execute(DefaultRequestDirector.java:480)
   [junit4]   2> 	at org.apache.http.impl.client.AbstractHttpClient.execute(AbstractHttpClient.java:906)
   [junit4]   2> 	at org.apache.http.impl.client.AbstractHttpClient.execute(AbstractHttpClient.java:805)
   [junit4]   2> 	at org.apache.http.impl.client.AbstractHttpClient.execute(AbstractHttpClient.java:784)
   [junit4]   2> 	at org.apache.solr.client.solrj.impl.HttpSolrServer.request(HttpSolrServer.java:365)
   [junit4]   2> 	... 34 more
   [junit4]   2> Caused by: java.net.ConnectException: Connection refused
   [junit4]   2> 	at java.net.PlainSocketImpl.socketConnect(Native Method)
   [junit4]   2> 	at java.net.AbstractPlainSocketImpl.doConnect(AbstractPlainSocketImpl.java:339)
   [junit4]   2> 	at java.net.AbstractPlainSocketImpl.connectToAddress(AbstractPlainSocketImpl.java:200)
   [junit4]   2> 	at java.net.AbstractPlainSocketImpl.connect(AbstractPlainSocketImpl.java:182)
   [junit4]   2> 	at java.net.SocksSocketImpl.connect(SocksSocketImpl.java:392)
   [junit4]   2> 	at java.net.Socket.connect(Socket.java:579)
   [junit4]   2> 	at org.apache.http.conn.scheme.PlainSocketFactory.connectSocket(PlainSocketFactory.java:127)
   [junit4]   2> 	at org.apache.http.impl.conn.DefaultClientConnectionOperator.openConnection(DefaultClientConnectionOperator.java:180)
   [junit4]   2> 	... 41 more
   [junit4]   2> 
   [junit4]   2> 1569610 T2838 C414 oasc.SolrCore.execute [collection1] webapp=/solr path=/replication params={command=details&_trace=getDetails&wt=javabin&qt=/replication&version=2} status=0 QTime=3 
   [junit4]   2> 1569617 T2839 C414 oasc.SolrCore.execute [collection1] webapp=/solr path=/replication params={slave=false&command=details&wt=javabin&qt=/replication&version=2} status=0 QTime=0 
   [junit4]   2> 1569624 T2831 C415 oasc.SolrCore.execute [collection1] webapp=/solr path=/replication params={command=details&_trace=getDetails&wt=javabin&qt=/replication&version=2} status=0 QTime=11 
   [junit4]   2> 1569627 T2840 C414 oasc.SolrCore.execute [collection1] webapp=/solr path=/replication params={command=indexversion&_trace=assertVersions&wt=javabin&qt=/replication&version=2} status=0 QTime=0 
   [junit4]   2> 1569631 T2830 C415 oasc.SolrCore.execute [collection1] webapp=/solr path=/replication params={command=indexversion&_trace=assertVersions&wt=javabin&qt=/replication&version=2} status=0 QTime=0 
   [junit4]   2> 1569636 T2841 C414 oasup.LogUpdateProcessor.finish [collection1] webapp=/solr path=/update params={wt=javabin&version=2} {add=[0]} 0 2
   [junit4]   2> 1569644 T2842 C414 oasup.LogUpdateProcessor.finish [collection1] webapp=/solr path=/update params={wt=javabin&version=2} {add=[1]} 0 0
   [junit4]   2> 1569648 T2843 C414 oasup.LogUpdateProcessor.finish [collection1] webapp=/solr path=/update params={wt=javabin&version=2} {add=[2]} 0 0
   [junit4]   2> 1569652 T2838 C414 oasup.LogUpdateProcessor.finish [collection1] webapp=/solr path=/update params={wt=javabin&version=2} {add=[3]} 0 0
   [junit4]   2> 1569656 T2839 C414 oasu.DirectUpdateHandler2.commit start commit{,optimize=false,openSearcher=true,waitSearcher=true,expungeDeletes=false,softCommit=false,prepareCommit=false}
   [junit4]   2> 1569660 T2839 C414 oasc.SolrDeletionPolicy.onCommit SolrDeletionPolicy.onCommit: commits: num=2
   [junit4]   2> 		commit{dir=MockDirWrapper(org.apache.lucene.store.RAMDirectory@6b5a4b37 lockFactory=org.apache.lucene.store.SingleInstanceLockFactory@5f817a17),segFN=segments_2,generation=2}
   [junit4]   2> 		commit{dir=MockDirWrapper(org.apache.lucene.store.RAMDirectory@6b5a4b37 lockFactory=org.apache.lucene.store.SingleInstanceLockFactory@5f817a17),segFN=segments_3,generation=3}
   [junit4]   2> 1569661 T2839 C414 oasc.SolrDeletionPolicy.updateCommits newest commit generation = 3
   [junit4]   2> 1569663 T2839 C414 oass.SolrIndexSearcher.<init> Opening Searcher@6340a3f3 main
   [junit4]   2> 1569664 T2839 C414 oasu.DirectUpdateHandler2.commit end_commit_flush
   [junit4]   2> 1569664 T2845 oasc.SolrCore.registerSearcher [collection1] Registered new searcher Searcher@6340a3f3 main{StandardDirectoryReader(segments_3:7:nrt _1(5.0):C4)}
   [junit4]   2> 1569665 T2839 C414 oasup.LogUpdateProcessor.finish [collection1] webapp=/solr path=/update params={waitSearcher=true&commit=true&wt=javabin&version=2&softCommit=false} {commit=} 0 9
   [junit4]   2> 1569668 T2852 oash.SnapPuller.<init> WARN 'masterUrl' must be specified without the /replication suffix
   [junit4]   2> 1569668 T2852 oash.SnapPuller.<init>  No value set for 'pollInterval'. Timer Task not started.
   [junit4]   2> 1569677 T2799 C413 oasc.SolrCore.execute [collection1] webapp=/solr path=/replication params={command=indexversion&qt=/replication&wt=javabin&version=2} status=0 QTime=0 
   [junit4]   2> 1569679 T2852 oash.SnapPuller.fetchLatestIndex Master's generation: 2
   [junit4]   2> 1569679 T2852 oash.SnapPuller.fetchLatestIndex Slave's generation: 3
   [junit4]   2> 1569679 T2852 oash.SnapPuller.fetchLatestIndex Starting replication process
   [junit4]   2> 1569685 T2800 C413 oasc.SolrCore.execute [collection1] webapp=/solr path=/replication params={command=filelist&qt=/replication&wt=javabin&generation=2&version=2} status=0 QTime=3 
   [junit4]   2> 1569686 T2852 oash.SnapPuller.fetchLatestIndex Number of files in latest index in master: 10
   [junit4]   2> 1569687 T2852 oasc.CachingDirectoryFactory.get return new directory for /Users/jenkins/jenkins-slave/workspace/Lucene-Solr-trunk-MacOSX/solr/build/solr-core/test/J0/./org.apache.solr.handler.TestReplicationHandler$SolrInstance-1375317472875/repeater/collection1/data/index.20130731193753661
   [junit4]   2> 1569687 T2852 oash.SnapPuller.fetchLatestIndex Starting download to MockDirWrapper(org.apache.lucene.store.RAMDirectory@769ef6fe lockFactory=org.apache.lucene.store.SingleInstanceLockFactory@3e57601) fullCopy=true
   [junit4]   2> 1569690 T2801 C413 oasc.SolrCore.execute [collection1] webapp=/solr path=/replication params={file=_0.cbnd&command=filecontent&checksum=true&wt=filestream&qt=/replication&generation=2} status=0 QTime=0 
   [junit4]   2> 1569698 T2802 C413 oasc.SolrCore.execute [collection1] webapp=/solr path=/replication params={file=_0.fnm&command=filecontent&checksum=true&wt=filestream&qt=/replication&generation=2} status=0 QTime=1 
   [junit4]   2> 1569707 T2803 C413 oasc.SolrCore.execute [collection1] webapp=/solr path=/replication params={file=_0.tim&command=filecontent&checksum=true&wt=filestream&qt=/replication&generation=2} status=0 QTime=0 
   [junit4]   2> 1569712 T2804 C413 oasc.SolrCore.execute [collection1] webapp=/solr path=/replication params={file=segments_2&command=filecontent&checksum=true&wt=filestream&qt=/replication&generation=2} status=0 QTime=0 
   [junit4]   2> 1569717 T2799 C413 oasc.SolrCore.execute [collection1] webapp=/solr path=/replication params={file=_0.fdx&command=filecontent&checksum=true&wt=filestream&qt=/replication&generation=2} status=0 QTime=1 
   [junit4]   2> 1569722 T2800 C413 oasc.SolrCore.execute [collection1] webapp=/solr path=/replication params={file=_0.cbnm&command=filecontent&checksum=true&wt=filestream&qt=/replication&generation=2} status=0 QTime=0 
   [junit4]   2> 1569726 T2801 C413 oasc.SolrCore.execute [collection1] webapp=/solr path=/replication params={file=_0.si&command=filecontent&checksum=true&wt=filestream&qt=/replication&generation=2} status=0 QTime=0 
   [junit4]   2> 1569730 T2802 C413 oasc.SolrCore.execute [collection1] webapp=/solr path=/replication params={file=_0.tip&command=filecontent&checksum=true&wt=filestream&qt=/replication&generation=2} status=0 QTime=0 
   [junit4]   2> 1569735 T2803 C413 oasc.SolrCore.execute [collection1] webapp=/solr path=/replication params={file=_0.doc&command=filecontent&checksum=true&wt=filestream&qt=/replication&generation=2} status=0 QTime=0 
   [junit4]   2> 1569739 T2804 C413 oasc.SolrCore.execute [collection1] webapp=/solr path=/replication params={file=_0.fdt&command=filecontent&checksum=true&wt=filestream&qt=/replication&generation=2} status=0 QTime=1 
   [junit4]   2> 1569740 T2852 oash.SnapPuller.fetchLatestIndex Total time taken for download : 0 secs
   [junit4]   2> 1569741 T2852 oash.SnapPuller.modifyIndexProps New index installed. Updating index properties... index=index.20130731193753661
   [junit4]   2> 1569742 T2852 oash.SnapPuller.fetchLatestIndex removing old index directory MockDirWrapper(org.apache.lucene.store.RAMDirectory@6b5a4b37 lockFactory=org.apache.lucene.store.SingleInstanceLockFactory@5f817a17)
   [junit4]   2> 1569743 T2852 oasu.DefaultSolrCoreState.newIndexWriter Creating new IndexWriter...
   [junit4]   2> 1569743 T2852 oasu.DefaultSolrCoreState.newIndexWriter Waiting until IndexWriter is unused... core=collection1
   [junit4]   2> 1569743 T2852 oasu.DefaultSolrCoreState.newIndexWriter Rollback old IndexWriter... core=collection1
   [junit4]   2> 1569745 T2852 oasc.SolrCore.getNewIndexDir New index directory detected: old=/Users/jenkins/jenkins-slave/workspace/Lucene-Solr-trunk-MacOSX/solr/build/solr-core/test/J0/./org.apache.solr.handler.TestReplicationHandler$SolrInstance-1375317472875/repeater/collection1/data/index/ new=/Users/jenkins/jenkins-slave/workspace/Lucene-Solr-trunk-MacOSX/solr/build/solr-core/test/J0/./org.apache.solr.handler.TestReplicationHandler$SolrInstance-1375317472875/repeater/collection1/data/index.20130731193753661
   [junit4]   2> 1569746 T2852 oasc.SolrDeletionPolicy.onInit SolrDeletionPolicy.onInit: commits: num=1
   [junit4]   2> 		commit{dir=MockDirWrapper(org.apache.lucene.store.RAMDirectory@769ef6fe lockFactory=org.apache.lucene.store.SingleInstanceLockFactory@3e57601),segFN=segments_2,generation=2}
   [junit4]   2> 1569747 T2852 oasc.SolrDeletionPolicy.updateCommits newest commit generation = 2
   [junit4]   2> 1569748 T2852 oasu.DefaultSolrCoreState.newIndexWriter New IndexWriter is ready to be used.
   [junit4]   2> 1569749 T2852 oass.SolrIndexSearcher.<init> Opening Searcher@5ba9197f main
   [junit4]   2> 1569749 T2845 oasc.SolrCore.registerSearcher [collection1] Registered new searcher Searcher@5ba9197f main{StandardDirectoryReader(segments_2:3:nrt _0(5.0):C3)}
   [junit4]   2> 1569750 T2840 C414 oasc.SolrCore.execute [collection1] webapp=/solr path=/replication params={masterUrl=http://127.0.0.1:50164/solr/replication&command=fetchindex&wait=true} status=0 QTime=83 
   [junit4]   2> 1569752 T2840 C414 oasc.CachingDirectoryFactory.closeCacheValue looking to close /Users/jenkins/jenkins-slave/workspace/Lucene-Solr-trunk-MacOSX/solr/build/solr-core/test/J0/./org.apache.solr.handler.TestReplicationHandler$SolrInstance-1375317472875/repeater/collection1/data/index [CachedDir<<refCount=0;path=/Users/jenkins/jenkins-slave/workspace/Lucene-Solr-trunk-MacOSX/solr/build/solr-core/test/J0/./org.apache.solr.handler.TestReplicationHandler$SolrInstance-1375317472875/repeater/collection1/data/index;done=true>>]
   [junit4]   2> 1569755 T2840 C414 oasc.CachingDirectoryFactory.close Closing directory: /Users/jenkins/jenkins-slave/workspace/Lucene-Solr-trunk-MacOSX/solr/build/solr-core/test/J0/./org.apache.solr.handler.TestReplicationHandler$SolrInstance-1375317472875/repeater/collection1/data/index
   [junit4]   2> 1569762 T2842 C414 oasc.SolrCore.execute [collection1] webapp=/solr path=/select params={sort=id+desc&q=*:*&wt=javabin&version=2} hits=3 status=0 QTime=1 
   [junit4]   2> 1569767 T2854 oash.SnapPuller.<init> WARN 'masterUrl' must be specified without the /replication suffix
   [junit4]   2> 1569767 T2854 oash.SnapPuller.<init>  No value set for 'pollInterval'. Timer Task not started.
   [junit4]   2> 1569772 T2843 C414 oasc.SolrCore.execute [collection1] webapp=/solr path=/replication params={command=indexversion&qt=/replication&wt=javabin&version=2} status=0 QTime=0 
   [junit4]   2> 1569773 T2854 oash.SnapPuller.fetchLatestIndex Slave in sync with master.
   [junit4]   2> 1569774 T2826 C415 oasc.SolrCore.execute [collection1] webapp=/solr path=/replication params={masterUrl=http://127.0.0.1:50167/solr/replication&command=fetchindex&wait=true} status=0 QTime=8 
   [junit4]   2> 1569777 T2828 C415 oasc.SolrCore.execute [collection1] webapp=/solr path=/select params={sort=id+desc&q=*:*&wt=javabin&version=2} hits=3 status=0 QTime=0 
   [junit4]   2> 1569782 T2799 C413 oasup.LogUpdateProcessor.finish [collection1] webapp=/solr path=/update params={wt=javabin&version=2} {add=[3]} 0 2
   [junit4]   2> 1569786 T2800 C413 oasup.LogUpdateProcessor.finish [collection1] webapp=/solr path=/update 

[...truncated too long message...]

t=0;path=/Users/jenkins/jenkins-slave/workspace/Lucene-Solr-trunk-MacOSX/solr/build/solr-core/test/J0/./org.apache.solr.cloud.CollectionsAPIDistributedZkTest-jetty4-1375317818680//new_implicit_coll_1_b_replica3/data;done=false>>]
   [junit4]   2> 2185015 T4138 oasc.CachingDirectoryFactory.close Closing directory: /Users/jenkins/jenkins-slave/workspace/Lucene-Solr-trunk-MacOSX/solr/build/solr-core/test/J0/./org.apache.solr.cloud.CollectionsAPIDistributedZkTest-jetty4-1375317818680//new_implicit_coll_1_b_replica3/data
   [junit4]   2> 2185015 T4138 oasc.CachingDirectoryFactory.closeCacheValue looking to close /Users/jenkins/jenkins-slave/workspace/Lucene-Solr-trunk-MacOSX/solr/build/solr-core/test/J0/./org.apache.solr.cloud.CollectionsAPIDistributedZkTest-jetty4-1375317818680//new_implicit_coll_1_b_replica3/data/index [CachedDir<<refCount=0;path=/Users/jenkins/jenkins-slave/workspace/Lucene-Solr-trunk-MacOSX/solr/build/solr-core/test/J0/./org.apache.solr.cloud.CollectionsAPIDistributedZkTest-jetty4-1375317818680//new_implicit_coll_1_b_replica3/data/index;done=false>>]
   [junit4]   2> 2185016 T4138 oasc.CachingDirectoryFactory.close Closing directory: /Users/jenkins/jenkins-slave/workspace/Lucene-Solr-trunk-MacOSX/solr/build/solr-core/test/J0/./org.apache.solr.cloud.CollectionsAPIDistributedZkTest-jetty4-1375317818680//new_implicit_coll_1_b_replica3/data/index
   [junit4]   2> 2185019 T4656 oasc.Overseer$ClusterStateUpdater.amILeader According to ZK I (id=90132828076113932-127.0.0.1:50461_-n_0000000004) am no longer a leader.
   [junit4]   2> 2185041 T4138 oejsh.ContextHandler.doStop stopped o.e.j.s.ServletContextHandler{/,null}
   [junit4]   2> 2185098 T4138 oas.SolrTestCaseJ4.tearDown ###Ending testDistribSearch
   [junit4]   2> 2185100 T4138 oasc.ZkTestServer.send4LetterWord connecting to 127.0.0.1:50445 50445
   [junit4]   1> client port:0.0.0.0/0.0.0.0:0
   [junit4]   2> NOTE: reproduce with: ant test  -Dtestcase=CollectionsAPIDistributedZkTest -Dtests.method=testDistribSearch -Dtests.seed=E0A70BE6B4CEE449 -Dtests.slow=true -Dtests.locale=sl_SI -Dtests.timezone=Asia/Bangkok -Dtests.file.encoding=ISO-8859-1
   [junit4] ERROR    278s | CollectionsAPIDistributedZkTest.testDistribSearch <<<
   [junit4]    > Throwable #1: org.apache.solr.client.solrj.SolrServerException: Server refused connection at: http://127.0.0.1:50452
   [junit4]    > 	at __randomizedtesting.SeedInfo.seed([E0A70BE6B4CEE449:614185FEC3918475]:0)
   [junit4]    > 	at org.apache.solr.client.solrj.impl.HttpSolrServer.request(HttpSolrServer.java:428)
   [junit4]    > 	at org.apache.solr.client.solrj.impl.HttpSolrServer.request(HttpSolrServer.java:180)
   [junit4]    > 	at org.apache.solr.cloud.CollectionsAPIDistributedZkTest.testCustomCollectionsAPI(CollectionsAPIDistributedZkTest.java:764)
   [junit4]    > 	at org.apache.solr.cloud.CollectionsAPIDistributedZkTest.doTest(CollectionsAPIDistributedZkTest.java:159)
   [junit4]    > 	at org.apache.solr.BaseDistributedSearchTestCase.testDistribSearch(BaseDistributedSearchTestCase.java:835)
   [junit4]    > 	at java.lang.Thread.run(Thread.java:724)
   [junit4]    > Caused by: org.apache.http.conn.HttpHostConnectException: Connection to http://127.0.0.1:50452 refused
   [junit4]    > 	at org.apache.http.impl.conn.DefaultClientConnectionOperator.openConnection(DefaultClientConnectionOperator.java:190)
   [junit4]    > 	at org.apache.http.impl.conn.ManagedClientConnectionImpl.open(ManagedClientConnectionImpl.java:294)
   [junit4]    > 	at org.apache.http.impl.client.DefaultRequestDirector.tryConnect(DefaultRequestDirector.java:645)
   [junit4]    > 	at org.apache.http.impl.client.DefaultRequestDirector.execute(DefaultRequestDirector.java:480)
   [junit4]    > 	at org.apache.http.impl.client.AbstractHttpClient.execute(AbstractHttpClient.java:906)
   [junit4]    > 	at org.apache.http.impl.client.AbstractHttpClient.execute(AbstractHttpClient.java:805)
   [junit4]    > 	at org.apache.http.impl.client.AbstractHttpClient.execute(AbstractHttpClient.java:784)
   [junit4]    > 	at org.apache.solr.client.solrj.impl.HttpSolrServer.request(HttpSolrServer.java:365)
   [junit4]    > 	... 44 more
   [junit4]    > Caused by: java.net.ConnectException: Connection refused
   [junit4]    > 	at java.net.PlainSocketImpl.socketConnect(Native Method)
   [junit4]    > 	at java.net.AbstractPlainSocketImpl.doConnect(AbstractPlainSocketImpl.java:339)
   [junit4]    > 	at java.net.AbstractPlainSocketImpl.connectToAddress(AbstractPlainSocketImpl.java:200)
   [junit4]    > 	at java.net.AbstractPlainSocketImpl.connect(AbstractPlainSocketImpl.java:182)
   [junit4]    > 	at java.net.SocksSocketImpl.connect(SocksSocketImpl.java:392)
   [junit4]    > 	at java.net.Socket.connect(Socket.java:579)
   [junit4]    > 	at org.apache.http.conn.scheme.PlainSocketFactory.connectSocket(PlainSocketFactory.java:127)
   [junit4]    > 	at org.apache.http.impl.conn.DefaultClientConnectionOperator.openConnection(DefaultClientConnectionOperator.java:180)
   [junit4]    > 	... 51 more
   [junit4]   2> 2185441 T4138 oas.SolrTestCaseJ4.deleteCore ###deleteCore
   [junit4]   2> 278229 T4137 ccr.ThreadLeakControl.checkThreadLeaks WARNING Will linger awaiting termination of 2 leaked thread(s).
   [junit4]   2> 2186325 T4220 oascc.ZkStateReader$3.process WARN ZooKeeper watch triggered, but Solr cannot talk to ZK
   [junit4]   2> 2186325 T4220 oascc.ZkStateReader$2.process A cluster state change: WatchedEvent state:SyncConnected type:NodeChildrenChanged path:/live_nodes, has occurred - updating... (live nodes size: 1)
   [junit4]   2> 2186325 T4220 oascc.ZkStateReader$2.process WARN ZooKeeper watch triggered, but Solr cannot talk to ZK
   [junit4]   2> NOTE: test params are: codec=Lucene41, sim=DefaultSimilarity, locale=sl_SI, timezone=Asia/Bangkok
   [junit4]   2> NOTE: Mac OS X 10.8.4 x86_64/Oracle Corporation 1.7.0_25 (64-bit)/cpus=2,threads=1,free=161913376,total=361037824
   [junit4]   2> NOTE: All tests run in this JVM: [TestSchemaResource, TestAtomicUpdateErrorCases, BasicDistributedZkTest, AnalysisAfterCoreReloadTest, FastVectorHighlighterTest, RecoveryZkTest, SolrPluginUtilsTest, LoggingHandlerTest, ClusterStateTest, PreAnalyzedUpdateProcessorTest, TestClassNameShortening, SolrRequestParserTest, TestSolrQueryParserDefaultOperatorResource, PreAnalyzedFieldTest, TestRTGBase, TestQuerySenderListener, TestLRUCache, TestFieldCollectionResource, ShardRoutingCustomTest, RAMDirectoryFactoryTest, ShardRoutingTest, ResponseLogComponentTest, SOLR749Test, FileBasedSpellCheckerTest, ConvertedLegacyTest, DirectSolrSpellCheckerTest, StatelessScriptUpdateProcessorFactoryTest, TestFaceting, SliceStateUpdateTest, TestSearchPerf, HdfsCollectionsAPIDistributedZkTest, TestArbitraryIndexDir, ZkSolrClientTest, TestPseudoReturnFields, MinimalSchemaTest, TestPHPSerializedResponseWriter, FieldMutatingUpdateProcessorTest, TestRandomMergePolicy, TestMultiCoreConfBootstrap, TestRandomFaceting, LukeRequestHandlerTest, SpellCheckCollatorTest, TestSolrXml, TestBinaryResponseWriter, TestCopyFieldCollectionResource, TestDynamicFieldCollectionResource, LeaderElectionIntegrationTest, XmlUpdateRequestHandlerTest, CoreContainerCoreInitFailuresTest, TestPluginEnable, TestFiltering, JSONWriterTest, StandardRequestHandlerTest, TestWordDelimiterFilterFactory, TestUpdate, SuggesterWFSTTest, SpellPossibilityIteratorTest, TestFastOutputStream, CircularListTest, CurrencyFieldXmlFileTest, TestFieldTypeCollectionResource, SpellCheckComponentTest, RegexBoostProcessorTest, TestMergePolicyConfig, SchemaVersionSpecificBehaviorTest, TestRecoveryHdfs, TestSuggestSpellingConverter, ScriptEngineTest, BasicFunctionalityTest, BasicDistributedZk2Test, DistributedSpellCheckComponentTest, BasicZkTest, TermVectorComponentTest, TestXIncludeConfig, SuggesterTest, TestFunctionQuery, TestFoldingMultitermQuery, TestDocumentBuilder, HdfsChaosMonkeySafeLeaderTest, ChaosMonkeySafeLeaderTest, TestCoreDiscovery, OverseerTest, TestJmxIntegration, TestDocSet, TestReplicationHandler, TestQueryUtils, TestGroupingSearch, TestSolrQueryParser, TestInfoStreamLogging, CacheHeaderTest, TestSurroundQueryParser, ZkNodePropsTest, TestUtils, BadCopyFieldTest, DateMathParserTest, TestSolrDeletionPolicy1, SolrCoreTest, SyncSliceTest, TestSystemIdResolver, DistributedTermsComponentTest, SynonymTokenizerTest, TimeZoneUtilsTest, DateFieldTest, TestCSVResponseWriter, TestManagedSchemaFieldResource, TestIBSimilarityFactory, TestSchemaVersionResource, TestStressVersions, MultiTermTest, HdfsBasicDistributedZkTest, AutoCommitTest, CollectionsAPIDistributedZkTest]
   [junit4] Completed in 279.29s, 1 test, 1 error <<< FAILURES!

[...truncated 630 lines...]
BUILD FAILED
/Users/jenkins/jenkins-slave/workspace/Lucene-Solr-trunk-MacOSX/build.xml:389: The following error occurred while executing this line:
/Users/jenkins/jenkins-slave/workspace/Lucene-Solr-trunk-MacOSX/build.xml:369: The following error occurred while executing this line:
/Users/jenkins/jenkins-slave/workspace/Lucene-Solr-trunk-MacOSX/build.xml:39: The following error occurred while executing this line:
/Users/jenkins/jenkins-slave/workspace/Lucene-Solr-trunk-MacOSX/solr/build.xml:181: The following error occurred while executing this line:
/Users/jenkins/jenkins-slave/workspace/Lucene-Solr-trunk-MacOSX/solr/common-build.xml:449: The following error occurred while executing this line:
/Users/jenkins/jenkins-slave/workspace/Lucene-Solr-trunk-MacOSX/lucene/common-build.xml:1230: The following error occurred while executing this line:
/Users/jenkins/jenkins-slave/workspace/Lucene-Solr-trunk-MacOSX/lucene/common-build.xml:873: There were test failures: 320 suites, 1345 tests, 1 error, 1 failure, 39 ignored (5 assumptions)

Total time: 107 minutes 19 seconds
Build step 'Invoke Ant' marked build as failure
Description set: Java: 64bit/jdk1.7.0 -XX:+UseCompressedOops -XX:+UseParallelGC
Archiving artifacts
Recording test results
Email was triggered for: Failure
Sending email for trigger: Failure



Mime
View raw message