lucene-dev mailing list archives

Site index · List index
Message view « Date » · « Thread »
Top « Date » · « Thread »
From Policeman Jenkins Server <jenk...@thetaphi.de>
Subject [JENKINS] Lucene-Solr-trunk-Windows (64bit/jdk1.7.0_25) - Build # 3105 - Failure!
Date Sat, 03 Aug 2013 11:25:55 GMT
Build: http://jenkins.thetaphi.de/job/Lucene-Solr-trunk-Windows/3105/
Java: 64bit/jdk1.7.0_25 -XX:+UseCompressedOops -XX:+UseConcMarkSweepGC

1 tests failed.
FAILED:  org.apache.solr.cloud.CollectionsAPIDistributedZkTest.testDistribSearch

Error Message:
Server refused connection at: http://127.0.0.1:57518/o_fl/fx

Stack Trace:
org.apache.solr.client.solrj.SolrServerException: Server refused connection at: http://127.0.0.1:57518/o_fl/fx
	at __randomizedtesting.SeedInfo.seed([792E27CA1FCC5944:F8C8A9D268933978]:0)
	at org.apache.solr.client.solrj.impl.HttpSolrServer.request(HttpSolrServer.java:428)
	at org.apache.solr.client.solrj.impl.HttpSolrServer.request(HttpSolrServer.java:180)
	at org.apache.solr.cloud.AbstractFullDistribZkTestBase.createCollection(AbstractFullDistribZkTestBase.java:1535)
	at org.apache.solr.cloud.CollectionsAPIDistributedZkTest.testCustomCollectionsAPI(CollectionsAPIDistributedZkTest.java:677)
	at org.apache.solr.cloud.CollectionsAPIDistributedZkTest.doTest(CollectionsAPIDistributedZkTest.java:159)
	at org.apache.solr.BaseDistributedSearchTestCase.testDistribSearch(BaseDistributedSearchTestCase.java:835)
	at sun.reflect.NativeMethodAccessorImpl.invoke0(Native Method)
	at sun.reflect.NativeMethodAccessorImpl.invoke(NativeMethodAccessorImpl.java:57)
	at sun.reflect.DelegatingMethodAccessorImpl.invoke(DelegatingMethodAccessorImpl.java:43)
	at java.lang.reflect.Method.invoke(Method.java:606)
	at com.carrotsearch.randomizedtesting.RandomizedRunner.invoke(RandomizedRunner.java:1559)
	at com.carrotsearch.randomizedtesting.RandomizedRunner.access$600(RandomizedRunner.java:79)
	at com.carrotsearch.randomizedtesting.RandomizedRunner$6.evaluate(RandomizedRunner.java:737)
	at com.carrotsearch.randomizedtesting.RandomizedRunner$7.evaluate(RandomizedRunner.java:773)
	at com.carrotsearch.randomizedtesting.RandomizedRunner$8.evaluate(RandomizedRunner.java:787)
	at com.carrotsearch.randomizedtesting.rules.SystemPropertiesRestoreRule$1.evaluate(SystemPropertiesRestoreRule.java:53)
	at org.apache.lucene.util.TestRuleSetupTeardownChained$1.evaluate(TestRuleSetupTeardownChained.java:50)
	at org.apache.lucene.util.TestRuleFieldCacheSanity$1.evaluate(TestRuleFieldCacheSanity.java:51)
	at org.apache.lucene.util.AbstractBeforeAfterRule$1.evaluate(AbstractBeforeAfterRule.java:46)
	at com.carrotsearch.randomizedtesting.rules.SystemPropertiesInvariantRule$1.evaluate(SystemPropertiesInvariantRule.java:55)
	at org.apache.lucene.util.TestRuleThreadAndTestName$1.evaluate(TestRuleThreadAndTestName.java:49)
	at org.apache.lucene.util.TestRuleIgnoreAfterMaxFailures$1.evaluate(TestRuleIgnoreAfterMaxFailures.java:70)
	at org.apache.lucene.util.TestRuleMarkFailure$1.evaluate(TestRuleMarkFailure.java:48)
	at com.carrotsearch.randomizedtesting.rules.StatementAdapter.evaluate(StatementAdapter.java:36)
	at com.carrotsearch.randomizedtesting.ThreadLeakControl$StatementRunner.run(ThreadLeakControl.java:358)
	at com.carrotsearch.randomizedtesting.ThreadLeakControl.forkTimeoutingTask(ThreadLeakControl.java:782)
	at com.carrotsearch.randomizedtesting.ThreadLeakControl$3.evaluate(ThreadLeakControl.java:442)
	at com.carrotsearch.randomizedtesting.RandomizedRunner.runSingleTest(RandomizedRunner.java:746)
	at com.carrotsearch.randomizedtesting.RandomizedRunner$3.evaluate(RandomizedRunner.java:648)
	at com.carrotsearch.randomizedtesting.RandomizedRunner$4.evaluate(RandomizedRunner.java:682)
	at com.carrotsearch.randomizedtesting.RandomizedRunner$5.evaluate(RandomizedRunner.java:693)
	at com.carrotsearch.randomizedtesting.rules.StatementAdapter.evaluate(StatementAdapter.java:36)
	at com.carrotsearch.randomizedtesting.rules.SystemPropertiesRestoreRule$1.evaluate(SystemPropertiesRestoreRule.java:53)
	at org.apache.lucene.util.AbstractBeforeAfterRule$1.evaluate(AbstractBeforeAfterRule.java:46)
	at org.apache.lucene.util.TestRuleStoreClassName$1.evaluate(TestRuleStoreClassName.java:42)
	at com.carrotsearch.randomizedtesting.rules.SystemPropertiesInvariantRule$1.evaluate(SystemPropertiesInvariantRule.java:55)
	at com.carrotsearch.randomizedtesting.rules.NoShadowingOrOverridesOnMethodsRule$1.evaluate(NoShadowingOrOverridesOnMethodsRule.java:39)
	at com.carrotsearch.randomizedtesting.rules.NoShadowingOrOverridesOnMethodsRule$1.evaluate(NoShadowingOrOverridesOnMethodsRule.java:39)
	at com.carrotsearch.randomizedtesting.rules.StatementAdapter.evaluate(StatementAdapter.java:36)
	at org.apache.lucene.util.TestRuleAssertionsRequired$1.evaluate(TestRuleAssertionsRequired.java:43)
	at org.apache.lucene.util.TestRuleMarkFailure$1.evaluate(TestRuleMarkFailure.java:48)
	at org.apache.lucene.util.TestRuleIgnoreAfterMaxFailures$1.evaluate(TestRuleIgnoreAfterMaxFailures.java:70)
	at org.apache.lucene.util.TestRuleIgnoreTestSuites$1.evaluate(TestRuleIgnoreTestSuites.java:55)
	at com.carrotsearch.randomizedtesting.rules.StatementAdapter.evaluate(StatementAdapter.java:36)
	at com.carrotsearch.randomizedtesting.ThreadLeakControl$StatementRunner.run(ThreadLeakControl.java:358)
	at java.lang.Thread.run(Thread.java:724)
Caused by: org.apache.http.conn.HttpHostConnectException: Connection to http://127.0.0.1:57518 refused
	at org.apache.http.impl.conn.DefaultClientConnectionOperator.openConnection(DefaultClientConnectionOperator.java:190)
	at org.apache.http.impl.conn.ManagedClientConnectionImpl.open(ManagedClientConnectionImpl.java:294)
	at org.apache.http.impl.client.DefaultRequestDirector.tryConnect(DefaultRequestDirector.java:645)
	at org.apache.http.impl.client.DefaultRequestDirector.execute(DefaultRequestDirector.java:480)
	at org.apache.http.impl.client.AbstractHttpClient.execute(AbstractHttpClient.java:906)
	at org.apache.http.impl.client.AbstractHttpClient.execute(AbstractHttpClient.java:805)
	at org.apache.http.impl.client.AbstractHttpClient.execute(AbstractHttpClient.java:784)
	at org.apache.solr.client.solrj.impl.HttpSolrServer.request(HttpSolrServer.java:365)
	... 45 more
Caused by: java.net.ConnectException: Connection refused: connect
	at java.net.DualStackPlainSocketImpl.waitForConnect(Native Method)
	at java.net.DualStackPlainSocketImpl.socketConnect(DualStackPlainSocketImpl.java:85)
	at java.net.AbstractPlainSocketImpl.doConnect(AbstractPlainSocketImpl.java:339)
	at java.net.AbstractPlainSocketImpl.connectToAddress(AbstractPlainSocketImpl.java:200)
	at java.net.AbstractPlainSocketImpl.connect(AbstractPlainSocketImpl.java:182)
	at java.net.PlainSocketImpl.connect(PlainSocketImpl.java:172)
	at java.net.SocksSocketImpl.connect(SocksSocketImpl.java:392)
	at java.net.Socket.connect(Socket.java:579)
	at org.apache.http.conn.scheme.PlainSocketFactory.connectSocket(PlainSocketFactory.java:127)
	at org.apache.http.impl.conn.DefaultClientConnectionOperator.openConnection(DefaultClientConnectionOperator.java:180)
	... 52 more




Build Log:
[...truncated 9601 lines...]
   [junit4] Suite: org.apache.solr.cloud.CollectionsAPIDistributedZkTest
   [junit4]   2> 1015736 T2529 oas.BaseDistributedSearchTestCase.initHostContext Setting hostContext system property: /o_fl/fx
   [junit4]   2> 1015739 T2529 oas.SolrTestCaseJ4.setUp ###Starting testDistribSearch
   [junit4]   2> Creating dataDir: C:\Users\JenkinsSlave\workspace\Lucene-Solr-trunk-Windows\solr\build\solr-core\test\J0\.\solrtest-CollectionsAPIDistributedZkTest-1375526665234
   [junit4]   2> 1015741 T2529 oasc.ZkTestServer.run STARTING ZK TEST SERVER
   [junit4]   2> 1015742 T2530 oasc.ZkTestServer$ZKServerMain.runFromConfig Starting server
   [junit4]   2> 1015813 T2529 oasc.ZkTestServer.run start zk server on port:57490
   [junit4]   2> 1015814 T2529 oascc.ConnectionManager.waitForConnected Waiting for client to connect to ZooKeeper
   [junit4]   2> 1015829 T2536 oascc.ConnectionManager.process Watcher org.apache.solr.common.cloud.ConnectionManager@41858be5 name:ZooKeeperConnection Watcher:127.0.0.1:57490 got event WatchedEvent state:SyncConnected type:None path:null path:null type:None
   [junit4]   2> 1015834 T2529 oascc.ConnectionManager.waitForConnected Client is connected to ZooKeeper
   [junit4]   2> 1015835 T2529 oascc.SolrZkClient.makePath makePath: /solr
   [junit4]   2> 1015842 T2529 oascc.ConnectionManager.waitForConnected Waiting for client to connect to ZooKeeper
   [junit4]   2> 1015844 T2538 oascc.ConnectionManager.process Watcher org.apache.solr.common.cloud.ConnectionManager@5a1d6292 name:ZooKeeperConnection Watcher:127.0.0.1:57490/solr got event WatchedEvent state:SyncConnected type:None path:null path:null type:None
   [junit4]   2> 1015845 T2529 oascc.ConnectionManager.waitForConnected Client is connected to ZooKeeper
   [junit4]   2> 1015845 T2529 oascc.SolrZkClient.makePath makePath: /collections/collection1
   [junit4]   2> 1015850 T2529 oascc.SolrZkClient.makePath makePath: /collections/collection1/shards
   [junit4]   2> 1015854 T2529 oascc.SolrZkClient.makePath makePath: /collections/control_collection
   [junit4]   2> 1015857 T2529 oascc.SolrZkClient.makePath makePath: /collections/control_collection/shards
   [junit4]   2> 1015862 T2529 oasc.AbstractZkTestCase.putConfig put C:\Users\JenkinsSlave\workspace\Lucene-Solr-trunk-Windows\solr\build\solr-core\test-files\solr\collection1\conf\solrconfig-tlog.xml to /configs/conf1/solrconfig.xml
   [junit4]   2> 1015862 T2529 oascc.SolrZkClient.makePath makePath: /configs/conf1/solrconfig.xml
   [junit4]   2> 1015868 T2529 oasc.AbstractZkTestCase.putConfig put C:\Users\JenkinsSlave\workspace\Lucene-Solr-trunk-Windows\solr\build\solr-core\test-files\solr\collection1\conf\schema.xml to /configs/conf1/schema.xml
   [junit4]   2> 1015869 T2529 oascc.SolrZkClient.makePath makePath: /configs/conf1/schema.xml
   [junit4]   2> 1015873 T2529 oasc.AbstractZkTestCase.putConfig put C:\Users\JenkinsSlave\workspace\Lucene-Solr-trunk-Windows\solr\build\solr-core\test-files\solr\collection1\conf\stopwords.txt to /configs/conf1/stopwords.txt
   [junit4]   2> 1015874 T2529 oascc.SolrZkClient.makePath makePath: /configs/conf1/stopwords.txt
   [junit4]   2> 1015879 T2529 oasc.AbstractZkTestCase.putConfig put C:\Users\JenkinsSlave\workspace\Lucene-Solr-trunk-Windows\solr\build\solr-core\test-files\solr\collection1\conf\protwords.txt to /configs/conf1/protwords.txt
   [junit4]   2> 1015879 T2529 oascc.SolrZkClient.makePath makePath: /configs/conf1/protwords.txt
   [junit4]   2> 1015883 T2529 oasc.AbstractZkTestCase.putConfig put C:\Users\JenkinsSlave\workspace\Lucene-Solr-trunk-Windows\solr\build\solr-core\test-files\solr\collection1\conf\currency.xml to /configs/conf1/currency.xml
   [junit4]   2> 1015884 T2529 oascc.SolrZkClient.makePath makePath: /configs/conf1/currency.xml
   [junit4]   2> 1015888 T2529 oasc.AbstractZkTestCase.putConfig put C:\Users\JenkinsSlave\workspace\Lucene-Solr-trunk-Windows\solr\build\solr-core\test-files\solr\collection1\conf\open-exchange-rates.json to /configs/conf1/open-exchange-rates.json
   [junit4]   2> 1015888 T2529 oascc.SolrZkClient.makePath makePath: /configs/conf1/open-exchange-rates.json
   [junit4]   2> 1015898 T2529 oasc.AbstractZkTestCase.putConfig put C:\Users\JenkinsSlave\workspace\Lucene-Solr-trunk-Windows\solr\build\solr-core\test-files\solr\collection1\conf\mapping-ISOLatin1Accent.txt to /configs/conf1/mapping-ISOLatin1Accent.txt
   [junit4]   2> 1015899 T2529 oascc.SolrZkClient.makePath makePath: /configs/conf1/mapping-ISOLatin1Accent.txt
   [junit4]   2> 1015904 T2529 oasc.AbstractZkTestCase.putConfig put C:\Users\JenkinsSlave\workspace\Lucene-Solr-trunk-Windows\solr\build\solr-core\test-files\solr\collection1\conf\old_synonyms.txt to /configs/conf1/old_synonyms.txt
   [junit4]   2> 1015905 T2529 oascc.SolrZkClient.makePath makePath: /configs/conf1/old_synonyms.txt
   [junit4]   2> 1015908 T2529 oasc.AbstractZkTestCase.putConfig put C:\Users\JenkinsSlave\workspace\Lucene-Solr-trunk-Windows\solr\build\solr-core\test-files\solr\collection1\conf\synonyms.txt to /configs/conf1/synonyms.txt
   [junit4]   2> 1015909 T2529 oascc.SolrZkClient.makePath makePath: /configs/conf1/synonyms.txt
   [junit4]   2> 1016241 T2529 oejs.Server.doStart jetty-8.1.10.v20130312
   [junit4]   2> 1016245 T2529 oejs.AbstractConnector.doStart Started SelectChannelConnector@127.0.0.1:57497
   [junit4]   2> 1016245 T2529 oass.SolrDispatchFilter.init SolrDispatchFilter.init()
   [junit4]   2> 1016246 T2529 oasc.SolrResourceLoader.locateSolrHome JNDI not configured for solr (NoInitialContextEx)
   [junit4]   2> 1016246 T2529 oasc.SolrResourceLoader.locateSolrHome using system property solr.solr.home: C:\Users\JenkinsSlave\workspace\Lucene-Solr-trunk-Windows\solr\build\solr-core\test\J0\.\org.apache.solr.cloud.CollectionsAPIDistributedZkTest-controljetty-1375526665408
   [junit4]   2> 1016246 T2529 oasc.SolrResourceLoader.<init> new SolrResourceLoader for directory: 'C:\Users\JenkinsSlave\workspace\Lucene-Solr-trunk-Windows\solr\build\solr-core\test\J0\.\org.apache.solr.cloud.CollectionsAPIDistributedZkTest-controljetty-1375526665408\'
   [junit4]   2> 1016269 T2529 oasc.ConfigSolr.fromFile Loading container configuration from C:\Users\JenkinsSlave\workspace\Lucene-Solr-trunk-Windows\solr\build\solr-core\test\J0\.\org.apache.solr.cloud.CollectionsAPIDistributedZkTest-controljetty-1375526665408\solr.xml
   [junit4]   2> 1016328 T2529 oasc.ConfigSolrXml.<init> Config-defined core root directory: 
   [junit4]   2> 1016328 T2529 oasc.CoreContainer.<init> New CoreContainer 614788803
   [junit4]   2> 1016329 T2529 oasc.CoreContainer.load Loading cores into CoreContainer [instanceDir=C:\Users\JenkinsSlave\workspace\Lucene-Solr-trunk-Windows\solr\build\solr-core\test\J0\.\org.apache.solr.cloud.CollectionsAPIDistributedZkTest-controljetty-1375526665408\]
   [junit4]   2> 1016331 T2529 oashc.HttpShardHandlerFactory.getParameter Setting socketTimeout to: 120000
   [junit4]   2> 1016331 T2529 oashc.HttpShardHandlerFactory.getParameter Setting urlScheme to: http://
   [junit4]   2> 1016331 T2529 oashc.HttpShardHandlerFactory.getParameter Setting connTimeout to: 15000
   [junit4]   2> 1016331 T2529 oashc.HttpShardHandlerFactory.getParameter Setting maxConnectionsPerHost to: 20
   [junit4]   2> 1016331 T2529 oashc.HttpShardHandlerFactory.getParameter Setting corePoolSize to: 0
   [junit4]   2> 1016331 T2529 oashc.HttpShardHandlerFactory.getParameter Setting maximumPoolSize to: 2147483647
   [junit4]   2> 1016331 T2529 oashc.HttpShardHandlerFactory.getParameter Setting maxThreadIdleTime to: 5
   [junit4]   2> 1016332 T2529 oashc.HttpShardHandlerFactory.getParameter Setting sizeOfQueue to: -1
   [junit4]   2> 1016332 T2529 oashc.HttpShardHandlerFactory.getParameter Setting fairnessPolicy to: false
   [junit4]   2> 1016332 T2529 oascsi.HttpClientUtil.createClient Creating new http client, config:maxConnectionsPerHost=20&maxConnections=10000&socketTimeout=120000&connTimeout=15000&retry=false
   [junit4]   2> 1016338 T2529 oasc.ZkContainer.initZooKeeper Zookeeper client=127.0.0.1:57490/solr
   [junit4]   2> 1016338 T2529 oasc.ZkController.checkChrootPath zkHost includes chroot
   [junit4]   2> 1016340 T2529 oascc.ConnectionManager.waitForConnected Waiting for client to connect to ZooKeeper
   [junit4]   2> 1016352 T2549 oascc.ConnectionManager.process Watcher org.apache.solr.common.cloud.ConnectionManager@494eafa6 name:ZooKeeperConnection Watcher:127.0.0.1:57490 got event WatchedEvent state:SyncConnected type:None path:null path:null type:None
   [junit4]   2> 1016352 T2529 oascc.ConnectionManager.waitForConnected Client is connected to ZooKeeper
   [junit4]   2> 1016355 T2529 oascsi.HttpClientUtil.createClient Creating new http client, config:maxConnections=500&maxConnectionsPerHost=16&socketTimeout=120000&connTimeout=15000
   [junit4]   2> 1016355 T2531 oazs.NIOServerCnxn.doIO WARN caught end of stream exception EndOfStreamException: Unable to read additional data from client sessionid 0x14043c73c190002, likely client has closed socket
   [junit4]   2> 	at org.apache.zookeeper.server.NIOServerCnxn.doIO(NIOServerCnxn.java:220)
   [junit4]   2> 	at org.apache.zookeeper.server.NIOServerCnxnFactory.run(NIOServerCnxnFactory.java:208)
   [junit4]   2> 	at java.lang.Thread.run(Thread.java:724)
   [junit4]   2> 
   [junit4]   2> 1016359 T2529 oascc.ConnectionManager.waitForConnected Waiting for client to connect to ZooKeeper
   [junit4]   2> 1016361 T2551 oascc.ConnectionManager.process Watcher org.apache.solr.common.cloud.ConnectionManager@3c4ae05b name:ZooKeeperConnection Watcher:127.0.0.1:57490/solr got event WatchedEvent state:SyncConnected type:None path:null path:null type:None
   [junit4]   2> 1016361 T2529 oascc.ConnectionManager.waitForConnected Client is connected to ZooKeeper
   [junit4]   2> 1016364 T2529 oascc.SolrZkClient.makePath makePath: /overseer/queue
   [junit4]   2> 1016370 T2529 oascc.SolrZkClient.makePath makePath: /overseer/collection-queue-work
   [junit4]   2> 1016374 T2529 oascc.SolrZkClient.makePath makePath: /live_nodes
   [junit4]   2> 1016377 T2529 oasc.ZkController.createEphemeralLiveNode Register node as live in ZooKeeper:/live_nodes/127.0.0.1:57497_o_fl%2Ffx
   [junit4]   2> 1016378 T2529 oascc.SolrZkClient.makePath makePath: /live_nodes/127.0.0.1:57497_o_fl%2Ffx
   [junit4]   2> 1016383 T2529 oascc.SolrZkClient.makePath makePath: /overseer_elect/election
   [junit4]   2> 1016390 T2529 oascc.SolrZkClient.makePath makePath: /overseer_elect/leader
   [junit4]   2> 1016394 T2529 oasc.Overseer.start Overseer (id=90146515533234179-127.0.0.1:57497_o_fl%2Ffx-n_0000000000) starting
   [junit4]   2> 1016399 T2529 oascc.SolrZkClient.makePath makePath: /overseer/queue-work
   [junit4]   2> 1016403 T2553 oasc.OverseerCollectionProcessor.run Process current queue of collection creations
   [junit4]   2> 1016404 T2529 oascc.SolrZkClient.makePath makePath: /clusterstate.json
   [junit4]   2> 1016407 T2529 oascc.SolrZkClient.makePath makePath: /aliases.json
   [junit4]   2> 1016410 T2529 oascc.ZkStateReader.createClusterStateWatchersAndUpdate Updating cluster state from ZooKeeper... 
   [junit4]   2> 1016414 T2552 oasc.Overseer$ClusterStateUpdater.run Starting to work on the main queue
   [junit4]   2> 1016416 T2529 oasc.CorePropertiesLocator.discover Looking for core definitions underneath C:\Users\JenkinsSlave\workspace\Lucene-Solr-trunk-Windows\solr\build\solr-core\test\J0\.\org.apache.solr.cloud.CollectionsAPIDistributedZkTest-controljetty-1375526665408
   [junit4]   2> 1016604 T2529 oasc.CorePropertiesLocator.discoverUnder Found core conf in C:\Users\JenkinsSlave\workspace\Lucene-Solr-trunk-Windows\solr\build\solr-core\test\J0\.\org.apache.solr.cloud.CollectionsAPIDistributedZkTest-controljetty-1375526665408\conf\
   [junit4]   2> 1016613 T2529 oasc.CorePropertiesLocator.discover Found 1 core definitions
   [junit4]   2> 1016615 T2529 oass.SolrDispatchFilter.init user.dir=C:\Users\JenkinsSlave\workspace\Lucene-Solr-trunk-Windows\solr\build\solr-core\test\J0
   [junit4]   2> 1016615 T2529 oass.SolrDispatchFilter.init SolrDispatchFilter.init() done
   [junit4]   2> 1016616 T2529 oascsi.HttpClientUtil.createClient Creating new http client, config:maxConnections=128&maxConnectionsPerHost=32&followRedirects=false
   [junit4]   2> 1016623 T2529 oascsi.HttpClientUtil.createClient Creating new http client, config:
   [junit4]   2> 1016625 T2529 oascc.ConnectionManager.waitForConnected Waiting for client to connect to ZooKeeper
   [junit4]   2> 1016628 T2556 oascc.ConnectionManager.process Watcher org.apache.solr.common.cloud.ConnectionManager@8528a1b name:ZooKeeperConnection Watcher:127.0.0.1:57490/solr got event WatchedEvent state:SyncConnected type:None path:null path:null type:None
   [junit4]   2> 1016628 T2529 oascc.ConnectionManager.waitForConnected Client is connected to ZooKeeper
   [junit4]   2> 1016630 T2529 oascc.ZkStateReader.createClusterStateWatchersAndUpdate Updating cluster state from ZooKeeper... 
   [junit4]   2> 1016633 T2529 oasc.ChaosMonkey.monkeyLog monkey: init - expire sessions:true cause connection loss:true
   [junit4]   2> 1016969 T2529 oejs.Server.doStart jetty-8.1.10.v20130312
   [junit4]   2> 1016971 T2529 oejs.AbstractConnector.doStart Started SelectChannelConnector@127.0.0.1:57509
   [junit4]   2> 1016976 T2529 oass.SolrDispatchFilter.init SolrDispatchFilter.init()
   [junit4]   2> 1016977 T2529 oasc.SolrResourceLoader.locateSolrHome JNDI not configured for solr (NoInitialContextEx)
   [junit4]   2> 1016977 T2529 oasc.SolrResourceLoader.locateSolrHome using system property solr.solr.home: C:\Users\JenkinsSlave\workspace\Lucene-Solr-trunk-Windows\solr\build\solr-core\test\J0\.\org.apache.solr.cloud.CollectionsAPIDistributedZkTest-jetty1-1375526666126
   [junit4]   2> 1016977 T2529 oasc.SolrResourceLoader.<init> new SolrResourceLoader for directory: 'C:\Users\JenkinsSlave\workspace\Lucene-Solr-trunk-Windows\solr\build\solr-core\test\J0\.\org.apache.solr.cloud.CollectionsAPIDistributedZkTest-jetty1-1375526666126\'
   [junit4]   2> 1017006 T2529 oasc.ConfigSolr.fromFile Loading container configuration from C:\Users\JenkinsSlave\workspace\Lucene-Solr-trunk-Windows\solr\build\solr-core\test\J0\.\org.apache.solr.cloud.CollectionsAPIDistributedZkTest-jetty1-1375526666126\solr.xml
   [junit4]   2> 1017086 T2529 oasc.ConfigSolrXml.<init> Config-defined core root directory: 
   [junit4]   2> 1017087 T2529 oasc.CoreContainer.<init> New CoreContainer 381897764
   [junit4]   2> 1017087 T2529 oasc.CoreContainer.load Loading cores into CoreContainer [instanceDir=C:\Users\JenkinsSlave\workspace\Lucene-Solr-trunk-Windows\solr\build\solr-core\test\J0\.\org.apache.solr.cloud.CollectionsAPIDistributedZkTest-jetty1-1375526666126\]
   [junit4]   2> 1017089 T2529 oashc.HttpShardHandlerFactory.getParameter Setting socketTimeout to: 120000
   [junit4]   2> 1017089 T2529 oashc.HttpShardHandlerFactory.getParameter Setting urlScheme to: http://
   [junit4]   2> 1017089 T2529 oashc.HttpShardHandlerFactory.getParameter Setting connTimeout to: 15000
   [junit4]   2> 1017089 T2529 oashc.HttpShardHandlerFactory.getParameter Setting maxConnectionsPerHost to: 20
   [junit4]   2> 1017089 T2529 oashc.HttpShardHandlerFactory.getParameter Setting corePoolSize to: 0
   [junit4]   2> 1017090 T2529 oashc.HttpShardHandlerFactory.getParameter Setting maximumPoolSize to: 2147483647
   [junit4]   2> 1017090 T2529 oashc.HttpShardHandlerFactory.getParameter Setting maxThreadIdleTime to: 5
   [junit4]   2> 1017091 T2529 oashc.HttpShardHandlerFactory.getParameter Setting sizeOfQueue to: -1
   [junit4]   2> 1017091 T2529 oashc.HttpShardHandlerFactory.getParameter Setting fairnessPolicy to: false
   [junit4]   2> 1017091 T2529 oascsi.HttpClientUtil.createClient Creating new http client, config:maxConnectionsPerHost=20&maxConnections=10000&socketTimeout=120000&connTimeout=15000&retry=false
   [junit4]   2> 1017098 T2529 oasc.ZkContainer.initZooKeeper Zookeeper client=127.0.0.1:57490/solr
   [junit4]   2> 1017099 T2529 oasc.ZkController.checkChrootPath zkHost includes chroot
   [junit4]   2> 1017101 T2529 oascc.ConnectionManager.waitForConnected Waiting for client to connect to ZooKeeper
   [junit4]   2> 1017104 T2567 oascc.ConnectionManager.process Watcher org.apache.solr.common.cloud.ConnectionManager@1a2dd93 name:ZooKeeperConnection Watcher:127.0.0.1:57490 got event WatchedEvent state:SyncConnected type:None path:null path:null type:None
   [junit4]   2> 1017104 T2529 oascc.ConnectionManager.waitForConnected Client is connected to ZooKeeper
   [junit4]   2> 1017107 T2529 oascsi.HttpClientUtil.createClient Creating new http client, config:maxConnections=500&maxConnectionsPerHost=16&socketTimeout=120000&connTimeout=15000
   [junit4]   2> 1017108 T2531 oazs.NIOServerCnxn.doIO WARN caught end of stream exception EndOfStreamException: Unable to read additional data from client sessionid 0x14043c73c190005, likely client has closed socket
   [junit4]   2> 	at org.apache.zookeeper.server.NIOServerCnxn.doIO(NIOServerCnxn.java:220)
   [junit4]   2> 	at org.apache.zookeeper.server.NIOServerCnxnFactory.run(NIOServerCnxnFactory.java:208)
   [junit4]   2> 	at java.lang.Thread.run(Thread.java:724)
   [junit4]   2> 
   [junit4]   2> 1017114 T2529 oascc.ConnectionManager.waitForConnected Waiting for client to connect to ZooKeeper
   [junit4]   2> 1017117 T2569 oascc.ConnectionManager.process Watcher org.apache.solr.common.cloud.ConnectionManager@648c245 name:ZooKeeperConnection Watcher:127.0.0.1:57490/solr got event WatchedEvent state:SyncConnected type:None path:null path:null type:None
   [junit4]   2> 1017117 T2529 oascc.ConnectionManager.waitForConnected Client is connected to ZooKeeper
   [junit4]   2> 1017124 T2529 oascc.ZkStateReader.createClusterStateWatchersAndUpdate Updating cluster state from ZooKeeper... 
   [junit4]   2> 1017830 T2529 oasc.ZkController.createEphemeralLiveNode Register node as live in ZooKeeper:/live_nodes/127.0.0.1:57509_o_fl%2Ffx
   [junit4]   2> 1017834 T2529 oascc.SolrZkClient.makePath makePath: /live_nodes/127.0.0.1:57509_o_fl%2Ffx
   [junit4]   2> 1017838 T2556 oascc.ZkStateReader$3.process Updating live nodes... (2)
   [junit4]   2> 1017838 T2569 oascc.ZkStateReader$3.process Updating live nodes... (2)
   [junit4]   2> 1017839 T2551 oascc.ZkStateReader$3.process Updating live nodes... (2)
   [junit4]   2> 1017845 T2529 oasc.CorePropertiesLocator.discover Looking for core definitions underneath C:\Users\JenkinsSlave\workspace\Lucene-Solr-trunk-Windows\solr\build\solr-core\test\J0\.\org.apache.solr.cloud.CollectionsAPIDistributedZkTest-jetty1-1375526666126
   [junit4]   2> 1018037 T2529 oasc.CorePropertiesLocator.discoverUnder Found core conf in C:\Users\JenkinsSlave\workspace\Lucene-Solr-trunk-Windows\solr\build\solr-core\test\J0\.\org.apache.solr.cloud.CollectionsAPIDistributedZkTest-jetty1-1375526666126\conf\
   [junit4]   2> 1018047 T2529 oasc.CorePropertiesLocator.discover Found 1 core definitions
   [junit4]   2> 1018048 T2529 oass.SolrDispatchFilter.init user.dir=C:\Users\JenkinsSlave\workspace\Lucene-Solr-trunk-Windows\solr\build\solr-core\test\J0
   [junit4]   2> 1018048 T2529 oass.SolrDispatchFilter.init SolrDispatchFilter.init() done
   [junit4]   2> 1018048 T2529 oascsi.HttpClientUtil.createClient Creating new http client, config:maxConnections=128&maxConnectionsPerHost=32&followRedirects=false
   [junit4]   2> 1018411 T2529 oejs.Server.doStart jetty-8.1.10.v20130312
   [junit4]   2> 1018414 T2529 oejs.AbstractConnector.doStart Started SelectChannelConnector@127.0.0.1:57518
   [junit4]   2> 1018415 T2529 oass.SolrDispatchFilter.init SolrDispatchFilter.init()
   [junit4]   2> 1018415 T2529 oasc.SolrResourceLoader.locateSolrHome JNDI not configured for solr (NoInitialContextEx)
   [junit4]   2> 1018415 T2529 oasc.SolrResourceLoader.locateSolrHome using system property solr.solr.home: C:\Users\JenkinsSlave\workspace\Lucene-Solr-trunk-Windows\solr\build\solr-core\test\J0\.\org.apache.solr.cloud.CollectionsAPIDistributedZkTest-jetty2-1375526667546
   [junit4]   2> 1018416 T2529 oasc.SolrResourceLoader.<init> new SolrResourceLoader for directory: 'C:\Users\JenkinsSlave\workspace\Lucene-Solr-trunk-Windows\solr\build\solr-core\test\J0\.\org.apache.solr.cloud.CollectionsAPIDistributedZkTest-jetty2-1375526667546\'
   [junit4]   2> 1018437 T2529 oasc.ConfigSolr.fromFile Loading container configuration from C:\Users\JenkinsSlave\workspace\Lucene-Solr-trunk-Windows\solr\build\solr-core\test\J0\.\org.apache.solr.cloud.CollectionsAPIDistributedZkTest-jetty2-1375526667546\solr.xml
   [junit4]   2> 1018496 T2529 oasc.ConfigSolrXml.<init> Config-defined core root directory: 
   [junit4]   2> 1018496 T2529 oasc.CoreContainer.<init> New CoreContainer 1341060684
   [junit4]   2> 1018496 T2529 oasc.CoreContainer.load Loading cores into CoreContainer [instanceDir=C:\Users\JenkinsSlave\workspace\Lucene-Solr-trunk-Windows\solr\build\solr-core\test\J0\.\org.apache.solr.cloud.CollectionsAPIDistributedZkTest-jetty2-1375526667546\]
   [junit4]   2> 1018497 T2529 oashc.HttpShardHandlerFactory.getParameter Setting socketTimeout to: 120000
   [junit4]   2> 1018498 T2529 oashc.HttpShardHandlerFactory.getParameter Setting urlScheme to: http://
   [junit4]   2> 1018498 T2529 oashc.HttpShardHandlerFactory.getParameter Setting connTimeout to: 15000
   [junit4]   2> 1018498 T2529 oashc.HttpShardHandlerFactory.getParameter Setting maxConnectionsPerHost to: 20
   [junit4]   2> 1018498 T2529 oashc.HttpShardHandlerFactory.getParameter Setting corePoolSize to: 0
   [junit4]   2> 1018499 T2529 oashc.HttpShardHandlerFactory.getParameter Setting maximumPoolSize to: 2147483647
   [junit4]   2> 1018499 T2529 oashc.HttpShardHandlerFactory.getParameter Setting maxThreadIdleTime to: 5
   [junit4]   2> 1018499 T2529 oashc.HttpShardHandlerFactory.getParameter Setting sizeOfQueue to: -1
   [junit4]   2> 1018500 T2529 oashc.HttpShardHandlerFactory.getParameter Setting fairnessPolicy to: false
   [junit4]   2> 1018500 T2529 oascsi.HttpClientUtil.createClient Creating new http client, config:maxConnectionsPerHost=20&maxConnections=10000&socketTimeout=120000&connTimeout=15000&retry=false
   [junit4]   2> 1018505 T2529 oasc.ZkContainer.initZooKeeper Zookeeper client=127.0.0.1:57490/solr
   [junit4]   2> 1018505 T2529 oasc.ZkController.checkChrootPath zkHost includes chroot
   [junit4]   2> 1018506 T2529 oascc.ConnectionManager.waitForConnected Waiting for client to connect to ZooKeeper
   [junit4]   2> 1018518 T2581 oascc.ConnectionManager.process Watcher org.apache.solr.common.cloud.ConnectionManager@1bc3c2ba name:ZooKeeperConnection Watcher:127.0.0.1:57490 got event WatchedEvent state:SyncConnected type:None path:null path:null type:None
   [junit4]   2> 1018519 T2529 oascc.ConnectionManager.waitForConnected Client is connected to ZooKeeper
   [junit4]   2> 1018522 T2529 oascsi.HttpClientUtil.createClient Creating new http client, config:maxConnections=500&maxConnectionsPerHost=16&socketTimeout=120000&connTimeout=15000
   [junit4]   2> 1018523 T2531 oazs.NIOServerCnxn.doIO WARN caught end of stream exception EndOfStreamException: Unable to read additional data from client sessionid 0x14043c73c190007, likely client has closed socket
   [junit4]   2> 	at org.apache.zookeeper.server.NIOServerCnxn.doIO(NIOServerCnxn.java:220)
   [junit4]   2> 	at org.apache.zookeeper.server.NIOServerCnxnFactory.run(NIOServerCnxnFactory.java:208)
   [junit4]   2> 	at java.lang.Thread.run(Thread.java:724)
   [junit4]   2> 
   [junit4]   2> 1018530 T2529 oascc.ConnectionManager.waitForConnected Waiting for client to connect to ZooKeeper
   [junit4]   2> 1018533 T2583 oascc.ConnectionManager.process Watcher org.apache.solr.common.cloud.ConnectionManager@6dc7f306 name:ZooKeeperConnection Watcher:127.0.0.1:57490/solr got event WatchedEvent state:SyncConnected type:None path:null path:null type:None
   [junit4]   2> 1018533 T2529 oascc.ConnectionManager.waitForConnected Client is connected to ZooKeeper
   [junit4]   2> 1018539 T2529 oascc.ZkStateReader.createClusterStateWatchersAndUpdate Updating cluster state from ZooKeeper... 
   [junit4]   2> 1019246 T2529 oasc.ZkController.createEphemeralLiveNode Register node as live in ZooKeeper:/live_nodes/127.0.0.1:57518_o_fl%2Ffx
   [junit4]   2> 1019251 T2529 oascc.SolrZkClient.makePath makePath: /live_nodes/127.0.0.1:57518_o_fl%2Ffx
   [junit4]   2> 1019258 T2556 oascc.ZkStateReader$3.process Updating live nodes... (3)
   [junit4]   2> 1019259 T2583 oascc.ZkStateReader$3.process Updating live nodes... (3)
   [junit4]   2> 1019259 T2569 oascc.ZkStateReader$3.process Updating live nodes... (3)
   [junit4]   2> 1019259 T2551 oascc.ZkStateReader$3.process Updating live nodes... (3)
   [junit4]   2> 1019268 T2529 oasc.CorePropertiesLocator.discover Looking for core definitions underneath C:\Users\JenkinsSlave\workspace\Lucene-Solr-trunk-Windows\solr\build\solr-core\test\J0\.\org.apache.solr.cloud.CollectionsAPIDistributedZkTest-jetty2-1375526667546
   [junit4]   2> 1019491 T2529 oasc.CorePropertiesLocator.discoverUnder Found core conf in C:\Users\JenkinsSlave\workspace\Lucene-Solr-trunk-Windows\solr\build\solr-core\test\J0\.\org.apache.solr.cloud.CollectionsAPIDistributedZkTest-jetty2-1375526667546\conf\
   [junit4]   2> 1019507 T2529 oasc.CorePropertiesLocator.discover Found 1 core definitions
   [junit4]   2> 1019508 T2529 oass.SolrDispatchFilter.init user.dir=C:\Users\JenkinsSlave\workspace\Lucene-Solr-trunk-Windows\solr\build\solr-core\test\J0
   [junit4]   2> 1019508 T2529 oass.SolrDispatchFilter.init SolrDispatchFilter.init() done
   [junit4]   2> 1019509 T2529 oascsi.HttpClientUtil.createClient Creating new http client, config:maxConnections=128&maxConnectionsPerHost=32&followRedirects=false
   [junit4]   2> 1019898 T2529 oejs.Server.doStart jetty-8.1.10.v20130312
   [junit4]   2> 1019903 T2529 oejs.AbstractConnector.doStart Started SelectChannelConnector@127.0.0.1:57527
   [junit4]   2> 1019903 T2529 oass.SolrDispatchFilter.init SolrDispatchFilter.init()
   [junit4]   2> 1019904 T2529 oasc.SolrResourceLoader.locateSolrHome JNDI not configured for solr (NoInitialContextEx)
   [junit4]   2> 1019904 T2529 oasc.SolrResourceLoader.locateSolrHome using system property solr.solr.home: C:\Users\JenkinsSlave\workspace\Lucene-Solr-trunk-Windows\solr\build\solr-core\test\J0\.\org.apache.solr.cloud.CollectionsAPIDistributedZkTest-jetty3-1375526669008
   [junit4]   2> 1019904 T2529 oasc.SolrResourceLoader.<init> new SolrResourceLoader for directory: 'C:\Users\JenkinsSlave\workspace\Lucene-Solr-trunk-Windows\solr\build\solr-core\test\J0\.\org.apache.solr.cloud.CollectionsAPIDistributedZkTest-jetty3-1375526669008\'
   [junit4]   2> 1019934 T2529 oasc.ConfigSolr.fromFile Loading container configuration from C:\Users\JenkinsSlave\workspace\Lucene-Solr-trunk-Windows\solr\build\solr-core\test\J0\.\org.apache.solr.cloud.CollectionsAPIDistributedZkTest-jetty3-1375526669008\solr.xml
   [junit4]   2> 1019994 T2529 oasc.ConfigSolrXml.<init> Config-defined core root directory: 
   [junit4]   2> 1019994 T2529 oasc.CoreContainer.<init> New CoreContainer 978016957
   [junit4]   2> 1019994 T2529 oasc.CoreContainer.load Loading cores into CoreContainer [instanceDir=C:\Users\JenkinsSlave\workspace\Lucene-Solr-trunk-Windows\solr\build\solr-core\test\J0\.\org.apache.solr.cloud.CollectionsAPIDistributedZkTest-jetty3-1375526669008\]
   [junit4]   2> 1019995 T2529 oashc.HttpShardHandlerFactory.getParameter Setting socketTimeout to: 120000
   [junit4]   2> 1019995 T2529 oashc.HttpShardHandlerFactory.getParameter Setting urlScheme to: http://
   [junit4]   2> 1019996 T2529 oashc.HttpShardHandlerFactory.getParameter Setting connTimeout to: 15000
   [junit4]   2> 1019996 T2529 oashc.HttpShardHandlerFactory.getParameter Setting maxConnectionsPerHost to: 20
   [junit4]   2> 1019996 T2529 oashc.HttpShardHandlerFactory.getParameter Setting corePoolSize to: 0
   [junit4]   2> 1019997 T2529 oashc.HttpShardHandlerFactory.getParameter Setting maximumPoolSize to: 2147483647
   [junit4]   2> 1019997 T2529 oashc.HttpShardHandlerFactory.getParameter Setting maxThreadIdleTime to: 5
   [junit4]   2> 1019998 T2529 oashc.HttpShardHandlerFactory.getParameter Setting sizeOfQueue to: -1
   [junit4]   2> 1019998 T2529 oashc.HttpShardHandlerFactory.getParameter Setting fairnessPolicy to: false
   [junit4]   2> 1019998 T2529 oascsi.HttpClientUtil.createClient Creating new http client, config:maxConnectionsPerHost=20&maxConnections=10000&socketTimeout=120000&connTimeout=15000&retry=false
   [junit4]   2> 1020002 T2529 oasc.ZkContainer.initZooKeeper Zookeeper client=127.0.0.1:57490/solr
   [junit4]   2> 1020003 T2529 oasc.ZkController.checkChrootPath zkHost includes chroot
   [junit4]   2> 1020004 T2529 oascc.ConnectionManager.waitForConnected Waiting for client to connect to ZooKeeper
   [junit4]   2> 1020017 T2595 oascc.ConnectionManager.process Watcher org.apache.solr.common.cloud.ConnectionManager@73fe10b6 name:ZooKeeperConnection Watcher:127.0.0.1:57490 got event WatchedEvent state:SyncConnected type:None path:null path:null type:None
   [junit4]   2> 1020017 T2529 oascc.ConnectionManager.waitForConnected Client is connected to ZooKeeper
   [junit4]   2> 1020020 T2529 oascsi.HttpClientUtil.createClient Creating new http client, config:maxConnections=500&maxConnectionsPerHost=16&socketTimeout=120000&connTimeout=15000
   [junit4]   2> 1020024 T2529 oascc.ConnectionManager.waitForConnected Waiting for client to connect to ZooKeeper
   [junit4]   2> 1020027 T2597 oascc.ConnectionManager.process Watcher org.apache.solr.common.cloud.ConnectionManager@276108d1 name:ZooKeeperConnection Watcher:127.0.0.1:57490/solr got event WatchedEvent state:SyncConnected type:None path:null path:null type:None
   [junit4]   2> 1020027 T2529 oascc.ConnectionManager.waitForConnected Client is connected to ZooKeeper
   [junit4]   2> 1020033 T2529 oascc.ZkStateReader.createClusterStateWatchersAndUpdate Updating cluster state from ZooKeeper... 
   [junit4]   2> 1020740 T2529 oasc.ZkController.createEphemeralLiveNode Register node as live in ZooKeeper:/live_nodes/127.0.0.1:57527_o_fl%2Ffx
   [junit4]   2> 1020743 T2529 oascc.SolrZkClient.makePath makePath: /live_nodes/127.0.0.1:57527_o_fl%2Ffx
   [junit4]   2> 1020749 T2597 oascc.ZkStateReader$3.process Updating live nodes... (4)
   [junit4]   2> 1020749 T2569 oascc.ZkStateReader$3.process Updating live nodes... (4)
   [junit4]   2> 1020749 T2583 oascc.ZkStateReader$3.process Updating live nodes... (4)
   [junit4]   2> 1020749 T2556 oascc.ZkStateReader$3.process Updating live nodes... (4)
   [junit4]   2> 1020749 T2551 oascc.ZkStateReader$3.process Updating live nodes... (4)
   [junit4]   2> 1020756 T2529 oasc.CorePropertiesLocator.discover Looking for core definitions underneath C:\Users\JenkinsSlave\workspace\Lucene-Solr-trunk-Windows\solr\build\solr-core\test\J0\.\org.apache.solr.cloud.CollectionsAPIDistributedZkTest-jetty3-1375526669008
   [junit4]   2> 1020898 T2529 oasc.CorePropertiesLocator.discoverUnder Found core conf in C:\Users\JenkinsSlave\workspace\Lucene-Solr-trunk-Windows\solr\build\solr-core\test\J0\.\org.apache.solr.cloud.CollectionsAPIDistributedZkTest-jetty3-1375526669008\conf\
   [junit4]   2> 1020909 T2529 oasc.CorePropertiesLocator.discover Found 1 core definitions
   [junit4]   2> 1020909 T2529 oass.SolrDispatchFilter.init user.dir=C:\Users\JenkinsSlave\workspace\Lucene-Solr-trunk-Windows\solr\build\solr-core\test\J0
   [junit4]   2> 1020910 T2529 oass.SolrDispatchFilter.init SolrDispatchFilter.init() done
   [junit4]   2> 1020910 T2529 oascsi.HttpClientUtil.createClient Creating new http client, config:maxConnections=128&maxConnectionsPerHost=32&followRedirects=false
   [junit4]   2> 1021328 T2529 oejs.Server.doStart jetty-8.1.10.v20130312
   [junit4]   2> 1021336 T2529 oejs.AbstractConnector.doStart Started SelectChannelConnector@127.0.0.1:57536
   [junit4]   2> 1021340 T2529 oass.SolrDispatchFilter.init SolrDispatchFilter.init()
   [junit4]   2> 1021340 T2529 oasc.SolrResourceLoader.locateSolrHome JNDI not configured for solr (NoInitialContextEx)
   [junit4]   2> 1021340 T2529 oasc.SolrResourceLoader.locateSolrHome using system property solr.solr.home: C:\Users\JenkinsSlave\workspace\Lucene-Solr-trunk-Windows\solr\build\solr-core\test\J0\.\org.apache.solr.cloud.CollectionsAPIDistributedZkTest-jetty4-1375526670411
   [junit4]   2> 1021340 T2529 oasc.SolrResourceLoader.<init> new SolrResourceLoader for directory: 'C:\Users\JenkinsSlave\workspace\Lucene-Solr-trunk-Windows\solr\build\solr-core\test\J0\.\org.apache.solr.cloud.CollectionsAPIDistributedZkTest-jetty4-1375526670411\'
   [junit4]   2> 1021352 T2529 oasc.ConfigSolr.fromFile Loading container configuration from C:\Users\JenkinsSlave\workspace\Lucene-Solr-trunk-Windows\solr\build\solr-core\test\J0\.\org.apache.solr.cloud.CollectionsAPIDistributedZkTest-jetty4-1375526670411\solr.xml
   [junit4]   2> 1021435 T2529 oasc.ConfigSolrXml.<init> Config-defined core root directory: 
   [junit4]   2> 1021436 T2529 oasc.CoreContainer.<init> New CoreContainer 87313194
   [junit4]   2> 1021436 T2529 oasc.CoreContainer.load Loading cores into CoreContainer [instanceDir=C:\Users\JenkinsSlave\workspace\Lucene-Solr-trunk-Windows\solr\build\solr-core\test\J0\.\org.apache.solr.cloud.CollectionsAPIDistributedZkTest-jetty4-1375526670411\]
   [junit4]   2> 1021438 T2529 oashc.HttpShardHandlerFactory.getParameter Setting socketTimeout to: 120000
   [junit4]   2> 1021438 T2529 oashc.HttpShardHandlerFactory.getParameter Setting urlScheme to: http://
   [junit4]   2> 1021439 T2529 oashc.HttpShardHandlerFactory.getParameter Setting connTimeout to: 15000
   [junit4]   2> 1021440 T2529 oashc.HttpShardHandlerFactory.getParameter Setting maxConnectionsPerHost to: 20
   [junit4]   2> 1021440 T2529 oashc.HttpShardHandlerFactory.getParameter Setting corePoolSize to: 0
   [junit4]   2> 1021440 T2529 oashc.HttpShardHandlerFactory.getParameter Setting maximumPoolSize to: 2147483647
   [junit4]   2> 1021440 T2529 oashc.HttpShardHandlerFactory.getParameter Setting maxThreadIdleTime to: 5
   [junit4]   2> 1021441 T2529 oashc.HttpShardHandlerFactory.getParameter Setting sizeOfQueue to: -1
   [junit4]   2> 1021441 T2529 oashc.HttpShardHandlerFactory.getParameter Setting fairnessPolicy to: false
   [junit4]   2> 1021442 T2529 oascsi.HttpClientUtil.createClient Creating new http client, config:maxConnectionsPerHost=20&maxConnections=10000&socketTimeout=120000&connTimeout=15000&retry=false
   [junit4]   2> 1021451 T2529 oasc.ZkContainer.initZooKeeper Zookeeper client=127.0.0.1:57490/solr
   [junit4]   2> 1021451 T2529 oasc.ZkController.checkChrootPath zkHost includes chroot
   [junit4]   2> 1021454 T2529 oascc.ConnectionManager.waitForConnected Waiting for client to connect to ZooKeeper
   [junit4]   2> 1021468 T2609 oascc.ConnectionManager.process Watcher org.apache.solr.common.cloud.ConnectionManager@ac89ec4 name:ZooKeeperConnection Watcher:127.0.0.1:57490 got event WatchedEvent state:SyncConnected type:None path:null path:null type:None
   [junit4]   2> 1021468 T2529 oascc.ConnectionManager.waitForConnected Client is connected to ZooKeeper
   [junit4]   2> 1021472 T2529 oascsi.HttpClientUtil.createClient Creating new http client, config:maxConnections=500&maxConnectionsPerHost=16&socketTimeout=120000&connTimeout=15000
   [junit4]   2> 1021481 T2529 oascc.ConnectionManager.waitForConnected Waiting for client to connect to ZooKeeper
   [junit4]   2> 1021484 T2611 oascc.ConnectionManager.process Watcher org.apache.solr.common.cloud.ConnectionManager@5f0a95fd name:ZooKeeperConnection Watcher:127.0.0.1:57490/solr got event WatchedEvent state:SyncConnected type:None path:null path:null type:None
   [junit4]   2> 1021485 T2529 oascc.ConnectionManager.waitForConnected Client is connected to ZooKeeper
   [junit4]   2> 1021496 T2529 oascc.ZkStateReader.createClusterStateWatchersAndUpdate Updating cluster state from ZooKeeper... 
   [junit4]   2> 1022276 T2529 oasc.ZkController.createEphemeralLiveNode Register node as live in ZooKeeper:/live_nodes/127.0.0.1:57536_o_fl%2Ffx
   [junit4]   2> 1022278 T2529 oascc.SolrZkClient.makePath makePath: /live_nodes/127.0.0.1:57536_o_fl%2Ffx
   [junit4]   2> 1022284 T2611 oascc.ZkStateReader$3.process Updating live nodes... (5)
   [junit4]   2> 1022284 T2569 oascc.ZkStateReader$3.process Updating live nodes... (5)
   [junit4]   2> 1022284 T2583 oascc.ZkStateReader$3.process Updating live nodes... (5)
   [junit4]   2> 1022285 T2556 oascc.ZkStateReader$3.process Updating live nodes... (5)
   [junit4]   2> 1022285 T2551 oascc.ZkStateReader$3.process Updating live nodes... (5)
   [junit4]   2> 1022286 T2597 oascc.ZkStateReader$3.process Updating live nodes... (5)
   [junit4]   2> 1022294 T2529 oasc.CorePropertiesLocator.discover Looking for core definitions underneath C:\Users\JenkinsSlave\workspace\Lucene-Solr-trunk-Windows\solr\build\solr-core\test\J0\.\org.apache.solr.cloud.CollectionsAPIDistributedZkTest-jetty4-1375526670411
   [junit4]   2> 1022529 T2529 oasc.CorePropertiesLocator.discoverUnder Found core conf in C:\Users\JenkinsSlave\workspace\Lucene-Solr-trunk-Windows\solr\build\solr-core\test\J0\.\org.apache.solr.cloud.CollectionsAPIDistributedZkTest-jetty4-1375526670411\conf\
   [junit4]   2> 1022538 T2529 oasc.CorePropertiesLocator.discover Found 1 core definitions
   [junit4]   2> 1022539 T2529 oass.SolrDispatchFilter.init user.dir=C:\Users\JenkinsSlave\workspace\Lucene-Solr-trunk-Windows\solr\build\solr-core\test\J0
   [junit4]   2> 1022539 T2529 oass.SolrDispatchFilter.init SolrDispatchFilter.init() done
   [junit4]   2> 1022540 T2529 oascsi.HttpClientUtil.createClient Creating new http client, config:maxConnections=128&maxConnectionsPerHost=32&followRedirects=false
   [junit4]   2> 1022544 T2529 oascsi.HttpClientUtil.createClient Creating new http client, config:maxConnections=128&maxConnectionsPerHost=32&followRedirects=false
   [junit4]   2> 1022549 T2563 oasha.CollectionsHandler.handleCreateAction Creating Collection : numShards=2&name=nodes_used_collection&replicationFactor=2&action=CREATE&wt=javabin&version=2
   [junit4]   2> 1022551 T2551 oasc.DistributedQueue$LatchChildWatcher.process Watcher fired on path: /overseer/collection-queue-work state: SyncConnected type NodeChildrenChanged
   [junit4]   2> 1022553 T2553 oasc.OverseerCollectionProcessor.run Overseer Collection Processor: Get the message id:/overseer/collection-queue-work/qn-0000000000 message:{
   [junit4]   2> 	  "operation":"createcollection",
   [junit4]   2> 	  "numShards":"2",
   [junit4]   2> 	  "name":"nodes_used_collection",
   [junit4]   2> 	  "replicationFactor":"2"}
   [junit4]   2> 1022553 T2553 oasc.OverseerCollectionProcessor.processMessage WARN OverseerCollectionProcessor.processMessage : createcollection , {
   [junit4]   2> 	  "operation":"createcollection",
   [junit4]   2> 	  "numShards":"2",
   [junit4]   2> 	  "name":"nodes_used_collection",
   [junit4]   2> 	  "replicationFactor":"2"}
   [junit4]   2> 1022919 T2552 oascc.ZkStateReader.updateClusterState Updating cloud state from ZooKeeper... 
   [junit4]   2> 1022921 T2552 oasc.Overseer$ClusterStateUpdater.buildCollection building a new collection: nodes_used_collection
   [junit4]   2> 1022921 T2552 oasc.Overseer$ClusterStateUpdater.createCollection Create collection nodes_used_collection with shards [shard1, shard2]
   [junit4]   2> 1022933 T2569 oascc.ZkStateReader$2.process A cluster state change: WatchedEvent state:SyncConnected type:NodeDataChanged path:/clusterstate.json, has occurred - updating... (live nodes size: 5)
   [junit4]   2> 1022934 T2611 oascc.ZkStateReader$2.process A cluster state change: WatchedEvent state:SyncConnected type:NodeDataChanged path:/clusterstate.json, has occurred - updating... (live nodes size: 5)
   [junit4]   2> 1022934 T2597 oascc.ZkStateReader$2.process A cluster state change: WatchedEvent state:SyncConnected type:NodeDataChanged path:/clusterstate.json, has occurred - updating... (live nodes size: 5)
   [junit4]   2> 1022935 T2583 oascc.ZkStateReader$2.process A cluster state change: WatchedEvent state:SyncConnected type:NodeDataChanged path:/clusterstate.json, has occurred - updating... (live nodes size: 5)
   [junit4]   2> 1022933 T2556 oascc.ZkStateReader$2.process A cluster state change: WatchedEvent state:SyncConnected type:NodeDataChanged path:/clusterstate.json, has occurred - updating... (live nodes size: 5)
   [junit4]   2> 1022935 T2551 oascc.ZkStateReader$2.process A cluster state change: WatchedEvent state:SyncConnected type:NodeDataChanged path:/clusterstate.json, has occurred - updating... (live nodes size: 5)
   [junit4]   2> 1022947 T2553 oasc.OverseerCollectionProcessor.createCollection going to create cores replicas shardNames [shard1, shard2] , repFactor : 2
   [junit4]   2> 1022948 T2553 oasc.OverseerCollectionProcessor.createCollection Creating shard nodes_used_collection_shard1_replica1 as part of slice shard1 of collection nodes_used_collection on 127.0.0.1:57518_o_fl%2Ffx
   [junit4]   2> 1022948 T2553 oasc.OverseerCollectionProcessor.createCollection Creating shard nodes_used_collection_shard1_replica2 as part of slice shard1 of collection nodes_used_collection on 127.0.0.1:57497_o_fl%2Ffx
   [junit4]   2> 1022948 T2553 oasc.OverseerCollectionProcessor.createCollection Creating shard nodes_used_collection_shard2_replica1 as part of slice shard2 of collection nodes_used_collection on 127.0.0.1:57527_o_fl%2Ffx
   [junit4]   2> 1022952 T2553 oasc.OverseerCollectionProcessor.createCollection Creating shard nodes_used_collection_shard2_replica2 as part of slice shard2 of collection nodes_used_collection on 127.0.0.1:57536_o_fl%2Ffx
   [junit4]   2> 1022955 T2575 oasc.ZkController.publish publishing core=nodes_used_collection_shard1_replica1 state=down
   [junit4]   2> 1022957 T2547 oasc.ZkController.publish publishing core=nodes_used_collection_shard1_replica2 state=down
   [junit4]   2> 1022958 T2593 oasc.ZkController.publish publishing core=nodes_used_collection_shard2_replica1 state=down
   [junit4]   2> 1022959 T2604 oasc.ZkController.publish publishing core=nodes_used_collection_shard2_replica2 state=down
   [junit4]   2> 1022965 T2575 oasc.ZkController.waitForCoreNodeName look for our core node name
   [junit4]   2> 1022967 T2547 oasc.ZkController.waitForCoreNodeName look for our core node name
   [junit4]   2> 1022971 T2593 oasc.ZkController.waitForCoreNodeName look for our core node name
   [junit4]   2> 1022972 T2604 oasc.ZkController.waitForCoreNodeName look for our core node name
   [junit4]   2> 1024105 T2552 oascc.ZkStateReader.updateClusterState Updating cloud state from ZooKeeper... 
   [junit4]   2> 1024107 T2552 oasc.Overseer$ClusterStateUpdater.updateState WARN Could not find collection node for nodes_used_collection, skipping publish state
   [junit4]   2> 1024107 T2552 oasc.Overseer$ClusterStateUpdater.updateState Update state numShards=2 message={
   [junit4]   2> 	  "operation":"state",
   [junit4]   2> 	  "core_node_name":"core_node1",
   [junit4]   2> 	  "numShards":"2",
   [junit4]   2> 	  "shard":"shard1",
   [junit4]   2> 	  "roles":null,
   [junit4]   2> 	  "state":"down",
   [junit4]   2> 	  "shard_state":"active",
   [junit4]   2> 	  "core":"nodes_used_collection_shard1_replica1",
   [junit4]   2> 	  "collection":"nodes_used_collection",
   [junit4]   2> 	  "shard_range":null,
   [junit4]   2> 	  "node_name":"127.0.0.1:57518_o_fl%2Ffx",
   [junit4]   2> 	  "base_url":"http://127.0.0.1:57518/o_fl/fx"}
   [junit4]   2> 1024116 T2552 oasc.Overseer$ClusterStateUpdater.updateState WARN Could not find collection node for nodes_used_collection, skipping publish state
   [junit4]   2> 1024116 T2552 oasc.Overseer$ClusterStateUpdater.updateState Update state numShards=2 message={
   [junit4]   2> 	  "operation":"state",
   [junit4]   2> 	  "core_node_name":"core_node2",
   [junit4]   2> 	  "numShards":"2",
   [junit4]   2> 	  "shard":"shard1",
   [junit4]   2> 	  "roles":null,
   [junit4]   2> 	  "state":"down",
   [junit4]   2> 	  "shard_state":"active",
   [junit4]   2> 	  "core":"nodes_used_collection_shard1_replica2",
   [junit4]   2> 	  "collection":"nodes_used_collection",
   [junit4]   2> 	  "shard_range":null,
   [junit4]   2> 	  "node_name":"127.0.0.1:57497_o_fl%2Ffx",
   [junit4]   2> 	  "base_url":"http://127.0.0.1:57497/o_fl/fx"}
   [junit4]   2> 1024123 T2552 oasc.Overseer$ClusterStateUpdater.updateState WARN Could not find collection node for nodes_used_collection, skipping publish state
   [junit4]   2> 1024123 T2552 oasc.Overseer$ClusterStateUpdater.updateState Update state numShards=2 message={
   [junit4]   2> 	  "operation":"state",
   [junit4]   2> 	  "core_node_name":"core_node3",
   [junit4]   2> 	  "numShards":"2",
   [junit4]   2> 	  "shard":"shard2",
   [junit4]   2> 	  "roles":null,
   [junit4]   2> 	  "state":"down",
   [junit4]   2> 	  "shard_state":"active",
   [junit4]   2> 	  "core":"nodes_used_collection_shard2_replica1",
   [junit4]   2> 	  "collection":"nodes_used_collection",
   [junit4]   2> 	  "shard_range":null,
   [junit4]   2> 	  "node_name":"127.0.0.1:57527_o_fl%2Ffx",
   [junit4]   2> 	  "base_url":"http://127.0.0.1:57527/o_fl/fx"}
   [junit4]   2> 1024131 T2552 oasc.Overseer$ClusterStateUpdater.updateState WARN Could not find collection node for nodes_used_collection, skipping publish state
   [junit4]   2> 1024131 T2552 oasc.Overseer$ClusterStateUpdater.updateState Update state numShards=2 message={
   [junit4]   2> 	  "operation":"state",
   [junit4]   2> 	  "core_node_name":"core_node4",
   [junit4]   2> 	  "numShards":"2",
   [junit4]   2> 	  "shard":"shard2",
   [junit4]   2> 	  "roles":null,
   [junit4]   2> 	  "state":"down",
   [junit4]   2> 	  "shard_state":"active",
   [junit4]   2> 	  "core":"nodes_used_collection_shard2_replica2",
   [junit4]   2> 	  "collection":"nodes_used_collection",
   [junit4]   2> 	  "shard_range":null,
   [junit4]   2> 	  "node_name":"127.0.0.1:57536_o_fl%2Ffx",
   [junit4]   2> 	  "base_url":"http://127.0.0.1:57536/o_fl/fx"}
   [junit4]   2> 1024138 T2556 oascc.ZkStateReader$2.process A cluster state change: WatchedEvent state:SyncConnected type:NodeDataChanged path:/clusterstate.json, has occurred - updating... (live nodes size: 5)
   [junit4]   2> 1024138 T2551 oascc.ZkStateReader$2.process A cluster state change: WatchedEvent state:SyncConnected type:NodeDataChanged path:/clusterstate.json, has occurred - updating... (live nodes size: 5)
   [junit4]   2> 1024139 T2583 oascc.ZkStateReader$2.process A cluster state change: WatchedEvent state:SyncConnected type:NodeDataChanged path:/clusterstate.json, has occurred - updating... (live nodes size: 5)
   [junit4]   2> 1024138 T2597 oascc.ZkStateReader$2.process A cluster state change: WatchedEvent state:SyncConnected type:NodeDataChanged path:/clusterstate.json, has occurred - updating... (live nodes size: 5)
   [junit4]   2> 1024138 T2611 oascc.ZkStateReader$2.process A cluster state change: WatchedEvent state:SyncConnected type:NodeDataChanged path:/clusterstate.json, has occurred - updating... (live nodes size: 5)
   [junit4]   2> 1024138 T2569 oascc.ZkStateReader$2.process A cluster state change: WatchedEvent state:SyncConnected type:NodeDataChanged path:/clusterstate.json, has occurred - updating... (live nodes size: 5)
   [junit4]   2> 1024514 T2575 oasc.ZkController.waitForShardId waiting to find shard id in clusterstate for nodes_used_collection_shard1_replica1
   [junit4]   2> 1024514 T2547 oasc.ZkController.waitForShardId waiting to find shard id in clusterstate for nodes_used_collection_shard1_replica2
   [junit4]   2> 1024514 T2575 oasc.CorePropertiesLocator.writePropertiesFile ERROR Couldn't persist core properties to C:\Users\JenkinsSlave\workspace\Lucene-Solr-trunk-Windows\solr\build\solr-core\test\J0\.\org.apache.solr.cloud.CollectionsAPIDistributedZkTest-jetty2-1375526667546\nodes_used_collection_shard1_replica1\core.properties: java.io.FileNotFoundException: C:\Users\JenkinsSlave\workspace\Lucene-Solr-trunk-Windows\solr\build\solr-core\test\J0\.\org.apache.solr.cloud.CollectionsAPIDistributedZkTest-jetty2-1375526667546\nodes_used_collection_shard1_replica1\core.properties (The system cannot find the path specified)
   [junit4]   2> 1024514 T2575 oasc.CoreContainer.create Creating SolrCore 'nodes_used_collection_shard1_replica1' using instanceDir: C:\Users\JenkinsSlave\workspace\Lucene-Solr-trunk-Windows\solr\build\solr-core\test\J0\.\org.apache.solr.cloud.CollectionsAPIDistributedZkTest-jetty2-1375526667546\nodes_used_collection_shard1_replica1
   [junit4]   2> 1024515 T2575 oasc.ZkController.createCollectionZkNode Check for collection zkNode:nodes_used_collection
   [junit4]   2> 1024514 T2547 oasc.CorePropertiesLocator.writePropertiesFile ERROR Couldn't persist core properties to C:\Users\JenkinsSlave\workspace\Lucene-Solr-trunk-Windows\solr\build\solr-core\test\J0\.\org.apache.solr.cloud.CollectionsAPIDistributedZkTest-controljetty-1375526665408\nodes_used_collection_shard1_replica2\core.properties: java.io.FileNotFoundException: C:\Users\JenkinsSlave\workspace\Lucene-Solr-trunk-Windows\solr\build\solr-core\test\J0\.\org.apache.solr.cloud.CollectionsAPIDistributedZkTest-controljetty-1375526665408\nodes_used_collection_shard1_replica2\core.properties (The system cannot find the path specified)
   [junit4]   2> 1024515 T2547 oasc.CoreContainer.create Creating SolrCore 'nodes_used_collection_shard1_replica2' using instanceDir: C:\Users\JenkinsSlave\workspace\Lucene-Solr-trunk-Windows\solr\build\solr-core\test\J0\.\org.apache.solr.cloud.CollectionsAPIDistributedZkTest-controljetty-1375526665408\nodes_used_collection_shard1_replica2
   [junit4]   2> 1024516 T2547 oasc.ZkController.createCollectionZkNode Check for collection zkNode:nodes_used_collection
   [junit4]   2> 1024516 T2575 oasc.ZkController.createCollectionZkNode Creating collection in ZooKeeper:nodes_used_collection
   [junit4]   2> 1024516 T2575 oasc.ZkController.getConfName Looking for collection configName
   [junit4]   2> 1024517 T2547 oasc.ZkController.createCollectionZkNode Creating collection in ZooKeeper:nodes_used_collection
   [junit4]   2> 1024517 T2547 oasc.ZkController.getConfName Looking for collection configName
   [junit4]   2> 1024517 T2575 oasc.ZkController.getConfName Only one config set found in zk - using it:conf1
   [junit4]   2> 1024518 T2547 oasc.ZkController.getConfName Only one config set found in zk - using it:conf1
   [junit4]   2> 1024518 T2547 oascc.SolrZkClient.makePath makePath: /collections/nodes_used_collection
   [junit4]   2> 1024518 T2575 oascc.SolrZkClient.makePath makePath: /collections/nodes_used_collection
   [junit4]   2> 1024519 T2604 oasc.ZkController.waitForShardId waiting to find shard id in clusterstate for nodes_used_collection_shard2_replica2
   [junit4]   2> 1024519 T2593 oasc.ZkController.waitForShardId waiting to find shard id in clusterstate for nodes_used_collection_shard2_replica1
   [junit4]   2> 1024520 T2604 oasc.CorePropertiesLocator.writePropertiesFile ERROR Couldn't persist core properties to C:\Users\JenkinsSlave\workspace\Lucene-Solr-trunk-Windows\solr\build\solr-core\test\J0\.\org.apache.solr.cloud.CollectionsAPIDistributedZkTest-jetty4-1375526670411\nodes_used_collection_shard2_replica2\core.properties: java.io.FileNotFoundException: C:\Users\JenkinsSlave\workspace\Lucene-Solr-trunk-Windows\solr\build\solr-core\test\J0\.\org.apache.solr.cloud.CollectionsAPIDistributedZkTest-jetty4-1375526670411\nodes_used_collection_shard2_replica2\core.properties (The system cannot find the path specified)
   [junit4]   2> 1024520 T2604 oasc.CoreContainer.create Creating SolrCore 'nodes_used_collection_shard2_replica2' using instanceDir: C:\Users\JenkinsSlave\workspace\Lucene-Solr-trunk-Windows\solr\build\solr-core\test\J0\.\org.apache.solr.cloud.CollectionsAPIDistributedZkTest-jetty4-1375526670411\nodes_used_collection_shard2_replica2
   [junit4]   2> 1024520 T2593 oasc.CorePropertiesLocator.writePropertiesFile ERROR Couldn't persist core properties to C:\Users\JenkinsSlave\workspace\Lucene-Solr-trunk-Windows\solr\build\solr-core\test\J0\.\org.apache.solr.cloud.CollectionsAPIDistributedZkTest-jetty3-1375526669008\nodes_used_collection_shard2_replica1\core.properties: java.io.FileNotFoundException: C:\Users\JenkinsSlave\workspace\Lucene-Solr-trunk-Windows\solr\build\solr-core\test\J0\.\org.apache.solr.cloud.CollectionsAPIDistributedZkTest-jetty3-1375526669008\nodes_used_collection_shard2_replica1\core.properties (The system cannot find the path specified)
   [junit4]   2> 1024521 T2593 oasc.CoreContainer.create Creating SolrCore 'nodes_used_collection_shard2_replica1' using instanceDir: C:\Users\JenkinsSlave\workspace\Lucene-Solr-trunk-Windows\solr\build\solr-core\test\J0\.\org.apache.solr.cloud.CollectionsAPIDistributedZkTest-jetty3-1375526669008\nodes_used_collection_shard2_replica1
   [junit4]   2> 1024521 T2593 oasc.ZkController.createCollectionZkNode Check for collection zkNode:nodes_used_collection
   [junit4]   2> 1024521 T2604 oasc.ZkController.createCollectionZkNode Check for collection zkNode:nodes_used_collection
   [junit4]   2> 1024527 T2575 oasc.ZkController.readConfigName Load collection config from:/collections/nodes_used_collection
   [junit4]   2> 1024527 T2593 oasc.ZkController.createCollectionZkNode Collection zkNode exists
   [junit4]   2> 1024527 T2593 oasc.ZkController.readConfigName Load collection config from:/collections/nodes_used_collection
   [junit4]   2> 1024528 T2547 oasc.ZkController.readConfigName Load collection config from:/collections/nodes_used_collection
   [junit4]   2> 1024528 T2604 oasc.ZkController.createCollectionZkNode Collection zkNode exists
   [junit4]   2> 1024529 T2604 oasc.ZkController.readConfigName Load collection config from:/collections/nodes_used_collection
   [junit4]   2> 1024529 T2575 oasc.SolrResourceLoader.<init> new SolrResourceLoader for directory: 'C:\Users\JenkinsSlave\workspace\Lucene-Solr-trunk-Windows\solr\build\solr-core\test\J0\.\org.apache.solr.cloud.CollectionsAPIDistributedZkTest-jetty2-1375526667546\nodes_used_collection_shard1_replica1\'
   [junit4]   2> 1024530 T2547 oasc.SolrResourceLoader.<init> new SolrResourceLoader for directory: 'C:\Users\JenkinsSlave\workspace\Lucene-Solr-trunk-Windows\solr\build\solr-core\test\J0\.\org.apache.solr.cloud.CollectionsAPIDistributedZkTest-controljetty-1375526665408\nodes_used_collection_shard1_replica2\'
   [junit4]   2> 1024532 T2593 oasc.SolrResourceLoader.<init> new SolrResourceLoader for directory: 'C:\Users\JenkinsSlave\workspace\Lucene-Solr-trunk-Windows\solr\build\solr-core\test\J0\.\org.apache.solr.cloud.CollectionsAPIDistributedZkTest-jetty3-1375526669008\nodes_used_collection_shard2_replica1\'
   [junit4]   2> 1024533 T2604 oasc.SolrResourceLoader.<init> new SolrResourceLoader for directory: 'C:\Users\JenkinsSlave\workspace\Lucene-Solr-trunk-Windows\solr\build\solr-core\test\J0\.\org.apache.solr.cloud.CollectionsAPIDistributedZkTest-jetty4-1375526670411\nodes_used_collection_shard2_replica2\'
   [junit4]   2> 1024629 T2575 oasc.SolrConfig.<init> Using Lucene MatchVersion: LUCENE_50
   [junit4]   2> 1024669 T2547 oasc.SolrConfig.<init> Using Lucene MatchVersion: LUCENE_50
   [junit4]   2> 1024693 T2575 oasc.SolrConfig.<init> Loaded SolrConfig: solrconfig.xml
   [junit4]   2> 1024706 T2604 oasc.SolrConfig.<init> Using Lucene MatchVersion: LUCENE_50
   [junit4]   2> 1024730 T2593 oasc.SolrConfig.<init> Using Lucene MatchVersion: LUCENE_50
   [junit4]   2> 1024770 T2547 oasc.SolrConfig.<init> Loaded SolrConfig: solrconfig.xml
   [junit4]   2> 1024793 T2575 oass.IndexSchema.readSchema Reading Solr Schema from schema.xml
   [junit4]   2> 1024800 T2575 oass.IndexSchema.readSchema [nodes_used_collection_shard1_replica1] Schema name=test
   [junit4]   2> 1024804 T2604 oasc.SolrConfig.<init> Loaded SolrConfig: solrconfig.xml
   [junit4]   2> 1024805 T2547 oass.IndexSchema.readSchema Reading Solr Schema from schema.xml
   [junit4]   2> 1024812 T2547 oass.IndexSchema.readSchema [nodes_used_collection_shard1_replica2] Schema name=test
   [junit4]   2> 1024840 T2593 oasc.SolrConfig.<init> Loaded SolrConfig: solrconfig.xml
   [junit4]   2> 1024851 T2604 oass.IndexSchema.readSchema Reading Solr Schema from schema.xml
   [junit4]   2> 1024858 T2604 oass.IndexSchema.readSchema [nodes_used_collection_shard2_replica2] Schema name=test
   [junit4]   2> 1024962 T2593 oass.IndexSchema.readSchema Reading Solr Schema from schema.xml
   [junit4]   2> 1024969 T2593 oass.IndexSchema.readSchema [nodes_used_collection_shard2_replica1] Schema name=test
   [junit4]   2> 1025706 T2604 oass.OpenExchangeRatesOrgProvider.init Initialized with rates=open-exchange-rates.json, refreshInterval=1440.
   [junit4]   2> 1025753 T2604 oass.IndexSchema.readSchema default search field in schema is text
   [junit4]   2> 1025763 T2604 oass.IndexSchema.readSchema unique key field: id
   [junit4]   2> 1026058 T2593 oass.OpenExchangeRatesOrgProvider.init Initialized with rates=open-exchange-rates.json, refreshInterval=1440.
   [junit4]   2> 1026065 T2593 oass.IndexSchema.readSchema default search field in schema is text
   [junit4]   2> 1026068 T2593 oass.IndexSchema.readSchema unique key field: id
   [junit4]   2> 1026109 T2547 oass.OpenExchangeRatesOrgProvider.init Initialized with rates=open-exchange-rates.json, refreshInterval=1440.
   [junit4]   2> 1026114 T2547 oass.IndexSchema.readSchema default search field in schema is text
   [junit4]   2> 1026123 T2547 oass.IndexSchema.readSchema unique key field: id
   [junit4]   2> 1026137 T2604 oass.FileExchangeRateProvider.reload Reloading exchange rates from file currency.xml
   [junit4]   2> 1026141 T2575 oass.OpenExchangeRatesOrgProvider.init Initialized with rates=open-exchange-rates.json, refreshInterval=1440.
   [junit4]   2> 1026142 T2604 oass.FileExchangeRateProvider.reload Reloading exchange rates from file currency.xml
   [junit4]   2> 1026148 T2604 oass.OpenExchangeRatesOrgProvider.reload Reloading exchange rates from open-exchange-rates.json
   [junit4]   2> 1026148 T2575 oass.IndexSchema.readSchema default search field in schema is text
   [junit4]   2> 1026151 T2604 oass.OpenExchangeRatesOrgProvider$OpenExchangeRates.<init> WARN Unknown key IMPORTANT NOTE
   [junit4]   2> 1026151 T2604 oass.OpenExchangeRatesOrgProvider$OpenExchangeRates.<init> WARN Expected key, got STRING
   [junit4]   2> 1026151 T2604 oass.OpenExchangeRatesOrgProvider.reload Reloading exchange rates from open-exchange-rates.json
   [junit4]   2> 1026153 T2604 oass.OpenExchangeRatesOrgProvider$OpenExchangeRates.<init> WARN Unknown key IMPORTANT NOTE
   [junit4]   2> 1026153 T2604 oass.OpenExchangeRatesOrgProvider$OpenExchangeRates.<init> WARN Expected key, got STRING
   [junit4]   2> 1026153 T2604 oasc.SolrCore.initDirectoryFactory org.apache.solr.core.MockDirectoryFactory
   [junit4]   2> 1026154 T2604 oasc.SolrCore.<init> [nodes_used_collection_shard2_replica2] Opening new SolrCore at C:\Users\JenkinsSlave\workspace\Lucene-Solr-trunk-Windows\solr\build\solr-core\test\J0\.\org.apache.solr.cloud.CollectionsAPIDistributedZkTest-jetty4-1375526670411\nodes_used_collection_shard2_replica2\, dataDir=C:\Users\JenkinsSlave\workspace\Lucene-Solr-trunk-Windows\solr\build\solr-core\test\J0\.\org.apache.solr.cloud.CollectionsAPIDistributedZkTest-jetty4-1375526670411\\nodes_used_collection_shard2_replica2\data\
   [junit4]   2> 1026154 T2604 oasc.JmxMonitoredMap.<init> JMX monitoring is enabled. Adding Solr mbeans to JMX Server: com.sun.jmx.mbeanserver.JmxMBeanServer@42beea25
   [junit4]   2> 1026154 T2575 oass.IndexSchema.readSchema unique key field: id
   [junit4]   2> 1026155 T2604 oasc.CachingDirectoryFactory.get return new directory for C:\Users\JenkinsSlave\workspace\Lucene-Solr-trunk-Windows\solr\build\solr-core\test\J0\.\org.apache.solr.cloud.CollectionsAPIDistributedZkTest-jetty4-1375526670411\\nodes_used_collection_shard2_replica2\data\
   [junit4]   2> 1026155 T2604 oasc.SolrCore.getNewIndexDir New index directory detected: old=null new=C:\Users\JenkinsSlave\workspace\Lucene-Solr-trunk-Windows\solr\build\solr-core\test\J0\.\org.apache.solr.cloud.CollectionsAPIDistributedZkTest-jetty4-1375526670411\\nodes_used_collection_shard2_replica2\data\index/
   [junit4]   2> 1026155 T2604 oasc.SolrCore.initIndex WARN [nodes_used_collection_shard2_replica2] Solr index directory 'C:\Users\JenkinsSlave\workspace\Lucene-Solr-trunk-Windows\solr\build\solr-core\test\J0\.\org.apache.solr.cloud.CollectionsAPIDistributedZkTest-jetty4-1375526670411\nodes_used_collection_shard2_replica2\data\index' doesn't exist. Creating new index...
   [junit4]   2> 1026155 T2604 oasc.CachingDirectoryFactory.get return new directory for C:\Users\JenkinsSlave\workspace\Lucene-Solr-trunk-Windows\solr\build\solr-core\test\J0\.\org.apache.solr.cloud.CollectionsAPIDistributedZkTest-jetty4-1375526670411\\nodes_used_collection_shard2_replica2\data\index
   [junit4]   2> 1026157 T2593 oass.FileExchangeRateProvider.reload Reloading exchange rates from file currency.xml
   [junit4]   2> 1026162 T2593 oass.FileExchangeRateProvider.reload Reloading exchange rates from file currency.xml
   [junit4]   2> 1026164 T2547 oass.FileExchangeRateProvider.reload Reloading exchange rates from file currency.xml
   [junit4]   2> 1026165 T2604 oasc.SolrDeletionPolicy.onCommit SolrDeletionPolicy.onCommit: commits: num=1
   [junit4]   2> 		commit{dir=MockDirWrapper(org.apache.lucene.store.RAMDirectory@77e1e433 lockFactory=org.apache.lucene.store.NativeFSLockFactory@7ed72538),segFN=segments_1,generation=1}
   [junit4]   2> 1026165 T2604 oasc.SolrDeletionPolicy.updateCommits newest commit generation = 1
   [junit4]   2> 1026171 T2604 oasup.UpdateRequestProcessorChain.init inserting DistributedUpdateProcessorFactory into updateRequestProcessorChain "dedupe"
   [junit4]   2> 1026171 T2604 oasup.UpdateRequestProcessorChain.init inserting DistributedUpdateProcessorFactory into updateRequestProcessorChain "stored_sig"
   [junit4]   2> 1026172 T2604 oasup.UpdateRequestProcessorChain.init inserting DistributedUpdateProcessorFactory into updateRequestProcessorChain "distrib-dup-test-chain-implicit"
   [junit4]   2> 1026173 T2604 oasc.RequestHandlers.initHandlersFromConfig created standard: solr.StandardRequestHandler
   [junit4]   2> 1026173 T2604 oasc.RequestHandlers.initHandlersFromConfig created /get: solr.RealTimeGetHandler
   [junit4]   2> 1026173 T2593 oass.OpenExchangeRatesOrgProvider.reload Reloading exchange rates from open-exchange-rates.json
   [junit4]   2> 1026173 T2604 oasc.RequestHandlers.initHandlersFromConfig adding lazy requestHandler: solr.ReplicationHandler
   [junit4]   2> 1026174 T2604 oasc.RequestHandlers.initHandlersFromConfig created /replication: solr.ReplicationHandler
   [junit4]   2> 1026175 T2604 oasc.RequestHandlers.initHandlersFromConfig created /update: solr.UpdateRequestHandler
   [junit4]   2> 1026175 T2604 oasc.RequestHandlers.initHandlersFromConfig created /admin/: org.apache.solr.handler.admin.AdminHandlers
   [junit4]   2> 1026177 T2593 oass.OpenExchangeRatesOrgProvider$OpenExchangeRates.<init> WARN Unknown key IMPORTANT NOTE
   [junit4]   2> 1026178 T2593 oass.OpenExchangeRatesOrgProvider$OpenExchangeRates.<init> WARN Expected key, got STRING
   [junit4]   2> 1026178 T2593 oass.OpenExchangeRatesOrgProvider.reload Reloading exchange rates from open-exchange-rates.json
   [junit4]   2> 1026181 T2593 oass.OpenExchangeRatesOrgProvider$OpenExchangeRates.<init> WARN Unknown key IMPORTANT NOTE
   [junit4]   2> 1026182 T2593 oass.OpenExchangeRatesOrgProvider$OpenExchangeRates.<init> WARN Expected key, got STRING
   [junit4]   2> 1026182 T2593 oasc.SolrCore.initDirectoryFactory org.apache.solr.core.MockDirectoryFactory
   [junit4]   2> 1026182 T2593 oasc.SolrCore.<init> [nodes_used_collection_shard2_replica1] Opening new SolrCore at C:\Users\JenkinsSlave\workspace\Lucene-Solr-trunk-Windows\solr\build\solr-core\test\J0\.\org.apache.solr.cloud.CollectionsAPIDistributedZkTest-jetty3-1375526669008\nodes_used_collection_shard2_replica1\, dataDir=C:\Users\JenkinsSlave\workspace\Lucene-Solr-trunk-Windows\solr\build\solr-core\test\J0\.\org.apache.solr.cloud.CollectionsAPIDistributedZkTest-jetty3-1375526669008\\nodes_used_collection_shard2_replica1\data\
   [junit4]   2> 1026182 T2547 oass.FileExchangeRateProvider.reload Reloading exchange rates from file currency.xml
   [junit4]   2> 1026182 T2593 oasc.JmxMonitoredMap.<init> JMX monitoring is enabled. Adding Solr mbeans to JMX Server: com.sun.jmx.mbeanserver.JmxMBeanServer@42beea25
   [junit4]   2> 1026183 T2593 oasc.CachingDirectoryFactory.get return new directory for C:\Users\JenkinsSlave\workspace\Lucene-Solr-trunk-Windows\solr\build\solr-core\test\J0\.\org.apache.solr.cloud.CollectionsAPIDistributedZkTest-jetty3-1375526669008\\nodes_used_collection_shard2_replica1\data\
   [junit4]   2> 1026184 T2593 oasc.SolrCore.getNewIndexDir New index directory detected: old=null new=C:\Users\JenkinsSlave\workspace\Lucene-Solr-trunk-Windows\solr\build\solr-core\test\J0\.\org.apache.solr.cloud.CollectionsAPIDistributedZkTest-jetty3-1375526669008\\nodes_used_collection_shard2_replica1\data\index/
   [junit4]   2> 1026184 T2593 oasc.SolrCore.initIndex WARN [nodes_used_collection_shard2_replica1] Solr index directory 'C:\Users\JenkinsSlave\workspace\Lucene-Solr-trunk-Windows\solr\build\solr-core\test\J0\.\org.apache.solr.cloud.CollectionsAPIDistributedZkTest-jetty3-1375526669008\nodes_used_collection_shard2_replica1\data\index' doesn't exist. Creating new index...
   [junit4]   2> 1026184 T2593 oasc.CachingDirectoryFactory.get return new directory for C:\Users\JenkinsSlave\workspace\Lucene-Solr-trunk-Windows\solr\build\solr-core\test\J0\.\org.apache.solr.cloud.CollectionsAPIDistributedZkTest-jetty3-1375526669008\\nodes_used_collection_shard2_replica1\data\index
   [junit4]   2> 1026187 T2547 oass.OpenExchangeRatesOrgProvider.reload Reloading exchange rates from open-exchange-rates.json
   [junit4]   2> 1026188 T2547 oass.OpenExchangeRatesOrgProvider$OpenExchangeRates.<init> WARN Unknown key IMPORTANT NOTE
   [junit4]   2> 1026189 T2547 oass.OpenExchangeRatesOrgProvider$OpenExchangeRates.<init> WARN Expected key, got STRING
   [junit4]   2> 1026189 T2547 oass.OpenExchangeRatesOrgProvider.reload Reloading exchange rates from open-exchange-rates.json
   [junit4]   2> 1026191 T2547 oass.OpenExchangeRatesOrgProvider$OpenExchangeRates.<init> WARN Unknown key IMPORTANT NOTE
   [junit4]   2> 1026191 T2547 oass.OpenExchangeRatesOrgProvider$OpenExchangeRates.<init> WARN Expected key, got STRING
   [junit4]   2> 1026191 T2547 oasc.SolrCore.initDirectoryFactory org.apache.solr.core.MockDirectoryFactory
   [junit4]   2> 1026191 T2547 oasc.SolrCore.<init> [nodes_used_collection_shard1_replica2] Opening new SolrCore at C:\Users\JenkinsSlave\workspace\Lucene-Solr-trunk-Windows\solr\build\solr-core\test\J0\.\org.apache.solr.cloud.CollectionsAPIDistributedZkTest-controljetty-1375526665408\nodes_used_collection_shard1_replica2\, dataDir=C:\Users\JenkinsSlave\workspace\Lucene-Solr-trunk-Windows\solr\build\solr-core\test\J0\.\org.apache.solr.cloud.CollectionsAPIDistributedZkTest-controljetty-1375526665408\\nodes_used_collection_shard1_replica2\data\
   [junit4]   2> 1026191 T2547 oasc.JmxMonitoredMap.<init> JMX monitoring is enabled. Adding Solr mbeans to JMX Server: com.sun.jmx.mbeanserver.JmxMBeanServer@42beea25
   [junit4]   2> 1026193 T2547 oasc.CachingDirectoryFactory.get return new directory for C:\Users\JenkinsSlave\workspace\Lucene-Solr-trunk-Windows\solr\build\solr-core\test\J0\.\org.apache.solr.cloud.CollectionsAPIDistributedZkTest-controljetty-1375526665408\\nodes_used_collection_shard1_replica2\data\
   [junit4]   2> 1026194 T2547 oasc.SolrCore.getNewIndexDir New index directory detected: old=null new=C:\Users\JenkinsSlave\workspace\Lucene-Solr-trunk-Windows\solr\build\solr-core\test\J0\.\org.apache.solr.cloud.CollectionsAPIDistributedZkTest-controljetty-1375526665408\\nodes_used_collection_shard1_replica2\data\index/
   [junit4]   2> 1026194 T2547 oasc.SolrCore.initIndex WARN [nodes_used_collection_shard1_replica2] Solr index directory 'C:\Users\JenkinsSlave\workspace\Lucene-Solr-trunk-Windows\solr\build\solr-core\test\J0\.\org.apache.solr.cloud.CollectionsAPIDistributedZkTest-controljetty-1375526665408\nodes_used_collection_shard1_replica2\data\index' doesn't exist. Creating new index...
   [junit4]   2> 1026194 T2547 oasc.CachingDirectoryFactory.get return new directory for C:\Users\JenkinsSlave\workspace\Lucene-Solr-trunk-Windows\solr\build\solr-core\test\J0\.\org.apache.solr.cloud.CollectionsAPIDistributedZkTest-controljetty-1375526665408\\nodes_used_collection_shard1_replica2\data\index
   [junit4]   2> 1026195 T2575 oass.FileExchangeRateProvider.reload Reloading exchange rates from file currency.xml
   [junit4]   2> 1026204 T2604 oashl.XMLLoader.init xsltCacheLifetimeSeconds=60
   [junit4]   2> 1026205 T2575 oass.FileExchangeRateProvider.reload Reloading exchange rates from file currency.xml
   [junit4]   2> 1026206 T2593 oasc.SolrDeletionPolicy.onCommit SolrDeletionPolicy.onCommit: commits: num=1
   [junit4]   2> 		commit{dir=MockDirWrapper(org.apache.lucene.store.RAMDirectory@1fb2535c lockFactory=org.apache.lucene.store.NativeFSLockFactory@5ce1b341),segFN=segments_1,generation=1}
   [junit4]   2> 1026206 T2593 oasc.SolrDeletionPolicy.updateCommits newest commit generation = 1
   [junit4]   2> 1026207 T2604 oass.SolrIndexSearcher.<init> Opening Searcher@38406f1e main
   [junit4]   2> 1026208 T2604 oasu.CommitTracker.<init> Hard AutoCommit: disabled
   [junit4]   2> 1026209 T2604 oasu.CommitTracker.<init> Soft AutoCommit: disabled
   [junit4]   2> 1026213 T2547 oasc.SolrDeletionPolicy.onCommit SolrDeletionPolicy.onCommit: commits: num=1
   [junit4]   2> 		commit{dir=MockDirWrapper(org.apache.lucene.store.RAMDirectory@2ae4770 lockFactory=org.apache.lucene.store.NativeFSLockFactory@70d05c4c),segFN=segments_1,generation=1}
   [junit4]   2> 1026213 T2547 oasc.SolrDeletionPolicy.updateCommits newest commit generation = 1
   [junit4]   2> 1026218 T2547 oasup.UpdateRequestProcessorChain.init inserting DistributedUpdateProcessorFactory into updateRequestProcessorChain "dedupe"
   [junit4]   2> 1026218 T2547 oasup.UpdateRequestProcessorChain.init inserting DistributedUpdateProcessorFactory into updateRequestProcessorChain "stored_sig"
   [junit4]   2> 1026219 T2547 oasup.UpdateRequestProcessorChain.init inserting DistributedUpdateProcessorFactory into updateRequestProcessorChain "distrib-dup-test-chain-implicit"
   [junit4]   2> 1026219 T2547 oasc.RequestHandlers.initHandlersFromConfig created standard: solr.StandardRequestHandler
   [junit4]   2> 1026219 T2547 oasc.RequestHandlers.initHandlersFromConfig created /get: solr.RealTimeGetHandler
   [junit4]   2> 1026219 T2547 oasc.RequestHandlers.initHandlersFromConfig adding lazy requestHandler: solr.ReplicationHandler
   [junit4]   2> 1026220 T2547 oasc.RequestHandlers.initHandlersFromConfig created /replication: solr.ReplicationHandler
   [junit4]   2> 1026220 T2575 oass.OpenExchangeRatesOrgProvider.reload Reloading exchange rates from open-exchange-rates.json
   [junit4]   2> 1026220 T2547 oasc.RequestHandlers.initHandlersFromConfig created /update: solr.UpdateRequestHandler
   [junit4]   2> 1026221 T2547 oasc.RequestHandlers.initHandlersFromConfig created /admin/: org.apache.solr.handler.admin.AdminHandlers
   [junit4]   2> 1026222 T2575 oass.OpenExchangeRatesOrgProvider$OpenExchangeRates.<init> WARN Unknown key IMPORTANT NOTE
   [junit4]   2> 1026222 T2575 oass.OpenExchangeRatesOrgProvider$OpenExchangeRates.<init> WARN Expected key, got STRING
   [junit4]   2> 1026222 T2575 oass.OpenExchangeRatesOrgProvider.reload Reloading exchange rates from open-exchange-rates.json
   [junit4]   2> 1026225 T2575 oass.OpenExchangeRatesOrgProvider$OpenExchangeRates.<init> WARN Unknown key IMPORTANT NOTE
   [junit4]   2> 1026225 T2575 oass.OpenExchangeRatesOrgProvider$OpenExchangeRates.<init> WARN Expected key, got STRING
   [junit4]   2> 1026225 T2575 oasc.SolrCore.initDirectoryFactory org.apache.solr.core.MockDirectoryFactory
   [junit4]   2> 1026225 T2575 oasc.SolrCore.<init> [nodes_used_collection_shard1_replica1] Opening new SolrCore at C:\Users\JenkinsSlave\workspace\Lucene-Solr-trunk-Windows\solr\build\solr-core\test\J0\.\org.apache.solr.cloud.CollectionsAPIDistributedZkTest-jetty2-1375526667546\nodes_used_collection_shard1_replica1\, dataDir=C:\Users\JenkinsSlave\workspace\Lucene-Solr-trunk-Windows\solr\build\solr-core\test\J0\.\org.apache.solr.cloud.CollectionsAPIDistributedZkTest-jetty2-1375526667546\\nodes_used_collection_shard1_replica1\data\
   [junit4]   2> 1026225 T2575 oasc.JmxMonitoredMap.<init> JMX monitoring is enabled. Adding Solr mbeans to JMX Server: com.sun.jmx.mbeanserver.JmxMBeanServer@42beea25
   [junit4]   2> 1026228 T2593 oasup.UpdateRequestProcessorChain.init inserting DistributedUpdateProcessorFactory into updateRequestProcessorChain "dedupe"
   [junit4]   2> 1026228 T2593 oasup.UpdateRequestProcessorChain.init inserting DistributedUpdateProcessorFactory into updateRequestProcessorChain "stored_sig"
   [junit4]   2> 1026228 T2593 oasup.UpdateRequestProcessorChain.init inserting DistributedUpdateProcessorFactory into updateRequestProcessorChain "distrib-dup-test-chain-implicit"
   [junit4]   2> 1026229 T2593 oasc.RequestHandlers.initHandlersFromConfig created standard: solr.StandardRequestHandler
   [junit4]   2> 1026229 T2593 oasc.RequestHandlers.initHandlersFromConfig created /get: solr.RealTimeGetHandler
   [junit4]   2> 1026229 T2547 oashl.XMLLoader.init xsltCacheLifetimeSeconds=60
   [junit4]   2> 1026230 T2575 oasc.CachingDirectoryFactory.get return new directory for C:\Users\JenkinsSlave\workspace\Lucene-Solr-trunk-Windows\solr\build\solr-core\test\J0\.\org.apache.solr.cloud.CollectionsAPIDistributedZkTest-jetty2-1375526667546\\nodes_used_collection_shard1_replica1\data\
   [junit4]   2> 1026229 T2593 oasc.RequestHandlers.initHandlersFromConfig adding lazy requestHandler: solr.ReplicationHandler
   [junit4]   2> 1026230 T2593 oasc.RequestHandlers.initHandlersFromConfig created /replication: solr.ReplicationHandler
   [junit4]   2> 1026231 T2593 oasc.RequestHandlers.initHandlersFromConfig created /update: solr.UpdateRequestHandler
   [junit4]   2> 1026231 T2593 oasc.RequestHandlers.initHandlersFromConfig created /admin/: org.apache.solr.handler.admin.AdminHandlers
   [junit4]   2> 1026232 T2547 oass.SolrIndexSearcher.<init> Opening Searcher@d08a697 main
   [junit4]   2> 1026232 T2593 oashl.XMLLoader.init xsltCacheLifetimeSeconds=60
   [junit4]   2> 1026234 T2547 oasu.CommitTracker.<init> Hard AutoCommit: disabled
   [junit4]   2> 1026234 T2547 oasu.CommitTracker.<init> Soft AutoCommit: disabled
   [junit4]   2> 1026235 T2575 oasc.SolrCore.getNewIndexDir New index directory detected: old=null new=C:\Users\JenkinsSlave\workspace\Lucene-Solr-trunk-Windows\solr\build\solr-core\test\J0\.\org.apache.solr.cloud.CollectionsAPIDistributedZkTest-jetty2-1375526667546\\nodes_used_collection_shard1_replica1\data\index/
   [junit4]   2> 1026238 T2575 oasc.SolrCore.initIndex WARN [nodes_used_collection_shard1_replica1] Solr index directory 'C:\Users\JenkinsSlave\workspace\Lucene-Solr-trunk-Windows\solr\build\solr-core\test\J0\.\org.apache.solr.cloud.CollectionsAPIDistributedZkTest-jetty2-1375526667546\nodes_used_collection_shard1_replica1\data\index' doesn't exist. Creating new index...
   [junit4]   2> 1026239 T2617 oasc.SolrCore.registerSearcher [nodes_used_collection_shard2_replica2] Registered new searcher Searcher@38406f1e main{StandardDirectoryReader(segments_1:1)}
   [junit4]   2> 1026238 T2547 oasc.CoreContainer.registerCore registering core: nodes_used_collection_shard1_replica2
   [junit4]   2> 1026238 T2604 oasc.CoreContainer.registerCore registering core: nodes_used_collection_shard2_replica2
   [junit4]   2> 1026240 T2604 oasc.ZkController.register Register replica - core:nodes_used_collection_shard2_replica2 address:http://127.0.0.1:57536/o_fl/fx collection:nodes_used_collection shard:shard2
   [junit4]   2> 1026236 T2593 oass.SolrIndexSearcher.<init> Opening Searcher@52215cb5 main
   [junit4]   2> 1026240 T2604 oascsi.HttpClientUtil.createClient Creating new http client, config:maxConnections=10000&maxConnectionsPerHost=20&connTimeout=15000&socketTimeout=30000&retry=false
   [junit4]   2> 1026241 T2593 oasu.CommitTracker.<init> Hard AutoCommit: disabled
   [junit4]   2> 1026241 T2593 oasu.CommitTracker.<init> Soft AutoCommit: disabled
   [junit4]   2> 1026240 T2547 oasc.ZkController.register Register replica - core:nodes_used_collection_shard1_replica2 address:http://127.0.0.1:57497/o_fl/fx collection:nodes_used_collection shard:shard1
   [junit4]   2> 1026246 T2547 oascsi.HttpClientUtil.createClient Creating new http client, config:maxConnections=10000&maxConnectionsPerHost=20&connTimeout=15000&socketTimeout=30000&retry=false
   [junit4]   2> 1026247 T2619 oasc.SolrCore.registerSearcher [nodes_used_collection_shard2_replica1] Registered new searcher Searcher@52215cb5 main{StandardDirectoryReader(segments_1:1)}
   [junit4]   2> 1026239 T2575 oasc.CachingDirectoryFactory.get return new directory for C:\Users\JenkinsSlave\workspace\Lucene-Solr-trunk-Windows\solr\build\solr-core\test\J0\.\org.apache.solr.cloud.CollectionsAPIDistributedZkTest-jetty2-1375526667546\\nodes_used_collection_shard1_replica1\data\index
   [junit4]   2> 1026238 T2618 oasc.SolrCore.registerSearcher [nodes_used_collection_shard1_replica2] Registered new searcher Searcher@d08a697 main{StandardDirectoryReader(segments_1:1)}
   [junit4]   2> 1026250 T2604 oascc.SolrZkClient.makePath makePath: /collections/nodes_used_collection/leader_elect/shard2/election
   [junit4]   2> 1026246 T2593 oasc.CoreContainer.registerCore registering core: nodes_used_collection_shard2_replica1
   [junit4]   2> 1026250 T2593 oasc.ZkController.register Register replica - core:nodes_used_collection_shard2_replica1 address:http://127.0.0.1:57527/o_fl/fx collection:nodes_used_collection shard:shard2
   [junit4]   2> 1026250 T2593 oascsi.HttpClientUtil.createClient Creating new http client, config:maxConnections=10000&maxConnectionsPerHost=20&connTimeout=15000&socketTimeout=30000&retry=false
   [junit4]   2> 1026251 T2575 oasc.SolrDeletionPolicy.onCommit SolrDeletionPolicy.onCommit: commits: num=1
   [junit4]   2> 		commit{dir=MockDirWrapper(org.apache.lucene.store.RAMDirectory@c4d9933 lockFactory=org.apache.lucene.store.NativeFSLockFactory@3d75faaf),segFN=segments_1,generation=1}
   [junit4]   2> 1026252 T2575 oasc.SolrDeletionPolicy.updateCommits newest commit generation = 1
   [junit4]   2> 1026256 T2575 oasup.UpdateRequestProcessorChain.init inserting DistributedUpdateProcessorFactory into updateRequestProcessorChain "dedupe"
   [junit4]   2> 1026257 T2575 oasup.UpdateRequestProcessorChain.init inserting DistributedUpdateProcessorFactory into updateRequestProcessorChain "stored_sig"
   [junit4]   2> 1026250 T2547 oascc.SolrZkClient.makePath makePath: /collections/nodes_used_collection/leader_elect/shard1/election
   [junit4]   2> 1026258 T2575 oasup.UpdateRequestProcessorChain.init inserting DistributedUpdateProcessorFactory into updateRequestProcessorChain "distrib-dup-test-chain-implicit"
   [junit4]   2> 1026258 T2593 oascc.SolrZkClient.makePath makePath: /collections/nodes_used_collection/leader_elect/shard2/election
   [junit4]   2> 1026259 T2575 oasc.RequestHandlers.initHandlersFromConfig created standard: solr.StandardRequestHandler
   [junit4]   2> 1026261 T2575 oasc.RequestHandlers.initHandlersFromConfig created /get: solr.RealTimeGetHandler
   [junit4]   2> 1026262 T2575 oasc.RequestHandlers.initHandlersFromConfig adding lazy requestHandler: solr.ReplicationHandler
   [junit4]   2> 1026262 T2575 oasc.RequestHandlers.initHandlersFromConfig created /replication: solr.ReplicationHandler
   [junit4]   2> 1026262 T2575 oasc.RequestHandlers.initHandlersFromConfig created /update: solr.UpdateRequestHandler
   [junit4]   2> 1026262 T2575 oasc.RequestHandlers.initHandlersFromConfig created /admin/: org.apache.solr.handler.admin.AdminHandlers
   [junit4]   2> 1026273 T2575 oashl.XMLLoader.init xsltCacheLifetimeSeconds=60
   [junit4]   2> 1026281 T2575 oass.SolrIndexSearcher.<init> Opening Searcher@e4fb275 main
   [junit4]   2> 1026284 T2575 oasu.CommitTracker.<init> Hard AutoCommit: disabled
   [junit4]   2> 1026284 T2575 oasu.CommitTracker.<init> Soft AutoCommit: disabled
   [junit4]   2> 1026286 T2547 oasc.ShardLeaderElectionContext.runLeaderProcess Running the leader process for shard shard1
   [junit4]   2> 1026287 T2593 oasc.ShardLeaderElectionContext.runLeaderProcess Running the leader process for shard shard2
   [junit4]   2> 1026287 T2620 oasc.SolrCore.registerSearcher [nodes_used_collection_shard1_replica1] Registered new searcher Searcher@e4fb275 main{StandardDirectoryReader(segments_1:1)}
   [junit4]   2> 1026290 T2575 oasc.CoreContainer.registerCore registering core: nodes_used_collection_shard1_replica1
   [junit4]   2> 1026290 T2575 oasc.ZkController.register Register replica - core:nodes_used_collection_shard1_replica1 address:http://127.0.0.1:57518/o_fl/fx collection:nodes_used_collection shard:shard1
   [junit4]   2> 1026291 T2575 oascsi.HttpClientUtil.createClient Creating new http client, config:maxConnections=10000&maxConnectionsPerHost=20&connTimeout=15000&socketTimeout=30000&retry=false
   [junit4]   2> 1026295 T2547 oasc.ShardLeaderElectionContext.waitForReplicasToComeUp Waiting until we see more replicas up for shard shard1: total=2 found=1 timeoutin=179999
   [junit4]   2> 1026296 T2593 oasc.ShardLeaderElectionContext.waitForReplicasToComeUp Enough replicas found to continue.
   [junit4]   2> 1026296 T2593 oasc.ShardLeaderElectionContext.runLeaderProcess I may be the new leader - try and sync
   [junit4]   2> 1026296 T2593 oasc.SyncStrategy.sync Sync replicas to http://127.0.0.1:57527/o_fl/fx/nodes_used_collection_shard2_replica1/
   [junit4]   2> 1026296 T2593 oasu.PeerSync.sync PeerSync: core=nodes_used_collection_shard2_replica1 url=http://127.0.0.1:57527/o_fl/fx START replicas=[http://127.0.0.1:57536/o_fl/fx/nodes_used_collection_shard2_replica2/] nUpdates=100
   [junit4]   2> 1026297 T2593 oasu.PeerSync.sync Pe

[...truncated too long message...]

ndows\solr\build\solr-core\test\J0\.\org.apache.solr.cloud.CollectionsAPIDistributedZkTest-1375526665233\zookeeper FAILED !!!!!
   [junit4]   2> !!!! WARNING: best effort to remove C:\Users\JenkinsSlave\workspace\Lucene-Solr-trunk-Windows\solr\build\solr-core\test\J0\.\org.apache.solr.cloud.CollectionsAPIDistributedZkTest-1375526665233 FAILED !!!!!
   [junit4]   2> 1188457 T2529 oas.SolrTestCaseJ4.tearDown ###Ending testDistribSearch
   [junit4]   2> 1188459 T2529 oasc.ZkTestServer.send4LetterWord connecting to 127.0.0.1:57490 57490
   [junit4]   2> 1189323 T2611 oascc.ZkStateReader$3.process WARN ZooKeeper watch triggered, but Solr cannot talk to ZK
   [junit4]   2> 1190074 T2611 oascc.ZkStateReader$2.process A cluster state change: WatchedEvent state:SyncConnected type:NodeChildrenChanged path:/live_nodes, has occurred - updating... (live nodes size: 1)
   [junit4]   2> 1190075 T2611 oascc.ZkStateReader$2.process WARN ZooKeeper watch triggered, but Solr cannot talk to ZK
   [junit4]   2> 1190075 T2611 oasc.LeaderElector$1.process WARN  org.apache.zookeeper.KeeperException$SessionExpiredException: KeeperErrorCode = Session expired for /collections/new_implicit_coll_0/leader_elect/c/election
   [junit4]   2> 	at org.apache.zookeeper.KeeperException.create(KeeperException.java:127)
   [junit4]   2> 	at org.apache.zookeeper.KeeperException.create(KeeperException.java:51)
   [junit4]   2> 	at org.apache.zookeeper.ZooKeeper.getChildren(ZooKeeper.java:1468)
   [junit4]   2> 	at org.apache.solr.common.cloud.SolrZkClient$6.execute(SolrZkClient.java:235)
   [junit4]   2> 	at org.apache.solr.common.cloud.SolrZkClient$6.execute(SolrZkClient.java:232)
   [junit4]   2> 	at org.apache.solr.common.cloud.ZkCmdExecutor.retryOperation(ZkCmdExecutor.java:65)
   [junit4]   2> 	at org.apache.solr.common.cloud.SolrZkClient.getChildren(SolrZkClient.java:232)
   [junit4]   2> 	at org.apache.solr.cloud.LeaderElector.checkIfIamLeader(LeaderElector.java:84)
   [junit4]   2> 	at org.apache.solr.cloud.LeaderElector.access$000(LeaderElector.java:55)
   [junit4]   2> 	at org.apache.solr.cloud.LeaderElector$1.process(LeaderElector.java:129)
   [junit4]   2> 	at org.apache.zookeeper.ClientCnxn$EventThread.processEvent(ClientCnxn.java:519)
   [junit4]   2> 	at org.apache.zookeeper.ClientCnxn$EventThread.run(ClientCnxn.java:495)
   [junit4]   2> 
   [junit4]   1> client port:0.0.0.0/0.0.0.0:0
   [junit4]   2> NOTE: reproduce with: ant test  -Dtestcase=CollectionsAPIDistributedZkTest -Dtests.method=testDistribSearch -Dtests.seed=792E27CA1FCC5944 -Dtests.slow=true -Dtests.locale=de -Dtests.timezone=Brazil/Acre -Dtests.file.encoding=ISO-8859-1
   [junit4] ERROR    174s | CollectionsAPIDistributedZkTest.testDistribSearch <<<
   [junit4]    > Throwable #1: org.apache.solr.client.solrj.SolrServerException: Server refused connection at: http://127.0.0.1:57518/o_fl/fx
   [junit4]    > 	at __randomizedtesting.SeedInfo.seed([792E27CA1FCC5944:F8C8A9D268933978]:0)
   [junit4]    > 	at org.apache.solr.client.solrj.impl.HttpSolrServer.request(HttpSolrServer.java:428)
   [junit4]    > 	at org.apache.solr.client.solrj.impl.HttpSolrServer.request(HttpSolrServer.java:180)
   [junit4]    > 	at org.apache.solr.cloud.AbstractFullDistribZkTestBase.createCollection(AbstractFullDistribZkTestBase.java:1535)
   [junit4]    > 	at org.apache.solr.cloud.CollectionsAPIDistributedZkTest.testCustomCollectionsAPI(CollectionsAPIDistributedZkTest.java:677)
   [junit4]    > 	at org.apache.solr.cloud.CollectionsAPIDistributedZkTest.doTest(CollectionsAPIDistributedZkTest.java:159)
   [junit4]    > 	at org.apache.solr.BaseDistributedSearchTestCase.testDistribSearch(BaseDistributedSearchTestCase.java:835)
   [junit4]    > 	at java.lang.Thread.run(Thread.java:724)
   [junit4]    > Caused by: org.apache.http.conn.HttpHostConnectException: Connection to http://127.0.0.1:57518 refused
   [junit4]    > 	at org.apache.http.impl.conn.DefaultClientConnectionOperator.openConnection(DefaultClientConnectionOperator.java:190)
   [junit4]    > 	at org.apache.http.impl.conn.ManagedClientConnectionImpl.open(ManagedClientConnectionImpl.java:294)
   [junit4]    > 	at org.apache.http.impl.client.DefaultRequestDirector.tryConnect(DefaultRequestDirector.java:645)
   [junit4]    > 	at org.apache.http.impl.client.DefaultRequestDirector.execute(DefaultRequestDirector.java:480)
   [junit4]    > 	at org.apache.http.impl.client.AbstractHttpClient.execute(AbstractHttpClient.java:906)
   [junit4]    > 	at org.apache.http.impl.client.AbstractHttpClient.execute(AbstractHttpClient.java:805)
   [junit4]    > 	at org.apache.http.impl.client.AbstractHttpClient.execute(AbstractHttpClient.java:784)
   [junit4]    > 	at org.apache.solr.client.solrj.impl.HttpSolrServer.request(HttpSolrServer.java:365)
   [junit4]    > 	... 45 more
   [junit4]    > Caused by: java.net.ConnectException: Connection refused: connect
   [junit4]    > 	at java.net.DualStackPlainSocketImpl.waitForConnect(Native Method)
   [junit4]    > 	at java.net.DualStackPlainSocketImpl.socketConnect(DualStackPlainSocketImpl.java:85)
   [junit4]    > 	at java.net.AbstractPlainSocketImpl.doConnect(AbstractPlainSocketImpl.java:339)
   [junit4]    > 	at java.net.AbstractPlainSocketImpl.connectToAddress(AbstractPlainSocketImpl.java:200)
   [junit4]    > 	at java.net.AbstractPlainSocketImpl.connect(AbstractPlainSocketImpl.java:182)
   [junit4]    > 	at java.net.PlainSocketImpl.connect(PlainSocketImpl.java:172)
   [junit4]    > 	at java.net.SocksSocketImpl.connect(SocksSocketImpl.java:392)
   [junit4]    > 	at java.net.Socket.connect(Socket.java:579)
   [junit4]    > 	at org.apache.http.conn.scheme.PlainSocketFactory.connectSocket(PlainSocketFactory.java:127)
   [junit4]    > 	at org.apache.http.impl.conn.DefaultClientConnectionOperator.openConnection(DefaultClientConnectionOperator.java:180)
   [junit4]    > 	... 52 more
   [junit4]   2> 1190101 T2529 oas.SolrTestCaseJ4.deleteCore ###deleteCore
   [junit4]   2> NOTE: test params are: codec=CheapBastard, sim=DefaultSimilarity, locale=de, timezone=Brazil/Acre
   [junit4]   2> NOTE: Windows 7 6.1 amd64/Oracle Corporation 1.7.0_25 (64-bit)/cpus=2,threads=2,free=145549376,total=270802944
   [junit4]   2> NOTE: All tests run in this JVM: [MoreLikeThisHandlerTest, TestSolrXMLSerializer, RequiredFieldsTest, WordBreakSolrSpellCheckerTest, QueryEqualityTest, TestBM25SimilarityFactory, TestSolrQueryParserResource, BadIndexSchemaTest, TestSolrQueryParser, LegacyHTMLStripCharFilterTest, TestFastOutputStream, TimeZoneUtilsTest, SliceStateTest, MultiTermTest, UnloadDistributedZkTest, DOMUtilTest, ClusterStateUpdateTest, SortByFunctionTest, TestSolrDeletionPolicy1, TestInfoStreamLogging, TestIndexingPerformance, TestFiltering, SystemInfoHandlerTest, TestReloadAndDeleteDocs, TestCloudManagedSchemaAddField, FullSolrCloudDistribCmdsTest, CopyFieldTest, CoreAdminCreateDiscoverTest, TestWriterPerf, TestDynamicFieldResource, TestSystemIdResolver, TestDocSet, TestArbitraryIndexDir, TermVectorComponentDistributedTest, ZkCLITest, TestIBSimilarityFactory, TestSearchPerf, IndexReaderFactoryTest, DateMathParserTest, TestFastWriter, TestConfig, TestFaceting, DocumentBuilderTest, TestSchemaNameResource, ResourceLoaderTest, ShowFileRequestHandlerTest, TestSerializedLuceneMatchVersion, CurrencyFieldOpenExchangeTest, TestSchemaSimilarityResource, HdfsBasicDistributedZkTest, TestCharFilters, TestValueSourceCache, ChaosMonkeyNothingIsSafeTest, TestCodecSupport, TestFastLRUCache, DocValuesMultiTest, CurrencyFieldXmlFileTest, AddSchemaFieldsUpdateProcessorFactoryTest, SolrIndexSplitterTest, TestPropInjectDefaults, TestSolr4Spatial, ExternalFileFieldSortTest, JsonLoaderTest, DocumentAnalysisRequestHandlerTest, TestJmxMonitoredMap, TestSuggestSpellingConverter, DirectSolrConnectionTest, DistributedTermsComponentTest, ChaosMonkeySafeLeaderTest, CoreContainerCoreInitFailuresTest, TestRecovery, AliasIntegrationTest, FieldMutatingUpdateProcessorTest, FastVectorHighlighterTest, AutoCommitTest, MinimalSchemaTest, TestCopyFieldCollectionResource, TestCoreContainer, TestReversedWildcardFilterFactory, IndexSchemaTest, TestPartialUpdateDeduplication, RAMDirectoryFactoryTest, TestPHPSerializedResponseWriter, TestPropInject, TestCloudManagedSchema, QueryResultKeyTest, BadCopyFieldTest, SearchHandlerTest, TestDistributedGrouping, DisMaxRequestHandlerTest, TestLuceneMatchVersion, TestRealTimeGet, SuggesterWFSTTest, TestQuerySenderListener, SOLR749Test, TestElisionMultitermQuery, XsltUpdateRequestHandlerTest, TestReload, CollectionsAPIDistributedZkTest]
   [junit4] Completed in 174.40s, 1 test, 1 error <<< FAILURES!

[...truncated 691 lines...]
BUILD FAILED
C:\Users\JenkinsSlave\workspace\Lucene-Solr-trunk-Windows\build.xml:389: The following error occurred while executing this line:
C:\Users\JenkinsSlave\workspace\Lucene-Solr-trunk-Windows\build.xml:369: The following error occurred while executing this line:
C:\Users\JenkinsSlave\workspace\Lucene-Solr-trunk-Windows\build.xml:39: The following error occurred while executing this line:
C:\Users\JenkinsSlave\workspace\Lucene-Solr-trunk-Windows\solr\build.xml:181: The following error occurred while executing this line:
C:\Users\JenkinsSlave\workspace\Lucene-Solr-trunk-Windows\solr\common-build.xml:449: The following error occurred while executing this line:
C:\Users\JenkinsSlave\workspace\Lucene-Solr-trunk-Windows\lucene\common-build.xml:1230: The following error occurred while executing this line:
C:\Users\JenkinsSlave\workspace\Lucene-Solr-trunk-Windows\lucene\common-build.xml:873: There were test failures: 320 suites, 1347 tests, 1 error, 39 ignored (11 assumptions)

Total time: 80 minutes 58 seconds
Build step 'Invoke Ant' marked build as failure
Description set: Java: 64bit/jdk1.7.0_25 -XX:+UseCompressedOops -XX:+UseConcMarkSweepGC
Archiving artifacts
Recording test results
Email was triggered for: Failure
Sending email for trigger: Failure



Mime
View raw message