lucene-dev mailing list archives

Site index · List index
Message view « Date » · « Thread »
Top « Date » · « Thread »
From Policeman Jenkins Server <jenk...@thetaphi.de>
Subject [JENKINS] Lucene-Solr-4.x-Linux (32bit/ibm-j9-jdk7) - Build # 6762 - Failure!
Date Fri, 02 Aug 2013 07:10:17 GMT
Build: http://jenkins.thetaphi.de/job/Lucene-Solr-4.x-Linux/6762/
Java: 32bit/ibm-j9-jdk7 -Xjit:exclude={org/apache/lucene/util/fst/FST.pack(IIF)Lorg/apache/lucene/util/fst/FST;}

3 tests failed.
REGRESSION:  org.apache.solr.update.HardAutoCommitTest.testCommitWithin

Error Message:
Exception during query

Stack Trace:
java.lang.RuntimeException: Exception during query
	at __randomizedtesting.SeedInfo.seed([1DF98AA475E602A1:A72BE5DCF6C8ECB4]:0)
	at org.apache.solr.SolrTestCaseJ4.assertQ(SolrTestCaseJ4.java:610)
	at org.apache.solr.update.HardAutoCommitTest.testCommitWithin(HardAutoCommitTest.java:79)
	at sun.reflect.NativeMethodAccessorImpl.invoke0(Native Method)
	at sun.reflect.NativeMethodAccessorImpl.invoke(NativeMethodAccessorImpl.java:88)
	at sun.reflect.DelegatingMethodAccessorImpl.invoke(DelegatingMethodAccessorImpl.java:55)
	at java.lang.reflect.Method.invoke(Method.java:613)
	at com.carrotsearch.randomizedtesting.RandomizedRunner.invoke(RandomizedRunner.java:1559)
	at com.carrotsearch.randomizedtesting.RandomizedRunner.access$600(RandomizedRunner.java:79)
	at com.carrotsearch.randomizedtesting.RandomizedRunner$6.evaluate(RandomizedRunner.java:737)
	at com.carrotsearch.randomizedtesting.RandomizedRunner$7.evaluate(RandomizedRunner.java:773)
	at com.carrotsearch.randomizedtesting.RandomizedRunner$8.evaluate(RandomizedRunner.java:787)
	at com.carrotsearch.randomizedtesting.rules.SystemPropertiesRestoreRule$1.evaluate(SystemPropertiesRestoreRule.java:53)
	at org.apache.lucene.util.TestRuleSetupTeardownChained$1.evaluate(TestRuleSetupTeardownChained.java:50)
	at org.apache.lucene.util.TestRuleFieldCacheSanity$1.evaluate(TestRuleFieldCacheSanity.java:51)
	at org.apache.lucene.util.AbstractBeforeAfterRule$1.evaluate(AbstractBeforeAfterRule.java:46)
	at com.carrotsearch.randomizedtesting.rules.SystemPropertiesInvariantRule$1.evaluate(SystemPropertiesInvariantRule.java:55)
	at org.apache.lucene.util.TestRuleThreadAndTestName$1.evaluate(TestRuleThreadAndTestName.java:49)
	at org.apache.lucene.util.TestRuleIgnoreAfterMaxFailures$1.evaluate(TestRuleIgnoreAfterMaxFailures.java:70)
	at org.apache.lucene.util.TestRuleMarkFailure$1.evaluate(TestRuleMarkFailure.java:48)
	at com.carrotsearch.randomizedtesting.rules.StatementAdapter.evaluate(StatementAdapter.java:36)
	at com.carrotsearch.randomizedtesting.ThreadLeakControl$StatementRunner.run(ThreadLeakControl.java:358)
	at com.carrotsearch.randomizedtesting.ThreadLeakControl.forkTimeoutingTask(ThreadLeakControl.java:782)
	at com.carrotsearch.randomizedtesting.ThreadLeakControl$3.evaluate(ThreadLeakControl.java:442)
	at com.carrotsearch.randomizedtesting.RandomizedRunner.runSingleTest(RandomizedRunner.java:746)
	at com.carrotsearch.randomizedtesting.RandomizedRunner$3.evaluate(RandomizedRunner.java:648)
	at com.carrotsearch.randomizedtesting.RandomizedRunner$4.evaluate(RandomizedRunner.java:682)
	at com.carrotsearch.randomizedtesting.RandomizedRunner$5.evaluate(RandomizedRunner.java:693)
	at com.carrotsearch.randomizedtesting.rules.StatementAdapter.evaluate(StatementAdapter.java:36)
	at com.carrotsearch.randomizedtesting.rules.SystemPropertiesRestoreRule$1.evaluate(SystemPropertiesRestoreRule.java:53)
	at org.apache.lucene.util.AbstractBeforeAfterRule$1.evaluate(AbstractBeforeAfterRule.java:46)
	at org.apache.lucene.util.TestRuleStoreClassName$1.evaluate(TestRuleStoreClassName.java:42)
	at com.carrotsearch.randomizedtesting.rules.SystemPropertiesInvariantRule$1.evaluate(SystemPropertiesInvariantRule.java:55)
	at com.carrotsearch.randomizedtesting.rules.NoShadowingOrOverridesOnMethodsRule$1.evaluate(NoShadowingOrOverridesOnMethodsRule.java:39)
	at com.carrotsearch.randomizedtesting.rules.NoShadowingOrOverridesOnMethodsRule$1.evaluate(NoShadowingOrOverridesOnMethodsRule.java:39)
	at com.carrotsearch.randomizedtesting.rules.StatementAdapter.evaluate(StatementAdapter.java:36)
	at org.apache.lucene.util.TestRuleAssertionsRequired$1.evaluate(TestRuleAssertionsRequired.java:43)
	at org.apache.lucene.util.TestRuleMarkFailure$1.evaluate(TestRuleMarkFailure.java:48)
	at org.apache.lucene.util.TestRuleIgnoreAfterMaxFailures$1.evaluate(TestRuleIgnoreAfterMaxFailures.java:70)
	at org.apache.lucene.util.TestRuleIgnoreTestSuites$1.evaluate(TestRuleIgnoreTestSuites.java:55)
	at com.carrotsearch.randomizedtesting.rules.StatementAdapter.evaluate(StatementAdapter.java:36)
	at com.carrotsearch.randomizedtesting.ThreadLeakControl$StatementRunner.run(ThreadLeakControl.java:358)
	at java.lang.Thread.run(Thread.java:780)
Caused by: java.lang.RuntimeException: REQUEST FAILED: xpath=//result[@numFound=0]
	xml response was: <?xml version="1.0" encoding="UTF-8"?>
<response>
<lst name="responseHeader"><int name="status">0</int><int name="QTime">2499</int></lst><result name="response" numFound="1" start="0"><doc><int name="id">529</int><int name="range_facet_si">529</int><arr name="range_facet_l"><long>529</long></arr><arr name="range_facet_sl"><long>529</long></arr><arr name="field_t"><str>what's inside?</str></arr><arr name="subject"><str>info</str></arr><long name="_version_">1442239167073353728</long><int name="intDefault">42</int><date name="timestamp">2013-08-02T06:54:11.753Z</date><arr name="multiDefault"><str>muLti-Default</str></arr></doc></result>
</response>

	request was:q=id:529&start=0&qt=standard&version=2.2&rows=20
	at org.apache.solr.SolrTestCaseJ4.assertQ(SolrTestCaseJ4.java:603)
	... 41 more


FAILED:  org.apache.solr.cloud.BasicDistributedZk2Test.testDistribSearch

Error Message:
Server at http://127.0.0.1:60274/eu/onenodecollectioncore returned non ok status:404, message:Can not find: /eu/onenodecollectioncore/update

Stack Trace:
org.apache.solr.client.solrj.impl.HttpSolrServer$RemoteSolrException: Server at http://127.0.0.1:60274/eu/onenodecollectioncore returned non ok status:404, message:Can not find: /eu/onenodecollectioncore/update
	at __randomizedtesting.SeedInfo.seed([1DF98AA475E602A1:9C1F04BC02B9629D]:0)
	at org.apache.solr.client.solrj.impl.HttpSolrServer.request(HttpSolrServer.java:385)
	at org.apache.solr.client.solrj.impl.HttpSolrServer.request(HttpSolrServer.java:180)
	at org.apache.solr.client.solrj.request.AbstractUpdateRequest.process(AbstractUpdateRequest.java:117)
	at org.apache.solr.client.solrj.SolrServer.add(SolrServer.java:116)
	at org.apache.solr.client.solrj.SolrServer.add(SolrServer.java:102)
	at org.apache.solr.cloud.BasicDistributedZk2Test.testNodeWithoutCollectionForwarding(BasicDistributedZk2Test.java:196)
	at org.apache.solr.cloud.BasicDistributedZk2Test.doTest(BasicDistributedZk2Test.java:88)
	at org.apache.solr.BaseDistributedSearchTestCase.testDistribSearch(BaseDistributedSearchTestCase.java:835)
	at sun.reflect.NativeMethodAccessorImpl.invoke0(Native Method)
	at sun.reflect.NativeMethodAccessorImpl.invoke(NativeMethodAccessorImpl.java:88)
	at sun.reflect.DelegatingMethodAccessorImpl.invoke(DelegatingMethodAccessorImpl.java:55)
	at java.lang.reflect.Method.invoke(Method.java:613)
	at com.carrotsearch.randomizedtesting.RandomizedRunner.invoke(RandomizedRunner.java:1559)
	at com.carrotsearch.randomizedtesting.RandomizedRunner.access$600(RandomizedRunner.java:79)
	at com.carrotsearch.randomizedtesting.RandomizedRunner$6.evaluate(RandomizedRunner.java:737)
	at com.carrotsearch.randomizedtesting.RandomizedRunner$7.evaluate(RandomizedRunner.java:773)
	at com.carrotsearch.randomizedtesting.RandomizedRunner$8.evaluate(RandomizedRunner.java:787)
	at com.carrotsearch.randomizedtesting.rules.SystemPropertiesRestoreRule$1.evaluate(SystemPropertiesRestoreRule.java:53)
	at org.apache.lucene.util.TestRuleSetupTeardownChained$1.evaluate(TestRuleSetupTeardownChained.java:50)
	at org.apache.lucene.util.TestRuleFieldCacheSanity$1.evaluate(TestRuleFieldCacheSanity.java:51)
	at org.apache.lucene.util.AbstractBeforeAfterRule$1.evaluate(AbstractBeforeAfterRule.java:46)
	at com.carrotsearch.randomizedtesting.rules.SystemPropertiesInvariantRule$1.evaluate(SystemPropertiesInvariantRule.java:55)
	at org.apache.lucene.util.TestRuleThreadAndTestName$1.evaluate(TestRuleThreadAndTestName.java:49)
	at org.apache.lucene.util.TestRuleIgnoreAfterMaxFailures$1.evaluate(TestRuleIgnoreAfterMaxFailures.java:70)
	at org.apache.lucene.util.TestRuleMarkFailure$1.evaluate(TestRuleMarkFailure.java:48)
	at com.carrotsearch.randomizedtesting.rules.StatementAdapter.evaluate(StatementAdapter.java:36)
	at com.carrotsearch.randomizedtesting.ThreadLeakControl$StatementRunner.run(ThreadLeakControl.java:358)
	at com.carrotsearch.randomizedtesting.ThreadLeakControl.forkTimeoutingTask(ThreadLeakControl.java:782)
	at com.carrotsearch.randomizedtesting.ThreadLeakControl$3.evaluate(ThreadLeakControl.java:442)
	at com.carrotsearch.randomizedtesting.RandomizedRunner.runSingleTest(RandomizedRunner.java:746)
	at com.carrotsearch.randomizedtesting.RandomizedRunner$3.evaluate(RandomizedRunner.java:648)
	at com.carrotsearch.randomizedtesting.RandomizedRunner$4.evaluate(RandomizedRunner.java:682)
	at com.carrotsearch.randomizedtesting.RandomizedRunner$5.evaluate(RandomizedRunner.java:693)
	at com.carrotsearch.randomizedtesting.rules.StatementAdapter.evaluate(StatementAdapter.java:36)
	at com.carrotsearch.randomizedtesting.rules.SystemPropertiesRestoreRule$1.evaluate(SystemPropertiesRestoreRule.java:53)
	at org.apache.lucene.util.AbstractBeforeAfterRule$1.evaluate(AbstractBeforeAfterRule.java:46)
	at org.apache.lucene.util.TestRuleStoreClassName$1.evaluate(TestRuleStoreClassName.java:42)
	at com.carrotsearch.randomizedtesting.rules.SystemPropertiesInvariantRule$1.evaluate(SystemPropertiesInvariantRule.java:55)
	at com.carrotsearch.randomizedtesting.rules.NoShadowingOrOverridesOnMethodsRule$1.evaluate(NoShadowingOrOverridesOnMethodsRule.java:39)
	at com.carrotsearch.randomizedtesting.rules.NoShadowingOrOverridesOnMethodsRule$1.evaluate(NoShadowingOrOverridesOnMethodsRule.java:39)
	at com.carrotsearch.randomizedtesting.rules.StatementAdapter.evaluate(StatementAdapter.java:36)
	at org.apache.lucene.util.TestRuleAssertionsRequired$1.evaluate(TestRuleAssertionsRequired.java:43)
	at org.apache.lucene.util.TestRuleMarkFailure$1.evaluate(TestRuleMarkFailure.java:48)
	at org.apache.lucene.util.TestRuleIgnoreAfterMaxFailures$1.evaluate(TestRuleIgnoreAfterMaxFailures.java:70)
	at org.apache.lucene.util.TestRuleIgnoreTestSuites$1.evaluate(TestRuleIgnoreTestSuites.java:55)
	at com.carrotsearch.randomizedtesting.rules.StatementAdapter.evaluate(StatementAdapter.java:36)
	at com.carrotsearch.randomizedtesting.ThreadLeakControl$StatementRunner.run(ThreadLeakControl.java:358)
	at java.lang.Thread.run(Thread.java:780)


FAILED:  org.apache.solr.cloud.CollectionsAPIDistributedZkTest.testDistribSearch

Error Message:
Server refused connection at: http://127.0.0.1:35559

Stack Trace:
org.apache.solr.client.solrj.SolrServerException: Server refused connection at: http://127.0.0.1:35559
	at __randomizedtesting.SeedInfo.seed([1DF98AA475E602A1:9C1F04BC02B9629D]:0)
	at org.apache.solr.client.solrj.impl.HttpSolrServer.request(HttpSolrServer.java:428)
	at org.apache.solr.client.solrj.impl.HttpSolrServer.request(HttpSolrServer.java:180)
	at org.apache.solr.cloud.CollectionsAPIDistributedZkTest.testCustomCollectionsAPI(CollectionsAPIDistributedZkTest.java:764)
	at org.apache.solr.cloud.CollectionsAPIDistributedZkTest.doTest(CollectionsAPIDistributedZkTest.java:159)
	at org.apache.solr.BaseDistributedSearchTestCase.testDistribSearch(BaseDistributedSearchTestCase.java:835)
	at sun.reflect.NativeMethodAccessorImpl.invoke0(Native Method)
	at sun.reflect.NativeMethodAccessorImpl.invoke(NativeMethodAccessorImpl.java:88)
	at sun.reflect.DelegatingMethodAccessorImpl.invoke(DelegatingMethodAccessorImpl.java:55)
	at java.lang.reflect.Method.invoke(Method.java:613)
	at com.carrotsearch.randomizedtesting.RandomizedRunner.invoke(RandomizedRunner.java:1559)
	at com.carrotsearch.randomizedtesting.RandomizedRunner.access$600(RandomizedRunner.java:79)
	at com.carrotsearch.randomizedtesting.RandomizedRunner$6.evaluate(RandomizedRunner.java:737)
	at com.carrotsearch.randomizedtesting.RandomizedRunner$7.evaluate(RandomizedRunner.java:773)
	at com.carrotsearch.randomizedtesting.RandomizedRunner$8.evaluate(RandomizedRunner.java:787)
	at com.carrotsearch.randomizedtesting.rules.SystemPropertiesRestoreRule$1.evaluate(SystemPropertiesRestoreRule.java:53)
	at org.apache.lucene.util.TestRuleSetupTeardownChained$1.evaluate(TestRuleSetupTeardownChained.java:50)
	at org.apache.lucene.util.TestRuleFieldCacheSanity$1.evaluate(TestRuleFieldCacheSanity.java:51)
	at org.apache.lucene.util.AbstractBeforeAfterRule$1.evaluate(AbstractBeforeAfterRule.java:46)
	at com.carrotsearch.randomizedtesting.rules.SystemPropertiesInvariantRule$1.evaluate(SystemPropertiesInvariantRule.java:55)
	at org.apache.lucene.util.TestRuleThreadAndTestName$1.evaluate(TestRuleThreadAndTestName.java:49)
	at org.apache.lucene.util.TestRuleIgnoreAfterMaxFailures$1.evaluate(TestRuleIgnoreAfterMaxFailures.java:70)
	at org.apache.lucene.util.TestRuleMarkFailure$1.evaluate(TestRuleMarkFailure.java:48)
	at com.carrotsearch.randomizedtesting.rules.StatementAdapter.evaluate(StatementAdapter.java:36)
	at com.carrotsearch.randomizedtesting.ThreadLeakControl$StatementRunner.run(ThreadLeakControl.java:358)
	at com.carrotsearch.randomizedtesting.ThreadLeakControl.forkTimeoutingTask(ThreadLeakControl.java:782)
	at com.carrotsearch.randomizedtesting.ThreadLeakControl$3.evaluate(ThreadLeakControl.java:442)
	at com.carrotsearch.randomizedtesting.RandomizedRunner.runSingleTest(RandomizedRunner.java:746)
	at com.carrotsearch.randomizedtesting.RandomizedRunner$3.evaluate(RandomizedRunner.java:648)
	at com.carrotsearch.randomizedtesting.RandomizedRunner$4.evaluate(RandomizedRunner.java:682)
	at com.carrotsearch.randomizedtesting.RandomizedRunner$5.evaluate(RandomizedRunner.java:693)
	at com.carrotsearch.randomizedtesting.rules.StatementAdapter.evaluate(StatementAdapter.java:36)
	at com.carrotsearch.randomizedtesting.rules.SystemPropertiesRestoreRule$1.evaluate(SystemPropertiesRestoreRule.java:53)
	at org.apache.lucene.util.AbstractBeforeAfterRule$1.evaluate(AbstractBeforeAfterRule.java:46)
	at org.apache.lucene.util.TestRuleStoreClassName$1.evaluate(TestRuleStoreClassName.java:42)
	at com.carrotsearch.randomizedtesting.rules.SystemPropertiesInvariantRule$1.evaluate(SystemPropertiesInvariantRule.java:55)
	at com.carrotsearch.randomizedtesting.rules.NoShadowingOrOverridesOnMethodsRule$1.evaluate(NoShadowingOrOverridesOnMethodsRule.java:39)
	at com.carrotsearch.randomizedtesting.rules.NoShadowingOrOverridesOnMethodsRule$1.evaluate(NoShadowingOrOverridesOnMethodsRule.java:39)
	at com.carrotsearch.randomizedtesting.rules.StatementAdapter.evaluate(StatementAdapter.java:36)
	at org.apache.lucene.util.TestRuleAssertionsRequired$1.evaluate(TestRuleAssertionsRequired.java:43)
	at org.apache.lucene.util.TestRuleMarkFailure$1.evaluate(TestRuleMarkFailure.java:48)
	at org.apache.lucene.util.TestRuleIgnoreAfterMaxFailures$1.evaluate(TestRuleIgnoreAfterMaxFailures.java:70)
	at org.apache.lucene.util.TestRuleIgnoreTestSuites$1.evaluate(TestRuleIgnoreTestSuites.java:55)
	at com.carrotsearch.randomizedtesting.rules.StatementAdapter.evaluate(StatementAdapter.java:36)
	at com.carrotsearch.randomizedtesting.ThreadLeakControl$StatementRunner.run(ThreadLeakControl.java:358)
	at java.lang.Thread.run(Thread.java:780)
Caused by: org.apache.http.conn.HttpHostConnectException: Connection to http://127.0.0.1:35559 refused
	at org.apache.http.impl.conn.DefaultClientConnectionOperator.openConnection(DefaultClientConnectionOperator.java:190)
	at org.apache.http.impl.conn.ManagedClientConnectionImpl.open(ManagedClientConnectionImpl.java:294)
	at org.apache.http.impl.client.DefaultRequestDirector.tryConnect(DefaultRequestDirector.java:645)
	at org.apache.http.impl.client.DefaultRequestDirector.execute(DefaultRequestDirector.java:480)
	at org.apache.http.impl.client.AbstractHttpClient.execute(AbstractHttpClient.java:906)
	at org.apache.http.impl.client.AbstractHttpClient.execute(AbstractHttpClient.java:805)
	at org.apache.http.impl.client.AbstractHttpClient.execute(AbstractHttpClient.java:784)
	at org.apache.solr.client.solrj.impl.HttpSolrServer.request(HttpSolrServer.java:365)
	... 44 more
Caused by: java.net.ConnectException: Connection refused
	at java.net.AbstractPlainSocketImpl.doConnect(AbstractPlainSocketImpl.java:369)
	at java.net.AbstractPlainSocketImpl.connectToAddress(AbstractPlainSocketImpl.java:230)
	at java.net.AbstractPlainSocketImpl.connect(AbstractPlainSocketImpl.java:212)
	at java.net.SocksSocketImpl.connect(SocksSocketImpl.java:402)
	at java.net.Socket.connect(Socket.java:590)
	at org.apache.http.conn.scheme.PlainSocketFactory.connectSocket(PlainSocketFactory.java:127)
	at org.apache.http.impl.conn.DefaultClientConnectionOperator.openConnection(DefaultClientConnectionOperator.java:180)
	... 51 more




Build Log:
[...truncated 9702 lines...]
   [junit4] Suite: org.apache.solr.cloud.BasicDistributedZk2Test
   [junit4]   2> 394327 T1089 oas.BaseDistributedSearchTestCase.initHostContext Setting hostContext system property: /eu/
   [junit4]   2> 394332 T1089 oas.SolrTestCaseJ4.setUp ###Starting testDistribSearch
   [junit4]   2> Creating dataDir: /mnt/ssd/jenkins/workspace/Lucene-Solr-4.x-Linux/solr/build/solr-core/test/J1/./solrtest-BasicDistributedZk2Test-1375426420346
   [junit4]   2> 394333 T1089 oasc.ZkTestServer.run STARTING ZK TEST SERVER
   [junit4]   2> 394333 T1090 oasc.ZkTestServer$ZKServerMain.runFromConfig Starting server
   [junit4]   2> 394433 T1089 oasc.ZkTestServer.run start zk server on port:36357
   [junit4]   2> 394435 T1089 oascc.ConnectionManager.waitForConnected Waiting for client to connect to ZooKeeper
   [junit4]   2> 394553 T1096 oascc.ConnectionManager.process Watcher org.apache.solr.common.cloud.ConnectionManager@64bd129c name:ZooKeeperConnection Watcher:127.0.0.1:36357 got event WatchedEvent state:SyncConnected type:None path:null path:null type:None
   [junit4]   2> 394553 T1089 oascc.ConnectionManager.waitForConnected Client is connected to ZooKeeper
   [junit4]   2> 394554 T1089 oascc.SolrZkClient.makePath makePath: /solr
   [junit4]   2> 394558 T1089 oascc.ConnectionManager.waitForConnected Waiting for client to connect to ZooKeeper
   [junit4]   2> 394560 T1098 oascc.ConnectionManager.process Watcher org.apache.solr.common.cloud.ConnectionManager@a526398f name:ZooKeeperConnection Watcher:127.0.0.1:36357/solr got event WatchedEvent state:SyncConnected type:None path:null path:null type:None
   [junit4]   2> 394560 T1089 oascc.ConnectionManager.waitForConnected Client is connected to ZooKeeper
   [junit4]   2> 394561 T1089 oascc.SolrZkClient.makePath makePath: /collections/collection1
   [junit4]   2> 394565 T1089 oascc.SolrZkClient.makePath makePath: /collections/collection1/shards
   [junit4]   2> 394568 T1089 oascc.SolrZkClient.makePath makePath: /collections/control_collection
   [junit4]   2> 394570 T1089 oascc.SolrZkClient.makePath makePath: /collections/control_collection/shards
   [junit4]   2> 394574 T1089 oasc.AbstractZkTestCase.putConfig put /mnt/ssd/jenkins/workspace/Lucene-Solr-4.x-Linux/solr/build/solr-core/test-files/solr/collection1/conf/solrconfig-tlog.xml to /configs/conf1/solrconfig.xml
   [junit4]   2> 394575 T1089 oascc.SolrZkClient.makePath makePath: /configs/conf1/solrconfig.xml
   [junit4]   2> 394580 T1089 oasc.AbstractZkTestCase.putConfig put /mnt/ssd/jenkins/workspace/Lucene-Solr-4.x-Linux/solr/build/solr-core/test-files/solr/collection1/conf/schema.xml to /configs/conf1/schema.xml
   [junit4]   2> 394581 T1089 oascc.SolrZkClient.makePath makePath: /configs/conf1/schema.xml
   [junit4]   2> 394585 T1089 oasc.AbstractZkTestCase.putConfig put /mnt/ssd/jenkins/workspace/Lucene-Solr-4.x-Linux/solr/build/solr-core/test-files/solr/collection1/conf/stopwords.txt to /configs/conf1/stopwords.txt
   [junit4]   2> 394586 T1089 oascc.SolrZkClient.makePath makePath: /configs/conf1/stopwords.txt
   [junit4]   2> 394588 T1089 oasc.AbstractZkTestCase.putConfig put /mnt/ssd/jenkins/workspace/Lucene-Solr-4.x-Linux/solr/build/solr-core/test-files/solr/collection1/conf/protwords.txt to /configs/conf1/protwords.txt
   [junit4]   2> 394589 T1089 oascc.SolrZkClient.makePath makePath: /configs/conf1/protwords.txt
   [junit4]   2> 394592 T1089 oasc.AbstractZkTestCase.putConfig put /mnt/ssd/jenkins/workspace/Lucene-Solr-4.x-Linux/solr/build/solr-core/test-files/solr/collection1/conf/currency.xml to /configs/conf1/currency.xml
   [junit4]   2> 394593 T1089 oascc.SolrZkClient.makePath makePath: /configs/conf1/currency.xml
   [junit4]   2> 394596 T1089 oasc.AbstractZkTestCase.putConfig put /mnt/ssd/jenkins/workspace/Lucene-Solr-4.x-Linux/solr/build/solr-core/test-files/solr/collection1/conf/open-exchange-rates.json to /configs/conf1/open-exchange-rates.json
   [junit4]   2> 394597 T1089 oascc.SolrZkClient.makePath makePath: /configs/conf1/open-exchange-rates.json
   [junit4]   2> 394600 T1089 oasc.AbstractZkTestCase.putConfig put /mnt/ssd/jenkins/workspace/Lucene-Solr-4.x-Linux/solr/build/solr-core/test-files/solr/collection1/conf/mapping-ISOLatin1Accent.txt to /configs/conf1/mapping-ISOLatin1Accent.txt
   [junit4]   2> 394601 T1089 oascc.SolrZkClient.makePath makePath: /configs/conf1/mapping-ISOLatin1Accent.txt
   [junit4]   2> 394604 T1089 oasc.AbstractZkTestCase.putConfig put /mnt/ssd/jenkins/workspace/Lucene-Solr-4.x-Linux/solr/build/solr-core/test-files/solr/collection1/conf/old_synonyms.txt to /configs/conf1/old_synonyms.txt
   [junit4]   2> 394605 T1089 oascc.SolrZkClient.makePath makePath: /configs/conf1/old_synonyms.txt
   [junit4]   2> 394609 T1089 oasc.AbstractZkTestCase.putConfig put /mnt/ssd/jenkins/workspace/Lucene-Solr-4.x-Linux/solr/build/solr-core/test-files/solr/collection1/conf/synonyms.txt to /configs/conf1/synonyms.txt
   [junit4]   2> 394610 T1089 oascc.SolrZkClient.makePath makePath: /configs/conf1/synonyms.txt
   [junit4]   2> 394722 T1089 oejs.Server.doStart jetty-8.1.10.v20130312
   [junit4]   2> 394728 T1089 oejs.AbstractConnector.doStart Started SelectChannelConnector@127.0.0.1:44553
   [junit4]   2> 394730 T1089 oass.SolrDispatchFilter.init SolrDispatchFilter.init()
   [junit4]   2> 394731 T1089 oasc.SolrResourceLoader.locateSolrHome JNDI not configured for solr (NoInitialContextEx)
   [junit4]   2> 394732 T1089 oasc.SolrResourceLoader.locateSolrHome using system property solr.solr.home: /mnt/ssd/jenkins/workspace/Lucene-Solr-4.x-Linux/solr/build/solr-core/test/J1/./org.apache.solr.cloud.BasicDistributedZk2Test-controljetty-1375426420628
   [junit4]   2> 394733 T1089 oasc.SolrResourceLoader.<init> new SolrResourceLoader for directory: '/mnt/ssd/jenkins/workspace/Lucene-Solr-4.x-Linux/solr/build/solr-core/test/J1/./org.apache.solr.cloud.BasicDistributedZk2Test-controljetty-1375426420628/'
   [junit4]   2> 394745 T1089 oasc.ConfigSolr.fromFile Loading container configuration from /mnt/ssd/jenkins/workspace/Lucene-Solr-4.x-Linux/solr/build/solr-core/test/J1/./org.apache.solr.cloud.BasicDistributedZk2Test-controljetty-1375426420628/solr.xml
   [junit4]   2> 394793 T1089 oasc.CoreContainer.<init> New CoreContainer -1450478718
   [junit4]   2> 394794 T1089 oasc.CoreContainer.load Loading cores into CoreContainer [instanceDir=/mnt/ssd/jenkins/workspace/Lucene-Solr-4.x-Linux/solr/build/solr-core/test/J1/./org.apache.solr.cloud.BasicDistributedZk2Test-controljetty-1375426420628/]
   [junit4]   2> 394796 T1089 oashc.HttpShardHandlerFactory.getParameter Setting socketTimeout to: 120000
   [junit4]   2> 394797 T1089 oashc.HttpShardHandlerFactory.getParameter Setting urlScheme to: http://
   [junit4]   2> 394798 T1089 oashc.HttpShardHandlerFactory.getParameter Setting connTimeout to: 15000
   [junit4]   2> 394799 T1089 oashc.HttpShardHandlerFactory.getParameter Setting maxConnectionsPerHost to: 20
   [junit4]   2> 394800 T1089 oashc.HttpShardHandlerFactory.getParameter Setting corePoolSize to: 0
   [junit4]   2> 394801 T1089 oashc.HttpShardHandlerFactory.getParameter Setting maximumPoolSize to: 2147483647
   [junit4]   2> 394802 T1089 oashc.HttpShardHandlerFactory.getParameter Setting maxThreadIdleTime to: 5
   [junit4]   2> 394803 T1089 oashc.HttpShardHandlerFactory.getParameter Setting sizeOfQueue to: -1
   [junit4]   2> 394804 T1089 oashc.HttpShardHandlerFactory.getParameter Setting fairnessPolicy to: false
   [junit4]   2> 394805 T1089 oascsi.HttpClientUtil.createClient Creating new http client, config:maxConnectionsPerHost=20&maxConnections=10000&socketTimeout=120000&connTimeout=15000&retry=false
   [junit4]   2> 394813 T1089 oasc.ZkContainer.initZooKeeper Zookeeper client=127.0.0.1:36357/solr
   [junit4]   2> 394814 T1089 oasc.ZkController.checkChrootPath zkHost includes chroot
   [junit4]   2> 394816 T1089 oascc.ConnectionManager.waitForConnected Waiting for client to connect to ZooKeeper
   [junit4]   2> 394817 T1109 oascc.ConnectionManager.process Watcher org.apache.solr.common.cloud.ConnectionManager@93145c87 name:ZooKeeperConnection Watcher:127.0.0.1:36357 got event WatchedEvent state:SyncConnected type:None path:null path:null type:None
   [junit4]   2> 394817 T1089 oascc.ConnectionManager.waitForConnected Client is connected to ZooKeeper
   [junit4]   2> 394820 T1089 oascsi.HttpClientUtil.createClient Creating new http client, config:maxConnections=500&maxConnectionsPerHost=16&socketTimeout=120000&connTimeout=15000
   [junit4]   2> 394828 T1089 oascc.ConnectionManager.waitForConnected Waiting for client to connect to ZooKeeper
   [junit4]   2> 394829 T1111 oascc.ConnectionManager.process Watcher org.apache.solr.common.cloud.ConnectionManager@59b3be7b name:ZooKeeperConnection Watcher:127.0.0.1:36357/solr got event WatchedEvent state:SyncConnected type:None path:null path:null type:None
   [junit4]   2> 394830 T1089 oascc.ConnectionManager.waitForConnected Client is connected to ZooKeeper
   [junit4]   2> 394831 T1089 oascc.SolrZkClient.makePath makePath: /overseer/queue
   [junit4]   2> 394836 T1089 oascc.SolrZkClient.makePath makePath: /overseer/collection-queue-work
   [junit4]   2> 394840 T1089 oascc.SolrZkClient.makePath makePath: /live_nodes
   [junit4]   2> 394842 T1089 oasc.ZkController.createEphemeralLiveNode Register node as live in ZooKeeper:/live_nodes/127.0.0.1:44553_eu
   [junit4]   2> 394844 T1089 oascc.SolrZkClient.makePath makePath: /live_nodes/127.0.0.1:44553_eu
   [junit4]   2> 394849 T1089 oascc.SolrZkClient.makePath makePath: /overseer_elect/election
   [junit4]   2> 394854 T1089 oascc.SolrZkClient.makePath makePath: /overseer_elect/leader
   [junit4]   2> 394857 T1089 oasc.Overseer.start Overseer (id=90139945883992067-127.0.0.1:44553_eu-n_0000000000) starting
   [junit4]   2> 394861 T1089 oascc.SolrZkClient.makePath makePath: /overseer/queue-work
   [junit4]   2> 394867 T1113 oasc.OverseerCollectionProcessor.run Process current queue of collection creations
   [junit4]   2> 394867 T1089 oascc.SolrZkClient.makePath makePath: /clusterstate.json
   [junit4]   2> 394874 T1089 oascc.SolrZkClient.makePath makePath: /aliases.json
   [junit4]   2> 394878 T1089 oascc.ZkStateReader.createClusterStateWatchersAndUpdate Updating cluster state from ZooKeeper... 
   [junit4]   2> 394884 T1112 oasc.Overseer$ClusterStateUpdater.run Starting to work on the main queue
   [junit4]   2> 394888 T1114 oasc.ZkController.publish publishing core=collection1 state=down
   [junit4]   2> 394889 T1114 oasc.ZkController.publish numShards not found on descriptor - reading it from system property
   [junit4]   2> 394891 T1114 oasc.ZkController.waitForCoreNodeName look for our core node name
   [junit4]   2> 396387 T1112 oascc.ZkStateReader.updateClusterState Updating cloud state from ZooKeeper... 
   [junit4]   2> 396389 T1112 oasc.Overseer$ClusterStateUpdater.updateState Update state numShards=1 message={
   [junit4]   2> 	  "shard_state":"active",
   [junit4]   2> 	  "base_url":"http://127.0.0.1:44553/eu",
   [junit4]   2> 	  "state":"down",
   [junit4]   2> 	  "operation":"state",
   [junit4]   2> 	  "core_node_name":"core_node1",
   [junit4]   2> 	  "node_name":"127.0.0.1:44553_eu",
   [junit4]   2> 	  "numShards":"1",
   [junit4]   2> 	  "shard_range":null,
   [junit4]   2> 	  "roles":null,
   [junit4]   2> 	  "collection":"control_collection",
   [junit4]   2> 	  "shard":null,
   [junit4]   2> 	  "core":"collection1"}
   [junit4]   2> 396389 T1112 oasc.Overseer$ClusterStateUpdater.createCollection Create collection control_collection with shards [shard1]
   [junit4]   2> 396389 T1112 oasc.Overseer$ClusterStateUpdater.updateState Assigning new node to shard shard=shard1
   [junit4]   2> 396393 T1111 oascc.ZkStateReader$2.process A cluster state change: WatchedEvent state:SyncConnected type:NodeDataChanged path:/clusterstate.json, has occurred - updating... (live nodes size: 1)
   [junit4]   2> 396892 T1114 oasc.ZkController.waitForShardId waiting to find shard id in clusterstate for collection1
   [junit4]   2> 396893 T1114 oasc.CoreContainer.create Creating SolrCore 'collection1' using instanceDir: /mnt/ssd/jenkins/workspace/Lucene-Solr-4.x-Linux/solr/build/solr-core/test/J1/./org.apache.solr.cloud.BasicDistributedZk2Test-controljetty-1375426420628/collection1
   [junit4]   2> 396893 T1114 oasc.ZkController.createCollectionZkNode Check for collection zkNode:control_collection
   [junit4]   2> 396894 T1114 oasc.ZkController.createCollectionZkNode Collection zkNode exists
   [junit4]   2> 396894 T1114 oasc.ZkController.readConfigName Load collection config from:/collections/control_collection
   [junit4]   2> 396895 T1114 oasc.SolrResourceLoader.<init> new SolrResourceLoader for directory: '/mnt/ssd/jenkins/workspace/Lucene-Solr-4.x-Linux/solr/build/solr-core/test/J1/./org.apache.solr.cloud.BasicDistributedZk2Test-controljetty-1375426420628/collection1/'
   [junit4]   2> 396896 T1114 oasc.SolrResourceLoader.replaceClassLoader Adding 'file:/mnt/ssd/jenkins/workspace/Lucene-Solr-4.x-Linux/solr/build/solr-core/test/J1/org.apache.solr.cloud.BasicDistributedZk2Test-controljetty-1375426420628/collection1/lib/README' to classloader
   [junit4]   2> 396897 T1114 oasc.SolrResourceLoader.replaceClassLoader Adding 'file:/mnt/ssd/jenkins/workspace/Lucene-Solr-4.x-Linux/solr/build/solr-core/test/J1/org.apache.solr.cloud.BasicDistributedZk2Test-controljetty-1375426420628/collection1/lib/classes/' to classloader
   [junit4]   2> 396937 T1114 oasc.SolrConfig.<init> Using Lucene MatchVersion: LUCENE_45
   [junit4]   2> 396987 T1114 oasc.SolrConfig.<init> Loaded SolrConfig: solrconfig.xml
   [junit4]   2> 396989 T1114 oass.IndexSchema.readSchema Reading Solr Schema from schema.xml
   [junit4]   2> 396996 T1114 oass.IndexSchema.readSchema [collection1] Schema name=test
   [junit4]   2> 397391 T1114 oass.ByteField.init WARN ByteField is deprecated and will be removed in 5.0. You should use TrieIntField instead.
   [junit4]   2> 397391 T1114 oass.ShortField.init WARN ShortField is deprecated and will be removed in 5.0. You should use TrieIntField instead.
   [junit4]   2> 397392 T1114 oass.OpenExchangeRatesOrgProvider.init Initialized with rates=open-exchange-rates.json, refreshInterval=1440.
   [junit4]   2> 397399 T1114 oass.IndexSchema.readSchema default search field in schema is text
   [junit4]   2> 397402 T1114 oass.IndexSchema.readSchema unique key field: id
   [junit4]   2> 397414 T1114 oass.FileExchangeRateProvider.reload Reloading exchange rates from file currency.xml
   [junit4]   2> 397418 T1114 oass.FileExchangeRateProvider.reload Reloading exchange rates from file currency.xml
   [junit4]   2> 397422 T1114 oass.OpenExchangeRatesOrgProvider.reload Reloading exchange rates from open-exchange-rates.json
   [junit4]   2> 397424 T1114 oass.OpenExchangeRatesOrgProvider$OpenExchangeRates.<init> WARN Unknown key IMPORTANT NOTE
   [junit4]   2> 397424 T1114 oass.OpenExchangeRatesOrgProvider$OpenExchangeRates.<init> WARN Expected key, got STRING
   [junit4]   2> 397424 T1114 oass.OpenExchangeRatesOrgProvider.reload Reloading exchange rates from open-exchange-rates.json
   [junit4]   2> 397425 T1114 oass.OpenExchangeRatesOrgProvider$OpenExchangeRates.<init> WARN Unknown key IMPORTANT NOTE
   [junit4]   2> 397426 T1114 oass.OpenExchangeRatesOrgProvider$OpenExchangeRates.<init> WARN Expected key, got STRING
   [junit4]   2> 397426 T1114 oasc.SolrCore.initDirectoryFactory org.apache.solr.core.MockDirectoryFactory
   [junit4]   2> 397427 T1114 oasc.SolrCore.<init> [collection1] Opening new SolrCore at /mnt/ssd/jenkins/workspace/Lucene-Solr-4.x-Linux/solr/build/solr-core/test/J1/./org.apache.solr.cloud.BasicDistributedZk2Test-controljetty-1375426420628/collection1/, dataDir=./org.apache.solr.cloud.BasicDistributedZk2Test-1375426420346/control/data/
   [junit4]   2> 397427 T1114 oasc.JmxMonitoredMap.<init> JMX monitoring is enabled. Adding Solr mbeans to JMX Server: com.sun.jmx.mbeanserver.JmxMBeanServer@34d51f86
   [junit4]   2> 397428 T1114 oasc.CachingDirectoryFactory.get return new directory for ./org.apache.solr.cloud.BasicDistributedZk2Test-1375426420346/control/data
   [junit4]   2> 397428 T1114 oasc.SolrCore.getNewIndexDir New index directory detected: old=null new=./org.apache.solr.cloud.BasicDistributedZk2Test-1375426420346/control/data/index/
   [junit4]   2> 397429 T1114 oasc.SolrCore.initIndex WARN [collection1] Solr index directory './org.apache.solr.cloud.BasicDistributedZk2Test-1375426420346/control/data/index' doesn't exist. Creating new index...
   [junit4]   2> 397429 T1114 oasc.CachingDirectoryFactory.get return new directory for ./org.apache.solr.cloud.BasicDistributedZk2Test-1375426420346/control/data/index
   [junit4]   2> 397430 T1114 oasc.SolrDeletionPolicy.onCommit SolrDeletionPolicy.onCommit: commits: num=1
   [junit4]   2> 		commit{dir=MockDirWrapper(org.apache.lucene.store.RAMDirectory@43234cac lockFactory=org.apache.lucene.store.NativeFSLockFactory@3a4bba3c),segFN=segments_1,generation=1}
   [junit4]   2> 397431 T1114 oasc.SolrDeletionPolicy.updateCommits newest commit generation = 1
   [junit4]   2> 397433 T1114 oasup.UpdateRequestProcessorChain.init inserting DistributedUpdateProcessorFactory into updateRequestProcessorChain "dedupe"
   [junit4]   2> 397433 T1114 oasup.UpdateRequestProcessorChain.init inserting DistributedUpdateProcessorFactory into updateRequestProcessorChain "stored_sig"
   [junit4]   2> 397434 T1114 oasup.UpdateRequestProcessorChain.init inserting DistributedUpdateProcessorFactory into updateRequestProcessorChain "distrib-dup-test-chain-implicit"
   [junit4]   2> 397435 T1114 oasc.RequestHandlers.initHandlersFromConfig created standard: solr.StandardRequestHandler
   [junit4]   2> 397435 T1114 oasc.RequestHandlers.initHandlersFromConfig created /get: solr.RealTimeGetHandler
   [junit4]   2> 397435 T1114 oasc.RequestHandlers.initHandlersFromConfig adding lazy requestHandler: solr.ReplicationHandler
   [junit4]   2> 397436 T1114 oasc.RequestHandlers.initHandlersFromConfig created /replication: solr.ReplicationHandler
   [junit4]   2> 397436 T1114 oasc.RequestHandlers.initHandlersFromConfig created /update: solr.UpdateRequestHandler
   [junit4]   2> 397437 T1114 oasc.RequestHandlers.initHandlersFromConfig created /admin/: org.apache.solr.handler.admin.AdminHandlers
   [junit4]   2> 397438 T1114 oashl.XMLLoader.init xsltCacheLifetimeSeconds=60
   [junit4]   2> 397440 T1114 oass.SolrIndexSearcher.<init> Opening Searcher@171da1f9 main
   [junit4]   2> 397441 T1114 oasu.CommitTracker.<init> Hard AutoCommit: disabled
   [junit4]   2> 397441 T1114 oasu.CommitTracker.<init> Soft AutoCommit: disabled
   [junit4]   2> 397445 T1115 oasc.SolrCore.registerSearcher [collection1] Registered new searcher Searcher@171da1f9 main{StandardDirectoryReader(segments_1:1)}
   [junit4]   2> 397445 T1114 oasc.CoreContainer.registerCore registering core: collection1
   [junit4]   2> 397445 T1114 oasc.ZkController.register Register replica - core:collection1 address:http://127.0.0.1:44553/eu collection:control_collection shard:shard1
   [junit4]   2> 397446 T1114 oascsi.HttpClientUtil.createClient Creating new http client, config:maxConnections=10000&maxConnectionsPerHost=20&connTimeout=15000&socketTimeout=30000&retry=false
   [junit4]   2> 397451 T1114 oascc.SolrZkClient.makePath makePath: /collections/control_collection/leader_elect/shard1/election
   [junit4]   2> 397456 T1114 oasc.ShardLeaderElectionContext.runLeaderProcess Running the leader process for shard shard1
   [junit4]   2> 397459 T1114 oasc.ShardLeaderElectionContext.waitForReplicasToComeUp Enough replicas found to continue.
   [junit4]   2> 397459 T1114 oasc.ShardLeaderElectionContext.runLeaderProcess I may be the new leader - try and sync
   [junit4]   2> 397459 T1114 oasc.SyncStrategy.sync Sync replicas to http://127.0.0.1:44553/eu/collection1/
   [junit4]   2> 397460 T1114 oasc.SyncStrategy.syncReplicas Sync Success - now sync replicas to me
   [junit4]   2> 397460 T1114 oasc.SyncStrategy.syncToMe http://127.0.0.1:44553/eu/collection1/ has no replicas
   [junit4]   2> 397460 T1114 oasc.ShardLeaderElectionContext.runLeaderProcess I am the new leader: http://127.0.0.1:44553/eu/collection1/ shard1
   [junit4]   2> 397461 T1114 oascc.SolrZkClient.makePath makePath: /collections/control_collection/leaders/shard1
   [junit4]   2> 397897 T1112 oascc.ZkStateReader.updateClusterState Updating cloud state from ZooKeeper... 
   [junit4]   2> 397903 T1111 oascc.ZkStateReader$2.process A cluster state change: WatchedEvent state:SyncConnected type:NodeDataChanged path:/clusterstate.json, has occurred - updating... (live nodes size: 1)
   [junit4]   2> 397917 T1114 oasc.ZkController.register We are http://127.0.0.1:44553/eu/collection1/ and leader is http://127.0.0.1:44553/eu/collection1/
   [junit4]   2> 397917 T1114 oasc.ZkController.register No LogReplay needed for core=collection1 baseURL=http://127.0.0.1:44553/eu
   [junit4]   2> 397918 T1114 oasc.ZkController.checkRecovery I am the leader, no recovery necessary
   [junit4]   2> 397918 T1114 oasc.ZkController.publish publishing core=collection1 state=active
   [junit4]   2> 397918 T1114 oasc.ZkController.publish numShards not found on descriptor - reading it from system property
   [junit4]   2> 397920 T1114 oascc.ZkStateReader.updateClusterState Updating cloud state from ZooKeeper... 
   [junit4]   2> 397921 T1089 oass.SolrDispatchFilter.init user.dir=/mnt/ssd/jenkins/workspace/Lucene-Solr-4.x-Linux/solr/build/solr-core/test/J1
   [junit4]   2> 397922 T1089 oass.SolrDispatchFilter.init SolrDispatchFilter.init() done
   [junit4]   2> 397923 T1089 oascsi.HttpClientUtil.createClient Creating new http client, config:maxConnections=128&maxConnectionsPerHost=32&followRedirects=false
   [junit4]   2> 397928 T1089 oascsi.HttpClientUtil.createClient Creating new http client, config:
   [junit4]   2> 397930 T1089 oascc.ConnectionManager.waitForConnected Waiting for client to connect to ZooKeeper
   [junit4]   2> 397931 T1118 oascc.ConnectionManager.process Watcher org.apache.solr.common.cloud.ConnectionManager@b1b3d57d name:ZooKeeperConnection Watcher:127.0.0.1:36357/solr got event WatchedEvent state:SyncConnected type:None path:null path:null type:None
   [junit4]   2> 397932 T1089 oascc.ConnectionManager.waitForConnected Client is connected to ZooKeeper
   [junit4]   2> 397933 T1089 oascc.ZkStateReader.createClusterStateWatchersAndUpdate Updating cluster state from ZooKeeper... 
   [junit4]   2> 397935 T1089 oasc.ChaosMonkey.monkeyLog monkey: init - expire sessions:true cause connection loss:true
   [junit4]   2> 398001 T1089 oejs.Server.doStart jetty-8.1.10.v20130312
   [junit4]   2> 398004 T1089 oejs.AbstractConnector.doStart Started SelectChannelConnector@127.0.0.1:43171
   [junit4]   2> 398005 T1089 oass.SolrDispatchFilter.init SolrDispatchFilter.init()
   [junit4]   2> 398005 T1089 oasc.SolrResourceLoader.locateSolrHome JNDI not configured for solr (NoInitialContextEx)
   [junit4]   2> 398006 T1089 oasc.SolrResourceLoader.locateSolrHome using system property solr.solr.home: /mnt/ssd/jenkins/workspace/Lucene-Solr-4.x-Linux/solr/build/solr-core/test/J1/./org.apache.solr.cloud.BasicDistributedZk2Test-jetty1-1375426423949
   [junit4]   2> 398007 T1089 oasc.SolrResourceLoader.<init> new SolrResourceLoader for directory: '/mnt/ssd/jenkins/workspace/Lucene-Solr-4.x-Linux/solr/build/solr-core/test/J1/./org.apache.solr.cloud.BasicDistributedZk2Test-jetty1-1375426423949/'
   [junit4]   2> 398014 T1089 oasc.ConfigSolr.fromFile Loading container configuration from /mnt/ssd/jenkins/workspace/Lucene-Solr-4.x-Linux/solr/build/solr-core/test/J1/./org.apache.solr.cloud.BasicDistributedZk2Test-jetty1-1375426423949/solr.xml
   [junit4]   2> 398045 T1089 oasc.CoreContainer.<init> New CoreContainer 318237478
   [junit4]   2> 398046 T1089 oasc.CoreContainer.load Loading cores into CoreContainer [instanceDir=/mnt/ssd/jenkins/workspace/Lucene-Solr-4.x-Linux/solr/build/solr-core/test/J1/./org.apache.solr.cloud.BasicDistributedZk2Test-jetty1-1375426423949/]
   [junit4]   2> 398047 T1089 oashc.HttpShardHandlerFactory.getParameter Setting socketTimeout to: 120000
   [junit4]   2> 398047 T1089 oashc.HttpShardHandlerFactory.getParameter Setting urlScheme to: http://
   [junit4]   2> 398048 T1089 oashc.HttpShardHandlerFactory.getParameter Setting connTimeout to: 15000
   [junit4]   2> 398049 T1089 oashc.HttpShardHandlerFactory.getParameter Setting maxConnectionsPerHost to: 20
   [junit4]   2> 398049 T1089 oashc.HttpShardHandlerFactory.getParameter Setting corePoolSize to: 0
   [junit4]   2> 398050 T1089 oashc.HttpShardHandlerFactory.getParameter Setting maximumPoolSize to: 2147483647
   [junit4]   2> 398050 T1089 oashc.HttpShardHandlerFactory.getParameter Setting maxThreadIdleTime to: 5
   [junit4]   2> 398051 T1089 oashc.HttpShardHandlerFactory.getParameter Setting sizeOfQueue to: -1
   [junit4]   2> 398052 T1089 oashc.HttpShardHandlerFactory.getParameter Setting fairnessPolicy to: false
   [junit4]   2> 398052 T1089 oascsi.HttpClientUtil.createClient Creating new http client, config:maxConnectionsPerHost=20&maxConnections=10000&socketTimeout=120000&connTimeout=15000&retry=false
   [junit4]   2> 398057 T1089 oasc.ZkContainer.initZooKeeper Zookeeper client=127.0.0.1:36357/solr
   [junit4]   2> 398058 T1089 oasc.ZkController.checkChrootPath zkHost includes chroot
   [junit4]   2> 398059 T1089 oascc.ConnectionManager.waitForConnected Waiting for client to connect to ZooKeeper
   [junit4]   2> 398060 T1129 oascc.ConnectionManager.process Watcher org.apache.solr.common.cloud.ConnectionManager@e8e45dc0 name:ZooKeeperConnection Watcher:127.0.0.1:36357 got event WatchedEvent state:SyncConnected type:None path:null path:null type:None
   [junit4]   2> 398060 T1089 oascc.ConnectionManager.waitForConnected Client is connected to ZooKeeper
   [junit4]   2> 398062 T1089 oascsi.HttpClientUtil.createClient Creating new http client, config:maxConnections=500&maxConnectionsPerHost=16&socketTimeout=120000&connTimeout=15000
   [junit4]   2> 398067 T1089 oascc.ConnectionManager.waitForConnected Waiting for client to connect to ZooKeeper
   [junit4]   2> 398068 T1131 oascc.ConnectionManager.process Watcher org.apache.solr.common.cloud.ConnectionManager@31b329cd name:ZooKeeperConnection Watcher:127.0.0.1:36357/solr got event WatchedEvent state:SyncConnected type:None path:null path:null type:None
   [junit4]   2> 398069 T1089 oascc.ConnectionManager.waitForConnected Client is connected to ZooKeeper
   [junit4]   2> 398072 T1089 oascc.ZkStateReader.createClusterStateWatchersAndUpdate Updating cluster state from ZooKeeper... 
   [junit4]   2> 399075 T1089 oasc.ZkController.createEphemeralLiveNode Register node as live in ZooKeeper:/live_nodes/127.0.0.1:43171_eu
   [junit4]   2> 399076 T1089 oascc.SolrZkClient.makePath makePath: /live_nodes/127.0.0.1:43171_eu
   [junit4]   2> 399078 T1111 oascc.ZkStateReader$2.process A cluster state change: WatchedEvent state:SyncConnected type:NodeChildrenChanged path:/live_nodes, has occurred - updating... (live nodes size: 1)
   [junit4]   2> 399079 T1131 oascc.ZkStateReader$3.process Updating live nodes... (2)
   [junit4]   2> 399079 T1118 oascc.ZkStateReader$3.process Updating live nodes... (2)
   [junit4]   2> 399080 T1111 oascc.ZkStateReader$3.process Updating live nodes... (2)
   [junit4]   2> 399084 T1132 oasc.ZkController.publish publishing core=collection1 state=down
   [junit4]   2> 399085 T1132 oasc.ZkController.publish numShards not found on descriptor - reading it from system property
   [junit4]   2> 399086 T1132 oasc.ZkController.waitForCoreNodeName look for our core node name
   [junit4]   2> 399407 T1112 oascc.ZkStateReader.updateClusterState Updating cloud state from ZooKeeper... 
   [junit4]   2> 399409 T1112 oasc.Overseer$ClusterStateUpdater.updateState Update state numShards=1 message={
   [junit4]   2> 	  "shard_state":"active",
   [junit4]   2> 	  "base_url":"http://127.0.0.1:44553/eu",
   [junit4]   2> 	  "state":"active",
   [junit4]   2> 	  "operation":"state",
   [junit4]   2> 	  "core_node_name":"core_node1",
   [junit4]   2> 	  "node_name":"127.0.0.1:44553_eu",
   [junit4]   2> 	  "numShards":"1",
   [junit4]   2> 	  "shard_range":null,
   [junit4]   2> 	  "roles":null,
   [junit4]   2> 	  "collection":"control_collection",
   [junit4]   2> 	  "shard":"shard1",
   [junit4]   2> 	  "core":"collection1"}
   [junit4]   2> 399413 T1112 oasc.Overseer$ClusterStateUpdater.updateState Update state numShards=2 message={
   [junit4]   2> 	  "shard_state":"active",
   [junit4]   2> 	  "base_url":"http://127.0.0.1:43171/eu",
   [junit4]   2> 	  "state":"down",
   [junit4]   2> 	  "operation":"state",
   [junit4]   2> 	  "core_node_name":"core_node1",
   [junit4]   2> 	  "node_name":"127.0.0.1:43171_eu",
   [junit4]   2> 	  "numShards":"2",
   [junit4]   2> 	  "shard_range":null,
   [junit4]   2> 	  "roles":null,
   [junit4]   2> 	  "collection":"collection1",
   [junit4]   2> 	  "shard":null,
   [junit4]   2> 	  "core":"collection1"}
   [junit4]   2> 399414 T1112 oasc.Overseer$ClusterStateUpdater.createCollection Create collection collection1 with shards [shard1, shard2]
   [junit4]   2> 399414 T1112 oasc.Overseer$ClusterStateUpdater.updateState Assigning new node to shard shard=shard1
   [junit4]   2> 399417 T1131 oascc.ZkStateReader$2.process A cluster state change: WatchedEvent state:SyncConnected type:NodeDataChanged path:/clusterstate.json, has occurred - updating... (live nodes size: 2)
   [junit4]   2> 399418 T1118 oascc.ZkStateReader$2.process A cluster state change: WatchedEvent state:SyncConnected type:NodeDataChanged path:/clusterstate.json, has occurred - updating... (live nodes size: 2)
   [junit4]   2> 399418 T1111 oascc.ZkStateReader$2.process A cluster state change: WatchedEvent state:SyncConnected type:NodeDataChanged path:/clusterstate.json, has occurred - updating... (live nodes size: 2)
   [junit4]   2> 400086 T1132 oasc.ZkController.waitForShardId waiting to find shard id in clusterstate for collection1
   [junit4]   2> 400087 T1132 oasc.CoreContainer.create Creating SolrCore 'collection1' using instanceDir: /mnt/ssd/jenkins/workspace/Lucene-Solr-4.x-Linux/solr/build/solr-core/test/J1/./org.apache.solr.cloud.BasicDistributedZk2Test-jetty1-1375426423949/collection1
   [junit4]   2> 400087 T1132 oasc.ZkController.createCollectionZkNode Check for collection zkNode:collection1
   [junit4]   2> 400088 T1132 oasc.ZkController.createCollectionZkNode Collection zkNode exists
   [junit4]   2> 400088 T1132 oasc.ZkController.readConfigName Load collection config from:/collections/collection1
   [junit4]   2> 400089 T1132 oasc.SolrResourceLoader.<init> new SolrResourceLoader for directory: '/mnt/ssd/jenkins/workspace/Lucene-Solr-4.x-Linux/solr/build/solr-core/test/J1/./org.apache.solr.cloud.BasicDistributedZk2Test-jetty1-1375426423949/collection1/'
   [junit4]   2> 400090 T1132 oasc.SolrResourceLoader.replaceClassLoader Adding 'file:/mnt/ssd/jenkins/workspace/Lucene-Solr-4.x-Linux/solr/build/solr-core/test/J1/org.apache.solr.cloud.BasicDistributedZk2Test-jetty1-1375426423949/collection1/lib/README' to classloader
   [junit4]   2> 400090 T1132 oasc.SolrResourceLoader.replaceClassLoader Adding 'file:/mnt/ssd/jenkins/workspace/Lucene-Solr-4.x-Linux/solr/build/solr-core/test/J1/org.apache.solr.cloud.BasicDistributedZk2Test-jetty1-1375426423949/collection1/lib/classes/' to classloader
   [junit4]   2> 400119 T1132 oasc.SolrConfig.<init> Using Lucene MatchVersion: LUCENE_45
   [junit4]   2> 400153 T1132 oasc.SolrConfig.<init> Loaded SolrConfig: solrconfig.xml
   [junit4]   2> 400154 T1132 oass.IndexSchema.readSchema Reading Solr Schema from schema.xml
   [junit4]   2> 400161 T1132 oass.IndexSchema.readSchema [collection1] Schema name=test
   [junit4]   2> 400499 T1132 oass.ByteField.init WARN ByteField is deprecated and will be removed in 5.0. You should use TrieIntField instead.
   [junit4]   2> 400500 T1132 oass.ShortField.init WARN ShortField is deprecated and will be removed in 5.0. You should use TrieIntField instead.
   [junit4]   2> 400500 T1132 oass.OpenExchangeRatesOrgProvider.init Initialized with rates=open-exchange-rates.json, refreshInterval=1440.
   [junit4]   2> 400506 T1132 oass.IndexSchema.readSchema default search field in schema is text
   [junit4]   2> 400508 T1132 oass.IndexSchema.readSchema unique key field: id
   [junit4]   2> 400519 T1132 oass.FileExchangeRateProvider.reload Reloading exchange rates from file currency.xml
   [junit4]   2> 400523 T1132 oass.FileExchangeRateProvider.reload Reloading exchange rates from file currency.xml
   [junit4]   2> 400527 T1132 oass.OpenExchangeRatesOrgProvider.reload Reloading exchange rates from open-exchange-rates.json
   [junit4]   2> 400528 T1132 oass.OpenExchangeRatesOrgProvider$OpenExchangeRates.<init> WARN Unknown key IMPORTANT NOTE
   [junit4]   2> 400528 T1132 oass.OpenExchangeRatesOrgProvider$OpenExchangeRates.<init> WARN Expected key, got STRING
   [junit4]   2> 400528 T1132 oass.OpenExchangeRatesOrgProvider.reload Reloading exchange rates from open-exchange-rates.json
   [junit4]   2> 400529 T1132 oass.OpenExchangeRatesOrgProvider$OpenExchangeRates.<init> WARN Unknown key IMPORTANT NOTE
   [junit4]   2> 400530 T1132 oass.OpenExchangeRatesOrgProvider$OpenExchangeRates.<init> WARN Expected key, got STRING
   [junit4]   2> 400530 T1132 oasc.SolrCore.initDirectoryFactory org.apache.solr.core.MockDirectoryFactory
   [junit4]   2> 400530 T1132 oasc.SolrCore.<init> [collection1] Opening new SolrCore at /mnt/ssd/jenkins/workspace/Lucene-Solr-4.x-Linux/solr/build/solr-core/test/J1/./org.apache.solr.cloud.BasicDistributedZk2Test-jetty1-1375426423949/collection1/, dataDir=./org.apache.solr.cloud.BasicDistributedZk2Test-1375426420346/jetty1/
   [junit4]   2> 400531 T1132 oasc.JmxMonitoredMap.<init> JMX monitoring is enabled. Adding Solr mbeans to JMX Server: com.sun.jmx.mbeanserver.JmxMBeanServer@34d51f86
   [junit4]   2> 400532 T1132 oasc.CachingDirectoryFactory.get return new directory for ./org.apache.solr.cloud.BasicDistributedZk2Test-1375426420346/jetty1
   [junit4]   2> 400532 T1132 oasc.SolrCore.getNewIndexDir New index directory detected: old=null new=./org.apache.solr.cloud.BasicDistributedZk2Test-1375426420346/jetty1/index/
   [junit4]   2> 400532 T1132 oasc.SolrCore.initIndex WARN [collection1] Solr index directory './org.apache.solr.cloud.BasicDistributedZk2Test-1375426420346/jetty1/index' doesn't exist. Creating new index...
   [junit4]   2> 400533 T1132 oasc.CachingDirectoryFactory.get return new directory for ./org.apache.solr.cloud.BasicDistributedZk2Test-1375426420346/jetty1/index
   [junit4]   2> 400534 T1132 oasc.SolrDeletionPolicy.onCommit SolrDeletionPolicy.onCommit: commits: num=1
   [junit4]   2> 		commit{dir=MockDirWrapper(org.apache.lucene.store.RAMDirectory@fb2731d9 lockFactory=org.apache.lucene.store.NativeFSLockFactory@9fe18dac),segFN=segments_1,generation=1}
   [junit4]   2> 400535 T1132 oasc.SolrDeletionPolicy.updateCommits newest commit generation = 1
   [junit4]   2> 400537 T1132 oasup.UpdateRequestProcessorChain.init inserting DistributedUpdateProcessorFactory into updateRequestProcessorChain "dedupe"
   [junit4]   2> 400537 T1132 oasup.UpdateRequestProcessorChain.init inserting DistributedUpdateProcessorFactory into updateRequestProcessorChain "stored_sig"
   [junit4]   2> 400538 T1132 oasup.UpdateRequestProcessorChain.init inserting DistributedUpdateProcessorFactory into updateRequestProcessorChain "distrib-dup-test-chain-implicit"
   [junit4]   2> 400538 T1132 oasc.RequestHandlers.initHandlersFromConfig created standard: solr.StandardRequestHandler
   [junit4]   2> 400539 T1132 oasc.RequestHandlers.initHandlersFromConfig created /get: solr.RealTimeGetHandler
   [junit4]   2> 400539 T1132 oasc.RequestHandlers.initHandlersFromConfig adding lazy requestHandler: solr.ReplicationHandler
   [junit4]   2> 400539 T1132 oasc.RequestHandlers.initHandlersFromConfig created /replication: solr.ReplicationHandler
   [junit4]   2> 400540 T1132 oasc.RequestHandlers.initHandlersFromConfig created /update: solr.UpdateRequestHandler
   [junit4]   2> 400540 T1132 oasc.RequestHandlers.initHandlersFromConfig created /admin/: org.apache.solr.handler.admin.AdminHandlers
   [junit4]   2> 400542 T1132 oashl.XMLLoader.init xsltCacheLifetimeSeconds=60
   [junit4]   2> 400544 T1132 oass.SolrIndexSearcher.<init> Opening Searcher@c0be29f2 main
   [junit4]   2> 400544 T1132 oasu.CommitTracker.<init> Hard AutoCommit: disabled
   [junit4]   2> 400545 T1132 oasu.CommitTracker.<init> Soft AutoCommit: disabled
   [junit4]   2> 400549 T1132 oasc.CoreContainer.registerCore registering core: collection1
   [junit4]   2> 400549 T1132 oasc.ZkController.register Register replica - core:collection1 address:http://127.0.0.1:43171/eu collection:collection1 shard:shard1
   [junit4]   2> 400549 T1132 oascsi.HttpClientUtil.createClient Creating new http client, config:maxConnections=10000&maxConnectionsPerHost=20&connTimeout=15000&socketTimeout=30000&retry=false
   [junit4]   2> 400551 T1133 oasc.SolrCore.registerSearcher [collection1] Registered new searcher Searcher@c0be29f2 main{StandardDirectoryReader(segments_1:1)}
   [junit4]   2> 400554 T1132 oascc.SolrZkClient.makePath makePath: /collections/collection1/leader_elect/shard1/election
   [junit4]   2> 400560 T1132 oasc.ShardLeaderElectionContext.runLeaderProcess Running the leader process for shard shard1
   [junit4]   2> 400562 T1132 oasc.ShardLeaderElectionContext.waitForReplicasToComeUp Enough replicas found to continue.
   [junit4]   2> 400562 T1132 oasc.ShardLeaderElectionContext.runLeaderProcess I may be the new leader - try and sync
   [junit4]   2> 400563 T1132 oasc.SyncStrategy.sync Sync replicas to http://127.0.0.1:43171/eu/collection1/
   [junit4]   2> 400563 T1132 oasc.SyncStrategy.syncReplicas Sync Success - now sync replicas to me
   [junit4]   2> 400563 T1132 oasc.SyncStrategy.syncToMe http://127.0.0.1:43171/eu/collection1/ has no replicas
   [junit4]   2> 400564 T1132 oasc.ShardLeaderElectionContext.runLeaderProcess I am the new leader: http://127.0.0.1:43171/eu/collection1/ shard1
   [junit4]   2> 400564 T1132 oascc.SolrZkClient.makePath makePath: /collections/collection1/leaders/shard1
   [junit4]   2> 400922 T1112 oascc.ZkStateReader.updateClusterState Updating cloud state from ZooKeeper... 
   [junit4]   2> 400930 T1111 oascc.ZkStateReader$2.process A cluster state change: WatchedEvent state:SyncConnected type:NodeDataChanged path:/clusterstate.json, has occurred - updating... (live nodes size: 2)
   [junit4]   2> 400930 T1118 oascc.ZkStateReader$2.process A cluster state change: WatchedEvent state:SyncConnected type:NodeDataChanged path:/clusterstate.json, has occurred - updating... (live nodes size: 2)
   [junit4]   2> 400930 T1131 oascc.ZkStateReader$2.process A cluster state change: WatchedEvent state:SyncConnected type:NodeDataChanged path:/clusterstate.json, has occurred - updating... (live nodes size: 2)
   [junit4]   2> 400970 T1132 oasc.ZkController.register We are http://127.0.0.1:43171/eu/collection1/ and leader is http://127.0.0.1:43171/eu/collection1/
   [junit4]   2> 400971 T1132 oasc.ZkController.register No LogReplay needed for core=collection1 baseURL=http://127.0.0.1:43171/eu
   [junit4]   2> 400971 T1132 oasc.ZkController.checkRecovery I am the leader, no recovery necessary
   [junit4]   2> 400972 T1132 oasc.ZkController.publish publishing core=collection1 state=active
   [junit4]   2> 400972 T1132 oasc.ZkController.publish numShards not found on descriptor - reading it from system property
   [junit4]   2> 400974 T1132 oascc.ZkStateReader.updateClusterState Updating cloud state from ZooKeeper... 
   [junit4]   2> 400975 T1089 oass.SolrDispatchFilter.init user.dir=/mnt/ssd/jenkins/workspace/Lucene-Solr-4.x-Linux/solr/build/solr-core/test/J1
   [junit4]   2> 400976 T1089 oass.SolrDispatchFilter.init SolrDispatchFilter.init() done
   [junit4]   2> 400977 T1089 oascsi.HttpClientUtil.createClient Creating new http client, config:maxConnections=128&maxConnectionsPerHost=32&followRedirects=false
   [junit4]   2> 401048 T1089 oejs.Server.doStart jetty-8.1.10.v20130312
   [junit4]   2> 401050 T1089 oejs.AbstractConnector.doStart Started SelectChannelConnector@127.0.0.1:60274
   [junit4]   2> 401051 T1089 oass.SolrDispatchFilter.init SolrDispatchFilter.init()
   [junit4]   2> 401052 T1089 oasc.SolrResourceLoader.locateSolrHome JNDI not configured for solr (NoInitialContextEx)
   [junit4]   2> 401053 T1089 oasc.SolrResourceLoader.locateSolrHome using system property solr.solr.home: /mnt/ssd/jenkins/workspace/Lucene-Solr-4.x-Linux/solr/build/solr-core/test/J1/./org.apache.solr.cloud.BasicDistributedZk2Test-jetty2-1375426426996
   [junit4]   2> 401053 T1089 oasc.SolrResourceLoader.<init> new SolrResourceLoader for directory: '/mnt/ssd/jenkins/workspace/Lucene-Solr-4.x-Linux/solr/build/solr-core/test/J1/./org.apache.solr.cloud.BasicDistributedZk2Test-jetty2-1375426426996/'
   [junit4]   2> 401061 T1089 oasc.ConfigSolr.fromFile Loading container configuration from /mnt/ssd/jenkins/workspace/Lucene-Solr-4.x-Linux/solr/build/solr-core/test/J1/./org.apache.solr.cloud.BasicDistributedZk2Test-jetty2-1375426426996/solr.xml
   [junit4]   2> 401091 T1089 oasc.CoreContainer.<init> New CoreContainer -209197987
   [junit4]   2> 401092 T1089 oasc.CoreContainer.load Loading cores into CoreContainer [instanceDir=/mnt/ssd/jenkins/workspace/Lucene-Solr-4.x-Linux/solr/build/solr-core/test/J1/./org.apache.solr.cloud.BasicDistributedZk2Test-jetty2-1375426426996/]
   [junit4]   2> 401093 T1089 oashc.HttpShardHandlerFactory.getParameter Setting socketTimeout to: 120000
   [junit4]   2> 401094 T1089 oashc.HttpShardHandlerFactory.getParameter Setting urlScheme to: http://
   [junit4]   2> 401094 T1089 oashc.HttpShardHandlerFactory.getParameter Setting connTimeout to: 15000
   [junit4]   2> 401095 T1089 oashc.HttpShardHandlerFactory.getParameter Setting maxConnectionsPerHost to: 20
   [junit4]   2> 401096 T1089 oashc.HttpShardHandlerFactory.getParameter Setting corePoolSize to: 0
   [junit4]   2> 401096 T1089 oashc.HttpShardHandlerFactory.getParameter Setting maximumPoolSize to: 2147483647
   [junit4]   2> 401097 T1089 oashc.HttpShardHandlerFactory.getParameter Setting maxThreadIdleTime to: 5
   [junit4]   2> 401097 T1089 oashc.HttpShardHandlerFactory.getParameter Setting sizeOfQueue to: -1
   [junit4]   2> 401098 T1089 oashc.HttpShardHandlerFactory.getParameter Setting fairnessPolicy to: false
   [junit4]   2> 401099 T1089 oascsi.HttpClientUtil.createClient Creating new http client, config:maxConnectionsPerHost=20&maxConnections=10000&socketTimeout=120000&connTimeout=15000&retry=false
   [junit4]   2> 401103 T1089 oasc.ZkContainer.initZooKeeper Zookeeper client=127.0.0.1:36357/solr
   [junit4]   2> 401104 T1089 oasc.ZkController.checkChrootPath zkHost includes chroot
   [junit4]   2> 401105 T1089 oascc.ConnectionManager.waitForConnected Waiting for client to connect to ZooKeeper
   [junit4]   2> 401106 T1145 oascc.ConnectionManager.process Watcher org.apache.solr.common.cloud.ConnectionManager@8a725c39 name:ZooKeeperConnection Watcher:127.0.0.1:36357 got event WatchedEvent state:SyncConnected type:None path:null path:null type:None
   [junit4]   2> 401107 T1089 oascc.ConnectionManager.waitForConnected Client is connected to ZooKeeper
   [junit4]   2> 401108 T1089 oascsi.HttpClientUtil.createClient Creating new http client, config:maxConnections=500&maxConnectionsPerHost=16&socketTimeout=120000&connTimeout=15000
   [junit4]   2> 401114 T1089 oascc.ConnectionManager.waitForConnected Waiting for client to connect to ZooKeeper
   [junit4]   2> 401115 T1147 oascc.ConnectionManager.process Watcher org.apache.solr.common.cloud.ConnectionManager@300be002 name:ZooKeeperConnection Watcher:127.0.0.1:36357/solr got event WatchedEvent state:SyncConnected type:None path:null path:null type:None
   [junit4]   2> 401115 T1089 oascc.ConnectionManager.waitForConnected Client is connected to ZooKeeper
   [junit4]   2> 401119 T1089 oascc.ZkStateReader.createClusterStateWatchersAndUpdate Updating cluster state from ZooKeeper... 
   [junit4]   2> 402124 T1089 oasc.ZkController.createEphemeralLiveNode Register node as live in ZooKeeper:/live_nodes/127.0.0.1:60274_eu
   [junit4]   2> 402126 T1089 oascc.SolrZkClient.makePath makePath: /live_nodes/127.0.0.1:60274_eu
   [junit4]   2> 402128 T1131 oascc.ZkStateReader$2.process A cluster state change: WatchedEvent state:SyncConnected type:NodeChildrenChanged path:/live_nodes, has occurred - updating... (live nodes size: 2)
   [junit4]   2> 402128 T1118 oascc.ZkStateReader$2.process A cluster state change: WatchedEvent state:SyncConnected type:NodeChildrenChanged path:/live_nodes, has occurred - updating... (live nodes size: 2)
   [junit4]   2> 402129 T1111 oascc.ZkStateReader$2.process A cluster state change: WatchedEvent state:SyncConnected type:NodeChildrenChanged path:/live_nodes, has occurred - updating... (live nodes size: 2)
   [junit4]   2> 402129 T1147 oascc.ZkStateReader$3.process Updating live nodes... (3)
   [junit4]   2> 402132 T1118 oascc.ZkStateReader$3.process Updating live nodes... (3)
   [junit4]   2> 402132 T1111 oascc.ZkStateReader$3.process Updating live nodes... (3)
   [junit4]   2> 402133 T1131 oascc.ZkStateReader$3.process Updating live nodes... (3)
   [junit4]   2> 402138 T1148 oasc.ZkController.publish publishing core=collection1 state=down
   [junit4]   2> 402138 T1148 oasc.ZkController.publish numShards not found on descriptor - reading it from system property
   [junit4]   2> 402142 T1148 oasc.ZkController.waitForCoreNodeName look for our core node name
   [junit4]   2> 402435 T1112 oascc.ZkStateReader.updateClusterState Updating cloud state from ZooKeeper... 
   [junit4]   2> 402436 T1112 oasc.Overseer$ClusterStateUpdater.updateState Update state numShards=2 message={
   [junit4]   2> 	  "shard_state":"active",
   [junit4]   2> 	  "base_url":"http://127.0.0.1:43171/eu",
   [junit4]   2> 	  "state":"active",
   [junit4]   2> 	  "operation":"state",
   [junit4]   2> 	  "core_node_name":"core_node1",
   [junit4]   2> 	  "node_name":"127.0.0.1:43171_eu",
   [junit4]   2> 	  "numShards":"2",
   [junit4]   2> 	  "shard_range":null,
   [junit4]   2> 	  "roles":null,
   [junit4]   2> 	  "collection":"collection1",
   [junit4]   2> 	  "shard":"shard1",
   [junit4]   2> 	  "core":"collection1"}
   [junit4]   2> 402439 T1112 oasc.Overseer$ClusterStateUpdater.updateState Update state numShards=2 message={
   [junit4]   2> 	  "shard_state":"active",
   [junit4]   2> 	  "base_url":"http://127.0.0.1:60274/eu",
   [junit4]   2> 	  "state":"down",
   [junit4]   2> 	  "operation":"state",
   [junit4]   2> 	  "core_node_name":"core_node2",
   [junit4]   2> 	  "node_name":"127.0.0.1:60274_eu",
   [junit4]   2> 	  "numShards":"2",
   [junit4]   2> 	  "shard_range":null,
   [junit4]   2> 	  "roles":null,
   [junit4]   2> 	  "collection":"collection1",
   [junit4]   2> 	  "shard":null,
   [junit4]   2> 	  "core":"collection1"}
   [junit4]   2> 402439 T1112 oasc.Overseer$ClusterStateUpdater.updateState Collection already exists with numShards=2
   [junit4]   2> 402439 T1112 oasc.Overseer$ClusterStateUpdater.updateState Assigning new node to shard shard=shard2
   [junit4]   2> 402461 T1118 oascc.ZkStateReader$2.process A cluster state change: WatchedEvent state:SyncConnected type:NodeDataChanged path:/clusterstate.json, has occurred - updating... (live nodes size: 3)
   [junit4]   2> 402461 T1147 oascc.ZkStateReader$2.process A cluster state change: WatchedEvent state:SyncConnected type:NodeDataChanged path:/clusterstate.json, has occurred - updating... (live nodes size: 3)
   [junit4]   2> 402462 T1131 oascc.ZkStateReader$2.process A cluster state change: WatchedEvent state:SyncConnected type:NodeDataChanged path:/clusterstate.json, has occurred - updating... (live nodes size: 3)
   [junit4]   2> 402462 T1111 oascc.ZkStateReader$2.process A cluster state change: WatchedEvent state:SyncConnected type:NodeDataChanged path:/clusterstate.json, has occurred - updating... (live nodes size: 3)
   [junit4]   2> 403143 T1148 oasc.ZkController.waitForShardId waiting to find shard id in clusterstate for collection1
   [junit4]   2> 403143 T1148 oasc.CoreContainer.create Creating SolrCore 'collection1' using instanceDir: /mnt/ssd/jenkins/workspace/Lucene-Solr-4.x-Linux/solr/build/solr-core/test/J1/./org.apache.solr.cloud.BasicDistributedZk2Test-jetty2-1375426426996/collection1
   [junit4]   2> 403144 T1148 oasc.ZkController.createCollectionZkNode Check for collection zkNode:collection1
   [junit4]   2> 403145 T1148 oasc.ZkController.createCollectionZkNode Collection zkNode exists
   [junit4]   2> 403145 T1148 oasc.ZkController.readConfigName Load collection config from:/collections/collection1
   [junit4]   2> 403147 T1148 oasc.SolrResourceLoader.<init> new SolrResourceLoader for directory: '/mnt/ssd/jenkins/workspace/Lucene-Solr-4.x-Linux/solr/build/solr-core/test/J1/./org.apache.solr.cloud.BasicDistributedZk2Test-jetty2-1375426426996/collection1/'
   [junit4]   2> 403148 T1148 oasc.SolrResourceLoader.replaceClassLoader Adding 'file:/mnt/ssd/jenkins/workspace/Lucene-Solr-4.x-Linux/solr/build/solr-core/test/J1/org.apache.solr.cloud.BasicDistributedZk2Test-jetty2-1375426426996/collection1/lib/README' to classloader
   [junit4]   2> 403149 T1148 oasc.SolrResourceLoader.replaceClassLoader Adding 'file:/mnt/ssd/jenkins/workspace/Lucene-Solr-4.x-Linux/solr/build/solr-core/test/J1/org.apache.solr.cloud.BasicDistributedZk2Test-jetty2-1375426426996/collection1/lib/classes/' to classloader
   [junit4]   2> 403174 T1148 oasc.SolrConfig.<init> Using Lucene MatchVersion: LUCENE_45
   [junit4]   2> 403204 T1148 oasc.SolrConfig.<init> Loaded SolrConfig: solrconfig.xml
   [junit4]   2> 403206 T1148 oass.IndexSchema.readSchema Reading Solr Schema from schema.xml
   [junit4]   2> 403212 T1148 oass.IndexSchema.readSchema [collection1] Schema name=test
   [junit4]   2> 403527 T1148 oass.ByteField.init WARN ByteField is deprecated and will be removed in 5.0. You should use TrieIntField instead.
   [junit4]   2> 403528 T1148 oass.ShortField.init WARN ShortField is deprecated and will be removed in 5.0. You should use TrieIntField instead.
   [junit4]   2> 403529 T1148 oass.OpenExchangeRatesOrgProvider.init Initialized with rates=open-exchange-rates.json, refreshInterval=1440.
   [junit4]   2> 403534 T1148 oass.IndexSchema.readSchema default search field in schema is text
   [junit4]   2> 403536 T1148 oass.IndexSchema.readSchema unique key field: id
   [junit4]   2> 403546 T1148 oass.FileExchangeRateProvider.reload Reloading exchange rates from file currency.xml
   [junit4]   2> 403550 T1148 oass.FileExchangeRateProvider.reload Reloading exchange rates from file currency.xml
   [junit4]   2> 403554 T1148 oass.OpenExchangeRatesOrgProvider.reload Reloading exchange rates from open-exchange-rates.json
   [junit4]   2> 403555 T1148 oass.OpenExchangeRatesOrgProvider$OpenExchangeRates.<init> WARN Unknown key IMPORTANT NOTE
   [junit4]   2> 403555 T1148 oass.OpenExchangeRatesOrgProvider$OpenExchangeRates.<init> WARN Expected key, got STRING
   [junit4]   2> 403555 T1148 oass.OpenExchangeRatesOrgProvider.reload Reloading exchange rates from open-exchange-rates.json
   [junit4]   2> 403556 T1148 oass.OpenExchangeRatesOrgProvider$OpenExchangeRates.<init> WARN Unknown key IMPORTANT NOTE
   [junit4]   2> 403557 T1148 oass.OpenExchangeRatesOrgProvider$OpenExchangeRates.<init> WARN Expected key, got STRING
   [junit4]   2> 403557 T1148 oasc.SolrCore.initDirectoryFactory org.apache.solr.core.MockDirectoryFactory
   [junit4]   2> 403558 T1148 oasc.SolrCore.<init> [collection1] Opening new SolrCore at /mnt/ssd/jenkins/workspace/Lucene-Solr-4.x-Linux/solr/build/solr-core/test/J1/./org.apache.solr.cloud.BasicDistributedZk2Test-jetty2-1375426426996/collection1/, dataDir=./org.apache.solr.cloud.BasicDistributedZk2Test-1375426420346/jetty2/
   [junit4]   2> 403558 T1148 oasc.JmxMonitoredMap.<init> JMX monitoring is enabled. Adding Solr mbeans to JMX Server: com.sun.jmx.mbeanserver.JmxMBeanServer@34d51f86
   [junit4]   2> 403559 T1148 oasc.CachingDirectoryFactory.get return new directory for ./org.apache.solr.cloud.BasicDistributedZk2Test-1375426420346/jetty2
   [junit4]   2> 403559 T1148 oasc.SolrCore.getNewIndexDir New index directory detected: old=null new=./org.apache.solr.cloud.BasicDistributedZk2Test-1375426420346/jetty2/index/
   [junit4]   2> 403560 T1148 oasc.SolrCore.initIndex WARN [collection1] Solr index directory './org.apache.solr.cloud.BasicDistributedZk2Test-1375426420346/jetty2/index' doesn't exist. Creating new index...
   [junit4]   2> 403560 T1148 oasc.CachingDirectoryFactory.get return new directory for ./org.apache.solr.cloud.BasicDistributedZk2Test-1375426420346/jetty2/index
   [junit4]   2> 403561 T1148 oasc.SolrDeletionPolicy.onCommit SolrDeletionPolicy.onCommit: commits: num=1
   [junit4]   2> 		commit{dir=MockDirWrapper(org.apache.lucene.store.RAMDirectory@5520e604 lockFactory=org.apache.lucene.store.NativeFSLockFactory@1197bfa3),segFN=segments_1,generation=1}
   [junit4]   2> 403562 T1148 oasc.SolrDeletionPolicy.updateCommits newest commit generation = 1
   [junit4]   2> 403564 T1148 oasup.UpdateRequestProcessorChain.init inserting DistributedUpdateProcessorFactory into updateRequestProcessorChain "dedupe"
   [junit4]   2> 403565 T1148 oasup.UpdateRequestProcessorChain.init inserting DistributedUpdateProcessorFactory into updateRequestProcessorChain "stored_sig"
   [junit4]   2> 403565 T1148 oasup.UpdateRequestProcessorChain.init inserting DistributedUpdateProcessorFactory into updateRequestProcessorChain "distrib-dup-test-chain-implicit"
   [junit4]   2> 403566 T1148 oasc.RequestHandlers.initHandlersFromConfig created standard: solr.StandardRequestHandler
   [junit4]   2> 403566 T1148 oasc.RequestHandlers.initHandlersFromConfig created /get: solr.RealTimeGetHandler
   [junit4]   2> 403567 T1148 oasc.RequestHandlers.initHandlersFromConfig adding lazy requestHandler: solr.ReplicationHandler
   [junit4]   2> 403567 T1148 oasc.RequestHandlers.initHandlersFromConfig created /replication: solr.ReplicationHandler
   [junit4]   2> 403568 T1148 oasc.RequestHandlers.initHandlersFromConfig created /update: solr.UpdateRequestHandler
   [junit4]   2> 403568 T1148 oasc.RequestHandlers.initHandlersFromConfig created /admin/: org.apache.solr.handler.admin.AdminHandlers
   [junit4]   2> 403569 T1148 oashl.XMLLoader.init xsltCacheLifetimeSeconds=60
   [junit4]   2> 403571 T1148 oass.SolrIndexSearcher.<init> Opening Searcher@4724f3c main
   [junit4]   2> 403572 T1148 oasu.CommitTracker.<init> Hard AutoCommit: disabled
   [junit4]   2> 403573 T1148 oasu.CommitTracker.<init> Soft AutoCommit: disabled
   [junit4]   2> 403577 T1149 oasc.SolrCore.registerSearcher [collection1] Registered new searcher Searcher@4724f3c main{StandardDirectoryReader(segments_1:1)}
   [junit4]   2> 403578 T1148 oasc.CoreContainer.registerCore registering core: collection1
   [junit4]   2> 403579 T1148 oasc.ZkController.register Register replica - core:collection1 address:http://127.0.0.1:60274/eu collection:collection1 shard:shard2
   [junit4]   2> 403579 T1148 oascsi.HttpClientUtil.createClient Creating new http client, config:maxConnections=10000&maxConnectionsPerHost=20&connTimeout=15000&socketTimeout=30000&retry=false
   [junit4]   2> 403584 T1148 oascc.SolrZkClient.makePath makePath: /collections/collection1/leader_elect/shard2/election
   [junit4]   2> 403591 T1148 oasc.ShardLeaderElectionContext.runLeaderProcess Running the leader process for shard shard2
   [junit4]   2> 403593 T1148 oasc.ShardLeaderElectionContext.waitForReplicasToComeUp Enough replicas found to continue.
   [junit4]   2> 403593 T1148 oasc.ShardLeaderElectionContext.runLeaderProcess I may be the new leader - try and sync
   [junit4]   2> 403594 T1148 oasc.SyncStrategy.sync Sync replicas to http://127.0.0.1:60274/eu/collection1/
   [junit4]   2> 403594 T1148 oasc.SyncStrategy.syncReplicas Sync Success - now sync replicas to me
   [junit4]   2> 403594 T1148 oasc.SyncStrategy.syncToMe http://127.0.0.1:60274/eu/collection1/ has no replicas
   [junit4]   2> 403595 T1148 oasc.ShardLeaderElectionContext.runLeaderProcess I am the new leader: http://127.0.0.1:60274/eu/collection1/ shard2
   [junit4]   2> 403595 T1148 oascc.SolrZkClient.makePath makePath: /collections/collection1/leaders/shard2
   [junit4]   2> 403968 T1112 oascc.ZkStateReader.updateClusterState Updating cloud state from ZooKeeper... 
   [junit4]   2> 403974 T1111 oascc.ZkStateReader$2.process A cluster state change: WatchedEvent state:SyncConnected type:NodeDataChanged path:/clusterstate.json, has occurred - updating... (live nodes size: 3)
   [junit4]   2> 403974 T1131 oascc.ZkStateReader$2.process A cluster state change: WatchedEvent state:SyncConnected type:NodeDataChanged path:/clusterstate.json, has occurred - updating... (live nodes size: 3)
   [junit4]   2> 403974 T1118 oascc.ZkStateReader$2.process A cluster state change: WatchedEvent state:SyncConnected type:NodeDataChanged path:/clusterstate.json, has occurred - updating... (live nodes size: 3)
   [junit4]   2> 403974 T1147 oascc.ZkStateReader$2.process A cluster state change: WatchedEvent state:SyncConnected type:NodeDataChanged path:/clusterstate.json, has occurred - updating... (live nodes size: 3)
   [junit4]   2> 404000 T1148 oasc.ZkController.register We are http://127.0.0.1:60274/eu/collection1/ and leader is http://127.0.0.1:60274/eu/collection1/
   [junit4]   2> 404000 T1148 oasc.ZkController.register No LogReplay needed for core=collection1 baseURL=http://127.0.0.1:60274/eu
   [junit4]   2> 404001 T1148 oasc.ZkController.checkRecovery I am the leader, no recovery necessary
   [junit4]   2> 404001 T1148 oasc.ZkController.publish publishing core=collection1 state=active
   [junit4]   2> 404001 T1148 oasc.ZkController.publish numShards not found on descriptor - reading it from system property
   [junit4]   2> 404003 T1148 oascc.ZkStateReader.updateClusterState Updating cloud state from ZooKeeper... 
   [junit4]   2> 404004 T1089 oass.SolrDispatchFilter.init user.dir=/mnt/ssd/jenkins/workspace/Lucene-Solr-4.x-Linux/solr/build/solr-core/test/J1
   [junit4]   2> 404005 T1089 oass.SolrDispatchFilter.init SolrDispatchFilter.init() done
   [junit4]   2> 404005 T1089 oascsi.HttpClientUtil.createClient Creating new http client, config:maxConnections=128&maxConnectionsPerHost=32&followRedirects=false
   [junit4]   2> 404077 T1089 oejs.Server.doStart jetty-8.1.10.v20130312
   [junit4]   2> 404080 T1089 oejs.AbstractConnector.doStart Started SelectChannelConnector@127.0.0.1:51821
   [junit4]   2> 404081 T1089 oass.SolrDispatchFilter.init SolrDispatchFilter.init()
   [junit4]   2> 404081 T1089 oasc.SolrResourceLoader.locateSolrHome JNDI not configured for solr (NoInitialContextEx)
   [junit4]   2> 404082 T1089 oasc.SolrResourceLoader.locateSolrHome using system property solr.solr.home: /mnt/ssd/jenkins/workspace/Lucene-Solr-4.x-Linux/solr/build/solr-core/test/J1/./org.apache.solr.cloud.BasicDistributedZk2Test-jetty3-1375426430024
   [junit4]   2> 404082 T1089 oasc.SolrResourceLoader.<init> new SolrResourceLoader for directory: '/mnt/ssd/jenkins/workspace/Lucene-Solr-4.x-Linux/solr/build/solr-core/test/J1/./org.apache.solr.cloud.BasicDistributedZk2Test-jetty3-1375426430024/'
   [junit4]   2> 404090 T1089 oasc.ConfigSolr.fromFile Loading container configuration from /mnt/ssd/jenkins/workspace/Lucene-Solr-4.x-Linux/solr/build/solr-core/test/J1/./org.apache.solr.cloud.BasicDistributedZk2Test-jetty3-1375426430024/solr.xml
   [junit4]   2> 404120 T1089 oasc.CoreContainer.<init> New CoreContainer -703130396
   [junit4]   2> 404121 T1089 oasc.CoreContainer.load Loading cores into CoreContainer [instanceDir=/mnt/ssd/jenkins/workspace/Lucene-Solr-4.x-Linux/solr/build/solr-core/test/J1/./org.apache.solr.cloud.BasicDistributedZk2Test-jetty3-1375426430024/]
   [junit4]   2> 404122 T1089 oashc.HttpShardHandlerFactory.getParameter Setting socketTimeout to: 120000
   [junit4]   2> 404123 T1089 oashc.HttpShardHandlerFactory.getParameter Setting urlScheme to: http://
   [junit4]   2> 404123 T1089 oashc.HttpShardHandlerFactory.getParameter Setting connTimeout to: 15000
   [junit4]   2> 404124 T1089 oashc.HttpShardHandlerFactory.getParameter Setting maxConnectionsPerHost to: 20
   [junit4]   2> 404125 T1089 oashc.HttpShardHandlerFactory.getParameter Setting corePoolSize to: 0
   [junit4]   2> 404125 T1089 oashc.HttpShardHandlerFactory.getParameter Setting maximumPoolSize to: 2147483647
   [junit4]   2> 404126 T1089 oashc.HttpShardHandlerFactory.getParameter Setting maxThreadIdleTime to: 5
   [junit4]   2> 404126 T1089 oashc.HttpShardHandlerFactory.getParameter Setting sizeOfQueue to: -1
   [junit4]   2> 404127 T1089 oashc.HttpShardHandlerFactory.getParameter Setting fairnessPolicy to: false
   [junit4]   2> 404128 T1089 oascsi.HttpClientUtil.createClient Creating new http client, config:maxConnectionsPerHost=20&maxConnections=10000&socketTimeout=120000&connTimeout=15000&retry=false
   [junit4]   2> 404134 T1089 oasc.ZkContainer.initZooKeeper Zookeeper client=127.0.0.1:36357/solr
   [junit4]   2> 404135 T1089 oasc.ZkController.checkChrootPath zkHost includes chroot
   [junit4]   2> 404137 T1089 oascc.ConnectionManager.waitForConnected Waiting for client to connect to ZooKeeper
   [junit4]   2> 404232 T1161 oascc.ConnectionManager.process Watcher org.apache.solr.common.cloud.ConnectionManager@ec889c64 name:ZooKeeperConnection Watcher:127.0.0.1:36357 got event WatchedEvent state:SyncConnected type:None path:null path:null type:None
   [junit4]   2> 404232 T1089 oascc.ConnectionManager.waitForConnected Client is connected to ZooKeeper
   [junit4]   2> 404235 T1089 oascsi.HttpClientUtil.createClient Creating new http client, config:maxConnections=500&maxConnectionsPerHost=16&socketTimeout=120000&connTimeout=15000
   [junit4]   2> 404240 T1089 oascc.ConnectionManager.waitForConnected Waiting for client to connect to ZooKeeper
   [junit4]   2> 404244 T1163 oascc.ConnectionManager.process Watcher org.apache.solr.common.cloud.ConnectionManager@a11546b3 name:ZooKeeperConnection Watcher:127.0.0.1:36357/solr got event WatchedEvent state:SyncConnected type:None path:null path:null type:None
   [junit4]   2> 404244 T1089 oascc.ConnectionManager.waitForConnected Client is connected to ZooKeeper
   [junit4]   2> 404247 T1089 oascc.ZkStateReader.createClusterStateWatchersAndUpdate Updating cluster state from ZooKeeper... 
   [junit4]   2> 405251 T1089 oasc.ZkController.createEphemeralLiveNode Register node as live in ZooKeeper:/live_nodes/127.0.0.1:51821_eu
   [junit4]   2> 405252 T1089 oascc.SolrZkClient.makePath makePath: /live_nodes/127.0.0.1:51821_eu
   [junit4]   2> 405254 T1131 oascc.ZkStateReader$2.process A cluster state change: WatchedEvent state:SyncConnected type:NodeChildrenChanged path:/live_nodes, has occurred - updating... (live nodes size: 3)
   [junit4]   2> 405254 T1111 oascc.ZkStateReader$2.process A cluster state change: WatchedEvent state:SyncConnected type:NodeChildrenChanged path:/live_nodes, has occurred - updating... (live nodes size: 3)
   [junit4]   2> 405255 T1118 oascc.ZkStateReader$2.process A cluster state change: WatchedEvent state:SyncConnected type:NodeChildrenChanged path:/live_nodes, has occurred - updating... (live nodes size: 3)
   [junit4]   2> 405255 T1163 oascc.ZkStateReader$3.process Updating live nodes... (4)
   [junit4]   2> 405255 T1147 oascc.ZkStateReader$3.process Updating live nodes... (4)
   [junit4]   2> 405256 T1147 oascc.ZkStateReader$2.process A cluster state change: WatchedEvent state:SyncConnected type:NodeChildrenChanged path:/live_nodes, has occurred - updating... (live nodes size: 4)
   [junit4]   2> 405256 T1131 oascc.ZkStateReader$3.process Updating live nodes... (4)
   [junit4]   2> 405257 T1111 oascc.ZkStateReader$3.process Updating live nodes... (4)
   [junit4]   2> 405257 T1118 oascc.ZkStateReader$3.process Updating live nodes... (4)
   [junit4]   2> 405261 T1164 oasc.ZkController.publish publishing core=collection1 state=down
   [junit4]   2> 405262 T1164 oasc.ZkController.publish numShards not found on descriptor - reading it from system property
   [junit4]   2> 405263 T1164 oasc.ZkController.waitForCoreNodeName look for our core node name
   [junit4]   2> 405480 T1112 oascc.ZkStateReader.updateClusterState Updating cloud state from ZooKeeper... 
   [junit4]   2> 405481 T1112 oasc.Overseer$ClusterStateUpdater.updateState Update state numShards=2 message={
   [junit4]   2> 	  "shard_state":"active",
   [junit4]   2> 	  "base_url":"http://127.0.0.1:60274/eu",
   [junit4]   2> 	  "state":"active",
   [junit4]   2> 	  "operation":"state",
   [junit4]   2> 	  "core_node_name":"core_node2",
   [junit4]   2> 	  "node_name":"127.0.0.1:60274_eu",
   [junit4]   2> 	  "numShards":"2",
   [junit4]   2> 	  "shard_range":null,
   [junit4]   2> 	  "roles":null,
   [junit4]   2> 	  "collection":"collection1",
   [junit4]   2> 	  "shard":"shard2",
   [junit4]   2> 	  "core":"collection1"}
   [junit4]   2> 405484 T1112 oasc.Overseer$ClusterStateUpdater.updateState Update state numShards=2 message={
   [junit4]   2> 	  "shard_state":"active",
   [junit4]   2> 	  "base_url":"http://127.0.0.1:51821/eu",
   [junit4]   2> 	  "state":"down",
   [junit4]   2> 	  "operation":"state",
   [junit4]   2> 	  "core_node_name":"core_node3",
   [junit4]   2> 	  "node_name":"127.0.0.1:51821_eu",
   [junit4]   2> 	  "numShards":"2",
   [junit4]   2> 	  "shard_range":null,
   [junit4]   2> 	  "roles":null,
   [junit4]   2> 	  "collection":"collection1",
   [junit4]   2> 	  "shard":null,
   [junit4]   2> 	  "core":"collection1"}
   [junit4]   2> 405485 T1112 oasc.Overseer$ClusterStateUpdater.updateState Collection already exists with numShards=2
   [junit4]   2> 405485 T1112 oasc.Overseer$ClusterStateUpdater.updateState Assigning new node to shard shard=shard1
   [junit4]   2> 405488 T1111 oascc.ZkStateReader$2.process A cluster state change: WatchedEvent state:SyncConnected type:NodeDataChanged path:/clusterstate.json, has occurred - updating... (live nodes size: 4)
   [junit4]   2> 405488 T1118 oascc.ZkStateReader$2.process A cluster state change: WatchedEvent state:SyncConnected type:NodeDataChanged path:/clusterstate.json, has occurred - updating... (live nodes size: 4)
   [junit4]   2> 405489 T1147 oascc.ZkStateReader$2.process A cluster state change: WatchedEvent state:SyncConnected type:NodeDataChanged path:/clusterstate.json, has occurred - updating... (live nodes size: 4)
   [junit4]   2> 405489 T1131 oascc.ZkStateReader$2.process A cluster state change: WatchedEvent state:SyncConnected type:NodeDataChanged path:/clusterstate.json, has occurred - updating... (live nodes size: 4)
   [junit4]   2> 405488 T1163 oascc.ZkStateReader$2.process A cluster state change: WatchedEvent state:SyncConnected type:NodeDataChanged path:/clusterstate.json, has occurred - updating... (live nodes size: 4)
   [junit4]   2> 406264 T1164 oasc.ZkController.waitForShardId waiting to find shard id in clusterstate for collection1
   [junit4]   2> 406264 T1164 oasc.CoreContainer.create Creating SolrCore 'collection1' using instanceDir: /mnt/ssd/jenkins/workspace/Lucene-Solr-4.x-Linux/solr/build/solr-core/test/J1/./org.apache.solr.cloud.BasicDistributedZk2Test-jetty3-1375426430024/collection1
   [junit4]   2> 406264 T1164 oasc.ZkController.createCollectionZkNode Check for collection zkNode:collection1
   [junit4]   2> 406265 T1164 oasc.ZkController.createCollectionZkNode Collection zkNode exists
   [junit4]   2> 406266 T1164 oasc.ZkController.readConfigName Load collection config from:/collections/collection1
   [junit4]   2> 406267 T1164 oasc.SolrResourceLoader.<init> new SolrResourceLoader for directory: '/mnt/ssd/jenkins/workspace/Lucene-Solr-4.x-Linux/solr/build/solr-core/test/J1/./org.apache.solr.cloud.BasicDistributedZk2Test-jetty3-1375426430024/collection1/'
   [junit4]   2> 406267 T1164 oasc.SolrResourceLoader.replaceClassLoader Adding 'file:/mnt/ssd/jenkins/workspace/Lucene-Solr-4.x-Linux/solr/build/solr-core/test/J1/org.apache.solr.cloud.BasicDistributedZk2Test-jetty3-1375426430024/collection1/lib/README' to classloader
   [junit4]   2> 406268 T1164 oasc.SolrResourceLoader.replaceClassLoader Adding 'file:/mnt/ssd/jenkins/workspace/Lucene-Solr-4.x-Linux/solr/build/solr-core/test/J1/org.apache.solr.cloud.BasicDistributedZk2Test-jetty3-1375426430024/collection1/lib/classes/' to classloader
   [junit4]   2> 406295 T1164 oasc.SolrConfig.<init> Using Lucene MatchVersion: LUCENE_45
   [junit4]   2> 406327 T1164 oasc.SolrConfig.<init> Loaded SolrConfig: solrconfig.xml
   [junit4]   2> 406329 T1164 oass.IndexSchema.readSchema Reading Solr Schema from schema.xml
   [junit4]   2> 406335 T1164 oass.IndexSchema.readSchema [collection1] Schema name=test
   [junit4]   2> 406660 T1164 oass.ByteField.init WARN ByteField is deprecated and will be removed in 5.0. You should use TrieIntField instead.
   [junit4]   2> 406661 T1164 oass.ShortField.init WARN ShortField is deprecated and will be removed in 5.0. You should use TrieIntField instead.
   [junit4]   2> 406662 T1164 oass.OpenExchangeRatesOrgProvider.init Initialized with rates=open-exchange-rates.json, refreshInterval=1440.
   [junit4]   2> 406667 T1164 oass.IndexSchema.readSchema default search field in schema is text
   [junit4]   2> 406669 T1164 oass.IndexSchema.readSchema unique key field: id
   [junit4]   2> 406679 T1164 oass.FileExchangeRateProvider.reload Reloading exchange rates from file currency.xml
   [junit4]   2> 406683 T1164 oass.FileExchangeRateProvider.reload Reloading exchange rates from file currency.xml
   [junit4]   2> 406687 T1164 oass.OpenExchangeRatesOrgProvider.reload Reloading exchange rates from open-exchange-rates.json
   [junit4]   2> 406688 T1164 oass.OpenExchangeRatesOrgProvider$OpenExchangeRates.<init> WARN Unknown key IMPORTANT NOTE
   [junit4]   2> 406689 T1164 oass.OpenExchangeRatesOrgProvider$OpenExchangeRates.<init> WARN Expected key, got STRING
   [junit4]   2> 406689 T1164 oass.OpenExchangeRatesOrgProvider.reload Reloading exchange rates from open-exchange-rates.json
   [junit4]   2> 406690 T1164 oass.OpenExchangeRatesOrgProvider$OpenExchangeRates.<init> WARN Unknown key IMPORTANT NOTE
   [junit4]   2> 406690 T1164 oass.OpenExchangeRatesOrgProvider$OpenExchangeRates.<init> WARN Expected key, got STRING
   [junit4]   2> 406691 T1164 oasc.SolrCore.initDirectoryFactory org.apache.solr.core.MockDirectoryFactory
   [junit4]   2> 406691 T1164 oasc.SolrCore.<init> [collection1] Opening new SolrCore at /mnt/ssd/jenkins/workspace/Lucene-Solr-4.x-Linux/solr/build/solr-core/test/J1/./org.apache.solr.cloud.BasicDistributedZk2Test-jetty3-1375426430024/collection1/, dataDir=./org.apache.solr.cloud.BasicDistributedZk2Test-1375426420346/jetty3/
   [junit4]   2> 406691 T1164 oasc.JmxMonitoredMap.<init> JMX monitoring is enabled. Adding Solr mbeans to JMX Server: com.sun.jmx.mbeanserver.JmxMBeanServer@34d51f86
   [junit4]   2> 406692 T1164 oasc.CachingDirectoryFactory.get return new directory for ./org.apache.solr.cloud.BasicDistributedZk2Test-1375426420346/jetty3
   [junit4]   2> 406692 T1164 oasc.SolrCore.getNewIndexDir New index directory detected: old=null new=./org.apache.solr.cloud.BasicDistributedZk2Test-1375426420346/jetty3/index/
   [junit4]   2> 406693 T1164 oasc.SolrCore.initIndex WARN [collection1] Solr index directory './org.apache.solr.cloud.BasicDistributedZk2Test-1375426420346/jetty3/index' doesn't exist. Creating new index...
   [junit4]   2> 406693 T1164 oasc.CachingDirectoryFactory.get return new directory for ./org.apache.solr.cloud.BasicDistributedZk2Test-1375426420346/jetty3/index
   [junit4]   2> 406694 T1164 oasc.SolrDeletionPolicy.onCommit SolrDeletionPolicy.onCommit: commits: num=1
   [junit4]   2> 		commit{dir=MockDirWrapper(org.apache.lucene.store.RAMDirectory@e53ffd42 lockFactory=org.apache.lucene.store.NativeFSLockFactory@5e70ea9f),segFN=segments_1,generation=1}
   [junit4]   2> 406695 T1164 oasc.SolrDeletionPolicy.updateCommits newest commit generation = 1
   [junit4]   2> 406697 T1164 oasup.UpdateRequestProcessorChain.init inserting DistributedUpdateProcessorFactory into updateRequestProcessorChain "dedupe"
   [junit4]   2> 406698 T1164 oasup.UpdateRequestProcessorChain.init inserting DistributedUpdateProcessorFactory into updateRequestProcessorChain "stored_sig"
   [junit4]   2> 406698 T1164 oasup.UpdateRequestProcessorChain.init inserting DistributedUpdateProcessorFactory into updateRequestProcessorChain "distrib-dup-test-chain-implicit"
   [junit4]   2> 406699 T1164 oasc.RequestHandlers.initHandlersFromConfig created standard: solr.StandardRequestHandler
   [junit4]   2> 406699 T1164 oasc.Req

[...truncated too long message...]

,docsPending=0,adds=0,deletesById=0,deletesByQuery=0,errors=0,cumulative_adds=3,cumulative_deletesById=0,cumulative_deletesByQuery=1,cumulative_errors=0}
   [junit4]   2> 917431 T2416 oasu.SolrCoreState.decrefSolrCoreState Closing SolrCoreState
   [junit4]   2> 917431 T2416 oasu.DefaultSolrCoreState.closeIndexWriter SolrCoreState ref count has reached 0 - closing IndexWriter
   [junit4]   2> 917432 T2416 oasu.DefaultSolrCoreState.closeIndexWriter closing IndexWriter with IndexWriterCloser
   [junit4]   2> 917433 T2416 oasc.SolrCore.closeSearcher [new_implicit_coll_0_c_replica3] Closing main searcher on request.
   [junit4]   2> 917433 T2416 oasc.CachingDirectoryFactory.close Closing MockDirectoryFactory - 2 directories currently being tracked
   [junit4]   2> 917434 T2416 oasc.CachingDirectoryFactory.closeCacheValue looking to close /mnt/ssd/jenkins/workspace/Lucene-Solr-4.x-Linux/solr/build/solr-core/test/J1/./org.apache.solr.cloud.CollectionsAPIDistributedZkTest-jetty4-1375426843299//new_implicit_coll_0_c_replica3/data [CachedDir<<refCount=0;path=/mnt/ssd/jenkins/workspace/Lucene-Solr-4.x-Linux/solr/build/solr-core/test/J1/./org.apache.solr.cloud.CollectionsAPIDistributedZkTest-jetty4-1375426843299//new_implicit_coll_0_c_replica3/data;done=false>>]
   [junit4]   2> 917434 T2416 oasc.CachingDirectoryFactory.close Closing directory: /mnt/ssd/jenkins/workspace/Lucene-Solr-4.x-Linux/solr/build/solr-core/test/J1/./org.apache.solr.cloud.CollectionsAPIDistributedZkTest-jetty4-1375426843299//new_implicit_coll_0_c_replica3/data
   [junit4]   2> 917435 T2416 oasc.CachingDirectoryFactory.closeCacheValue looking to close /mnt/ssd/jenkins/workspace/Lucene-Solr-4.x-Linux/solr/build/solr-core/test/J1/./org.apache.solr.cloud.CollectionsAPIDistributedZkTest-jetty4-1375426843299//new_implicit_coll_0_c_replica3/data/index [CachedDir<<refCount=0;path=/mnt/ssd/jenkins/workspace/Lucene-Solr-4.x-Linux/solr/build/solr-core/test/J1/./org.apache.solr.cloud.CollectionsAPIDistributedZkTest-jetty4-1375426843299//new_implicit_coll_0_c_replica3/data/index;done=false>>]
   [junit4]   2> 917435 T2416 oasc.CachingDirectoryFactory.close Closing directory: /mnt/ssd/jenkins/workspace/Lucene-Solr-4.x-Linux/solr/build/solr-core/test/J1/./org.apache.solr.cloud.CollectionsAPIDistributedZkTest-jetty4-1375426843299//new_implicit_coll_0_c_replica3/data/index
   [junit4]   2> 917436 T2727 oasc.Overseer$ClusterStateUpdater.amILeader According to ZK I (id=90139973346459660-127.0.0.1:57391_-n_0000000004) am no longer a leader.
   [junit4]   2> 917458 T2416 oejsh.ContextHandler.doStop stopped o.e.j.s.ServletContextHandler{/,null}
   [junit4]   2> 917512 T2416 oas.SolrTestCaseJ4.tearDown ###Ending testDistribSearch
   [junit4]   2> 917513 T2416 oasc.ZkTestServer.send4LetterWord connecting to 127.0.0.1:59851 59851
   [junit4]   1> client port:0.0.0.0/0.0.0.0:0
   [junit4]   2> NOTE: reproduce with: ant test  -Dtestcase=CollectionsAPIDistributedZkTest -Dtests.method=testDistribSearch -Dtests.seed=1DF98AA475E602A1 -Dtests.multiplier=3 -Dtests.slow=true -Dtests.locale=es_BO -Dtests.timezone=America/Asuncion -Dtests.file.encoding=UTF-8
   [junit4] ERROR    104s J1 | CollectionsAPIDistributedZkTest.testDistribSearch <<<
   [junit4]    > Throwable #1: org.apache.solr.client.solrj.SolrServerException: Server refused connection at: http://127.0.0.1:35559
   [junit4]    > 	at __randomizedtesting.SeedInfo.seed([1DF98AA475E602A1:9C1F04BC02B9629D]:0)
   [junit4]    > 	at org.apache.solr.client.solrj.impl.HttpSolrServer.request(HttpSolrServer.java:428)
   [junit4]    > 	at org.apache.solr.client.solrj.impl.HttpSolrServer.request(HttpSolrServer.java:180)
   [junit4]    > 	at org.apache.solr.cloud.CollectionsAPIDistributedZkTest.testCustomCollectionsAPI(CollectionsAPIDistributedZkTest.java:764)
   [junit4]    > 	at org.apache.solr.cloud.CollectionsAPIDistributedZkTest.doTest(CollectionsAPIDistributedZkTest.java:159)
   [junit4]    > 	at org.apache.solr.BaseDistributedSearchTestCase.testDistribSearch(BaseDistributedSearchTestCase.java:835)
   [junit4]    > 	at java.lang.Thread.run(Thread.java:780)
   [junit4]    > Caused by: org.apache.http.conn.HttpHostConnectException: Connection to http://127.0.0.1:35559 refused
   [junit4]    > 	at org.apache.http.impl.conn.DefaultClientConnectionOperator.openConnection(DefaultClientConnectionOperator.java:190)
   [junit4]    > 	at org.apache.http.impl.conn.ManagedClientConnectionImpl.open(ManagedClientConnectionImpl.java:294)
   [junit4]    > 	at org.apache.http.impl.client.DefaultRequestDirector.tryConnect(DefaultRequestDirector.java:645)
   [junit4]    > 	at org.apache.http.impl.client.DefaultRequestDirector.execute(DefaultRequestDirector.java:480)
   [junit4]    > 	at org.apache.http.impl.client.AbstractHttpClient.execute(AbstractHttpClient.java:906)
   [junit4]    > 	at org.apache.http.impl.client.AbstractHttpClient.execute(AbstractHttpClient.java:805)
   [junit4]    > 	at org.apache.http.impl.client.AbstractHttpClient.execute(AbstractHttpClient.java:784)
   [junit4]    > 	at org.apache.solr.client.solrj.impl.HttpSolrServer.request(HttpSolrServer.java:365)
   [junit4]    > 	... 44 more
   [junit4]    > Caused by: java.net.ConnectException: Connection refused
   [junit4]    > 	at java.net.AbstractPlainSocketImpl.doConnect(AbstractPlainSocketImpl.java:369)
   [junit4]    > 	at java.net.AbstractPlainSocketImpl.connectToAddress(AbstractPlainSocketImpl.java:230)
   [junit4]    > 	at java.net.AbstractPlainSocketImpl.connect(AbstractPlainSocketImpl.java:212)
   [junit4]    > 	at java.net.SocksSocketImpl.connect(SocksSocketImpl.java:402)
   [junit4]    > 	at java.net.Socket.connect(Socket.java:590)
   [junit4]    > 	at org.apache.http.conn.scheme.PlainSocketFactory.connectSocket(PlainSocketFactory.java:127)
   [junit4]    > 	at org.apache.http.impl.conn.DefaultClientConnectionOperator.openConnection(DefaultClientConnectionOperator.java:180)
   [junit4]    > 	... 51 more
   [junit4]   2> 917530 T2416 oas.SolrTestCaseJ4.deleteCore ###deleteCore
   [junit4]   2> 104172 T2415 ccr.ThreadLeakControl.checkThreadLeaks WARNING Will linger awaiting termination of 3 leaked thread(s).
   [junit4]   2> 918737 T2498 oascc.ZkStateReader$3.process WARN ZooKeeper watch triggered, but Solr cannot talk to ZK
   [junit4]   2> 918738 T2498 oascc.ZkStateReader$2.process A cluster state change: WatchedEvent state:SyncConnected type:NodeChildrenChanged path:/live_nodes, has occurred - updating... (live nodes size: 1)
   [junit4]   2> 918738 T2498 oascc.ZkStateReader$2.process WARN ZooKeeper watch triggered, but Solr cannot talk to ZK
   [junit4]   2> NOTE: test params are: codec=Asserting, sim=DefaultSimilarity, locale=es_BO, timezone=America/Asuncion
   [junit4]   2> NOTE: Linux 3.2.0-51-generic x86/IBM Corporation 1.7.0 (32-bit)/cpus=8,threads=3,free=43685968,total=239468544
   [junit4]   2> NOTE: All tests run in this JVM: [SolrRequestParserTest, OpenExchangeRatesOrgProviderTest, TestMergePolicyConfig, StressHdfsTest, ChaosMonkeySafeLeaderTest, CoreMergeIndexesAdminHandlerTest, SortByFunctionTest, OpenCloseCoreStressTest, TestStressReorder, TermVectorComponentDistributedTest, TimeZoneUtilsTest, DOMUtilTest, TestStressLucene, PathHierarchyTokenizerFactoryTest, DefaultValueUpdateProcessorTest, OutputWriterTest, TestClassNameShortening, TestIndexingPerformance, FileUtilsTest, ZkNodePropsTest, TestRangeQuery, BadIndexSchemaTest, BlockCacheTest, ConvertedLegacyTest, TestRTGBase, TestRandomFaceting, TestQuerySenderNoQuery, DistanceFunctionTest, NotRequiredUniqueKeyTest, MultiTermTest, BasicDistributedZk2Test, HardAutoCommitTest, QueryResultKeyTest, TestCloudManagedSchemaAddField, SolrCmdDistributorTest, TestJmxIntegration, TestDefaultSimilarityFactory, DocValuesMultiTest, TestFieldResource, BlockDirectoryTest, TestUpdate, TestZkChroot, RequestHandlersTest, ClusterStateTest, SolrIndexConfigTest, TestSuggestSpellingConverter, TestAtomicUpdateErrorCases, TestDistributedSearch, CopyFieldTest, TestFastOutputStream, LeaderElectionIntegrationTest, TestQueryTypes, DisMaxRequestHandlerTest, CoreContainerCoreInitFailuresTest, UniqFieldsUpdateProcessorFactoryTest, TestArbitraryIndexDir, RequiredFieldsTest, TestBinaryField, TestCoreDiscovery, TestShardHandlerFactory, TestAddFieldRealTimeGet, TestNumberUtils, StandardRequestHandlerTest, NumericFieldsTest, TestLuceneMatchVersion, BasicZkTest, IndexBasedSpellCheckerTest, TestSystemIdResolver, TestFiltering, TestDynamicFieldResource, TestElisionMultitermQuery, HdfsLockFactoryTest, CachingDirectoryFactoryTest, TestCollationField, TestSolr4Spatial, UnloadDistributedZkTest, CollectionsAPIDistributedZkTest]
   [junit4] Completed on J1 in 105.45s, 1 test, 1 error <<< FAILURES!

[...truncated 489 lines...]
BUILD FAILED
/mnt/ssd/jenkins/workspace/Lucene-Solr-4.x-Linux/build.xml:395: The following error occurred while executing this line:
/mnt/ssd/jenkins/workspace/Lucene-Solr-4.x-Linux/build.xml:388: The following error occurred while executing this line:
/mnt/ssd/jenkins/workspace/Lucene-Solr-4.x-Linux/build.xml:39: The following error occurred while executing this line:
/mnt/ssd/jenkins/workspace/Lucene-Solr-4.x-Linux/solr/build.xml:181: The following error occurred while executing this line:
/mnt/ssd/jenkins/workspace/Lucene-Solr-4.x-Linux/solr/common-build.xml:449: The following error occurred while executing this line:
/mnt/ssd/jenkins/workspace/Lucene-Solr-4.x-Linux/lucene/common-build.xml:1233: The following error occurred while executing this line:
/mnt/ssd/jenkins/workspace/Lucene-Solr-4.x-Linux/lucene/common-build.xml:876: There were test failures: 321 suites, 1352 tests, 3 errors, 34 ignored (6 assumptions)

Total time: 47 minutes 12 seconds
Build step 'Invoke Ant' marked build as failure
Description set: Java: 32bit/ibm-j9-jdk7 -Xjit:exclude={org/apache/lucene/util/fst/FST.pack(IIF)Lorg/apache/lucene/util/fst/FST;}
Archiving artifacts
Recording test results
Email was triggered for: Failure
Sending email for trigger: Failure



Mime
View raw message