lucene-dev mailing list archives

Site index · List index
Message view « Date » · « Thread »
Top « Date » · « Thread »
From Policeman Jenkins Server <jenk...@thetaphi.de>
Subject [JENKINS] Lucene-Solr-4.x-Linux (32bit/jdk1.6.0_45) - Build # 6759 - Still Failing!
Date Fri, 02 Aug 2013 02:43:31 GMT
Build: http://jenkins.thetaphi.de/job/Lucene-Solr-4.x-Linux/6759/
Java: 32bit/jdk1.6.0_45 -client -XX:+UseSerialGC

1 tests failed.
FAILED:  org.apache.solr.cloud.CollectionsAPIDistributedZkTest.testDistribSearch

Error Message:
Server refused connection at: http://127.0.0.1:35869/_

Stack Trace:
org.apache.solr.client.solrj.SolrServerException: Server refused connection at: http://127.0.0.1:35869/_
	at __randomizedtesting.SeedInfo.seed([D400734A7C2D0747:55E6FD520B72677B]:0)
	at org.apache.solr.client.solrj.impl.HttpSolrServer.request(HttpSolrServer.java:428)
	at org.apache.solr.client.solrj.impl.HttpSolrServer.request(HttpSolrServer.java:180)
	at org.apache.solr.cloud.CollectionsAPIDistributedZkTest.testCustomCollectionsAPI(CollectionsAPIDistributedZkTest.java:764)
	at org.apache.solr.cloud.CollectionsAPIDistributedZkTest.doTest(CollectionsAPIDistributedZkTest.java:159)
	at org.apache.solr.BaseDistributedSearchTestCase.testDistribSearch(BaseDistributedSearchTestCase.java:835)
	at sun.reflect.NativeMethodAccessorImpl.invoke0(Native Method)
	at sun.reflect.NativeMethodAccessorImpl.invoke(NativeMethodAccessorImpl.java:39)
	at sun.reflect.DelegatingMethodAccessorImpl.invoke(DelegatingMethodAccessorImpl.java:25)
	at java.lang.reflect.Method.invoke(Method.java:597)
	at com.carrotsearch.randomizedtesting.RandomizedRunner.invoke(RandomizedRunner.java:1559)
	at com.carrotsearch.randomizedtesting.RandomizedRunner.access$600(RandomizedRunner.java:79)
	at com.carrotsearch.randomizedtesting.RandomizedRunner$6.evaluate(RandomizedRunner.java:737)
	at com.carrotsearch.randomizedtesting.RandomizedRunner$7.evaluate(RandomizedRunner.java:773)
	at com.carrotsearch.randomizedtesting.RandomizedRunner$8.evaluate(RandomizedRunner.java:787)
	at com.carrotsearch.randomizedtesting.rules.SystemPropertiesRestoreRule$1.evaluate(SystemPropertiesRestoreRule.java:53)
	at org.apache.lucene.util.TestRuleSetupTeardownChained$1.evaluate(TestRuleSetupTeardownChained.java:50)
	at org.apache.lucene.util.TestRuleFieldCacheSanity$1.evaluate(TestRuleFieldCacheSanity.java:51)
	at org.apache.lucene.util.AbstractBeforeAfterRule$1.evaluate(AbstractBeforeAfterRule.java:46)
	at com.carrotsearch.randomizedtesting.rules.SystemPropertiesInvariantRule$1.evaluate(SystemPropertiesInvariantRule.java:55)
	at org.apache.lucene.util.TestRuleThreadAndTestName$1.evaluate(TestRuleThreadAndTestName.java:49)
	at org.apache.lucene.util.TestRuleIgnoreAfterMaxFailures$1.evaluate(TestRuleIgnoreAfterMaxFailures.java:70)
	at org.apache.lucene.util.TestRuleMarkFailure$1.evaluate(TestRuleMarkFailure.java:48)
	at com.carrotsearch.randomizedtesting.rules.StatementAdapter.evaluate(StatementAdapter.java:36)
	at com.carrotsearch.randomizedtesting.ThreadLeakControl$StatementRunner.run(ThreadLeakControl.java:358)
	at com.carrotsearch.randomizedtesting.ThreadLeakControl.forkTimeoutingTask(ThreadLeakControl.java:782)
	at com.carrotsearch.randomizedtesting.ThreadLeakControl$3.evaluate(ThreadLeakControl.java:442)
	at com.carrotsearch.randomizedtesting.RandomizedRunner.runSingleTest(RandomizedRunner.java:746)
	at com.carrotsearch.randomizedtesting.RandomizedRunner$3.evaluate(RandomizedRunner.java:648)
	at com.carrotsearch.randomizedtesting.RandomizedRunner$4.evaluate(RandomizedRunner.java:682)
	at com.carrotsearch.randomizedtesting.RandomizedRunner$5.evaluate(RandomizedRunner.java:693)
	at com.carrotsearch.randomizedtesting.rules.StatementAdapter.evaluate(StatementAdapter.java:36)
	at com.carrotsearch.randomizedtesting.rules.SystemPropertiesRestoreRule$1.evaluate(SystemPropertiesRestoreRule.java:53)
	at org.apache.lucene.util.AbstractBeforeAfterRule$1.evaluate(AbstractBeforeAfterRule.java:46)
	at org.apache.lucene.util.TestRuleStoreClassName$1.evaluate(TestRuleStoreClassName.java:42)
	at com.carrotsearch.randomizedtesting.rules.SystemPropertiesInvariantRule$1.evaluate(SystemPropertiesInvariantRule.java:55)
	at com.carrotsearch.randomizedtesting.rules.NoShadowingOrOverridesOnMethodsRule$1.evaluate(NoShadowingOrOverridesOnMethodsRule.java:39)
	at com.carrotsearch.randomizedtesting.rules.NoShadowingOrOverridesOnMethodsRule$1.evaluate(NoShadowingOrOverridesOnMethodsRule.java:39)
	at com.carrotsearch.randomizedtesting.rules.StatementAdapter.evaluate(StatementAdapter.java:36)
	at org.apache.lucene.util.TestRuleAssertionsRequired$1.evaluate(TestRuleAssertionsRequired.java:43)
	at org.apache.lucene.util.TestRuleMarkFailure$1.evaluate(TestRuleMarkFailure.java:48)
	at org.apache.lucene.util.TestRuleIgnoreAfterMaxFailures$1.evaluate(TestRuleIgnoreAfterMaxFailures.java:70)
	at org.apache.lucene.util.TestRuleIgnoreTestSuites$1.evaluate(TestRuleIgnoreTestSuites.java:55)
	at com.carrotsearch.randomizedtesting.rules.StatementAdapter.evaluate(StatementAdapter.java:36)
	at com.carrotsearch.randomizedtesting.ThreadLeakControl$StatementRunner.run(ThreadLeakControl.java:358)
	at java.lang.Thread.run(Thread.java:662)
Caused by: org.apache.http.conn.HttpHostConnectException: Connection to http://127.0.0.1:35869 refused
	at org.apache.http.impl.conn.DefaultClientConnectionOperator.openConnection(DefaultClientConnectionOperator.java:190)
	at org.apache.http.impl.conn.ManagedClientConnectionImpl.open(ManagedClientConnectionImpl.java:294)
	at org.apache.http.impl.client.DefaultRequestDirector.tryConnect(DefaultRequestDirector.java:645)
	at org.apache.http.impl.client.DefaultRequestDirector.execute(DefaultRequestDirector.java:480)
	at org.apache.http.impl.client.AbstractHttpClient.execute(AbstractHttpClient.java:906)
	at org.apache.http.impl.client.AbstractHttpClient.execute(AbstractHttpClient.java:805)
	at org.apache.http.impl.client.AbstractHttpClient.execute(AbstractHttpClient.java:784)
	at org.apache.solr.client.solrj.impl.HttpSolrServer.request(HttpSolrServer.java:365)
	... 44 more
Caused by: java.net.ConnectException: Connection refused
	at java.net.PlainSocketImpl.socketConnect(Native Method)
	at java.net.PlainSocketImpl.doConnect(PlainSocketImpl.java:351)
	at java.net.PlainSocketImpl.connectToAddress(PlainSocketImpl.java:213)
	at java.net.PlainSocketImpl.connect(PlainSocketImpl.java:200)
	at java.net.SocksSocketImpl.connect(SocksSocketImpl.java:366)
	at java.net.Socket.connect(Socket.java:529)
	at org.apache.http.conn.scheme.PlainSocketFactory.connectSocket(PlainSocketFactory.java:127)
	at org.apache.http.impl.conn.DefaultClientConnectionOperator.openConnection(DefaultClientConnectionOperator.java:180)
	... 51 more




Build Log:
[...truncated 9279 lines...]
   [junit4] Suite: org.apache.solr.cloud.CollectionsAPIDistributedZkTest
   [junit4]   2> 914695 T2321 oas.BaseDistributedSearchTestCase.initHostContext Setting hostContext system property: /_/
   [junit4]   2> 914700 T2321 oas.SolrTestCaseJ4.setUp ###Starting testDistribSearch
   [junit4]   2> Creating dataDir: /mnt/ssd/jenkins/workspace/Lucene-Solr-4.x-Linux/solr/build/solr-core/test/J1/./solrtest-CollectionsAPIDistributedZkTest-1375410901884
   [junit4]   2> 914701 T2321 oasc.ZkTestServer.run STARTING ZK TEST SERVER
   [junit4]   2> 914701 T2322 oasc.ZkTestServer$ZKServerMain.runFromConfig Starting server
   [junit4]   2> 914801 T2321 oasc.ZkTestServer.run start zk server on port:54235
   [junit4]   2> 914803 T2321 oascc.ConnectionManager.waitForConnected Waiting for client to connect to ZooKeeper
   [junit4]   2> 914805 T2328 oascc.ConnectionManager.process Watcher org.apache.solr.common.cloud.ConnectionManager@666b04 name:ZooKeeperConnection Watcher:127.0.0.1:54235 got event WatchedEvent state:SyncConnected type:None path:null path:null type:None
   [junit4]   2> 914806 T2321 oascc.ConnectionManager.waitForConnected Client is connected to ZooKeeper
   [junit4]   2> 914806 T2321 oascc.SolrZkClient.makePath makePath: /solr
   [junit4]   2> 914812 T2321 oascc.ConnectionManager.waitForConnected Waiting for client to connect to ZooKeeper
   [junit4]   2> 914813 T2330 oascc.ConnectionManager.process Watcher org.apache.solr.common.cloud.ConnectionManager@ab2745 name:ZooKeeperConnection Watcher:127.0.0.1:54235/solr got event WatchedEvent state:SyncConnected type:None path:null path:null type:None
   [junit4]   2> 914813 T2321 oascc.ConnectionManager.waitForConnected Client is connected to ZooKeeper
   [junit4]   2> 914814 T2321 oascc.SolrZkClient.makePath makePath: /collections/collection1
   [junit4]   2> 914818 T2321 oascc.SolrZkClient.makePath makePath: /collections/collection1/shards
   [junit4]   2> 914822 T2321 oascc.SolrZkClient.makePath makePath: /collections/control_collection
   [junit4]   2> 914835 T2321 oascc.SolrZkClient.makePath makePath: /collections/control_collection/shards
   [junit4]   2> 914839 T2321 oasc.AbstractZkTestCase.putConfig put /mnt/ssd/jenkins/workspace/Lucene-Solr-4.x-Linux/solr/build/solr-core/test-files/solr/collection1/conf/solrconfig-tlog.xml to /configs/conf1/solrconfig.xml
   [junit4]   2> 914839 T2321 oascc.SolrZkClient.makePath makePath: /configs/conf1/solrconfig.xml
   [junit4]   2> 914845 T2321 oasc.AbstractZkTestCase.putConfig put /mnt/ssd/jenkins/workspace/Lucene-Solr-4.x-Linux/solr/build/solr-core/test-files/solr/collection1/conf/schema.xml to /configs/conf1/schema.xml
   [junit4]   2> 914845 T2321 oascc.SolrZkClient.makePath makePath: /configs/conf1/schema.xml
   [junit4]   2> 914850 T2321 oasc.AbstractZkTestCase.putConfig put /mnt/ssd/jenkins/workspace/Lucene-Solr-4.x-Linux/solr/build/solr-core/test-files/solr/collection1/conf/stopwords.txt to /configs/conf1/stopwords.txt
   [junit4]   2> 914850 T2321 oascc.SolrZkClient.makePath makePath: /configs/conf1/stopwords.txt
   [junit4]   2> 914854 T2321 oasc.AbstractZkTestCase.putConfig put /mnt/ssd/jenkins/workspace/Lucene-Solr-4.x-Linux/solr/build/solr-core/test-files/solr/collection1/conf/protwords.txt to /configs/conf1/protwords.txt
   [junit4]   2> 914854 T2321 oascc.SolrZkClient.makePath makePath: /configs/conf1/protwords.txt
   [junit4]   2> 914858 T2321 oasc.AbstractZkTestCase.putConfig put /mnt/ssd/jenkins/workspace/Lucene-Solr-4.x-Linux/solr/build/solr-core/test-files/solr/collection1/conf/currency.xml to /configs/conf1/currency.xml
   [junit4]   2> 914859 T2321 oascc.SolrZkClient.makePath makePath: /configs/conf1/currency.xml
   [junit4]   2> 914864 T2321 oasc.AbstractZkTestCase.putConfig put /mnt/ssd/jenkins/workspace/Lucene-Solr-4.x-Linux/solr/build/solr-core/test-files/solr/collection1/conf/open-exchange-rates.json to /configs/conf1/open-exchange-rates.json
   [junit4]   2> 914865 T2321 oascc.SolrZkClient.makePath makePath: /configs/conf1/open-exchange-rates.json
   [junit4]   2> 914869 T2321 oasc.AbstractZkTestCase.putConfig put /mnt/ssd/jenkins/workspace/Lucene-Solr-4.x-Linux/solr/build/solr-core/test-files/solr/collection1/conf/mapping-ISOLatin1Accent.txt to /configs/conf1/mapping-ISOLatin1Accent.txt
   [junit4]   2> 914870 T2321 oascc.SolrZkClient.makePath makePath: /configs/conf1/mapping-ISOLatin1Accent.txt
   [junit4]   2> 914875 T2321 oasc.AbstractZkTestCase.putConfig put /mnt/ssd/jenkins/workspace/Lucene-Solr-4.x-Linux/solr/build/solr-core/test-files/solr/collection1/conf/old_synonyms.txt to /configs/conf1/old_synonyms.txt
   [junit4]   2> 914875 T2321 oascc.SolrZkClient.makePath makePath: /configs/conf1/old_synonyms.txt
   [junit4]   2> 914882 T2321 oasc.AbstractZkTestCase.putConfig put /mnt/ssd/jenkins/workspace/Lucene-Solr-4.x-Linux/solr/build/solr-core/test-files/solr/collection1/conf/synonyms.txt to /configs/conf1/synonyms.txt
   [junit4]   2> 914883 T2321 oascc.SolrZkClient.makePath makePath: /configs/conf1/synonyms.txt
   [junit4]   2> 914990 T2321 oejs.Server.doStart jetty-8.1.10.v20130312
   [junit4]   2> 914998 T2321 oejs.AbstractConnector.doStart Started SelectChannelConnector@127.0.0.1:55293
   [junit4]   2> 914999 T2321 oass.SolrDispatchFilter.init SolrDispatchFilter.init()
   [junit4]   2> 914999 T2321 oasc.SolrResourceLoader.locateSolrHome JNDI not configured for solr (NoInitialContextEx)
   [junit4]   2> 915000 T2321 oasc.SolrResourceLoader.locateSolrHome using system property solr.solr.home: /mnt/ssd/jenkins/workspace/Lucene-Solr-4.x-Linux/solr/build/solr-core/test/J1/./org.apache.solr.cloud.CollectionsAPIDistributedZkTest-controljetty-1375410902074
   [junit4]   2> 915000 T2321 oasc.SolrResourceLoader.<init> new SolrResourceLoader for directory: '/mnt/ssd/jenkins/workspace/Lucene-Solr-4.x-Linux/solr/build/solr-core/test/J1/./org.apache.solr.cloud.CollectionsAPIDistributedZkTest-controljetty-1375410902074/'
   [junit4]   2> 915016 T2321 oasc.ConfigSolr.fromFile Loading container configuration from /mnt/ssd/jenkins/workspace/Lucene-Solr-4.x-Linux/solr/build/solr-core/test/J1/./org.apache.solr.cloud.CollectionsAPIDistributedZkTest-controljetty-1375410902074/solr.xml
   [junit4]   2> 915072 T2321 oasc.ConfigSolrXml.<init> Config-defined core root directory: 
   [junit4]   2> 915073 T2321 oasc.CoreContainer.<init> New CoreContainer 16916803
   [junit4]   2> 915073 T2321 oasc.CoreContainer.load Loading cores into CoreContainer [instanceDir=/mnt/ssd/jenkins/workspace/Lucene-Solr-4.x-Linux/solr/build/solr-core/test/J1/./org.apache.solr.cloud.CollectionsAPIDistributedZkTest-controljetty-1375410902074/]
   [junit4]   2> 915074 T2321 oashc.HttpShardHandlerFactory.getParameter Setting socketTimeout to: 120000
   [junit4]   2> 915075 T2321 oashc.HttpShardHandlerFactory.getParameter Setting urlScheme to: http://
   [junit4]   2> 915075 T2321 oashc.HttpShardHandlerFactory.getParameter Setting connTimeout to: 15000
   [junit4]   2> 915076 T2321 oashc.HttpShardHandlerFactory.getParameter Setting maxConnectionsPerHost to: 20
   [junit4]   2> 915076 T2321 oashc.HttpShardHandlerFactory.getParameter Setting corePoolSize to: 0
   [junit4]   2> 915077 T2321 oashc.HttpShardHandlerFactory.getParameter Setting maximumPoolSize to: 2147483647
   [junit4]   2> 915077 T2321 oashc.HttpShardHandlerFactory.getParameter Setting maxThreadIdleTime to: 5
   [junit4]   2> 915078 T2321 oashc.HttpShardHandlerFactory.getParameter Setting sizeOfQueue to: -1
   [junit4]   2> 915078 T2321 oashc.HttpShardHandlerFactory.getParameter Setting fairnessPolicy to: false
   [junit4]   2> 915079 T2321 oascsi.HttpClientUtil.createClient Creating new http client, config:maxConnectionsPerHost=20&maxConnections=10000&socketTimeout=120000&connTimeout=15000&retry=false
   [junit4]   2> 915084 T2321 oasc.ZkContainer.initZooKeeper Zookeeper client=127.0.0.1:54235/solr
   [junit4]   2> 915084 T2321 oasc.ZkController.checkChrootPath zkHost includes chroot
   [junit4]   2> 915086 T2321 oascc.ConnectionManager.waitForConnected Waiting for client to connect to ZooKeeper
   [junit4]   2> 915088 T2341 oascc.ConnectionManager.process Watcher org.apache.solr.common.cloud.ConnectionManager@d5f3c5 name:ZooKeeperConnection Watcher:127.0.0.1:54235 got event WatchedEvent state:SyncConnected type:None path:null path:null type:None
   [junit4]   2> 915088 T2321 oascc.ConnectionManager.waitForConnected Client is connected to ZooKeeper
   [junit4]   2> 915093 T2321 oascsi.HttpClientUtil.createClient Creating new http client, config:maxConnections=500&maxConnectionsPerHost=16&socketTimeout=120000&connTimeout=15000
   [junit4]   2> 915100 T2321 oascc.ConnectionManager.waitForConnected Waiting for client to connect to ZooKeeper
   [junit4]   2> 915102 T2343 oascc.ConnectionManager.process Watcher org.apache.solr.common.cloud.ConnectionManager@165a745 name:ZooKeeperConnection Watcher:127.0.0.1:54235/solr got event WatchedEvent state:SyncConnected type:None path:null path:null type:None
   [junit4]   2> 915102 T2321 oascc.ConnectionManager.waitForConnected Client is connected to ZooKeeper
   [junit4]   2> 915104 T2321 oascc.SolrZkClient.makePath makePath: /overseer/queue
   [junit4]   2> 915125 T2321 oascc.SolrZkClient.makePath makePath: /overseer/collection-queue-work
   [junit4]   2> 915131 T2321 oascc.SolrZkClient.makePath makePath: /live_nodes
   [junit4]   2> 915148 T2321 oasc.ZkController.createEphemeralLiveNode Register node as live in ZooKeeper:/live_nodes/127.0.0.1:55293__
   [junit4]   2> 915152 T2321 oascc.SolrZkClient.makePath makePath: /live_nodes/127.0.0.1:55293__
   [junit4]   2> 915158 T2321 oascc.SolrZkClient.makePath makePath: /overseer_elect/election
   [junit4]   2> 915181 T2321 oascc.SolrZkClient.makePath makePath: /overseer_elect/leader
   [junit4]   2> 915185 T2321 oasc.Overseer.start Overseer (id=90138928866066435-127.0.0.1:55293__-n_0000000000) starting
   [junit4]   2> 915189 T2321 oascc.SolrZkClient.makePath makePath: /overseer/queue-work
   [junit4]   2> 915214 T2345 oasc.OverseerCollectionProcessor.run Process current queue of collection creations
   [junit4]   2> 915215 T2321 oascc.SolrZkClient.makePath makePath: /clusterstate.json
   [junit4]   2> 915219 T2321 oascc.SolrZkClient.makePath makePath: /aliases.json
   [junit4]   2> 915221 T2321 oascc.ZkStateReader.createClusterStateWatchersAndUpdate Updating cluster state from ZooKeeper... 
   [junit4]   2> 915229 T2344 oasc.Overseer$ClusterStateUpdater.run Starting to work on the main queue
   [junit4]   2> 915229 T2321 oasc.CorePropertiesLocator.discover Looking for core definitions underneath /mnt/ssd/jenkins/workspace/Lucene-Solr-4.x-Linux/solr/build/solr-core/test/J1/./org.apache.solr.cloud.CollectionsAPIDistributedZkTest-controljetty-1375410902074
   [junit4]   2> 915266 T2321 oasc.CorePropertiesLocator.discoverUnder Found core conf in /mnt/ssd/jenkins/workspace/Lucene-Solr-4.x-Linux/solr/build/solr-core/test/J1/./org.apache.solr.cloud.CollectionsAPIDistributedZkTest-controljetty-1375410902074/conf/
   [junit4]   2> 915266 T2321 oasc.CorePropertiesLocator.discover Found 1 core definitions
   [junit4]   2> 915267 T2321 oass.SolrDispatchFilter.init user.dir=/mnt/ssd/jenkins/workspace/Lucene-Solr-4.x-Linux/solr/build/solr-core/test/J1
   [junit4]   2> 915267 T2321 oass.SolrDispatchFilter.init SolrDispatchFilter.init() done
   [junit4]   2> 915268 T2321 oascsi.HttpClientUtil.createClient Creating new http client, config:maxConnections=128&maxConnectionsPerHost=32&followRedirects=false
   [junit4]   2> 915271 T2321 oascsi.HttpClientUtil.createClient Creating new http client, config:
   [junit4]   2> 915272 T2321 oascc.ConnectionManager.waitForConnected Waiting for client to connect to ZooKeeper
   [junit4]   2> 915273 T2348 oascc.ConnectionManager.process Watcher org.apache.solr.common.cloud.ConnectionManager@1169565 name:ZooKeeperConnection Watcher:127.0.0.1:54235/solr got event WatchedEvent state:SyncConnected type:None path:null path:null type:None
   [junit4]   2> 915273 T2321 oascc.ConnectionManager.waitForConnected Client is connected to ZooKeeper
   [junit4]   2> 915275 T2321 oascc.ZkStateReader.createClusterStateWatchersAndUpdate Updating cluster state from ZooKeeper... 
   [junit4]   2> 915278 T2321 oasc.ChaosMonkey.monkeyLog monkey: init - expire sessions:true cause connection loss:true
   [junit4]   2> 915384 T2321 oejs.Server.doStart jetty-8.1.10.v20130312
   [junit4]   2> 915386 T2321 oejs.AbstractConnector.doStart Started SelectChannelConnector@127.0.0.1:35869
   [junit4]   2> 915387 T2321 oass.SolrDispatchFilter.init SolrDispatchFilter.init()
   [junit4]   2> 915387 T2321 oasc.SolrResourceLoader.locateSolrHome JNDI not configured for solr (NoInitialContextEx)
   [junit4]   2> 915388 T2321 oasc.SolrResourceLoader.locateSolrHome using system property solr.solr.home: /mnt/ssd/jenkins/workspace/Lucene-Solr-4.x-Linux/solr/build/solr-core/test/J1/./org.apache.solr.cloud.CollectionsAPIDistributedZkTest-jetty1-1375410902462
   [junit4]   2> 915388 T2321 oasc.SolrResourceLoader.<init> new SolrResourceLoader for directory: '/mnt/ssd/jenkins/workspace/Lucene-Solr-4.x-Linux/solr/build/solr-core/test/J1/./org.apache.solr.cloud.CollectionsAPIDistributedZkTest-jetty1-1375410902462/'
   [junit4]   2> 915408 T2321 oasc.ConfigSolr.fromFile Loading container configuration from /mnt/ssd/jenkins/workspace/Lucene-Solr-4.x-Linux/solr/build/solr-core/test/J1/./org.apache.solr.cloud.CollectionsAPIDistributedZkTest-jetty1-1375410902462/solr.xml
   [junit4]   2> 915475 T2321 oasc.ConfigSolrXml.<init> Config-defined core root directory: 
   [junit4]   2> 915476 T2321 oasc.CoreContainer.<init> New CoreContainer 3379551
   [junit4]   2> 915476 T2321 oasc.CoreContainer.load Loading cores into CoreContainer [instanceDir=/mnt/ssd/jenkins/workspace/Lucene-Solr-4.x-Linux/solr/build/solr-core/test/J1/./org.apache.solr.cloud.CollectionsAPIDistributedZkTest-jetty1-1375410902462/]
   [junit4]   2> 915477 T2321 oashc.HttpShardHandlerFactory.getParameter Setting socketTimeout to: 120000
   [junit4]   2> 915478 T2321 oashc.HttpShardHandlerFactory.getParameter Setting urlScheme to: http://
   [junit4]   2> 915478 T2321 oashc.HttpShardHandlerFactory.getParameter Setting connTimeout to: 15000
   [junit4]   2> 915478 T2321 oashc.HttpShardHandlerFactory.getParameter Setting maxConnectionsPerHost to: 20
   [junit4]   2> 915479 T2321 oashc.HttpShardHandlerFactory.getParameter Setting corePoolSize to: 0
   [junit4]   2> 915479 T2321 oashc.HttpShardHandlerFactory.getParameter Setting maximumPoolSize to: 2147483647
   [junit4]   2> 915480 T2321 oashc.HttpShardHandlerFactory.getParameter Setting maxThreadIdleTime to: 5
   [junit4]   2> 915480 T2321 oashc.HttpShardHandlerFactory.getParameter Setting sizeOfQueue to: -1
   [junit4]   2> 915480 T2321 oashc.HttpShardHandlerFactory.getParameter Setting fairnessPolicy to: false
   [junit4]   2> 915481 T2321 oascsi.HttpClientUtil.createClient Creating new http client, config:maxConnectionsPerHost=20&maxConnections=10000&socketTimeout=120000&connTimeout=15000&retry=false
   [junit4]   2> 915486 T2321 oasc.ZkContainer.initZooKeeper Zookeeper client=127.0.0.1:54235/solr
   [junit4]   2> 915487 T2321 oasc.ZkController.checkChrootPath zkHost includes chroot
   [junit4]   2> 915489 T2321 oascc.ConnectionManager.waitForConnected Waiting for client to connect to ZooKeeper
   [junit4]   2> 915490 T2359 oascc.ConnectionManager.process Watcher org.apache.solr.common.cloud.ConnectionManager@18d1c15 name:ZooKeeperConnection Watcher:127.0.0.1:54235 got event WatchedEvent state:SyncConnected type:None path:null path:null type:None
   [junit4]   2> 915490 T2321 oascc.ConnectionManager.waitForConnected Client is connected to ZooKeeper
   [junit4]   2> 915496 T2321 oascsi.HttpClientUtil.createClient Creating new http client, config:maxConnections=500&maxConnectionsPerHost=16&socketTimeout=120000&connTimeout=15000
   [junit4]   2> 915507 T2321 oascc.ConnectionManager.waitForConnected Waiting for client to connect to ZooKeeper
   [junit4]   2> 915508 T2361 oascc.ConnectionManager.process Watcher org.apache.solr.common.cloud.ConnectionManager@eabf23 name:ZooKeeperConnection Watcher:127.0.0.1:54235/solr got event WatchedEvent state:SyncConnected type:None path:null path:null type:None
   [junit4]   2> 915512 T2321 oascc.ConnectionManager.waitForConnected Client is connected to ZooKeeper
   [junit4]   2> 915518 T2321 oascc.ZkStateReader.createClusterStateWatchersAndUpdate Updating cluster state from ZooKeeper... 
   [junit4]   2> 916535 T2321 oasc.ZkController.createEphemeralLiveNode Register node as live in ZooKeeper:/live_nodes/127.0.0.1:35869__
   [junit4]   2> 916537 T2321 oascc.SolrZkClient.makePath makePath: /live_nodes/127.0.0.1:35869__
   [junit4]   2> 916544 T2348 oascc.ZkStateReader$3.process Updating live nodes... (2)
   [junit4]   2> 916544 T2361 oascc.ZkStateReader$3.process Updating live nodes... (2)
   [junit4]   2> 916546 T2343 oascc.ZkStateReader$3.process Updating live nodes... (2)
   [junit4]   2> 916561 T2321 oasc.CorePropertiesLocator.discover Looking for core definitions underneath /mnt/ssd/jenkins/workspace/Lucene-Solr-4.x-Linux/solr/build/solr-core/test/J1/./org.apache.solr.cloud.CollectionsAPIDistributedZkTest-jetty1-1375410902462
   [junit4]   2> 916605 T2321 oasc.CorePropertiesLocator.discoverUnder Found core conf in /mnt/ssd/jenkins/workspace/Lucene-Solr-4.x-Linux/solr/build/solr-core/test/J1/./org.apache.solr.cloud.CollectionsAPIDistributedZkTest-jetty1-1375410902462/conf/
   [junit4]   2> 916606 T2321 oasc.CorePropertiesLocator.discover Found 1 core definitions
   [junit4]   2> 916609 T2321 oass.SolrDispatchFilter.init user.dir=/mnt/ssd/jenkins/workspace/Lucene-Solr-4.x-Linux/solr/build/solr-core/test/J1
   [junit4]   2> 916609 T2321 oass.SolrDispatchFilter.init SolrDispatchFilter.init() done
   [junit4]   2> 916610 T2321 oascsi.HttpClientUtil.createClient Creating new http client, config:maxConnections=128&maxConnectionsPerHost=32&followRedirects=false
   [junit4]   2> 916719 T2321 oejs.Server.doStart jetty-8.1.10.v20130312
   [junit4]   2> 916724 T2321 oejs.AbstractConnector.doStart Started SelectChannelConnector@127.0.0.1:56516
   [junit4]   2> 916730 T2321 oass.SolrDispatchFilter.init SolrDispatchFilter.init()
   [junit4]   2> 916731 T2321 oasc.SolrResourceLoader.locateSolrHome JNDI not configured for solr (NoInitialContextEx)
   [junit4]   2> 916731 T2321 oasc.SolrResourceLoader.locateSolrHome using system property solr.solr.home: /mnt/ssd/jenkins/workspace/Lucene-Solr-4.x-Linux/solr/build/solr-core/test/J1/./org.apache.solr.cloud.CollectionsAPIDistributedZkTest-jetty2-1375410903798
   [junit4]   2> 916732 T2321 oasc.SolrResourceLoader.<init> new SolrResourceLoader for directory: '/mnt/ssd/jenkins/workspace/Lucene-Solr-4.x-Linux/solr/build/solr-core/test/J1/./org.apache.solr.cloud.CollectionsAPIDistributedZkTest-jetty2-1375410903798/'
   [junit4]   2> 916751 T2321 oasc.ConfigSolr.fromFile Loading container configuration from /mnt/ssd/jenkins/workspace/Lucene-Solr-4.x-Linux/solr/build/solr-core/test/J1/./org.apache.solr.cloud.CollectionsAPIDistributedZkTest-jetty2-1375410903798/solr.xml
   [junit4]   2> 916848 T2321 oasc.ConfigSolrXml.<init> Config-defined core root directory: 
   [junit4]   2> 916849 T2321 oasc.CoreContainer.<init> New CoreContainer 11299348
   [junit4]   2> 916849 T2321 oasc.CoreContainer.load Loading cores into CoreContainer [instanceDir=/mnt/ssd/jenkins/workspace/Lucene-Solr-4.x-Linux/solr/build/solr-core/test/J1/./org.apache.solr.cloud.CollectionsAPIDistributedZkTest-jetty2-1375410903798/]
   [junit4]   2> 916851 T2321 oashc.HttpShardHandlerFactory.getParameter Setting socketTimeout to: 120000
   [junit4]   2> 916851 T2321 oashc.HttpShardHandlerFactory.getParameter Setting urlScheme to: http://
   [junit4]   2> 916852 T2321 oashc.HttpShardHandlerFactory.getParameter Setting connTimeout to: 15000
   [junit4]   2> 916852 T2321 oashc.HttpShardHandlerFactory.getParameter Setting maxConnectionsPerHost to: 20
   [junit4]   2> 916853 T2321 oashc.HttpShardHandlerFactory.getParameter Setting corePoolSize to: 0
   [junit4]   2> 916854 T2321 oashc.HttpShardHandlerFactory.getParameter Setting maximumPoolSize to: 2147483647
   [junit4]   2> 916854 T2321 oashc.HttpShardHandlerFactory.getParameter Setting maxThreadIdleTime to: 5
   [junit4]   2> 916855 T2321 oashc.HttpShardHandlerFactory.getParameter Setting sizeOfQueue to: -1
   [junit4]   2> 916855 T2321 oashc.HttpShardHandlerFactory.getParameter Setting fairnessPolicy to: false
   [junit4]   2> 916856 T2321 oascsi.HttpClientUtil.createClient Creating new http client, config:maxConnectionsPerHost=20&maxConnections=10000&socketTimeout=120000&connTimeout=15000&retry=false
   [junit4]   2> 916861 T2321 oasc.ZkContainer.initZooKeeper Zookeeper client=127.0.0.1:54235/solr
   [junit4]   2> 916861 T2321 oasc.ZkController.checkChrootPath zkHost includes chroot
   [junit4]   2> 916863 T2321 oascc.ConnectionManager.waitForConnected Waiting for client to connect to ZooKeeper
   [junit4]   2> 916865 T2377 oascc.ConnectionManager.process Watcher org.apache.solr.common.cloud.ConnectionManager@1686109 name:ZooKeeperConnection Watcher:127.0.0.1:54235 got event WatchedEvent state:SyncConnected type:None path:null path:null type:None
   [junit4]   2> 916865 T2321 oascc.ConnectionManager.waitForConnected Client is connected to ZooKeeper
   [junit4]   2> 916868 T2321 oascsi.HttpClientUtil.createClient Creating new http client, config:maxConnections=500&maxConnectionsPerHost=16&socketTimeout=120000&connTimeout=15000
   [junit4]   2> 916871 T2321 oascc.ConnectionManager.waitForConnected Waiting for client to connect to ZooKeeper
   [junit4]   2> 916872 T2379 oascc.ConnectionManager.process Watcher org.apache.solr.common.cloud.ConnectionManager@1253d7e name:ZooKeeperConnection Watcher:127.0.0.1:54235/solr got event WatchedEvent state:SyncConnected type:None path:null path:null type:None
   [junit4]   2> 916873 T2321 oascc.ConnectionManager.waitForConnected Client is connected to ZooKeeper
   [junit4]   2> 916885 T2321 oascc.ZkStateReader.createClusterStateWatchersAndUpdate Updating cluster state from ZooKeeper... 
   [junit4]   2> 917892 T2321 oasc.ZkController.createEphemeralLiveNode Register node as live in ZooKeeper:/live_nodes/127.0.0.1:56516__
   [junit4]   2> 917893 T2321 oascc.SolrZkClient.makePath makePath: /live_nodes/127.0.0.1:56516__
   [junit4]   2> 917899 T2379 oascc.ZkStateReader$3.process Updating live nodes... (3)
   [junit4]   2> 917899 T2348 oascc.ZkStateReader$3.process Updating live nodes... (3)
   [junit4]   2> 917900 T2361 oascc.ZkStateReader$3.process Updating live nodes... (3)
   [junit4]   2> 917900 T2343 oascc.ZkStateReader$3.process Updating live nodes... (3)
   [junit4]   2> 917907 T2321 oasc.CorePropertiesLocator.discover Looking for core definitions underneath /mnt/ssd/jenkins/workspace/Lucene-Solr-4.x-Linux/solr/build/solr-core/test/J1/./org.apache.solr.cloud.CollectionsAPIDistributedZkTest-jetty2-1375410903798
   [junit4]   2> 917934 T2321 oasc.CorePropertiesLocator.discoverUnder Found core conf in /mnt/ssd/jenkins/workspace/Lucene-Solr-4.x-Linux/solr/build/solr-core/test/J1/./org.apache.solr.cloud.CollectionsAPIDistributedZkTest-jetty2-1375410903798/conf/
   [junit4]   2> 917935 T2321 oasc.CorePropertiesLocator.discover Found 1 core definitions
   [junit4]   2> 917935 T2321 oass.SolrDispatchFilter.init user.dir=/mnt/ssd/jenkins/workspace/Lucene-Solr-4.x-Linux/solr/build/solr-core/test/J1
   [junit4]   2> 917936 T2321 oass.SolrDispatchFilter.init SolrDispatchFilter.init() done
   [junit4]   2> 917936 T2321 oascsi.HttpClientUtil.createClient Creating new http client, config:maxConnections=128&maxConnectionsPerHost=32&followRedirects=false
   [junit4]   2> 918012 T2321 oejs.Server.doStart jetty-8.1.10.v20130312
   [junit4]   2> 918014 T2321 oejs.AbstractConnector.doStart Started SelectChannelConnector@127.0.0.1:52614
   [junit4]   2> 918015 T2321 oass.SolrDispatchFilter.init SolrDispatchFilter.init()
   [junit4]   2> 918015 T2321 oasc.SolrResourceLoader.locateSolrHome JNDI not configured for solr (NoInitialContextEx)
   [junit4]   2> 918016 T2321 oasc.SolrResourceLoader.locateSolrHome using system property solr.solr.home: /mnt/ssd/jenkins/workspace/Lucene-Solr-4.x-Linux/solr/build/solr-core/test/J1/./org.apache.solr.cloud.CollectionsAPIDistributedZkTest-jetty3-1375410905122
   [junit4]   2> 918016 T2321 oasc.SolrResourceLoader.<init> new SolrResourceLoader for directory: '/mnt/ssd/jenkins/workspace/Lucene-Solr-4.x-Linux/solr/build/solr-core/test/J1/./org.apache.solr.cloud.CollectionsAPIDistributedZkTest-jetty3-1375410905122/'
   [junit4]   2> 918028 T2321 oasc.ConfigSolr.fromFile Loading container configuration from /mnt/ssd/jenkins/workspace/Lucene-Solr-4.x-Linux/solr/build/solr-core/test/J1/./org.apache.solr.cloud.CollectionsAPIDistributedZkTest-jetty3-1375410905122/solr.xml
   [junit4]   2> 918080 T2321 oasc.ConfigSolrXml.<init> Config-defined core root directory: 
   [junit4]   2> 918081 T2321 oasc.CoreContainer.<init> New CoreContainer 14909811
   [junit4]   2> 918081 T2321 oasc.CoreContainer.load Loading cores into CoreContainer [instanceDir=/mnt/ssd/jenkins/workspace/Lucene-Solr-4.x-Linux/solr/build/solr-core/test/J1/./org.apache.solr.cloud.CollectionsAPIDistributedZkTest-jetty3-1375410905122/]
   [junit4]   2> 918082 T2321 oashc.HttpShardHandlerFactory.getParameter Setting socketTimeout to: 120000
   [junit4]   2> 918083 T2321 oashc.HttpShardHandlerFactory.getParameter Setting urlScheme to: http://
   [junit4]   2> 918083 T2321 oashc.HttpShardHandlerFactory.getParameter Setting connTimeout to: 15000
   [junit4]   2> 918083 T2321 oashc.HttpShardHandlerFactory.getParameter Setting maxConnectionsPerHost to: 20
   [junit4]   2> 918084 T2321 oashc.HttpShardHandlerFactory.getParameter Setting corePoolSize to: 0
   [junit4]   2> 918084 T2321 oashc.HttpShardHandlerFactory.getParameter Setting maximumPoolSize to: 2147483647
   [junit4]   2> 918084 T2321 oashc.HttpShardHandlerFactory.getParameter Setting maxThreadIdleTime to: 5
   [junit4]   2> 918085 T2321 oashc.HttpShardHandlerFactory.getParameter Setting sizeOfQueue to: -1
   [junit4]   2> 918085 T2321 oashc.HttpShardHandlerFactory.getParameter Setting fairnessPolicy to: false
   [junit4]   2> 918086 T2321 oascsi.HttpClientUtil.createClient Creating new http client, config:maxConnectionsPerHost=20&maxConnections=10000&socketTimeout=120000&connTimeout=15000&retry=false
   [junit4]   2> 918089 T2321 oasc.ZkContainer.initZooKeeper Zookeeper client=127.0.0.1:54235/solr
   [junit4]   2> 918089 T2321 oasc.ZkController.checkChrootPath zkHost includes chroot
   [junit4]   2> 918090 T2321 oascc.ConnectionManager.waitForConnected Waiting for client to connect to ZooKeeper
   [junit4]   2> 918091 T2391 oascc.ConnectionManager.process Watcher org.apache.solr.common.cloud.ConnectionManager@47bd11 name:ZooKeeperConnection Watcher:127.0.0.1:54235 got event WatchedEvent state:SyncConnected type:None path:null path:null type:None
   [junit4]   2> 918092 T2321 oascc.ConnectionManager.waitForConnected Client is connected to ZooKeeper
   [junit4]   2> 918094 T2321 oascsi.HttpClientUtil.createClient Creating new http client, config:maxConnections=500&maxConnectionsPerHost=16&socketTimeout=120000&connTimeout=15000
   [junit4]   2> 918097 T2321 oascc.ConnectionManager.waitForConnected Waiting for client to connect to ZooKeeper
   [junit4]   2> 918098 T2393 oascc.ConnectionManager.process Watcher org.apache.solr.common.cloud.ConnectionManager@142602e name:ZooKeeperConnection Watcher:127.0.0.1:54235/solr got event WatchedEvent state:SyncConnected type:None path:null path:null type:None
   [junit4]   2> 918098 T2321 oascc.ConnectionManager.waitForConnected Client is connected to ZooKeeper
   [junit4]   2> 918104 T2321 oascc.ZkStateReader.createClusterStateWatchersAndUpdate Updating cluster state from ZooKeeper... 
   [junit4]   2> 919109 T2321 oasc.ZkController.createEphemeralLiveNode Register node as live in ZooKeeper:/live_nodes/127.0.0.1:52614__
   [junit4]   2> 919111 T2321 oascc.SolrZkClient.makePath makePath: /live_nodes/127.0.0.1:52614__
   [junit4]   2> 919120 T2348 oascc.ZkStateReader$3.process Updating live nodes... (4)
   [junit4]   2> 919121 T2343 oascc.ZkStateReader$3.process Updating live nodes... (4)
   [junit4]   2> 919121 T2361 oascc.ZkStateReader$3.process Updating live nodes... (4)
   [junit4]   2> 919122 T2379 oascc.ZkStateReader$3.process Updating live nodes... (4)
   [junit4]   2> 919122 T2393 oascc.ZkStateReader$3.process Updating live nodes... (4)
   [junit4]   2> 919131 T2321 oasc.CorePropertiesLocator.discover Looking for core definitions underneath /mnt/ssd/jenkins/workspace/Lucene-Solr-4.x-Linux/solr/build/solr-core/test/J1/./org.apache.solr.cloud.CollectionsAPIDistributedZkTest-jetty3-1375410905122
   [junit4]   2> 919157 T2321 oasc.CorePropertiesLocator.discoverUnder Found core conf in /mnt/ssd/jenkins/workspace/Lucene-Solr-4.x-Linux/solr/build/solr-core/test/J1/./org.apache.solr.cloud.CollectionsAPIDistributedZkTest-jetty3-1375410905122/conf/
   [junit4]   2> 919158 T2321 oasc.CorePropertiesLocator.discover Found 1 core definitions
   [junit4]   2> 919158 T2321 oass.SolrDispatchFilter.init user.dir=/mnt/ssd/jenkins/workspace/Lucene-Solr-4.x-Linux/solr/build/solr-core/test/J1
   [junit4]   2> 919159 T2321 oass.SolrDispatchFilter.init SolrDispatchFilter.init() done
   [junit4]   2> 919159 T2321 oascsi.HttpClientUtil.createClient Creating new http client, config:maxConnections=128&maxConnectionsPerHost=32&followRedirects=false
   [junit4]   2> 919232 T2321 oejs.Server.doStart jetty-8.1.10.v20130312
   [junit4]   2> 919234 T2321 oejs.AbstractConnector.doStart Started SelectChannelConnector@127.0.0.1:49370
   [junit4]   2> 919235 T2321 oass.SolrDispatchFilter.init SolrDispatchFilter.init()
   [junit4]   2> 919235 T2321 oasc.SolrResourceLoader.locateSolrHome JNDI not configured for solr (NoInitialContextEx)
   [junit4]   2> 919235 T2321 oasc.SolrResourceLoader.locateSolrHome using system property solr.solr.home: /mnt/ssd/jenkins/workspace/Lucene-Solr-4.x-Linux/solr/build/solr-core/test/J1/./org.apache.solr.cloud.CollectionsAPIDistributedZkTest-jetty4-1375410906345
   [junit4]   2> 919236 T2321 oasc.SolrResourceLoader.<init> new SolrResourceLoader for directory: '/mnt/ssd/jenkins/workspace/Lucene-Solr-4.x-Linux/solr/build/solr-core/test/J1/./org.apache.solr.cloud.CollectionsAPIDistributedZkTest-jetty4-1375410906345/'
   [junit4]   2> 919247 T2321 oasc.ConfigSolr.fromFile Loading container configuration from /mnt/ssd/jenkins/workspace/Lucene-Solr-4.x-Linux/solr/build/solr-core/test/J1/./org.apache.solr.cloud.CollectionsAPIDistributedZkTest-jetty4-1375410906345/solr.xml
   [junit4]   2> 919286 T2321 oasc.ConfigSolrXml.<init> Config-defined core root directory: 
   [junit4]   2> 919287 T2321 oasc.CoreContainer.<init> New CoreContainer 22650394
   [junit4]   2> 919287 T2321 oasc.CoreContainer.load Loading cores into CoreContainer [instanceDir=/mnt/ssd/jenkins/workspace/Lucene-Solr-4.x-Linux/solr/build/solr-core/test/J1/./org.apache.solr.cloud.CollectionsAPIDistributedZkTest-jetty4-1375410906345/]
   [junit4]   2> 919297 T2321 oashc.HttpShardHandlerFactory.getParameter Setting socketTimeout to: 120000
   [junit4]   2> 919298 T2321 oashc.HttpShardHandlerFactory.getParameter Setting urlScheme to: http://
   [junit4]   2> 919298 T2321 oashc.HttpShardHandlerFactory.getParameter Setting connTimeout to: 15000
   [junit4]   2> 919298 T2321 oashc.HttpShardHandlerFactory.getParameter Setting maxConnectionsPerHost to: 20
   [junit4]   2> 919299 T2321 oashc.HttpShardHandlerFactory.getParameter Setting corePoolSize to: 0
   [junit4]   2> 919299 T2321 oashc.HttpShardHandlerFactory.getParameter Setting maximumPoolSize to: 2147483647
   [junit4]   2> 919299 T2321 oashc.HttpShardHandlerFactory.getParameter Setting maxThreadIdleTime to: 5
   [junit4]   2> 919300 T2321 oashc.HttpShardHandlerFactory.getParameter Setting sizeOfQueue to: -1
   [junit4]   2> 919300 T2321 oashc.HttpShardHandlerFactory.getParameter Setting fairnessPolicy to: false
   [junit4]   2> 919300 T2321 oascsi.HttpClientUtil.createClient Creating new http client, config:maxConnectionsPerHost=20&maxConnections=10000&socketTimeout=120000&connTimeout=15000&retry=false
   [junit4]   2> 919303 T2321 oasc.ZkContainer.initZooKeeper Zookeeper client=127.0.0.1:54235/solr
   [junit4]   2> 919304 T2321 oasc.ZkController.checkChrootPath zkHost includes chroot
   [junit4]   2> 919304 T2321 oascc.ConnectionManager.waitForConnected Waiting for client to connect to ZooKeeper
   [junit4]   2> 919306 T2405 oascc.ConnectionManager.process Watcher org.apache.solr.common.cloud.ConnectionManager@83e7a8 name:ZooKeeperConnection Watcher:127.0.0.1:54235 got event WatchedEvent state:SyncConnected type:None path:null path:null type:None
   [junit4]   2> 919306 T2321 oascc.ConnectionManager.waitForConnected Client is connected to ZooKeeper
   [junit4]   2> 919310 T2321 oascsi.HttpClientUtil.createClient Creating new http client, config:maxConnections=500&maxConnectionsPerHost=16&socketTimeout=120000&connTimeout=15000
   [junit4]   2> 919315 T2321 oascc.ConnectionManager.waitForConnected Waiting for client to connect to ZooKeeper
   [junit4]   2> 919316 T2407 oascc.ConnectionManager.process Watcher org.apache.solr.common.cloud.ConnectionManager@630a21 name:ZooKeeperConnection Watcher:127.0.0.1:54235/solr got event WatchedEvent state:SyncConnected type:None path:null path:null type:None
   [junit4]   2> 919316 T2321 oascc.ConnectionManager.waitForConnected Client is connected to ZooKeeper
   [junit4]   2> 919323 T2321 oascc.ZkStateReader.createClusterStateWatchersAndUpdate Updating cluster state from ZooKeeper... 
   [junit4]   2> 920328 T2321 oasc.ZkController.createEphemeralLiveNode Register node as live in ZooKeeper:/live_nodes/127.0.0.1:49370__
   [junit4]   2> 920329 T2321 oascc.SolrZkClient.makePath makePath: /live_nodes/127.0.0.1:49370__
   [junit4]   2> 920335 T2348 oascc.ZkStateReader$3.process Updating live nodes... (5)
   [junit4]   2> 920335 T2393 oascc.ZkStateReader$3.process Updating live nodes... (5)
   [junit4]   2> 920335 T2361 oascc.ZkStateReader$3.process Updating live nodes... (5)
   [junit4]   2> 920335 T2407 oascc.ZkStateReader$3.process Updating live nodes... (5)
   [junit4]   2> 920337 T2379 oascc.ZkStateReader$3.process Updating live nodes... (5)
   [junit4]   2> 920337 T2343 oascc.ZkStateReader$3.process Updating live nodes... (5)
   [junit4]   2> 920343 T2321 oasc.CorePropertiesLocator.discover Looking for core definitions underneath /mnt/ssd/jenkins/workspace/Lucene-Solr-4.x-Linux/solr/build/solr-core/test/J1/./org.apache.solr.cloud.CollectionsAPIDistributedZkTest-jetty4-1375410906345
   [junit4]   2> 920369 T2321 oasc.CorePropertiesLocator.discoverUnder Found core conf in /mnt/ssd/jenkins/workspace/Lucene-Solr-4.x-Linux/solr/build/solr-core/test/J1/./org.apache.solr.cloud.CollectionsAPIDistributedZkTest-jetty4-1375410906345/conf/
   [junit4]   2> 920370 T2321 oasc.CorePropertiesLocator.discover Found 1 core definitions
   [junit4]   2> 920371 T2321 oass.SolrDispatchFilter.init user.dir=/mnt/ssd/jenkins/workspace/Lucene-Solr-4.x-Linux/solr/build/solr-core/test/J1
   [junit4]   2> 920371 T2321 oass.SolrDispatchFilter.init SolrDispatchFilter.init() done
   [junit4]   2> 920371 T2321 oascsi.HttpClientUtil.createClient Creating new http client, config:maxConnections=128&maxConnectionsPerHost=32&followRedirects=false
   [junit4]   2> 920374 T2321 oascsi.HttpClientUtil.createClient Creating new http client, config:maxConnections=128&maxConnectionsPerHost=32&followRedirects=false
   [junit4]   2> 920377 T2357 oasha.CollectionsHandler.handleCreateAction Creating Collection : numShards=2&name=nodes_used_collection&replicationFactor=2&action=CREATE&wt=javabin&version=2
   [junit4]   2> 920378 T2343 oasc.DistributedQueue$LatchChildWatcher.process Watcher fired on path: /overseer/collection-queue-work state: SyncConnected type NodeChildrenChanged
   [junit4]   2> 920380 T2343 oasc.DistributedQueue$LatchChildWatcher.process Watcher fired on path: /overseer/collection-queue-work state: SyncConnected type NodeChildrenChanged
   [junit4]   2> 920381 T2345 oasc.OverseerCollectionProcessor.run Overseer Collection Processor: Get the message id:/overseer/collection-queue-work/qn-0000000000 message:{
   [junit4]   2> 	  "operation":"createcollection",
   [junit4]   2> 	  "numShards":"2",
   [junit4]   2> 	  "name":"nodes_used_collection",
   [junit4]   2> 	  "replicationFactor":"2"}
   [junit4]   2> 920381 T2345 oasc.OverseerCollectionProcessor.processMessage WARN OverseerCollectionProcessor.processMessage : createcollection , {
   [junit4]   2> 	  "operation":"createcollection",
   [junit4]   2> 	  "numShards":"2",
   [junit4]   2> 	  "name":"nodes_used_collection",
   [junit4]   2> 	  "replicationFactor":"2"}
   [junit4]   2> 921245 T2344 oascc.ZkStateReader.updateClusterState Updating cloud state from ZooKeeper... 
   [junit4]   2> 921247 T2344 oasc.Overseer$ClusterStateUpdater.buildCollection building a new collection: nodes_used_collection
   [junit4]   2> 921247 T2344 oasc.Overseer$ClusterStateUpdater.createCollection Create collection nodes_used_collection with shards [shard1, shard2]
   [junit4]   2> 921254 T2343 oascc.ZkStateReader$2.process A cluster state change: WatchedEvent state:SyncConnected type:NodeDataChanged path:/clusterstate.json, has occurred - updating... (live nodes size: 5)
   [junit4]   2> 921255 T2393 oascc.ZkStateReader$2.process A cluster state change: WatchedEvent state:SyncConnected type:NodeDataChanged path:/clusterstate.json, has occurred - updating... (live nodes size: 5)
   [junit4]   2> 921255 T2407 oascc.ZkStateReader$2.process A cluster state change: WatchedEvent state:SyncConnected type:NodeDataChanged path:/clusterstate.json, has occurred - updating... (live nodes size: 5)
   [junit4]   2> 921255 T2361 oascc.ZkStateReader$2.process A cluster state change: WatchedEvent state:SyncConnected type:NodeDataChanged path:/clusterstate.json, has occurred - updating... (live nodes size: 5)
   [junit4]   2> 921255 T2379 oascc.ZkStateReader$2.process A cluster state change: WatchedEvent state:SyncConnected type:NodeDataChanged path:/clusterstate.json, has occurred - updating... (live nodes size: 5)
   [junit4]   2> 921255 T2348 oascc.ZkStateReader$2.process A cluster state change: WatchedEvent state:SyncConnected type:NodeDataChanged path:/clusterstate.json, has occurred - updating... (live nodes size: 5)
   [junit4]   2> 921285 T2345 oasc.OverseerCollectionProcessor.createCollection going to create cores replicas shardNames [shard1, shard2] , repFactor : 2
   [junit4]   2> 921285 T2345 oasc.OverseerCollectionProcessor.createCollection Creating shard nodes_used_collection_shard1_replica1 as part of slice shard1 of collection nodes_used_collection on 127.0.0.1:49370__
   [junit4]   2> 921286 T2345 oasc.OverseerCollectionProcessor.createCollection Creating shard nodes_used_collection_shard1_replica2 as part of slice shard1 of collection nodes_used_collection on 127.0.0.1:55293__
   [junit4]   2> 921287 T2345 oasc.OverseerCollectionProcessor.createCollection Creating shard nodes_used_collection_shard2_replica1 as part of slice shard2 of collection nodes_used_collection on 127.0.0.1:52614__
   [junit4]   2> 921287 T2345 oasc.OverseerCollectionProcessor.createCollection Creating shard nodes_used_collection_shard2_replica2 as part of slice shard2 of collection nodes_used_collection on 127.0.0.1:56516__
   [junit4]   2> 921288 T2401 oasc.ZkController.publish publishing core=nodes_used_collection_shard1_replica1 state=down
   [junit4]   2> 921288 T2388 oasc.ZkController.publish publishing core=nodes_used_collection_shard2_replica1 state=down
   [junit4]   2> 921288 T2339 oasc.ZkController.publish publishing core=nodes_used_collection_shard1_replica2 state=down
   [junit4]   2> 921289 T2367 oasc.ZkController.publish publishing core=nodes_used_collection_shard2_replica2 state=down
   [junit4]   2> 921290 T2401 oasc.ZkController.waitForCoreNodeName look for our core node name
   [junit4]   2> 921291 T2388 oasc.ZkController.waitForCoreNodeName look for our core node name
   [junit4]   2> 921291 T2339 oasc.ZkController.waitForCoreNodeName look for our core node name
   [junit4]   2> 921292 T2367 oasc.ZkController.waitForCoreNodeName look for our core node name
   [junit4]   2> 922770 T2344 oascc.ZkStateReader.updateClusterState Updating cloud state from ZooKeeper... 
   [junit4]   2> 922772 T2344 oasc.Overseer$ClusterStateUpdater.updateState WARN Could not find collection node for nodes_used_collection, skipping publish state
   [junit4]   2> 922772 T2344 oasc.Overseer$ClusterStateUpdater.updateState Update state numShards=2 message={
   [junit4]   2> 	  "operation":"state",
   [junit4]   2> 	  "core_node_name":"core_node1",
   [junit4]   2> 	  "numShards":"2",
   [junit4]   2> 	  "shard":"shard1",
   [junit4]   2> 	  "roles":null,
   [junit4]   2> 	  "state":"down",
   [junit4]   2> 	  "shard_state":"active",
   [junit4]   2> 	  "core":"nodes_used_collection_shard1_replica1",
   [junit4]   2> 	  "collection":"nodes_used_collection",
   [junit4]   2> 	  "shard_range":null,
   [junit4]   2> 	  "node_name":"127.0.0.1:49370__",
   [junit4]   2> 	  "base_url":"http://127.0.0.1:49370/_"}
   [junit4]   2> 922780 T2344 oasc.Overseer$ClusterStateUpdater.updateState WARN Could not find collection node for nodes_used_collection, skipping publish state
   [junit4]   2> 922780 T2344 oasc.Overseer$ClusterStateUpdater.updateState Update state numShards=2 message={
   [junit4]   2> 	  "operation":"state",
   [junit4]   2> 	  "core_node_name":"core_node2",
   [junit4]   2> 	  "numShards":"2",
   [junit4]   2> 	  "shard":"shard2",
   [junit4]   2> 	  "roles":null,
   [junit4]   2> 	  "state":"down",
   [junit4]   2> 	  "shard_state":"active",
   [junit4]   2> 	  "core":"nodes_used_collection_shard2_replica1",
   [junit4]   2> 	  "collection":"nodes_used_collection",
   [junit4]   2> 	  "shard_range":null,
   [junit4]   2> 	  "node_name":"127.0.0.1:52614__",
   [junit4]   2> 	  "base_url":"http://127.0.0.1:52614/_"}
   [junit4]   2> 922785 T2344 oasc.Overseer$ClusterStateUpdater.updateState WARN Could not find collection node for nodes_used_collection, skipping publish state
   [junit4]   2> 922786 T2344 oasc.Overseer$ClusterStateUpdater.updateState Update state numShards=2 message={
   [junit4]   2> 	  "operation":"state",
   [junit4]   2> 	  "core_node_name":"core_node3",
   [junit4]   2> 	  "numShards":"2",
   [junit4]   2> 	  "shard":"shard1",
   [junit4]   2> 	  "roles":null,
   [junit4]   2> 	  "state":"down",
   [junit4]   2> 	  "shard_state":"active",
   [junit4]   2> 	  "core":"nodes_used_collection_shard1_replica2",
   [junit4]   2> 	  "collection":"nodes_used_collection",
   [junit4]   2> 	  "shard_range":null,
   [junit4]   2> 	  "node_name":"127.0.0.1:55293__",
   [junit4]   2> 	  "base_url":"http://127.0.0.1:55293/_"}
   [junit4]   2> 922791 T2344 oasc.Overseer$ClusterStateUpdater.updateState WARN Could not find collection node for nodes_used_collection, skipping publish state
   [junit4]   2> 922792 T2344 oasc.Overseer$ClusterStateUpdater.updateState Update state numShards=2 message={
   [junit4]   2> 	  "operation":"state",
   [junit4]   2> 	  "core_node_name":"core_node4",
   [junit4]   2> 	  "numShards":"2",
   [junit4]   2> 	  "shard":"shard2",
   [junit4]   2> 	  "roles":null,
   [junit4]   2> 	  "state":"down",
   [junit4]   2> 	  "shard_state":"active",
   [junit4]   2> 	  "core":"nodes_used_collection_shard2_replica2",
   [junit4]   2> 	  "collection":"nodes_used_collection",
   [junit4]   2> 	  "shard_range":null,
   [junit4]   2> 	  "node_name":"127.0.0.1:56516__",
   [junit4]   2> 	  "base_url":"http://127.0.0.1:56516/_"}
   [junit4]   2> 922797 T2379 oascc.ZkStateReader$2.process A cluster state change: WatchedEvent state:SyncConnected type:NodeDataChanged path:/clusterstate.json, has occurred - updating... (live nodes size: 5)
   [junit4]   2> 922797 T2348 oascc.ZkStateReader$2.process A cluster state change: WatchedEvent state:SyncConnected type:NodeDataChanged path:/clusterstate.json, has occurred - updating... (live nodes size: 5)
   [junit4]   2> 922798 T2393 oascc.ZkStateReader$2.process A cluster state change: WatchedEvent state:SyncConnected type:NodeDataChanged path:/clusterstate.json, has occurred - updating... (live nodes size: 5)
   [junit4]   2> 922798 T2343 oascc.ZkStateReader$2.process A cluster state change: WatchedEvent state:SyncConnected type:NodeDataChanged path:/clusterstate.json, has occurred - updating... (live nodes size: 5)
   [junit4]   2> 922797 T2407 oascc.ZkStateReader$2.process A cluster state change: WatchedEvent state:SyncConnected type:NodeDataChanged path:/clusterstate.json, has occurred - updating... (live nodes size: 5)
   [junit4]   2> 922797 T2361 oascc.ZkStateReader$2.process A cluster state change: WatchedEvent state:SyncConnected type:NodeDataChanged path:/clusterstate.json, has occurred - updating... (live nodes size: 5)
   [junit4]   2> 923291 T2401 oasc.ZkController.waitForShardId waiting to find shard id in clusterstate for nodes_used_collection_shard1_replica1
   [junit4]   2> 923291 T2388 oasc.ZkController.waitForShardId waiting to find shard id in clusterstate for nodes_used_collection_shard2_replica1
   [junit4]   2> 923292 T2339 oasc.ZkController.waitForShardId waiting to find shard id in clusterstate for nodes_used_collection_shard1_replica2
   [junit4]   2> 923291 T2401 oasc.CorePropertiesLocator.writePropertiesFile ERROR Couldn't persist core properties to /mnt/ssd/jenkins/workspace/Lucene-Solr-4.x-Linux/solr/build/solr-core/test/J1/./org.apache.solr.cloud.CollectionsAPIDistributedZkTest-jetty4-1375410906345/nodes_used_collection_shard1_replica1/core.properties: java.io.FileNotFoundException: /mnt/ssd/jenkins/workspace/Lucene-Solr-4.x-Linux/solr/build/solr-core/test/J1/./org.apache.solr.cloud.CollectionsAPIDistributedZkTest-jetty4-1375410906345/nodes_used_collection_shard1_replica1/core.properties (No such file or directory)
   [junit4]   2> 923292 T2339 oasc.CorePropertiesLocator.writePropertiesFile ERROR Couldn't persist core properties to /mnt/ssd/jenkins/workspace/Lucene-Solr-4.x-Linux/solr/build/solr-core/test/J1/./org.apache.solr.cloud.CollectionsAPIDistributedZkTest-controljetty-1375410902074/nodes_used_collection_shard1_replica2/core.properties: java.io.FileNotFoundException: /mnt/ssd/jenkins/workspace/Lucene-Solr-4.x-Linux/solr/build/solr-core/test/J1/./org.apache.solr.cloud.CollectionsAPIDistributedZkTest-controljetty-1375410902074/nodes_used_collection_shard1_replica2/core.properties (No such file or directory)
   [junit4]   2> 923292 T2388 oasc.CorePropertiesLocator.writePropertiesFile ERROR Couldn't persist core properties to /mnt/ssd/jenkins/workspace/Lucene-Solr-4.x-Linux/solr/build/solr-core/test/J1/./org.apache.solr.cloud.CollectionsAPIDistributedZkTest-jetty3-1375410905122/nodes_used_collection_shard2_replica1/core.properties: java.io.FileNotFoundException: /mnt/ssd/jenkins/workspace/Lucene-Solr-4.x-Linux/solr/build/solr-core/test/J1/./org.apache.solr.cloud.CollectionsAPIDistributedZkTest-jetty3-1375410905122/nodes_used_collection_shard2_replica1/core.properties (No such file or directory)
   [junit4]   2> 923293 T2388 oasc.CoreContainer.create Creating SolrCore 'nodes_used_collection_shard2_replica1' using instanceDir: /mnt/ssd/jenkins/workspace/Lucene-Solr-4.x-Linux/solr/build/solr-core/test/J1/./org.apache.solr.cloud.CollectionsAPIDistributedZkTest-jetty3-1375410905122/nodes_used_collection_shard2_replica1
   [junit4]   2> 923294 T2388 oasc.ZkController.createCollectionZkNode Check for collection zkNode:nodes_used_collection
   [junit4]   2> 923292 T2367 oasc.ZkController.waitForShardId waiting to find shard id in clusterstate for nodes_used_collection_shard2_replica2
   [junit4]   2> 923293 T2339 oasc.CoreContainer.create Creating SolrCore 'nodes_used_collection_shard1_replica2' using instanceDir: /mnt/ssd/jenkins/workspace/Lucene-Solr-4.x-Linux/solr/build/solr-core/test/J1/./org.apache.solr.cloud.CollectionsAPIDistributedZkTest-controljetty-1375410902074/nodes_used_collection_shard1_replica2
   [junit4]   2> 923295 T2388 oasc.ZkController.createCollectionZkNode Creating collection in ZooKeeper:nodes_used_collection
   [junit4]   2> 923293 T2401 oasc.CoreContainer.create Creating SolrCore 'nodes_used_collection_shard1_replica1' using instanceDir: /mnt/ssd/jenkins/workspace/Lucene-Solr-4.x-Linux/solr/build/solr-core/test/J1/./org.apache.solr.cloud.CollectionsAPIDistributedZkTest-jetty4-1375410906345/nodes_used_collection_shard1_replica1
   [junit4]   2> 923295 T2388 oasc.ZkController.getConfName Looking for collection configName
   [junit4]   2> 923295 T2339 oasc.ZkController.createCollectionZkNode Check for collection zkNode:nodes_used_collection
   [junit4]   2> 923294 T2367 oasc.CorePropertiesLocator.writePropertiesFile ERROR Couldn't persist core properties to /mnt/ssd/jenkins/workspace/Lucene-Solr-4.x-Linux/solr/build/solr-core/test/J1/./org.apache.solr.cloud.CollectionsAPIDistributedZkTest-jetty2-1375410903798/nodes_used_collection_shard2_replica2/core.properties: java.io.FileNotFoundException: /mnt/ssd/jenkins/workspace/Lucene-Solr-4.x-Linux/solr/build/solr-core/test/J1/./org.apache.solr.cloud.CollectionsAPIDistributedZkTest-jetty2-1375410903798/nodes_used_collection_shard2_replica2/core.properties (No such file or directory)
   [junit4]   2> 923295 T2401 oasc.ZkController.createCollectionZkNode Check for collection zkNode:nodes_used_collection
   [junit4]   2> 923296 T2367 oasc.CoreContainer.create Creating SolrCore 'nodes_used_collection_shard2_replica2' using instanceDir: /mnt/ssd/jenkins/workspace/Lucene-Solr-4.x-Linux/solr/build/solr-core/test/J1/./org.apache.solr.cloud.CollectionsAPIDistributedZkTest-jetty2-1375410903798/nodes_used_collection_shard2_replica2
   [junit4]   2> 923297 T2367 oasc.ZkController.createCollectionZkNode Check for collection zkNode:nodes_used_collection
   [junit4]   2> 923297 T2339 oasc.ZkController.createCollectionZkNode Creating collection in ZooKeeper:nodes_used_collection
   [junit4]   2> 923298 T2388 oasc.ZkController.getConfName Only one config set found in zk - using it:conf1
   [junit4]   2> 923298 T2339 oasc.ZkController.getConfName Looking for collection configName
   [junit4]   2> 923298 T2388 oascc.SolrZkClient.makePath makePath: /collections/nodes_used_collection
   [junit4]   2> 923299 T2367 oasc.ZkController.createCollectionZkNode Creating collection in ZooKeeper:nodes_used_collection
   [junit4]   2> 923299 T2401 oasc.ZkController.createCollectionZkNode Creating collection in ZooKeeper:nodes_used_collection
   [junit4]   2> 923299 T2367 oasc.ZkController.getConfName Looking for collection configName
   [junit4]   2> 923300 T2401 oasc.ZkController.getConfName Looking for collection configName
   [junit4]   2> 923303 T2367 oasc.ZkController.getConfName Only one config set found in zk - using it:conf1
   [junit4]   2> 923304 T2367 oascc.SolrZkClient.makePath makePath: /collections/nodes_used_collection
   [junit4]   2> 923304 T2339 oasc.ZkController.getConfName Only one config set found in zk - using it:conf1
   [junit4]   2> 923304 T2401 oasc.ZkController.getConfName Only one config set found in zk - using it:conf1
   [junit4]   2> 923305 T2401 oascc.SolrZkClient.makePath makePath: /collections/nodes_used_collection
   [junit4]   2> 923304 T2339 oascc.SolrZkClient.makePath makePath: /collections/nodes_used_collection
   [junit4]   2> 923311 T2401 oasc.ZkController.readConfigName Load collection config from:/collections/nodes_used_collection
   [junit4]   2> 923311 T2339 oasc.ZkController.readConfigName Load collection config from:/collections/nodes_used_collection
   [junit4]   2> 923311 T2388 oasc.ZkController.readConfigName Load collection config from:/collections/nodes_used_collection
   [junit4]   2> 923313 T2367 oasc.ZkController.readConfigName Load collection config from:/collections/nodes_used_collection
   [junit4]   2> 923315 T2401 oasc.SolrResourceLoader.<init> new SolrResourceLoader for directory: '/mnt/ssd/jenkins/workspace/Lucene-Solr-4.x-Linux/solr/build/solr-core/test/J1/./org.apache.solr.cloud.CollectionsAPIDistributedZkTest-jetty4-1375410906345/nodes_used_collection_shard1_replica1/'
   [junit4]   2> 923315 T2339 oasc.SolrResourceLoader.<init> new SolrResourceLoader for directory: '/mnt/ssd/jenkins/workspace/Lucene-Solr-4.x-Linux/solr/build/solr-core/test/J1/./org.apache.solr.cloud.CollectionsAPIDistributedZkTest-controljetty-1375410902074/nodes_used_collection_shard1_replica2/'
   [junit4]   2> 923318 T2388 oasc.SolrResourceLoader.<init> new SolrResourceLoader for directory: '/mnt/ssd/jenkins/workspace/Lucene-Solr-4.x-Linux/solr/build/solr-core/test/J1/./org.apache.solr.cloud.CollectionsAPIDistributedZkTest-jetty3-1375410905122/nodes_used_collection_shard2_replica1/'
   [junit4]   2> 923319 T2367 oasc.SolrResourceLoader.<init> new SolrResourceLoader for directory: '/mnt/ssd/jenkins/workspace/Lucene-Solr-4.x-Linux/solr/build/solr-core/test/J1/./org.apache.solr.cloud.CollectionsAPIDistributedZkTest-jetty2-1375410903798/nodes_used_collection_shard2_replica2/'
   [junit4]   2> 923380 T2401 oasc.SolrConfig.<init> Using Lucene MatchVersion: LUCENE_45
   [junit4]   2> 923390 T2367 oasc.SolrConfig.<init> Using Lucene MatchVersion: LUCENE_45
   [junit4]   2> 923393 T2388 oasc.SolrConfig.<init> Using Lucene MatchVersion: LUCENE_45
   [junit4]   2> 923398 T2339 oasc.SolrConfig.<init> Using Lucene MatchVersion: LUCENE_45
   [junit4]   2> 923452 T2401 oasc.SolrConfig.<init> Loaded SolrConfig: solrconfig.xml
   [junit4]   2> 923454 T2401 oass.IndexSchema.readSchema Reading Solr Schema from schema.xml
   [junit4]   2> 923467 T2388 oasc.SolrConfig.<init> Loaded SolrConfig: solrconfig.xml
   [junit4]   2> 923468 T2401 oass.IndexSchema.readSchema [nodes_used_collection_shard1_replica1] Schema name=test
   [junit4]   2> 923469 T2388 oass.IndexSchema.readSchema Reading Solr Schema from schema.xml
   [junit4]   2> 923479 T2388 oass.IndexSchema.readSchema [nodes_used_collection_shard2_replica1] Schema name=test
   [junit4]   2> 923484 T2367 oasc.SolrConfig.<init> Loaded SolrConfig: solrconfig.xml
   [junit4]   2> 923487 T2367 oass.IndexSchema.readSchema Reading Solr Schema from schema.xml
   [junit4]   2> 923507 T2339 oasc.SolrConfig.<init> Loaded SolrConfig: solrconfig.xml
   [junit4]   2> 923509 T2339 oass.IndexSchema.readSchema Reading Solr Schema from schema.xml
   [junit4]   2> 923512 T2367 oass.IndexSchema.readSchema [nodes_used_collection_shard2_replica2] Schema name=test
   [junit4]   2> 923525 T2339 oass.IndexSchema.readSchema [nodes_used_collection_shard1_replica2] Schema name=test
   [junit4]   2> 924106 T2388 oass.ByteField.init WARN ByteField is deprecated and will be removed in 5.0. You should use TrieIntField instead.
   [junit4]   2> 924107 T2388 oass.ShortField.init WARN ShortField is deprecated and will be removed in 5.0. You should use TrieIntField instead.
   [junit4]   2> 924108 T2388 oass.OpenExchangeRatesOrgProvider.init Initialized with rates=open-exchange-rates.json, refreshInterval=1440.
   [junit4]   2> 924116 T2388 oass.IndexSchema.readSchema default search field in schema is text
   [junit4]   2> 924120 T2388 oass.IndexSchema.readSchema unique key field: id
   [junit4]   2> 924145 T2388 oass.FileExchangeRateProvider.reload Reloading exchange rates from file currency.xml
   [junit4]   2> 924148 T2367 oass.ByteField.init WARN ByteField is deprecated and will be removed in 5.0. You should use TrieIntField instead.
   [junit4]   2> 924149 T2367 oass.ShortField.init WARN ShortField is deprecated and will be removed in 5.0. You should use TrieIntField instead.
   [junit4]   2> 924149 T2388 oass.FileExchangeRateProvider.reload Reloading exchange rates from file currency.xml
   [junit4]   2> 924149 T2367 oass.OpenExchangeRatesOrgProvider.init Initialized with rates=open-exchange-rates.json, refreshInterval=1440.
   [junit4]   2> 924153 T2388 oass.OpenExchangeRatesOrgProvider.reload Reloading exchange rates from open-exchange-rates.json
   [junit4]   2> 924155 T2388 oass.OpenExchangeRatesOrgProvider$OpenExchangeRates.<init> WARN Unknown key IMPORTANT NOTE
   [junit4]   2> 924155 T2388 oass.OpenExchangeRatesOrgProvider$OpenExchangeRates.<init> WARN Expected key, got STRING
   [junit4]   2> 924156 T2388 oass.OpenExchangeRatesOrgProvider.reload Reloading exchange rates from open-exchange-rates.json
   [junit4]   2> 924156 T2367 oass.IndexSchema.readSchema default search field in schema is text
   [junit4]   2> 924157 T2388 oass.OpenExchangeRatesOrgProvider$OpenExchangeRates.<init> WARN Unknown key IMPORTANT NOTE
   [junit4]   2> 924158 T2388 oass.OpenExchangeRatesOrgProvider$OpenExchangeRates.<init> WARN Expected key, got STRING
   [junit4]   2> 924158 T2388 oasc.SolrCore.initDirectoryFactory org.apache.solr.core.MockDirectoryFactory
   [junit4]   2> 924158 T2388 oasc.SolrCore.<init> [nodes_used_collection_shard2_replica1] Opening new SolrCore at /mnt/ssd/jenkins/workspace/Lucene-Solr-4.x-Linux/solr/build/solr-core/test/J1/./org.apache.solr.cloud.CollectionsAPIDistributedZkTest-jetty3-1375410905122/nodes_used_collection_shard2_replica1/, dataDir=/mnt/ssd/jenkins/workspace/Lucene-Solr-4.x-Linux/solr/build/solr-core/test/J1/./org.apache.solr.cloud.CollectionsAPIDistributedZkTest-jetty3-1375410905122//nodes_used_collection_shard2_replica1/data/
   [junit4]   2> 924159 T2388 oasc.JmxMonitoredMap.<init> JMX monitoring is enabled. Adding Solr mbeans to JMX Server: com.sun.jmx.mbeanserver.JmxMBeanServer@edbca8
   [junit4]   2> 924159 T2367 oass.IndexSchema.readSchema unique key field: id
   [junit4]   2> 924160 T2388 oasc.CachingDirectoryFactory.get return new directory for /mnt/ssd/jenkins/workspace/Lucene-Solr-4.x-Linux/solr/build/solr-core/test/J1/./org.apache.solr.cloud.CollectionsAPIDistributedZkTest-jetty3-1375410905122//nodes_used_collection_shard2_replica1/data
   [junit4]   2> 924160 T2388 oasc.SolrCore.getNewIndexDir New index directory detected: old=null new=/mnt/ssd/jenkins/workspace/Lucene-Solr-4.x-Linux/solr/build/solr-core/test/J1/./org.apache.solr.cloud.CollectionsAPIDistributedZkTest-jetty3-1375410905122//nodes_used_collection_shard2_replica1/data/index/
   [junit4]   2> 924160 T2388 oasc.SolrCore.initIndex WARN [nodes_used_collection_shard2_replica1] Solr index directory '/mnt/ssd/jenkins/workspace/Lucene-Solr-4.x-Linux/solr/build/solr-core/test/J1/./org.apache.solr.cloud.CollectionsAPIDistributedZkTest-jetty3-1375410905122/nodes_used_collection_shard2_replica1/data/index' doesn't exist. Creating new index...
   [junit4]   2> 924161 T2388 oasc.CachingDirectoryFactory.get return new directory for /mnt/ssd/jenkins/workspace/Lucene-Solr-4.x-Linux/solr/build/solr-core/test/J1/./org.apache.solr.cloud.CollectionsAPIDistributedZkTest-jetty3-1375410905122//nodes_used_collection_shard2_replica1/data/index
   [junit4]   2> 924162 T2388 oasc.SolrDeletionPolicy.onCommit SolrDeletionPolicy.onCommit: commits: num=1
   [junit4]   2> 		commit{dir=MockDirWrapper(org.apache.lucene.store.RAMDirectory@22361d lockFactory=org.apache.lucene.store.NativeFSLockFactory@db40c5),segFN=segments_1,generation=1}
   [junit4]   2> 924163 T2388 oasc.SolrDeletionPolicy.updateCommits newest commit generation = 1
   [junit4]   2> 924167 T2388 oasup.UpdateRequestProcessorChain.init inserting DistributedUpdateProcessorFactory into updateRequestProcessorChain "dedupe"
   [junit4]   2> 924167 T2388 oasup.UpdateRequestProcessorChain.init inserting DistributedUpdateProcessorFactory into updateRequestProcessorChain "stored_sig"
   [junit4]   2> 924168 T2388 oasup.UpdateRequestProcessorChain.init inserting DistributedUpdateProcessorFactory into updateRequestProcessorChain "distrib-dup-test-chain-implicit"
   [junit4]   2> 924169 T2388 oasc.RequestHandlers.initHandlersFromConfig created standard: solr.StandardRequestHandler
   [junit4]   2> 924170 T2388 oasc.RequestHandlers.initHandlersFromConfig created /get: solr.RealTimeGetHandler
   [junit4]   2> 924170 T2388 oasc.RequestHandlers.initHandlersFromConfig adding lazy requestHandler: solr.ReplicationHandler
   [junit4]   2> 924171 T2388 oasc.RequestHandlers.initHandlersFromConfig created /replication: solr.ReplicationHandler
   [junit4]   2> 924172 T2388 oasc.RequestHandlers.initHandlersFromConfig created /update: solr.UpdateRequestHandler
   [junit4]   2> 924172 T2388 oasc.RequestHandlers.initHandlersFromConfig created /admin/: org.apache.solr.handler.admin.AdminHandlers
   [junit4]   2> 924174 T2388 oashl.XMLLoader.init xsltCacheLifetimeSeconds=60
   [junit4]   2> 924177 T2388 oass.SolrIndexSearcher.<init> Opening Searcher@3cf80f main
   [junit4]   2> 924178 T2388 oasu.CommitTracker.<init> Hard AutoCommit: disabled
   [junit4]   2> 924178 T2388 oasu.CommitTracker.<init> Soft AutoCommit: disabled
   [junit4]   2> 924182 T2367 oass.FileExchangeRateProvider.reload Reloading exchange rates from file currency.xml
   [junit4]   2> 924183 T2413 oasc.SolrCore.registerSearcher [nodes_used_collection_shard2_replica1] Registered new searcher Searcher@3cf80f main{StandardDirectoryReader(segments_1:1)}
   [junit4]   2> 924185 T2388 oasc.CoreContainer.registerCore registering core: nodes_used_collection_shard2_replica1
   [junit4]   2> 924186 T2388 oasc.ZkController.register Register replica - core:nodes_used_collection_shard2_replica1 address:http://127.0.0.1:52614/_ collection:nodes_used_collection shard:shard2
   [junit4]   2> 924186 T2388 oascsi.HttpClientUtil.createClient Creating new http client, config:maxConnections=10000&maxConnectionsPerHost=20&connTimeout=15000&socketTimeout=30000&retry=false
   [junit4]   2> 924196 T2367 oass.FileExchangeRateProvider.reload Reloading exchange rates from file currency.xml
   [junit4]   2> 924198 T2388 oascc.SolrZkClient.makePath makePath: /collections/nodes_used_collection/leader_elect/shard2/election
   [junit4]   2> 924201 T2367 oass.OpenExchangeRatesOrgProvider.reload Reloading exchange rates from open-exchange-rates.json
   [junit4]   2> 924204 T2367 oass.OpenExchangeRatesOrgProvider$OpenExchangeRates.<init> WARN Unknown key IMPORTANT NOTE
   [junit4]   2> 924205 T2367 oass.OpenExchangeRatesOrgProvider$OpenExchangeRates.<init> WARN Expected key, got STRING
   [junit4]   2> 924205 T2367 oass.OpenExchangeRatesOrgProvider.reload Reloading exchange rates from open-exchange-rates.json
   [junit4]   2> 924208 T2367 oass.OpenExchangeRatesOrgProvider$OpenExchangeRates.<init> WARN Unknown key IMPORTANT NOTE
   [junit4]   2> 924209 T2367 oass.OpenExchangeRatesOrgProvider$OpenExchangeRates.<init> WARN Expected key, got STRING
   [junit4]   2> 924209 T2367 oasc.SolrCore.initDirectoryFactory org.apache.solr.core.MockDirectoryFactory
   [junit4]   2> 924210 T2367 oasc.SolrCore.<init> [nodes_used_collection_shard2_replica2] Opening new SolrCore at /mnt/ssd/jenkins/workspace/Lucene-Solr-4.x-Linux/solr/build/solr-core/test/J1/./org.apache.solr.cloud.CollectionsAPIDistributedZkTest-jetty2-1375410903798/nodes_used_collection_shard2_replica2/, dataDir=/mnt/ssd/jenkins/workspace/Lucene-Solr-4.x-Linux/solr/build/solr-core/test/J1/./org.apache.solr.cloud.CollectionsAPIDistributedZkTest-jetty2-1375410903798//nodes_used_collection_shard2_replica2/data/
   [junit4]   2> 924210 T2367 oasc.JmxMonitoredMap.<init> JMX monitoring is enabled. Adding Solr mbeans to JMX Server: com.sun.jmx.mbeanserver.JmxMBeanServer@edbca8
   [junit4]   2> 924211 T2367 oasc.CachingDirectoryFactory.get return new directory for /mnt/ssd/jenkins/workspace/Lucene-Solr-4.x-Linux/solr/build/solr-core/test/J1/./org.apache.solr.cloud.CollectionsAPIDistributedZkTest-jetty2-1375410903798//nodes_used_collection_shard2_replica2/data
   [junit4]   2> 924211 T2388 oasc.ShardLeaderElectionContext.runLeaderProcess Running the leader process for shard shard2
   [junit4]   2> 924212 T2367 oasc.SolrCore.getNewIndexDir New index directory detected: old=null new=/mnt/ssd/jenkins/workspace/Lucene-Solr-4.x-Linux/solr/build/solr-core/test/J1/./org.apache.solr.cloud.CollectionsAPIDistributedZkTest-jetty2-1375410903798//nodes_used_collection_shard2_replica2/data/index/
   [junit4]   2> 924213 T2367 oasc.SolrCore.initIndex WARN [nodes_used_collection_shard2_replica2] Solr index directory '/mnt/ssd/jenkins/workspace/Lucene-Solr-4.x-Linux/solr/build/solr-core/test/J1/./org.apache.solr.cloud.CollectionsAPIDistributedZkTest-jetty2-1375410903798/nodes_used_collection_shard2_replica2/data/index' doesn't exist. Creating new index...
   [junit4]   2> 924213 T2367 oasc.CachingDirectoryFactory.get return new directory for /mnt/ssd/jenkins/workspace/Lucene-Solr-4.x-Linux/solr/build/solr-core/test/J1/./org.apache.solr.cloud.CollectionsAPIDistributedZkTest-jetty2-1375410903798//nodes_used_collection_shard2_replica2/data/index
   [junit4]   2> 924215 T2367 oasc.SolrDeletionPolicy.onCommit SolrDeletionPolicy.onCommit: commits: num=1
   [junit4]   2> 		commit{dir=MockDirWrapper(org.apache.lucene.store.RAMDirectory@1851b82 lockFactory=org.apache.lucene.store.NativeFSLockFactory@1ec4848),segFN=segments_1,generation=1}
   [junit4]   2> 924216 T2367 oasc.SolrDeletionPolicy.updateCommits newest commit generation = 1
   [junit4]   2> 924216 T2388 oasc.ShardLeaderElectionContext.waitForReplicasToComeUp Waiting until we see more replicas up for shard shard2: total=2 found=1 timeoutin=179999
   [junit4]   2> 924220 T2367 oasup.UpdateRequestProcessorChain.init inserting DistributedUpdateProcessorFactory into updateRequestProcessorChain "dedupe"
   [junit4]   2> 924220 T2367 oasup.UpdateRequestProcessorChain.init inserting DistributedUpdateProcessorFactory into updateRequestProcessorChain "stored_sig"
   [junit4]   2> 924221 T2367 oasup.UpdateRequestProcessorChain.init inserting DistributedUpdateProcessorFactory into updateRequestProcessorChain "distrib-dup-test-chain-implicit"
   [junit4]   2> 924222 T2367 oasc.RequestHandlers.initHandlersFromConfig created standard: solr.StandardRequestHandler
   [junit4]   2> 924223 T2367 oasc.RequestHandlers.initHandlersFromConfig created /get: solr.RealTimeGetHandler
   [junit4]   2> 924224 T2367 oasc.RequestHandlers.initHandlersFromConfig adding lazy requestHandler: solr.ReplicationHandler
   [junit4]   2> 924224 T2367 oasc.RequestHandlers.initHandlersFromConfig created /replication: solr.ReplicationHandler
   [junit4]   2> 924225 T2367 oasc.RequestHandlers.initHandlersFromConfig created /update: solr.UpdateRequestHandler
   [junit4]   2> 924225 T2367 oasc.RequestHandlers.initHandlersFromConfig created /admin/: org.apache.solr.handler.admin.AdminHandlers
   [junit4]   2> 924228 T2367 oashl.XMLLoader.init xsltCacheLifetimeSeconds=60
   [junit4]   2> 924231 T2367 oass.SolrIndexSearcher.<init> Opening Searcher@1d9a782 main
   [junit4]   2> 924232 T2367 oasu.CommitTracker.<init> Hard AutoCommit: disabled
   [junit4]   2> 924232 T2367 oasu.CommitTracker.<init> Soft AutoCommit: disabled
   [junit4]   2> 924236 T2414 oasc.SolrCore.registerSearcher [nodes_used_collection_shard2_replica2] Registered new searcher Searcher@1d9a782 main{StandardDirectoryReader(segments_1:1)}
   [junit4]   2> 924238 T2367 oasc.CoreContainer.registerCore registering core: nodes_used_collection_shard2_replica2
   [junit4]   2> 924238 T2367 oasc.ZkController.register Register replica - core:nodes_used_collection_shard2_replica2 address:http://127.0.0.1:56516/_ collection:nodes_used_collection shard:shard2
   [junit4]   2> 924239 T2367 oascsi.HttpClientUtil.createClient Creating new http client, config:maxConnections=10000&maxConnectionsPerHost=20&connTimeout=15000&socketTimeout=30000&retry=false
   [junit4]   2> 924310 T2401 oass.ByteField.init WARN ByteField is deprecated and will be removed in 5.0. You should use TrieIntField instead.
   [junit4]   2> 924310 T2401 oass.ShortField.init WARN ShortField is deprecated and will be removed in 5.0. You should use TrieIntField instead.
   [junit4]   2> 924311 T2401 oass.OpenExchangeRatesOrgProvider.init Initialized with rates=open-exchange-rates.json, refreshInterval=1440.
   [junit4]   2> 924317 T2344 oascc.ZkStateReader.updateClusterState Updating cloud state from ZooKeeper... 
   [junit4]   2> 924321 T2401 oass.IndexSchema.readSchema default search field in schema is text
   [junit4]   2> 924323 T2379 oascc.ZkStateReader$2.process A cluster state change: WatchedEvent state:SyncConnected type:NodeDataChanged path:/clusterstate.json, has occurred - updating... (live nodes size: 5)
   [junit4]   2> 924324 T2407 oascc.ZkStateReader$2.process A cluster state change: WatchedEvent state:SyncConnected type:NodeDataChanged path:/clusterstate.json, has occurred - updating... (live nodes size: 5)
   [junit4]   2> 924324 T2361 oascc.ZkStateReader$2.process A cluster state change: WatchedEvent state:SyncConnected type:NodeDataChanged path:/clusterstate.json, has occurred - updating... (live nodes size: 5)
   [junit4]   2> 924324 T2343 oascc.ZkStateReader$2.process A cluster state change: WatchedEvent state:SyncConnected type:NodeDataChanged path:/clusterstate.json, has occurred - updating... (live nodes size: 5)
   [junit4]   2> 924324 T2348 oascc.ZkStateReader$2.process A cluster state change: WatchedEvent state:SyncConnected type:NodeDataChanged path:/clusterstate.json, has occurred - updating... (live nodes size: 5)
   [junit4]   2> 924324 T2393 oascc.ZkStateReader$2.process A cluster state change: WatchedEvent state:SyncConnected type:NodeDataChanged path:/clusterstate.json, has occurred - updating... (live nodes size: 5)
   [junit4]   2> 924326 T2401 oass.IndexSchema.readSchema unique key field: id
   [junit4]   2> 924351 T2401 oass.FileExchangeRateProvider.reload Reloading exchange rates from file currency.xml
   [junit4]   2> 924358 T2401 oass.FileExchangeRateProvider.reload Reloading exchange rates from file currency.xml
   [junit4]   2> 924364 T2401 oass.OpenExchangeRatesOrgProvider.reload Reloading exchange rates from open-exchange-rates.json
   [junit4]   2> 924366 T2401 oass.OpenExchangeRatesOrgProvider$OpenExchangeRates.<init> WARN Unknown key IMPORTANT NOTE
   [junit4]   2> 924366 T2401 oass.OpenExchangeRatesOrgProvider$OpenExchangeRates.<init> WARN Expected key, got STRING
   [junit4]   2> 924367 T2401 oass.OpenExchangeRatesOrgProvider.reload Reloading exchange rates from open-exchange-rates.json
   [junit4]   2> 924369 T2401 oass.OpenExchangeRatesOrgProvider$OpenExchangeRates.<init> WARN Unknown key IMPORTANT NOTE
   [junit4]   2> 924369 T2401 oass.OpenExchangeRatesOrgProvider$OpenExchangeRates.<init> WARN Expected key, got STRING
   [junit4]   2> 924370 T2401 oasc.SolrCore.initDirectoryFactory org.apache.solr.core.MockDirectoryFactory
   [junit4]   2> 924370 T2401 oasc.SolrCore.<init> [nodes_used_collection_shard1_replica1] Opening new SolrCore at /mnt/ssd/jenkins/workspace/Lucene-Solr-4.x-Linux/solr/build/solr-core/test/J1/./org.apache.solr.cloud.CollectionsAPIDistributedZkTest-jetty4-1375410906345/nodes_used_collection_shard1_replica1/, dataDir=/mnt/ssd/jenkins/workspace/Lucene-Solr-4.x-Linux/solr/build/solr-core/test/J1/./org.apache.solr.cloud.CollectionsAPIDistributedZkTest-jetty4-1375410906345//nodes_used_collection_shard1_replica1/data/
   [junit4]   2> 924371 T2401 oasc.JmxMonitoredMap.<init> JMX monitoring is enabled. Adding Solr mbeans to JMX Server: com.sun.jmx.mbeanserver.JmxMBeanServer@edbca8
   [junit4]   2> 924372 T2401 oasc.CachingDirectoryFactory.get return new directory for /mnt/ssd/jenkins/workspace/Lucene-Solr-4.x-Linux/solr/build/solr-core/test/J1/./org.apache.solr.cloud.CollectionsAPIDistributedZkTest-jetty4-1375410906345//nodes_used_collection_shard1_replica1/data
   [junit4]   2> 924372 T2401 oasc.SolrCore.getNewIndexDir New index directory detected: old=null new=/mnt/ssd/jenkins/workspace/Lucene-Solr-4.x-Linux/solr/build/solr-core/test/J1/./org.apache.solr.cloud.CollectionsAPIDistributedZkTest-jetty4-1375410906345//nodes_used_collection_shard1_replica1/data/index/
   [junit4]   2> 924373 T2401 oasc.SolrCore.initIndex WARN [nodes_used_collection_shard1_replica1] Solr index directory '/mnt/ssd/jenkins/workspace/Lucene-Solr-4.x-Linux/solr/build/solr-core/test/J1/./org.apache.solr.cloud.CollectionsAPIDistributedZkTest-jetty4-1375410906345/nodes_used_collection_shard1_replica1/data/index' doesn't exist. Creating new index...
   [junit4]   2> 924374 T2401 oasc.CachingDirectoryFactory.get return new directory for /mnt/ssd/jenkins/workspace/Lucene-Solr-4.x-Linux/solr/build/solr-core/test/J1/./org.apache.solr.cloud.CollectionsAPIDistributedZkTest-jetty4-1375410906345//nodes_used_collection_shard1_replica1/data/index
   [junit4]   2> 924376 T2401 oasc.SolrDeletionPolicy.onCommit SolrDeletionPolicy.onCommit: commits: num=1
   [junit4]   2> 		commit{dir=MockDirWrapper(org.apache.lucene.store.RAMDirectory@fe6d2a lockFactory=org.apache.lucene.store.NativeFSLockFactory@b32f7f),segFN=segments_1,generation=1}
   [junit4]   2> 924376 T2401 oasc.SolrDeletionPolicy.updateCommits newest commit generation = 1
   [junit4]   2> 924389 T2401 oasup.UpdateRequestProcessorChain.init inserting DistributedUpdateProcessorFactory into updateRequestProcessorChain "dedupe"
   [junit4]   2> 924390 T2401 oasup.UpdateRequestProcessorChain.init inserting DistributedUpdateProcessorFactory into updateRequestProcessorChain "stored_sig"
   [junit4]   2> 924391 T2401 oasup.UpdateRequestProcessorChain.init inserting DistributedUpdateProcessorFactory into updateRequestProcessorChain "distrib-dup-test-chain-implicit"
   [junit4]   2> 924392 T2401 oasc.RequestHandlers.initHandlersFromConfig created standard: solr.StandardRequestHandler
   [junit4]   2> 924392 T2401 oasc.RequestHandlers.initHandlersFromConfig created /get: solr.RealTimeGetHandler
   [junit4]   2> 924393 T2401 oasc.RequestHandlers.initHandlersFromConfig adding lazy requestHandler: solr.ReplicationHandler
   [junit4]   2> 924393 T2401 oasc.RequestHandlers.initHandlersFromConfig created /replication: solr.ReplicationHandler
   [junit4]   2> 924394 T2401 oasc.RequestHandlers.initHandlersFromConfig created /update: solr.UpdateRequestHandler
   [junit4]   2> 924395 T2401 oasc.RequestHandlers.initHandlersFromConfig created /admin/: org.apache.solr.handler.admin.AdminHandlers
   [junit4]   2> 924398 T2401 oashl.XMLLoader.init xsltCacheLifetimeSeconds=60
   [junit4]   2> 924402 T2401 oass.SolrIndexSearcher.<init> Opening Searcher@116c917 main
   [junit4]   2> 924403 T2401 oasu.CommitTracker.<init> Hard AutoCommit: disabled
   [junit4]   2> 924404 T2401 oasu.CommitTracker.<init> Soft AutoCommit: disabled
   [junit4]   2> 924409 T2415 oasc.SolrCore.registerSearcher [nodes_used_collection_shard1_replica1] Registered new searcher Searcher@116c917 main{StandardDirectoryReader(segments_1:1)}
   [junit4]   2> 924411 T2401 oasc.CoreContainer.registerCore registering core: nodes_used_collection_shard1_replica1
   [junit4]   2> 924412 T2401 oasc.ZkController.register Register replica - core:nodes_used_collection_shard1_replica1 address:http://127.0.0.1:49370/_ collection:nodes_used_collection shard:shard1
   [junit4]   2> 924412 T2401 oascsi.HttpClientUtil.createClient Creating new http client, config:maxConnections=10000&maxConnectionsPerHost=20&connTimeout=15000&socketTimeout=30000&retry=false
   [junit4]   2> 924417 T2401 oascc.SolrZkClient.makePath makePath: /collections/nodes_used_collection/leader_elect/shard1/election
   [junit4]   2> 924420 T2339 oass.ByteField.init WARN ByteField is deprecated and will be removed in 5.0. You should use TrieIntField instead.
   [junit4]   2> 924421 T2339 oass.ShortField.init WARN ShortField is deprecated and will be removed in 5.0. You should use TrieIntField instead.
   [junit4]   2> 924421 T2339 oass.OpenExchangeRatesOrgProvider.init Initialized with rates=open-exchange-rates.json, refreshInterval=1440.
   [junit4]   2> 924426 T2401 oasc.ShardLeaderElectionContext.runLeaderProcess Running the leader process for shard shard1
   [junit4]   2> 924428 T2339 oass.IndexSchema.readSchema default search field in schema is text
   [junit4]   2> 924430 T2401 oasc.ShardLeaderElectionContext.waitForReplicasToComeUp Waiting until we see more replicas up for shard shard1: total=2 found=1 timeoutin=179999
   [junit4]   2> 924431 T2339 oass.IndexSchema.readSchema unique key field: id
   [junit4]   2> 924450 T2339 oass.FileExchangeRateProvider.reload Reloading exchange rates from file currency.xml
   [junit4]   2> 924455 T2339 oass.FileExchangeRateProvider.reload Reloading exchange rates from file currency.xml
   [junit4]   2> 924458 T2339 oass.OpenExchangeRatesOrgProvider.reload Reloading exchange rates from open-exchange-rates.json
   [junit4]   2> 924460 T2339 oass.OpenExchangeRatesOrgProvider$OpenExchangeRates.<init> WARN Unknown key IMPORTANT NOTE
   [junit4]   2> 924461 T2339 oass.OpenExchangeRatesOrgProvider$OpenExchangeRates.<init> WARN Expected key, got STRING
   [junit4]   2> 924461 T2339 oass.OpenExchangeRatesOrgProvider.reload Reloading exchange rates from open-exchange-rates.json
   [junit4]   2> 924463 T2339 oass.OpenExchangeRatesOrgProvider$OpenExchangeRates.<init> WARN Unknown key IMPORTANT NOTE
   [junit4]   2> 924463 T2339 oass.OpenExchangeRatesOrgProvider$OpenExchangeRates.<init> WARN Expected key, got STRING
   [junit4]   2> 924463 T2339 oasc.SolrCore.initDirectoryFactory org.apache.solr.core.MockDirectoryFactory
   [junit4]   2> 924464 T2339 oasc.SolrCore.<init> [nodes_used_collection_shard1_replica2] Opening new SolrCore at /mnt/ssd/jenkins/workspace/Lucene-Solr-4.x-Linux/solr/build/solr-core/test/J1/./org.apache.solr.cloud.CollectionsAPIDistributedZkTest-controljetty-1375410902074/nodes_used_collection_shard1_replica2/, dataDir=/mnt/ssd/jenkins/workspace/Lucene-Solr-4.x-Linux/solr/build/solr-core/test/J1/./org.apache.solr.cloud.CollectionsAPIDistributedZkTest-controljetty-1375410902074//nodes_used_collection_shard1_replica2/data/
   [junit4]   2> 924464 T2339 oasc.JmxMonitoredMap.<init> JMX monitoring is enabled. Adding Solr mbeans to JMX Server: com.sun.jmx.mbeanserver.JmxMBeanServer@edbca8
   [junit4]   2> 924465 T2339 oasc.CachingDirectoryFactory.get return new directory for /mnt/ssd/jenkins/workspace/Lucene-Solr-4.x-Linux/solr/build/solr-core/test/J1/./org.apache.solr.cloud.CollectionsAPIDistributedZkTest-controljetty-1375410902074//nodes_used_collection_shard1_replica2/data
   [junit4]   2> 924465 T2339 oasc.SolrCore.getNewIndexDir New index directory detected: old=null new=/mnt/ssd/jenkins/workspace/Lucene-Solr-4.x-Linux/solr/build/solr-core/test/J1/./org.apache.solr.cloud.CollectionsAPIDistributedZkTest-controljetty-1375410902074//nodes_used_collection_shard1_replica2/data/index/
   [junit4]   2> 924466 T2339 oasc.SolrCore.initIndex WARN [nodes_used_collection_shard1_replica2] Solr index directory '/mnt/ssd/jenkins/workspace/Lucene-Solr-4.x-Linux/solr/build/solr-core/test/J1/./org.apache.solr.cloud.CollectionsAPIDistributedZkTest-controljetty-1375410902074/nodes_used_collection_shard1_replica2/data/index' doesn't exist. Creating new index...
   [junit4]   2> 924466 T2339 oasc.CachingDirectoryFactory.get return new directory for /mnt/ssd/jenkins/workspace/Lucene-Solr-4.x-Linux/solr/build/solr-core/test/J1/./org.apache.solr.cloud.CollectionsAPIDistributedZkTest-controljetty-1375410902074//nodes_used_collection_shard1_replica2/data/index
   [junit4]   2> 924467 T2339 oasc.SolrDeletionPolicy.onCommit SolrDeletionPolicy.onCommit: commits: num=1
   [junit4]   2> 		commit{dir=MockDirWrapper(org.apache.lucene.store.RAMDirectory@e747d3 lockFactory=org.apache.lucene.store.NativeFSLockFactory@5fc11b),segFN=segments_1,generation=1}
   [junit4]   2> 924468 T2339 oasc.SolrDeletionPolicy.updateCommits newest commit generation = 1
   [junit4]   2> 924471 T2339 oasup.UpdateRequestProcessorChain.init inserting DistributedUpdateProcessorFactory into updateRequestProcessorChain "dedupe"
   [junit4]   2> 924471 T2339 oasup.UpdateRequestProcessorChain.init inserting DistributedUpdateProcessorFactory into updateRequestProcessorChain "stored_sig"
   [junit4]   2> 924472 T2339 oasup.UpdateRequestProcessorChain.init inserting DistributedUpdateProcessorFactory into updateRequestProcessorChain "distrib-dup-test-chain-implicit"
   [junit4]   2> 924472 T2339 oasc.RequestHandlers.initHandlersFromConfig created standard: solr.StandardRequestHandler
   [junit4]   2> 924473 T2339 oasc.RequestHandlers.initHandlersFromConfig created /get: solr.RealTimeGetHandler
   [junit4]   2> 924473 T2339 oasc.RequestHandlers.initHandlersFromConfig adding lazy requestHandler: solr.ReplicationHandler
   [junit4]   2> 924473 T2339 oasc.RequestHandlers.initHandlersFromConfig created /replication: solr.ReplicationHandler
   [junit4]   2> 924474 T2339 oasc.RequestHandlers.initHandlersFromConfig created /update: solr.UpdateRequestHandler
   [junit4]   2> 924474 T2339 oasc.RequestHandlers.initHandlersFromConfig created /admin/: org.apache.solr.handler.admin.AdminHandlers
   [junit4]   2> 924476 T2339 oashl.XMLLoader.init xsltCacheLifetimeSeconds=60
   [junit4]   2> 924479 T2339 oass.SolrIndexSearcher.<init> Opening Searcher@61d4e3 main
   [junit4]   2> 924480 T2339 oasu.CommitTracker.<init> Hard AutoCommit: disabled
   [junit4]   2> 924480 T2339 oasu.CommitTracker.<init> Soft AutoCommit: disabled
   [junit4]   2> 924483 T2416 oasc.SolrCore.registerSearcher [nodes_used_collection_shard1_replica2] Registered new searcher Searcher@61d4e3 main{StandardDirectoryReader(segments_1:1)}
   [junit4]   2> 924486 T2339 oasc.CoreContainer.registerCore registering core: nodes_used_collection_shard1_replica2
   [junit4]   2> 924486 T2339 oasc.ZkController.register Register replica - core:nodes_used_collection_shard1_replica2 address:http://127.0.0.1:55293/_ collection:nodes_used_collection shard:shard1
   [junit4]   2> 924486 T2339 oascsi.HttpClientUtil.createClient Creating new http client, config:maxConnections=10000&maxConnectionsPerHost=20&connTimeout=15000&socketTimeout=30000&retry=false
   [junit4]   2> 924718 T2388 oasc.ShardLeaderElectionContext.waitForReplicasToComeUp Enough replicas found to continue.
   [junit4]   2> 924718 T2388 oasc.ShardLeaderElectionContext.runLeaderProcess I may be the new leader - try and sync
   [junit4]   2> 924718 T2388 oasc.SyncStrategy.sync Sync replicas to http://127.0.0.1:52614/_/nodes_used_collection_shard2_replica1/
   [junit4]   2> 924719 T2388 oasu.PeerSync.sync PeerSync: core=nodes_used_collection_shard2_replica1 url=http://127.0.0.1:52614/_ START replicas=[http://127.0.0.1:56516/_/nodes_used_collection_shard2_replica2/] nUpdates=100
   [junit4]   2> 924720 T2388 oasu.PeerSync.sync PeerSync: core=nodes_used_collection_shard2_replica1 url=http://127.0.0.1:52614/_ DONE.  We have no versions.  sync failed.
   [junit4]   2> 924720 T2388 oasc.SyncStrategy.syncReplicas Leader's attempt to sync with shard failed, moving to the next candidate
   [junit4]   2> 924720 T2388 oasc.ShardLeaderElectionContext.runLeaderProcess We failed sync, but we have no versions - we can't sync in that case - we were active before, so become leader anyway
   [junit4]   2> 924721 T2388 oasc.ShardLeaderElectionContext.runLeaderProcess I am the new leader: http://127.0.0.1:52614/_/nodes_used_collection_shard2_replica

[...truncated too long message...]

p.impl.client.AbstractHttpClient.execute(AbstractHttpClient.java:906)
   [junit4]    > 	at org.apache.http.impl.client.AbstractHttpClient.execute(AbstractHttpClient.java:805)
   [junit4]    > 	at org.apache.http.impl.client.AbstractHttpClient.execute(AbstractHttpClient.java:784)
   [junit4]    > 	at org.apache.solr.client.solrj.impl.HttpSolrServer.request(HttpSolrServer.java:365)
   [junit4]    > 	... 44 more
   [junit4]    > Caused by: java.net.ConnectException: Connection refused
   [junit4]    > 	at java.net.PlainSocketImpl.socketConnect(Native Method)
   [junit4]    > 	at java.net.PlainSocketImpl.doConnect(PlainSocketImpl.java:351)
   [junit4]    > 	at java.net.PlainSocketImpl.connectToAddress(PlainSocketImpl.java:213)
   [junit4]    > 	at java.net.PlainSocketImpl.connect(PlainSocketImpl.java:200)
   [junit4]    > 	at java.net.SocksSocketImpl.connect(SocksSocketImpl.java:366)
   [junit4]    > 	at java.net.Socket.connect(Socket.java:529)
   [junit4]    > 	at org.apache.http.conn.scheme.PlainSocketFactory.connectSocket(PlainSocketFactory.java:127)
   [junit4]    > 	at org.apache.http.impl.conn.DefaultClientConnectionOperator.openConnection(DefaultClientConnectionOperator.java:180)
   [junit4]    > 	... 51 more
   [junit4]   2> 1060924 T2321 oas.SolrTestCaseJ4.deleteCore ###deleteCore
   [junit4]   2> 146234 T2320 ccr.ThreadLeakControl.checkThreadLeaks WARNING Will linger awaiting termination of 2 leaked thread(s).
   [junit4]   2> 1062124 T2407 oasc.LeaderElector$1.process WARN  org.apache.zookeeper.KeeperException$SessionExpiredException: KeeperErrorCode = Session expired for /collections/new_implicit_coll_0/leader_elect/d/election
   [junit4]   2> 	at org.apache.zookeeper.KeeperException.create(KeeperException.java:127)
   [junit4]   2> 	at org.apache.zookeeper.KeeperException.create(KeeperException.java:51)
   [junit4]   2> 	at org.apache.zookeeper.ZooKeeper.getChildren(ZooKeeper.java:1468)
   [junit4]   2> 	at org.apache.solr.common.cloud.SolrZkClient$6.execute(SolrZkClient.java:235)
   [junit4]   2> 	at org.apache.solr.common.cloud.SolrZkClient$6.execute(SolrZkClient.java:232)
   [junit4]   2> 	at org.apache.solr.common.cloud.ZkCmdExecutor.retryOperation(ZkCmdExecutor.java:65)
   [junit4]   2> 	at org.apache.solr.common.cloud.SolrZkClient.getChildren(SolrZkClient.java:232)
   [junit4]   2> 	at org.apache.solr.cloud.LeaderElector.checkIfIamLeader(LeaderElector.java:84)
   [junit4]   2> 	at org.apache.solr.cloud.LeaderElector.access$000(LeaderElector.java:55)
   [junit4]   2> 	at org.apache.solr.cloud.LeaderElector$1.process(LeaderElector.java:129)
   [junit4]   2> 	at org.apache.zookeeper.ClientCnxn$EventThread.processEvent(ClientCnxn.java:519)
   [junit4]   2> 	at org.apache.zookeeper.ClientCnxn$EventThread.run(ClientCnxn.java:495)
   [junit4]   2> 
   [junit4]   2> 1062124 T2407 oasc.LeaderElector$1.process WARN  org.apache.zookeeper.KeeperException$SessionExpiredException: KeeperErrorCode = Session expired for /collections/new_implicit_coll_0/leader_elect/a/election
   [junit4]   2> 	at org.apache.zookeeper.KeeperException.create(KeeperException.java:127)
   [junit4]   2> 	at org.apache.zookeeper.KeeperException.create(KeeperException.java:51)
   [junit4]   2> 	at org.apache.zookeeper.ZooKeeper.getChildren(ZooKeeper.java:1468)
   [junit4]   2> 	at org.apache.solr.common.cloud.SolrZkClient$6.execute(SolrZkClient.java:235)
   [junit4]   2> 	at org.apache.solr.common.cloud.SolrZkClient$6.execute(SolrZkClient.java:232)
   [junit4]   2> 	at org.apache.solr.common.cloud.ZkCmdExecutor.retryOperation(ZkCmdExecutor.java:65)
   [junit4]   2> 	at org.apache.solr.common.cloud.SolrZkClient.getChildren(SolrZkClient.java:232)
   [junit4]   2> 	at org.apache.solr.cloud.LeaderElector.checkIfIamLeader(LeaderElector.java:84)
   [junit4]   2> 	at org.apache.solr.cloud.LeaderElector.access$000(LeaderElector.java:55)
   [junit4]   2> 	at org.apache.solr.cloud.LeaderElector$1.process(LeaderElector.java:129)
   [junit4]   2> 	at org.apache.zookeeper.ClientCnxn$EventThread.processEvent(ClientCnxn.java:519)
   [junit4]   2> 	at org.apache.zookeeper.ClientCnxn$EventThread.run(ClientCnxn.java:495)
   [junit4]   2> 
   [junit4]   2> 1062125 T2407 oasc.LeaderElector$1.process WARN  org.apache.zookeeper.KeeperException$SessionExpiredException: KeeperErrorCode = Session expired for /collections/new_implicit_coll_0/leader_elect/b/election
   [junit4]   2> 	at org.apache.zookeeper.KeeperException.create(KeeperException.java:127)
   [junit4]   2> 	at org.apache.zookeeper.KeeperException.create(KeeperException.java:51)
   [junit4]   2> 	at org.apache.zookeeper.ZooKeeper.getChildren(ZooKeeper.java:1468)
   [junit4]   2> 	at org.apache.solr.common.cloud.SolrZkClient$6.execute(SolrZkClient.java:235)
   [junit4]   2> 	at org.apache.solr.common.cloud.SolrZkClient$6.execute(SolrZkClient.java:232)
   [junit4]   2> 	at org.apache.solr.common.cloud.ZkCmdExecutor.retryOperation(ZkCmdExecutor.java:65)
   [junit4]   2> 	at org.apache.solr.common.cloud.SolrZkClient.getChildren(SolrZkClient.java:232)
   [junit4]   2> 	at org.apache.solr.cloud.LeaderElector.checkIfIamLeader(LeaderElector.java:84)
   [junit4]   2> 	at org.apache.solr.cloud.LeaderElector.access$000(LeaderElector.java:55)
   [junit4]   2> 	at org.apache.solr.cloud.LeaderElector$1.process(LeaderElector.java:129)
   [junit4]   2> 	at org.apache.zookeeper.ClientCnxn$EventThread.processEvent(ClientCnxn.java:519)
   [junit4]   2> 	at org.apache.zookeeper.ClientCnxn$EventThread.run(ClientCnxn.java:495)
   [junit4]   2> 
   [junit4]   2> 1062125 T2407 oascc.ZkStateReader$2.process A cluster state change: WatchedEvent state:SyncConnected type:NodeChildrenChanged path:/live_nodes, has occurred - updating... (live nodes size: 1)
   [junit4]   2> 1062125 T2407 oascc.ZkStateReader$2.process WARN ZooKeeper watch triggered, but Solr cannot talk to ZK
   [junit4]   2> 1062126 T2407 oascc.ZkStateReader$3.process WARN ZooKeeper watch triggered, but Solr cannot talk to ZK
   [junit4]   2> NOTE: test params are: codec=Lucene42: {range_facet_l=PostingsFormat(name=MockSep), _route_=Pulsing41(freqCutoff=9 minBlockSize=73 maxBlockSize=169), text=Pulsing41(freqCutoff=9 minBlockSize=73 maxBlockSize=169), _version_=PostingsFormat(name=MockSep), intDefault=PostingsFormat(name=MockSep), id=PostingsFormat(name=Direct), timestamp=PostingsFormat(name=MockSep), a_t=PostingsFormat(name=MockSep), range_facet_sl=Pulsing41(freqCutoff=9 minBlockSize=73 maxBlockSize=169), range_facet_si=PostingsFormat(name=Asserting), other_tl1=PostingsFormat(name=MockSep), multiDefault=PostingsFormat(name=Asserting), a_si=PostingsFormat(name=Asserting)}, docValues:{}, sim=DefaultSimilarity, locale=ko_KR, timezone=Africa/Malabo
   [junit4]   2> NOTE: Linux 3.2.0-51-generic i386/Sun Microsystems Inc. 1.6.0_45 (32-bit)/cpus=8,threads=5,free=63095504,total=204476416
   [junit4]   2> NOTE: All tests run in this JVM: [DistanceFunctionTest, ZkSolrClientTest, CoreAdminCreateDiscoverTest, TestOmitPositions, TestArbitraryIndexDir, TestAnalyzedSuggestions, TestSolrJ, TestDefaultSimilarityFactory, TestPartialUpdateDeduplication, DOMUtilTest, TestPropInject, TestSolrXMLSerializer, TestStressLucene, TestCSVResponseWriter, SolrIndexConfigTest, TestFastOutputStream, TestBinaryResponseWriter, PathHierarchyTokenizerFactoryTest, TestNumberUtils, TestPostingsSolrHighlighter, StandardRequestHandlerTest, DirectSolrSpellCheckerTest, BadCopyFieldTest, SuggesterTSTTest, TestSerializedLuceneMatchVersion, FieldAnalysisRequestHandlerTest, StatsComponentTest, IndexSchemaRuntimeFieldTest, QueryResultKeyTest, TestDistributedGrouping, HdfsRecoveryZkTest, TestRandomFaceting, TestCopyFieldCollectionResource, TestCollationField, TestCloudManagedSchema, FullSolrCloudDistribCmdsTest, TestFoldingMultitermQuery, TestManagedSchemaFieldResource, TestSchemaSimilarityResource, TestHashPartitioner, EchoParamsTest, HdfsSyncSliceTest, IndexReaderFactoryTest, TestRangeQuery, SolrCmdDistributorTest, XsltUpdateRequestHandlerTest, TestSchemaResource, DeleteShardTest, SolrRequestParserTest, BasicZkTest, DirectUpdateHandlerTest, TestUpdate, SortByFunctionTest, TestStressReorder, SpellCheckComponentTest, TestReload, BlockCacheTest, CoreContainerCoreInitFailuresTest, CopyFieldTest, DocumentAnalysisRequestHandlerTest, TestJmxIntegration, LeaderElectionIntegrationTest, SuggesterWFSTTest, ChaosMonkeySafeLeaderTest, DebugComponentTest, SampleTest, ShardSplitTest, UniqFieldsUpdateProcessorFactoryTest, JSONWriterTest, PingRequestHandlerTest, SpellCheckCollatorTest, TestWordDelimiterFilterFactory, TestFieldCollectionResource, TestMultiCoreConfBootstrap, DisMaxRequestHandlerTest, BasicDistributedZk2Test, CollectionsAPIDistributedZkTest]
   [junit4] Completed on J1 in 147.52s, 1 test, 1 error <<< FAILURES!

[...truncated 482 lines...]
BUILD FAILED
/mnt/ssd/jenkins/workspace/Lucene-Solr-4.x-Linux/build.xml:395: The following error occurred while executing this line:
/mnt/ssd/jenkins/workspace/Lucene-Solr-4.x-Linux/build.xml:375: The following error occurred while executing this line:
/mnt/ssd/jenkins/workspace/Lucene-Solr-4.x-Linux/build.xml:39: The following error occurred while executing this line:
/mnt/ssd/jenkins/workspace/Lucene-Solr-4.x-Linux/solr/build.xml:181: The following error occurred while executing this line:
/mnt/ssd/jenkins/workspace/Lucene-Solr-4.x-Linux/solr/common-build.xml:449: The following error occurred while executing this line:
/mnt/ssd/jenkins/workspace/Lucene-Solr-4.x-Linux/lucene/common-build.xml:1233: The following error occurred while executing this line:
/mnt/ssd/jenkins/workspace/Lucene-Solr-4.x-Linux/lucene/common-build.xml:876: There were test failures: 321 suites, 1352 tests, 1 error, 34 ignored (6 assumptions)

Total time: 45 minutes 13 seconds
Build step 'Invoke Ant' marked build as failure
Description set: Java: 32bit/jdk1.6.0_45 -client -XX:+UseSerialGC
Archiving artifacts
Recording test results
Email was triggered for: Failure
Sending email for trigger: Failure



Mime
View raw message