lucene-dev mailing list archives

Site index · List index
Message view « Date » · « Thread »
Top « Date » · « Thread »
From Policeman Jenkins Server <jenk...@thetaphi.de>
Subject [JENKINS] Lucene-Solr-4.x-Linux (64bit/jdk1.6.0_45) - Build # 6752 - Still Failing!
Date Thu, 01 Aug 2013 16:31:06 GMT
Build: http://jenkins.thetaphi.de/job/Lucene-Solr-4.x-Linux/6752/
Java: 64bit/jdk1.6.0_45 -XX:-UseCompressedOops -XX:+UseSerialGC

1 tests failed.
FAILED:  org.apache.solr.cloud.CollectionsAPIDistributedZkTest.testDistribSearch

Error Message:
Server refused connection at: http://127.0.0.1:50024/wnpb/k

Stack Trace:
org.apache.solr.client.solrj.SolrServerException: Server refused connection at: http://127.0.0.1:50024/wnpb/k
	at __randomizedtesting.SeedInfo.seed([E089ED5C5D8E6763:616F63442AD1075F]:0)
	at org.apache.solr.client.solrj.impl.HttpSolrServer.request(HttpSolrServer.java:428)
	at org.apache.solr.client.solrj.impl.HttpSolrServer.request(HttpSolrServer.java:180)
	at org.apache.solr.cloud.AbstractFullDistribZkTestBase.createCollection(AbstractFullDistribZkTestBase.java:1535)
	at org.apache.solr.cloud.CollectionsAPIDistributedZkTest.testCustomCollectionsAPI(CollectionsAPIDistributedZkTest.java:677)
	at org.apache.solr.cloud.CollectionsAPIDistributedZkTest.doTest(CollectionsAPIDistributedZkTest.java:159)
	at org.apache.solr.BaseDistributedSearchTestCase.testDistribSearch(BaseDistributedSearchTestCase.java:835)
	at sun.reflect.NativeMethodAccessorImpl.invoke0(Native Method)
	at sun.reflect.NativeMethodAccessorImpl.invoke(NativeMethodAccessorImpl.java:39)
	at sun.reflect.DelegatingMethodAccessorImpl.invoke(DelegatingMethodAccessorImpl.java:25)
	at java.lang.reflect.Method.invoke(Method.java:597)
	at com.carrotsearch.randomizedtesting.RandomizedRunner.invoke(RandomizedRunner.java:1559)
	at com.carrotsearch.randomizedtesting.RandomizedRunner.access$600(RandomizedRunner.java:79)
	at com.carrotsearch.randomizedtesting.RandomizedRunner$6.evaluate(RandomizedRunner.java:737)
	at com.carrotsearch.randomizedtesting.RandomizedRunner$7.evaluate(RandomizedRunner.java:773)
	at com.carrotsearch.randomizedtesting.RandomizedRunner$8.evaluate(RandomizedRunner.java:787)
	at com.carrotsearch.randomizedtesting.rules.SystemPropertiesRestoreRule$1.evaluate(SystemPropertiesRestoreRule.java:53)
	at org.apache.lucene.util.TestRuleSetupTeardownChained$1.evaluate(TestRuleSetupTeardownChained.java:50)
	at org.apache.lucene.util.TestRuleFieldCacheSanity$1.evaluate(TestRuleFieldCacheSanity.java:51)
	at org.apache.lucene.util.AbstractBeforeAfterRule$1.evaluate(AbstractBeforeAfterRule.java:46)
	at com.carrotsearch.randomizedtesting.rules.SystemPropertiesInvariantRule$1.evaluate(SystemPropertiesInvariantRule.java:55)
	at org.apache.lucene.util.TestRuleThreadAndTestName$1.evaluate(TestRuleThreadAndTestName.java:49)
	at org.apache.lucene.util.TestRuleIgnoreAfterMaxFailures$1.evaluate(TestRuleIgnoreAfterMaxFailures.java:70)
	at org.apache.lucene.util.TestRuleMarkFailure$1.evaluate(TestRuleMarkFailure.java:48)
	at com.carrotsearch.randomizedtesting.rules.StatementAdapter.evaluate(StatementAdapter.java:36)
	at com.carrotsearch.randomizedtesting.ThreadLeakControl$StatementRunner.run(ThreadLeakControl.java:358)
	at com.carrotsearch.randomizedtesting.ThreadLeakControl.forkTimeoutingTask(ThreadLeakControl.java:782)
	at com.carrotsearch.randomizedtesting.ThreadLeakControl$3.evaluate(ThreadLeakControl.java:442)
	at com.carrotsearch.randomizedtesting.RandomizedRunner.runSingleTest(RandomizedRunner.java:746)
	at com.carrotsearch.randomizedtesting.RandomizedRunner$3.evaluate(RandomizedRunner.java:648)
	at com.carrotsearch.randomizedtesting.RandomizedRunner$4.evaluate(RandomizedRunner.java:682)
	at com.carrotsearch.randomizedtesting.RandomizedRunner$5.evaluate(RandomizedRunner.java:693)
	at com.carrotsearch.randomizedtesting.rules.StatementAdapter.evaluate(StatementAdapter.java:36)
	at com.carrotsearch.randomizedtesting.rules.SystemPropertiesRestoreRule$1.evaluate(SystemPropertiesRestoreRule.java:53)
	at org.apache.lucene.util.AbstractBeforeAfterRule$1.evaluate(AbstractBeforeAfterRule.java:46)
	at org.apache.lucene.util.TestRuleStoreClassName$1.evaluate(TestRuleStoreClassName.java:42)
	at com.carrotsearch.randomizedtesting.rules.SystemPropertiesInvariantRule$1.evaluate(SystemPropertiesInvariantRule.java:55)
	at com.carrotsearch.randomizedtesting.rules.NoShadowingOrOverridesOnMethodsRule$1.evaluate(NoShadowingOrOverridesOnMethodsRule.java:39)
	at com.carrotsearch.randomizedtesting.rules.NoShadowingOrOverridesOnMethodsRule$1.evaluate(NoShadowingOrOverridesOnMethodsRule.java:39)
	at com.carrotsearch.randomizedtesting.rules.StatementAdapter.evaluate(StatementAdapter.java:36)
	at org.apache.lucene.util.TestRuleAssertionsRequired$1.evaluate(TestRuleAssertionsRequired.java:43)
	at org.apache.lucene.util.TestRuleMarkFailure$1.evaluate(TestRuleMarkFailure.java:48)
	at org.apache.lucene.util.TestRuleIgnoreAfterMaxFailures$1.evaluate(TestRuleIgnoreAfterMaxFailures.java:70)
	at org.apache.lucene.util.TestRuleIgnoreTestSuites$1.evaluate(TestRuleIgnoreTestSuites.java:55)
	at com.carrotsearch.randomizedtesting.rules.StatementAdapter.evaluate(StatementAdapter.java:36)
	at com.carrotsearch.randomizedtesting.ThreadLeakControl$StatementRunner.run(ThreadLeakControl.java:358)
	at java.lang.Thread.run(Thread.java:662)
Caused by: org.apache.http.conn.HttpHostConnectException: Connection to http://127.0.0.1:50024 refused
	at org.apache.http.impl.conn.DefaultClientConnectionOperator.openConnection(DefaultClientConnectionOperator.java:190)
	at org.apache.http.impl.conn.ManagedClientConnectionImpl.open(ManagedClientConnectionImpl.java:294)
	at org.apache.http.impl.client.DefaultRequestDirector.tryConnect(DefaultRequestDirector.java:645)
	at org.apache.http.impl.client.DefaultRequestDirector.execute(DefaultRequestDirector.java:480)
	at org.apache.http.impl.client.AbstractHttpClient.execute(AbstractHttpClient.java:906)
	at org.apache.http.impl.client.AbstractHttpClient.execute(AbstractHttpClient.java:805)
	at org.apache.http.impl.client.AbstractHttpClient.execute(AbstractHttpClient.java:784)
	at org.apache.solr.client.solrj.impl.HttpSolrServer.request(HttpSolrServer.java:365)
	... 45 more
Caused by: java.net.ConnectException: Connection refused
	at java.net.PlainSocketImpl.socketConnect(Native Method)
	at java.net.PlainSocketImpl.doConnect(PlainSocketImpl.java:351)
	at java.net.PlainSocketImpl.connectToAddress(PlainSocketImpl.java:213)
	at java.net.PlainSocketImpl.connect(PlainSocketImpl.java:200)
	at java.net.SocksSocketImpl.connect(SocksSocketImpl.java:366)
	at java.net.Socket.connect(Socket.java:529)
	at org.apache.http.conn.scheme.PlainSocketFactory.connectSocket(PlainSocketFactory.java:127)
	at org.apache.http.impl.conn.DefaultClientConnectionOperator.openConnection(DefaultClientConnectionOperator.java:180)
	... 52 more




Build Log:
[...truncated 9263 lines...]
   [junit4] Suite: org.apache.solr.cloud.CollectionsAPIDistributedZkTest
   [junit4]   2> 610577 T2013 oas.BaseDistributedSearchTestCase.initHostContext Setting hostContext system property: /wnpb/k
   [junit4]   2> 610581 T2013 oas.SolrTestCaseJ4.setUp ###Starting testDistribSearch
   [junit4]   2> Creating dataDir: /mnt/ssd/jenkins/workspace/Lucene-Solr-4.x-Linux/solr/build/solr-core/test/J1/./solrtest-CollectionsAPIDistributedZkTest-1375373897246
   [junit4]   2> 610582 T2013 oasc.ZkTestServer.run STARTING ZK TEST SERVER
   [junit4]   2> 610582 T2014 oasc.ZkTestServer$ZKServerMain.runFromConfig Starting server
   [junit4]   2> 610682 T2013 oasc.ZkTestServer.run start zk server on port:53772
   [junit4]   2> 610683 T2013 oascc.ConnectionManager.waitForConnected Waiting for client to connect to ZooKeeper
   [junit4]   2> 610690 T2020 oascc.ConnectionManager.process Watcher org.apache.solr.common.cloud.ConnectionManager@5fafd15a name:ZooKeeperConnection Watcher:127.0.0.1:53772 got event WatchedEvent state:SyncConnected type:None path:null path:null type:None
   [junit4]   2> 610691 T2013 oascc.ConnectionManager.waitForConnected Client is connected to ZooKeeper
   [junit4]   2> 610691 T2013 oascc.SolrZkClient.makePath makePath: /solr
   [junit4]   2> 610698 T2013 oascc.ConnectionManager.waitForConnected Waiting for client to connect to ZooKeeper
   [junit4]   2> 610700 T2022 oascc.ConnectionManager.process Watcher org.apache.solr.common.cloud.ConnectionManager@357ed673 name:ZooKeeperConnection Watcher:127.0.0.1:53772/solr got event WatchedEvent state:SyncConnected type:None path:null path:null type:None
   [junit4]   2> 610700 T2013 oascc.ConnectionManager.waitForConnected Client is connected to ZooKeeper
   [junit4]   2> 610701 T2013 oascc.SolrZkClient.makePath makePath: /collections/collection1
   [junit4]   2> 610706 T2013 oascc.SolrZkClient.makePath makePath: /collections/collection1/shards
   [junit4]   2> 610711 T2013 oascc.SolrZkClient.makePath makePath: /collections/control_collection
   [junit4]   2> 610715 T2013 oascc.SolrZkClient.makePath makePath: /collections/control_collection/shards
   [junit4]   2> 610720 T2013 oasc.AbstractZkTestCase.putConfig put /mnt/ssd/jenkins/workspace/Lucene-Solr-4.x-Linux/solr/build/solr-core/test-files/solr/collection1/conf/solrconfig-tlog.xml to /configs/conf1/solrconfig.xml
   [junit4]   2> 610721 T2013 oascc.SolrZkClient.makePath makePath: /configs/conf1/solrconfig.xml
   [junit4]   2> 610728 T2013 oasc.AbstractZkTestCase.putConfig put /mnt/ssd/jenkins/workspace/Lucene-Solr-4.x-Linux/solr/build/solr-core/test-files/solr/collection1/conf/schema.xml to /configs/conf1/schema.xml
   [junit4]   2> 610728 T2013 oascc.SolrZkClient.makePath makePath: /configs/conf1/schema.xml
   [junit4]   2> 610733 T2013 oasc.AbstractZkTestCase.putConfig put /mnt/ssd/jenkins/workspace/Lucene-Solr-4.x-Linux/solr/build/solr-core/test-files/solr/collection1/conf/stopwords.txt to /configs/conf1/stopwords.txt
   [junit4]   2> 610733 T2013 oascc.SolrZkClient.makePath makePath: /configs/conf1/stopwords.txt
   [junit4]   2> 610737 T2013 oasc.AbstractZkTestCase.putConfig put /mnt/ssd/jenkins/workspace/Lucene-Solr-4.x-Linux/solr/build/solr-core/test-files/solr/collection1/conf/protwords.txt to /configs/conf1/protwords.txt
   [junit4]   2> 610737 T2013 oascc.SolrZkClient.makePath makePath: /configs/conf1/protwords.txt
   [junit4]   2> 610741 T2013 oasc.AbstractZkTestCase.putConfig put /mnt/ssd/jenkins/workspace/Lucene-Solr-4.x-Linux/solr/build/solr-core/test-files/solr/collection1/conf/currency.xml to /configs/conf1/currency.xml
   [junit4]   2> 610742 T2013 oascc.SolrZkClient.makePath makePath: /configs/conf1/currency.xml
   [junit4]   2> 610747 T2013 oasc.AbstractZkTestCase.putConfig put /mnt/ssd/jenkins/workspace/Lucene-Solr-4.x-Linux/solr/build/solr-core/test-files/solr/collection1/conf/open-exchange-rates.json to /configs/conf1/open-exchange-rates.json
   [junit4]   2> 610747 T2013 oascc.SolrZkClient.makePath makePath: /configs/conf1/open-exchange-rates.json
   [junit4]   2> 610751 T2013 oasc.AbstractZkTestCase.putConfig put /mnt/ssd/jenkins/workspace/Lucene-Solr-4.x-Linux/solr/build/solr-core/test-files/solr/collection1/conf/mapping-ISOLatin1Accent.txt to /configs/conf1/mapping-ISOLatin1Accent.txt
   [junit4]   2> 610752 T2013 oascc.SolrZkClient.makePath makePath: /configs/conf1/mapping-ISOLatin1Accent.txt
   [junit4]   2> 610756 T2013 oasc.AbstractZkTestCase.putConfig put /mnt/ssd/jenkins/workspace/Lucene-Solr-4.x-Linux/solr/build/solr-core/test-files/solr/collection1/conf/old_synonyms.txt to /configs/conf1/old_synonyms.txt
   [junit4]   2> 610756 T2013 oascc.SolrZkClient.makePath makePath: /configs/conf1/old_synonyms.txt
   [junit4]   2> 610761 T2013 oasc.AbstractZkTestCase.putConfig put /mnt/ssd/jenkins/workspace/Lucene-Solr-4.x-Linux/solr/build/solr-core/test-files/solr/collection1/conf/synonyms.txt to /configs/conf1/synonyms.txt
   [junit4]   2> 610761 T2013 oascc.SolrZkClient.makePath makePath: /configs/conf1/synonyms.txt
   [junit4]   2> 610855 T2013 oejs.Server.doStart jetty-8.1.10.v20130312
   [junit4]   2> 610858 T2013 oejs.AbstractConnector.doStart Started SelectChannelConnector@127.0.0.1:43193
   [junit4]   2> 610859 T2013 oass.SolrDispatchFilter.init SolrDispatchFilter.init()
   [junit4]   2> 610859 T2013 oasc.SolrResourceLoader.locateSolrHome JNDI not configured for solr (NoInitialContextEx)
   [junit4]   2> 610860 T2013 oasc.SolrResourceLoader.locateSolrHome using system property solr.solr.home: /mnt/ssd/jenkins/workspace/Lucene-Solr-4.x-Linux/solr/build/solr-core/test/J1/./org.apache.solr.cloud.CollectionsAPIDistributedZkTest-controljetty-1375373897431
   [junit4]   2> 610860 T2013 oasc.SolrResourceLoader.<init> new SolrResourceLoader for directory: '/mnt/ssd/jenkins/workspace/Lucene-Solr-4.x-Linux/solr/build/solr-core/test/J1/./org.apache.solr.cloud.CollectionsAPIDistributedZkTest-controljetty-1375373897431/'
   [junit4]   2> 610871 T2013 oasc.ConfigSolr.fromFile Loading container configuration from /mnt/ssd/jenkins/workspace/Lucene-Solr-4.x-Linux/solr/build/solr-core/test/J1/./org.apache.solr.cloud.CollectionsAPIDistributedZkTest-controljetty-1375373897431/solr.xml
   [junit4]   2> 610913 T2013 oasc.ConfigSolrXml.<init> Config-defined core root directory: 
   [junit4]   2> 610913 T2013 oasc.CoreContainer.<init> New CoreContainer 1764892857
   [junit4]   2> 610914 T2013 oasc.CoreContainer.load Loading cores into CoreContainer [instanceDir=/mnt/ssd/jenkins/workspace/Lucene-Solr-4.x-Linux/solr/build/solr-core/test/J1/./org.apache.solr.cloud.CollectionsAPIDistributedZkTest-controljetty-1375373897431/]
   [junit4]   2> 610915 T2013 oashc.HttpShardHandlerFactory.getParameter Setting socketTimeout to: 120000
   [junit4]   2> 610915 T2013 oashc.HttpShardHandlerFactory.getParameter Setting urlScheme to: http://
   [junit4]   2> 610916 T2013 oashc.HttpShardHandlerFactory.getParameter Setting connTimeout to: 15000
   [junit4]   2> 610916 T2013 oashc.HttpShardHandlerFactory.getParameter Setting maxConnectionsPerHost to: 20
   [junit4]   2> 610916 T2013 oashc.HttpShardHandlerFactory.getParameter Setting corePoolSize to: 0
   [junit4]   2> 610917 T2013 oashc.HttpShardHandlerFactory.getParameter Setting maximumPoolSize to: 2147483647
   [junit4]   2> 610917 T2013 oashc.HttpShardHandlerFactory.getParameter Setting maxThreadIdleTime to: 5
   [junit4]   2> 610917 T2013 oashc.HttpShardHandlerFactory.getParameter Setting sizeOfQueue to: -1
   [junit4]   2> 610918 T2013 oashc.HttpShardHandlerFactory.getParameter Setting fairnessPolicy to: false
   [junit4]   2> 610918 T2013 oascsi.HttpClientUtil.createClient Creating new http client, config:maxConnectionsPerHost=20&maxConnections=10000&socketTimeout=120000&connTimeout=15000&retry=false
   [junit4]   2> 610921 T2013 oasc.ZkContainer.initZooKeeper Zookeeper client=127.0.0.1:53772/solr
   [junit4]   2> 610921 T2013 oasc.ZkController.checkChrootPath zkHost includes chroot
   [junit4]   2> 610922 T2013 oascc.ConnectionManager.waitForConnected Waiting for client to connect to ZooKeeper
   [junit4]   2> 610924 T2033 oascc.ConnectionManager.process Watcher org.apache.solr.common.cloud.ConnectionManager@5a0287a3 name:ZooKeeperConnection Watcher:127.0.0.1:53772 got event WatchedEvent state:SyncConnected type:None path:null path:null type:None
   [junit4]   2> 610925 T2013 oascc.ConnectionManager.waitForConnected Client is connected to ZooKeeper
   [junit4]   2> 610927 T2013 oascsi.HttpClientUtil.createClient Creating new http client, config:maxConnections=500&maxConnectionsPerHost=16&socketTimeout=120000&connTimeout=15000
   [junit4]   2> 610930 T2013 oascc.ConnectionManager.waitForConnected Waiting for client to connect to ZooKeeper
   [junit4]   2> 610931 T2035 oascc.ConnectionManager.process Watcher org.apache.solr.common.cloud.ConnectionManager@6f902c71 name:ZooKeeperConnection Watcher:127.0.0.1:53772/solr got event WatchedEvent state:SyncConnected type:None path:null path:null type:None
   [junit4]   2> 610931 T2013 oascc.ConnectionManager.waitForConnected Client is connected to ZooKeeper
   [junit4]   2> 610953 T2013 oascc.SolrZkClient.makePath makePath: /overseer/queue
   [junit4]   2> 610958 T2013 oascc.SolrZkClient.makePath makePath: /overseer/collection-queue-work
   [junit4]   2> 610963 T2013 oascc.SolrZkClient.makePath makePath: /live_nodes
   [junit4]   2> 610966 T2013 oasc.ZkController.createEphemeralLiveNode Register node as live in ZooKeeper:/live_nodes/127.0.0.1:43193_wnpb%2Fk
   [junit4]   2> 610967 T2013 oascc.SolrZkClient.makePath makePath: /live_nodes/127.0.0.1:43193_wnpb%2Fk
   [junit4]   2> 610972 T2013 oascc.SolrZkClient.makePath makePath: /overseer_elect/election
   [junit4]   2> 610979 T2013 oascc.SolrZkClient.makePath makePath: /overseer_elect/leader
   [junit4]   2> 610983 T2013 oasc.Overseer.start Overseer (id=90136503730044931-127.0.0.1:43193_wnpb%2Fk-n_0000000000) starting
   [junit4]   2> 610987 T2013 oascc.SolrZkClient.makePath makePath: /overseer/queue-work
   [junit4]   2> 610992 T2037 oasc.OverseerCollectionProcessor.run Process current queue of collection creations
   [junit4]   2> 610993 T2013 oascc.SolrZkClient.makePath makePath: /clusterstate.json
   [junit4]   2> 610997 T2013 oascc.SolrZkClient.makePath makePath: /aliases.json
   [junit4]   2> 610999 T2013 oascc.ZkStateReader.createClusterStateWatchersAndUpdate Updating cluster state from ZooKeeper... 
   [junit4]   2> 611004 T2036 oasc.Overseer$ClusterStateUpdater.run Starting to work on the main queue
   [junit4]   2> 611007 T2013 oasc.CorePropertiesLocator.discover Looking for core definitions underneath /mnt/ssd/jenkins/workspace/Lucene-Solr-4.x-Linux/solr/build/solr-core/test/J1/./org.apache.solr.cloud.CollectionsAPIDistributedZkTest-controljetty-1375373897431
   [junit4]   2> 611042 T2013 oasc.CorePropertiesLocator.discoverUnder Found core conf in /mnt/ssd/jenkins/workspace/Lucene-Solr-4.x-Linux/solr/build/solr-core/test/J1/./org.apache.solr.cloud.CollectionsAPIDistributedZkTest-controljetty-1375373897431/conf/
   [junit4]   2> 611043 T2013 oasc.CorePropertiesLocator.discover Found 1 core definitions
   [junit4]   2> 611043 T2013 oass.SolrDispatchFilter.init user.dir=/mnt/ssd/jenkins/workspace/Lucene-Solr-4.x-Linux/solr/build/solr-core/test/J1
   [junit4]   2> 611043 T2013 oass.SolrDispatchFilter.init SolrDispatchFilter.init() done
   [junit4]   2> 611044 T2013 oascsi.HttpClientUtil.createClient Creating new http client, config:maxConnections=128&maxConnectionsPerHost=32&followRedirects=false
   [junit4]   2> 611046 T2013 oascsi.HttpClientUtil.createClient Creating new http client, config:
   [junit4]   2> 611047 T2013 oascc.ConnectionManager.waitForConnected Waiting for client to connect to ZooKeeper
   [junit4]   2> 611048 T2040 oascc.ConnectionManager.process Watcher org.apache.solr.common.cloud.ConnectionManager@279de0fc name:ZooKeeperConnection Watcher:127.0.0.1:53772/solr got event WatchedEvent state:SyncConnected type:None path:null path:null type:None
   [junit4]   2> 611049 T2013 oascc.ConnectionManager.waitForConnected Client is connected to ZooKeeper
   [junit4]   2> 611051 T2013 oascc.ZkStateReader.createClusterStateWatchersAndUpdate Updating cluster state from ZooKeeper... 
   [junit4]   2> 611054 T2013 oasc.ChaosMonkey.monkeyLog monkey: init - expire sessions:true cause connection loss:true
   [junit4]   2> 611119 T2013 oejs.Server.doStart jetty-8.1.10.v20130312
   [junit4]   2> 611121 T2013 oejs.AbstractConnector.doStart Started SelectChannelConnector@127.0.0.1:57387
   [junit4]   2> 611122 T2013 oass.SolrDispatchFilter.init SolrDispatchFilter.init()
   [junit4]   2> 611123 T2013 oasc.SolrResourceLoader.locateSolrHome JNDI not configured for solr (NoInitialContextEx)
   [junit4]   2> 611123 T2013 oasc.SolrResourceLoader.locateSolrHome using system property solr.solr.home: /mnt/ssd/jenkins/workspace/Lucene-Solr-4.x-Linux/solr/build/solr-core/test/J1/./org.apache.solr.cloud.CollectionsAPIDistributedZkTest-jetty1-1375373897719
   [junit4]   2> 611123 T2013 oasc.SolrResourceLoader.<init> new SolrResourceLoader for directory: '/mnt/ssd/jenkins/workspace/Lucene-Solr-4.x-Linux/solr/build/solr-core/test/J1/./org.apache.solr.cloud.CollectionsAPIDistributedZkTest-jetty1-1375373897719/'
   [junit4]   2> 611140 T2013 oasc.ConfigSolr.fromFile Loading container configuration from /mnt/ssd/jenkins/workspace/Lucene-Solr-4.x-Linux/solr/build/solr-core/test/J1/./org.apache.solr.cloud.CollectionsAPIDistributedZkTest-jetty1-1375373897719/solr.xml
   [junit4]   2> 611174 T2013 oasc.ConfigSolrXml.<init> Config-defined core root directory: 
   [junit4]   2> 611175 T2013 oasc.CoreContainer.<init> New CoreContainer 166964668
   [junit4]   2> 611175 T2013 oasc.CoreContainer.load Loading cores into CoreContainer [instanceDir=/mnt/ssd/jenkins/workspace/Lucene-Solr-4.x-Linux/solr/build/solr-core/test/J1/./org.apache.solr.cloud.CollectionsAPIDistributedZkTest-jetty1-1375373897719/]
   [junit4]   2> 611176 T2013 oashc.HttpShardHandlerFactory.getParameter Setting socketTimeout to: 120000
   [junit4]   2> 611177 T2013 oashc.HttpShardHandlerFactory.getParameter Setting urlScheme to: http://
   [junit4]   2> 611177 T2013 oashc.HttpShardHandlerFactory.getParameter Setting connTimeout to: 15000
   [junit4]   2> 611177 T2013 oashc.HttpShardHandlerFactory.getParameter Setting maxConnectionsPerHost to: 20
   [junit4]   2> 611178 T2013 oashc.HttpShardHandlerFactory.getParameter Setting corePoolSize to: 0
   [junit4]   2> 611178 T2013 oashc.HttpShardHandlerFactory.getParameter Setting maximumPoolSize to: 2147483647
   [junit4]   2> 611178 T2013 oashc.HttpShardHandlerFactory.getParameter Setting maxThreadIdleTime to: 5
   [junit4]   2> 611179 T2013 oashc.HttpShardHandlerFactory.getParameter Setting sizeOfQueue to: -1
   [junit4]   2> 611179 T2013 oashc.HttpShardHandlerFactory.getParameter Setting fairnessPolicy to: false
   [junit4]   2> 611179 T2013 oascsi.HttpClientUtil.createClient Creating new http client, config:maxConnectionsPerHost=20&maxConnections=10000&socketTimeout=120000&connTimeout=15000&retry=false
   [junit4]   2> 611182 T2013 oasc.ZkContainer.initZooKeeper Zookeeper client=127.0.0.1:53772/solr
   [junit4]   2> 611182 T2013 oasc.ZkController.checkChrootPath zkHost includes chroot
   [junit4]   2> 611183 T2013 oascc.ConnectionManager.waitForConnected Waiting for client to connect to ZooKeeper
   [junit4]   2> 611185 T2051 oascc.ConnectionManager.process Watcher org.apache.solr.common.cloud.ConnectionManager@5d1316be name:ZooKeeperConnection Watcher:127.0.0.1:53772 got event WatchedEvent state:SyncConnected type:None path:null path:null type:None
   [junit4]   2> 611185 T2013 oascc.ConnectionManager.waitForConnected Client is connected to ZooKeeper
   [junit4]   2> 611188 T2013 oascsi.HttpClientUtil.createClient Creating new http client, config:maxConnections=500&maxConnectionsPerHost=16&socketTimeout=120000&connTimeout=15000
   [junit4]   2> 611191 T2013 oascc.ConnectionManager.waitForConnected Waiting for client to connect to ZooKeeper
   [junit4]   2> 611193 T2053 oascc.ConnectionManager.process Watcher org.apache.solr.common.cloud.ConnectionManager@edc0dc2 name:ZooKeeperConnection Watcher:127.0.0.1:53772/solr got event WatchedEvent state:SyncConnected type:None path:null path:null type:None
   [junit4]   2> 611193 T2013 oascc.ConnectionManager.waitForConnected Client is connected to ZooKeeper
   [junit4]   2> 611200 T2013 oascc.ZkStateReader.createClusterStateWatchersAndUpdate Updating cluster state from ZooKeeper... 
   [junit4]   2> 612205 T2013 oasc.ZkController.createEphemeralLiveNode Register node as live in ZooKeeper:/live_nodes/127.0.0.1:57387_wnpb%2Fk
   [junit4]   2> 612206 T2013 oascc.SolrZkClient.makePath makePath: /live_nodes/127.0.0.1:57387_wnpb%2Fk
   [junit4]   2> 612211 T2040 oascc.ZkStateReader$3.process Updating live nodes... (2)
   [junit4]   2> 612212 T2053 oascc.ZkStateReader$3.process Updating live nodes... (2)
   [junit4]   2> 612212 T2035 oascc.ZkStateReader$3.process Updating live nodes... (2)
   [junit4]   2> 612219 T2013 oasc.CorePropertiesLocator.discover Looking for core definitions underneath /mnt/ssd/jenkins/workspace/Lucene-Solr-4.x-Linux/solr/build/solr-core/test/J1/./org.apache.solr.cloud.CollectionsAPIDistributedZkTest-jetty1-1375373897719
   [junit4]   2> 612242 T2013 oasc.CorePropertiesLocator.discoverUnder Found core conf in /mnt/ssd/jenkins/workspace/Lucene-Solr-4.x-Linux/solr/build/solr-core/test/J1/./org.apache.solr.cloud.CollectionsAPIDistributedZkTest-jetty1-1375373897719/conf/
   [junit4]   2> 612242 T2013 oasc.CorePropertiesLocator.discover Found 1 core definitions
   [junit4]   2> 612243 T2013 oass.SolrDispatchFilter.init user.dir=/mnt/ssd/jenkins/workspace/Lucene-Solr-4.x-Linux/solr/build/solr-core/test/J1
   [junit4]   2> 612243 T2013 oass.SolrDispatchFilter.init SolrDispatchFilter.init() done
   [junit4]   2> 612244 T2013 oascsi.HttpClientUtil.createClient Creating new http client, config:maxConnections=128&maxConnectionsPerHost=32&followRedirects=false
   [junit4]   2> 612311 T2013 oejs.Server.doStart jetty-8.1.10.v20130312
   [junit4]   2> 612313 T2013 oejs.AbstractConnector.doStart Started SelectChannelConnector@127.0.0.1:50024
   [junit4]   2> 612313 T2013 oass.SolrDispatchFilter.init SolrDispatchFilter.init()
   [junit4]   2> 612314 T2013 oasc.SolrResourceLoader.locateSolrHome JNDI not configured for solr (NoInitialContextEx)
   [junit4]   2> 612314 T2013 oasc.SolrResourceLoader.locateSolrHome using system property solr.solr.home: /mnt/ssd/jenkins/workspace/Lucene-Solr-4.x-Linux/solr/build/solr-core/test/J1/./org.apache.solr.cloud.CollectionsAPIDistributedZkTest-jetty2-1375373898910
   [junit4]   2> 612314 T2013 oasc.SolrResourceLoader.<init> new SolrResourceLoader for directory: '/mnt/ssd/jenkins/workspace/Lucene-Solr-4.x-Linux/solr/build/solr-core/test/J1/./org.apache.solr.cloud.CollectionsAPIDistributedZkTest-jetty2-1375373898910/'
   [junit4]   2> 612325 T2013 oasc.ConfigSolr.fromFile Loading container configuration from /mnt/ssd/jenkins/workspace/Lucene-Solr-4.x-Linux/solr/build/solr-core/test/J1/./org.apache.solr.cloud.CollectionsAPIDistributedZkTest-jetty2-1375373898910/solr.xml
   [junit4]   2> 612366 T2013 oasc.ConfigSolrXml.<init> Config-defined core root directory: 
   [junit4]   2> 612366 T2013 oasc.CoreContainer.<init> New CoreContainer 676048482
   [junit4]   2> 612366 T2013 oasc.CoreContainer.load Loading cores into CoreContainer [instanceDir=/mnt/ssd/jenkins/workspace/Lucene-Solr-4.x-Linux/solr/build/solr-core/test/J1/./org.apache.solr.cloud.CollectionsAPIDistributedZkTest-jetty2-1375373898910/]
   [junit4]   2> 612368 T2013 oashc.HttpShardHandlerFactory.getParameter Setting socketTimeout to: 120000
   [junit4]   2> 612368 T2013 oashc.HttpShardHandlerFactory.getParameter Setting urlScheme to: http://
   [junit4]   2> 612368 T2013 oashc.HttpShardHandlerFactory.getParameter Setting connTimeout to: 15000
   [junit4]   2> 612369 T2013 oashc.HttpShardHandlerFactory.getParameter Setting maxConnectionsPerHost to: 20
   [junit4]   2> 612369 T2013 oashc.HttpShardHandlerFactory.getParameter Setting corePoolSize to: 0
   [junit4]   2> 612369 T2013 oashc.HttpShardHandlerFactory.getParameter Setting maximumPoolSize to: 2147483647
   [junit4]   2> 612370 T2013 oashc.HttpShardHandlerFactory.getParameter Setting maxThreadIdleTime to: 5
   [junit4]   2> 612370 T2013 oashc.HttpShardHandlerFactory.getParameter Setting sizeOfQueue to: -1
   [junit4]   2> 612370 T2013 oashc.HttpShardHandlerFactory.getParameter Setting fairnessPolicy to: false
   [junit4]   2> 612371 T2013 oascsi.HttpClientUtil.createClient Creating new http client, config:maxConnectionsPerHost=20&maxConnections=10000&socketTimeout=120000&connTimeout=15000&retry=false
   [junit4]   2> 612373 T2013 oasc.ZkContainer.initZooKeeper Zookeeper client=127.0.0.1:53772/solr
   [junit4]   2> 612373 T2013 oasc.ZkController.checkChrootPath zkHost includes chroot
   [junit4]   2> 612374 T2013 oascc.ConnectionManager.waitForConnected Waiting for client to connect to ZooKeeper
   [junit4]   2> 612376 T2065 oascc.ConnectionManager.process Watcher org.apache.solr.common.cloud.ConnectionManager@a5b899 name:ZooKeeperConnection Watcher:127.0.0.1:53772 got event WatchedEvent state:SyncConnected type:None path:null path:null type:None
   [junit4]   2> 612376 T2013 oascc.ConnectionManager.waitForConnected Client is connected to ZooKeeper
   [junit4]   2> 612379 T2013 oascsi.HttpClientUtil.createClient Creating new http client, config:maxConnections=500&maxConnectionsPerHost=16&socketTimeout=120000&connTimeout=15000
   [junit4]   2> 612382 T2013 oascc.ConnectionManager.waitForConnected Waiting for client to connect to ZooKeeper
   [junit4]   2> 612383 T2067 oascc.ConnectionManager.process Watcher org.apache.solr.common.cloud.ConnectionManager@6abc3ad4 name:ZooKeeperConnection Watcher:127.0.0.1:53772/solr got event WatchedEvent state:SyncConnected type:None path:null path:null type:None
   [junit4]   2> 612384 T2013 oascc.ConnectionManager.waitForConnected Client is connected to ZooKeeper
   [junit4]   2> 612390 T2013 oascc.ZkStateReader.createClusterStateWatchersAndUpdate Updating cluster state from ZooKeeper... 
   [junit4]   2> 613395 T2013 oasc.ZkController.createEphemeralLiveNode Register node as live in ZooKeeper:/live_nodes/127.0.0.1:50024_wnpb%2Fk
   [junit4]   2> 613397 T2013 oascc.SolrZkClient.makePath makePath: /live_nodes/127.0.0.1:50024_wnpb%2Fk
   [junit4]   2> 613403 T2040 oascc.ZkStateReader$3.process Updating live nodes... (3)
   [junit4]   2> 613403 T2035 oascc.ZkStateReader$3.process Updating live nodes... (3)
   [junit4]   2> 613404 T2053 oascc.ZkStateReader$3.process Updating live nodes... (3)
   [junit4]   2> 613405 T2067 oascc.ZkStateReader$3.process Updating live nodes... (3)
   [junit4]   2> 613415 T2013 oasc.CorePropertiesLocator.discover Looking for core definitions underneath /mnt/ssd/jenkins/workspace/Lucene-Solr-4.x-Linux/solr/build/solr-core/test/J1/./org.apache.solr.cloud.CollectionsAPIDistributedZkTest-jetty2-1375373898910
   [junit4]   2> 613446 T2013 oasc.CorePropertiesLocator.discoverUnder Found core conf in /mnt/ssd/jenkins/workspace/Lucene-Solr-4.x-Linux/solr/build/solr-core/test/J1/./org.apache.solr.cloud.CollectionsAPIDistributedZkTest-jetty2-1375373898910/conf/
   [junit4]   2> 613447 T2013 oasc.CorePropertiesLocator.discover Found 1 core definitions
   [junit4]   2> 613448 T2013 oass.SolrDispatchFilter.init user.dir=/mnt/ssd/jenkins/workspace/Lucene-Solr-4.x-Linux/solr/build/solr-core/test/J1
   [junit4]   2> 613448 T2013 oass.SolrDispatchFilter.init SolrDispatchFilter.init() done
   [junit4]   2> 613449 T2013 oascsi.HttpClientUtil.createClient Creating new http client, config:maxConnections=128&maxConnectionsPerHost=32&followRedirects=false
   [junit4]   2> 613519 T2013 oejs.Server.doStart jetty-8.1.10.v20130312
   [junit4]   2> 613522 T2013 oejs.AbstractConnector.doStart Started SelectChannelConnector@127.0.0.1:46579
   [junit4]   2> 613522 T2013 oass.SolrDispatchFilter.init SolrDispatchFilter.init()
   [junit4]   2> 613523 T2013 oasc.SolrResourceLoader.locateSolrHome JNDI not configured for solr (NoInitialContextEx)
   [junit4]   2> 613523 T2013 oasc.SolrResourceLoader.locateSolrHome using system property solr.solr.home: /mnt/ssd/jenkins/workspace/Lucene-Solr-4.x-Linux/solr/build/solr-core/test/J1/./org.apache.solr.cloud.CollectionsAPIDistributedZkTest-jetty3-1375373900117
   [junit4]   2> 613523 T2013 oasc.SolrResourceLoader.<init> new SolrResourceLoader for directory: '/mnt/ssd/jenkins/workspace/Lucene-Solr-4.x-Linux/solr/build/solr-core/test/J1/./org.apache.solr.cloud.CollectionsAPIDistributedZkTest-jetty3-1375373900117/'
   [junit4]   2> 613534 T2013 oasc.ConfigSolr.fromFile Loading container configuration from /mnt/ssd/jenkins/workspace/Lucene-Solr-4.x-Linux/solr/build/solr-core/test/J1/./org.apache.solr.cloud.CollectionsAPIDistributedZkTest-jetty3-1375373900117/solr.xml
   [junit4]   2> 613578 T2013 oasc.ConfigSolrXml.<init> Config-defined core root directory: 
   [junit4]   2> 613578 T2013 oasc.CoreContainer.<init> New CoreContainer 1782991630
   [junit4]   2> 613579 T2013 oasc.CoreContainer.load Loading cores into CoreContainer [instanceDir=/mnt/ssd/jenkins/workspace/Lucene-Solr-4.x-Linux/solr/build/solr-core/test/J1/./org.apache.solr.cloud.CollectionsAPIDistributedZkTest-jetty3-1375373900117/]
   [junit4]   2> 613580 T2013 oashc.HttpShardHandlerFactory.getParameter Setting socketTimeout to: 120000
   [junit4]   2> 613580 T2013 oashc.HttpShardHandlerFactory.getParameter Setting urlScheme to: http://
   [junit4]   2> 613581 T2013 oashc.HttpShardHandlerFactory.getParameter Setting connTimeout to: 15000
   [junit4]   2> 613581 T2013 oashc.HttpShardHandlerFactory.getParameter Setting maxConnectionsPerHost to: 20
   [junit4]   2> 613582 T2013 oashc.HttpShardHandlerFactory.getParameter Setting corePoolSize to: 0
   [junit4]   2> 613582 T2013 oashc.HttpShardHandlerFactory.getParameter Setting maximumPoolSize to: 2147483647
   [junit4]   2> 613582 T2013 oashc.HttpShardHandlerFactory.getParameter Setting maxThreadIdleTime to: 5
   [junit4]   2> 613583 T2013 oashc.HttpShardHandlerFactory.getParameter Setting sizeOfQueue to: -1
   [junit4]   2> 613583 T2013 oashc.HttpShardHandlerFactory.getParameter Setting fairnessPolicy to: false
   [junit4]   2> 613584 T2013 oascsi.HttpClientUtil.createClient Creating new http client, config:maxConnectionsPerHost=20&maxConnections=10000&socketTimeout=120000&connTimeout=15000&retry=false
   [junit4]   2> 613587 T2013 oasc.ZkContainer.initZooKeeper Zookeeper client=127.0.0.1:53772/solr
   [junit4]   2> 613587 T2013 oasc.ZkController.checkChrootPath zkHost includes chroot
   [junit4]   2> 613588 T2013 oascc.ConnectionManager.waitForConnected Waiting for client to connect to ZooKeeper
   [junit4]   2> 613590 T2079 oascc.ConnectionManager.process Watcher org.apache.solr.common.cloud.ConnectionManager@2ce9baa4 name:ZooKeeperConnection Watcher:127.0.0.1:53772 got event WatchedEvent state:SyncConnected type:None path:null path:null type:None
   [junit4]   2> 613591 T2013 oascc.ConnectionManager.waitForConnected Client is connected to ZooKeeper
   [junit4]   2> 613594 T2013 oascsi.HttpClientUtil.createClient Creating new http client, config:maxConnections=500&maxConnectionsPerHost=16&socketTimeout=120000&connTimeout=15000
   [junit4]   2> 613597 T2013 oascc.ConnectionManager.waitForConnected Waiting for client to connect to ZooKeeper
   [junit4]   2> 613599 T2081 oascc.ConnectionManager.process Watcher org.apache.solr.common.cloud.ConnectionManager@59d7d093 name:ZooKeeperConnection Watcher:127.0.0.1:53772/solr got event WatchedEvent state:SyncConnected type:None path:null path:null type:None
   [junit4]   2> 613599 T2013 oascc.ConnectionManager.waitForConnected Client is connected to ZooKeeper
   [junit4]   2> 613605 T2013 oascc.ZkStateReader.createClusterStateWatchersAndUpdate Updating cluster state from ZooKeeper... 
   [junit4]   2> 614610 T2013 oasc.ZkController.createEphemeralLiveNode Register node as live in ZooKeeper:/live_nodes/127.0.0.1:46579_wnpb%2Fk
   [junit4]   2> 614612 T2013 oascc.SolrZkClient.makePath makePath: /live_nodes/127.0.0.1:46579_wnpb%2Fk
   [junit4]   2> 614620 T2040 oascc.ZkStateReader$3.process Updating live nodes... (4)
   [junit4]   2> 614620 T2053 oascc.ZkStateReader$3.process Updating live nodes... (4)
   [junit4]   2> 614621 T2035 oascc.ZkStateReader$3.process Updating live nodes... (4)
   [junit4]   2> 614621 T2067 oascc.ZkStateReader$3.process Updating live nodes... (4)
   [junit4]   2> 614622 T2081 oascc.ZkStateReader$3.process Updating live nodes... (4)
   [junit4]   2> 614629 T2013 oasc.CorePropertiesLocator.discover Looking for core definitions underneath /mnt/ssd/jenkins/workspace/Lucene-Solr-4.x-Linux/solr/build/solr-core/test/J1/./org.apache.solr.cloud.CollectionsAPIDistributedZkTest-jetty3-1375373900117
   [junit4]   2> 614652 T2013 oasc.CorePropertiesLocator.discoverUnder Found core conf in /mnt/ssd/jenkins/workspace/Lucene-Solr-4.x-Linux/solr/build/solr-core/test/J1/./org.apache.solr.cloud.CollectionsAPIDistributedZkTest-jetty3-1375373900117/conf/
   [junit4]   2> 614653 T2013 oasc.CorePropertiesLocator.discover Found 1 core definitions
   [junit4]   2> 614653 T2013 oass.SolrDispatchFilter.init user.dir=/mnt/ssd/jenkins/workspace/Lucene-Solr-4.x-Linux/solr/build/solr-core/test/J1
   [junit4]   2> 614654 T2013 oass.SolrDispatchFilter.init SolrDispatchFilter.init() done
   [junit4]   2> 614654 T2013 oascsi.HttpClientUtil.createClient Creating new http client, config:maxConnections=128&maxConnectionsPerHost=32&followRedirects=false
   [junit4]   2> 614721 T2013 oejs.Server.doStart jetty-8.1.10.v20130312
   [junit4]   2> 614723 T2013 oejs.AbstractConnector.doStart Started SelectChannelConnector@127.0.0.1:50685
   [junit4]   2> 614724 T2013 oass.SolrDispatchFilter.init SolrDispatchFilter.init()
   [junit4]   2> 614724 T2013 oasc.SolrResourceLoader.locateSolrHome JNDI not configured for solr (NoInitialContextEx)
   [junit4]   2> 614725 T2013 oasc.SolrResourceLoader.locateSolrHome using system property solr.solr.home: /mnt/ssd/jenkins/workspace/Lucene-Solr-4.x-Linux/solr/build/solr-core/test/J1/./org.apache.solr.cloud.CollectionsAPIDistributedZkTest-jetty4-1375373901320
   [junit4]   2> 614725 T2013 oasc.SolrResourceLoader.<init> new SolrResourceLoader for directory: '/mnt/ssd/jenkins/workspace/Lucene-Solr-4.x-Linux/solr/build/solr-core/test/J1/./org.apache.solr.cloud.CollectionsAPIDistributedZkTest-jetty4-1375373901320/'
   [junit4]   2> 614735 T2013 oasc.ConfigSolr.fromFile Loading container configuration from /mnt/ssd/jenkins/workspace/Lucene-Solr-4.x-Linux/solr/build/solr-core/test/J1/./org.apache.solr.cloud.CollectionsAPIDistributedZkTest-jetty4-1375373901320/solr.xml
   [junit4]   2> 614781 T2013 oasc.ConfigSolrXml.<init> Config-defined core root directory: 
   [junit4]   2> 614782 T2013 oasc.CoreContainer.<init> New CoreContainer 539606295
   [junit4]   2> 614782 T2013 oasc.CoreContainer.load Loading cores into CoreContainer [instanceDir=/mnt/ssd/jenkins/workspace/Lucene-Solr-4.x-Linux/solr/build/solr-core/test/J1/./org.apache.solr.cloud.CollectionsAPIDistributedZkTest-jetty4-1375373901320/]
   [junit4]   2> 614783 T2013 oashc.HttpShardHandlerFactory.getParameter Setting socketTimeout to: 120000
   [junit4]   2> 614784 T2013 oashc.HttpShardHandlerFactory.getParameter Setting urlScheme to: http://
   [junit4]   2> 614784 T2013 oashc.HttpShardHandlerFactory.getParameter Setting connTimeout to: 15000
   [junit4]   2> 614784 T2013 oashc.HttpShardHandlerFactory.getParameter Setting maxConnectionsPerHost to: 20
   [junit4]   2> 614785 T2013 oashc.HttpShardHandlerFactory.getParameter Setting corePoolSize to: 0
   [junit4]   2> 614785 T2013 oashc.HttpShardHandlerFactory.getParameter Setting maximumPoolSize to: 2147483647
   [junit4]   2> 614786 T2013 oashc.HttpShardHandlerFactory.getParameter Setting maxThreadIdleTime to: 5
   [junit4]   2> 614786 T2013 oashc.HttpShardHandlerFactory.getParameter Setting sizeOfQueue to: -1
   [junit4]   2> 614786 T2013 oashc.HttpShardHandlerFactory.getParameter Setting fairnessPolicy to: false
   [junit4]   2> 614787 T2013 oascsi.HttpClientUtil.createClient Creating new http client, config:maxConnectionsPerHost=20&maxConnections=10000&socketTimeout=120000&connTimeout=15000&retry=false
   [junit4]   2> 614790 T2013 oasc.ZkContainer.initZooKeeper Zookeeper client=127.0.0.1:53772/solr
   [junit4]   2> 614791 T2013 oasc.ZkController.checkChrootPath zkHost includes chroot
   [junit4]   2> 614792 T2013 oascc.ConnectionManager.waitForConnected Waiting for client to connect to ZooKeeper
   [junit4]   2> 614794 T2093 oascc.ConnectionManager.process Watcher org.apache.solr.common.cloud.ConnectionManager@143d4180 name:ZooKeeperConnection Watcher:127.0.0.1:53772 got event WatchedEvent state:SyncConnected type:None path:null path:null type:None
   [junit4]   2> 614794 T2013 oascc.ConnectionManager.waitForConnected Client is connected to ZooKeeper
   [junit4]   2> 614797 T2013 oascsi.HttpClientUtil.createClient Creating new http client, config:maxConnections=500&maxConnectionsPerHost=16&socketTimeout=120000&connTimeout=15000
   [junit4]   2> 614799 T2013 oascc.ConnectionManager.waitForConnected Waiting for client to connect to ZooKeeper
   [junit4]   2> 614801 T2095 oascc.ConnectionManager.process Watcher org.apache.solr.common.cloud.ConnectionManager@5833fa27 name:ZooKeeperConnection Watcher:127.0.0.1:53772/solr got event WatchedEvent state:SyncConnected type:None path:null path:null type:None
   [junit4]   2> 614801 T2013 oascc.ConnectionManager.waitForConnected Client is connected to ZooKeeper
   [junit4]   2> 614808 T2013 oascc.ZkStateReader.createClusterStateWatchersAndUpdate Updating cluster state from ZooKeeper... 
   [junit4]   2> 615815 T2013 oasc.ZkController.createEphemeralLiveNode Register node as live in ZooKeeper:/live_nodes/127.0.0.1:50685_wnpb%2Fk
   [junit4]   2> 615817 T2013 oascc.SolrZkClient.makePath makePath: /live_nodes/127.0.0.1:50685_wnpb%2Fk
   [junit4]   2> 615823 T2040 oascc.ZkStateReader$3.process Updating live nodes... (5)
   [junit4]   2> 615824 T2035 oascc.ZkStateReader$3.process Updating live nodes... (5)
   [junit4]   2> 615824 T2053 oascc.ZkStateReader$3.process Updating live nodes... (5)
   [junit4]   2> 615825 T2067 oascc.ZkStateReader$3.process Updating live nodes... (5)
   [junit4]   2> 615826 T2081 oascc.ZkStateReader$3.process Updating live nodes... (5)
   [junit4]   2> 615826 T2095 oascc.ZkStateReader$3.process Updating live nodes... (5)
   [junit4]   2> 615834 T2013 oasc.CorePropertiesLocator.discover Looking for core definitions underneath /mnt/ssd/jenkins/workspace/Lucene-Solr-4.x-Linux/solr/build/solr-core/test/J1/./org.apache.solr.cloud.CollectionsAPIDistributedZkTest-jetty4-1375373901320
   [junit4]   2> 615869 T2013 oasc.CorePropertiesLocator.discoverUnder Found core conf in /mnt/ssd/jenkins/workspace/Lucene-Solr-4.x-Linux/solr/build/solr-core/test/J1/./org.apache.solr.cloud.CollectionsAPIDistributedZkTest-jetty4-1375373901320/conf/
   [junit4]   2> 615870 T2013 oasc.CorePropertiesLocator.discover Found 1 core definitions
   [junit4]   2> 615870 T2013 oass.SolrDispatchFilter.init user.dir=/mnt/ssd/jenkins/workspace/Lucene-Solr-4.x-Linux/solr/build/solr-core/test/J1
   [junit4]   2> 615871 T2013 oass.SolrDispatchFilter.init SolrDispatchFilter.init() done
   [junit4]   2> 615872 T2013 oascsi.HttpClientUtil.createClient Creating new http client, config:maxConnections=128&maxConnectionsPerHost=32&followRedirects=false
   [junit4]   2> 615875 T2013 oascsi.HttpClientUtil.createClient Creating new http client, config:maxConnections=128&maxConnectionsPerHost=32&followRedirects=false
   [junit4]   2> 615878 T2047 oasha.CollectionsHandler.handleCreateAction Creating Collection : numShards=2&name=nodes_used_collection&replicationFactor=2&action=CREATE&wt=javabin&version=2
   [junit4]   2> 615880 T2035 oasc.DistributedQueue$LatchChildWatcher.process Watcher fired on path: /overseer/collection-queue-work state: SyncConnected type NodeChildrenChanged
   [junit4]   2> 615882 T2035 oasc.DistributedQueue$LatchChildWatcher.process Watcher fired on path: /overseer/collection-queue-work state: SyncConnected type NodeChildrenChanged
   [junit4]   2> 615883 T2037 oasc.OverseerCollectionProcessor.run Overseer Collection Processor: Get the message id:/overseer/collection-queue-work/qn-0000000000 message:{
   [junit4]   2> 	  "operation":"createcollection",
   [junit4]   2> 	  "numShards":"2",
   [junit4]   2> 	  "name":"nodes_used_collection",
   [junit4]   2> 	  "replicationFactor":"2"}
   [junit4]   2> 615883 T2037 oasc.OverseerCollectionProcessor.processMessage WARN OverseerCollectionProcessor.processMessage : createcollection , {
   [junit4]   2> 	  "operation":"createcollection",
   [junit4]   2> 	  "numShards":"2",
   [junit4]   2> 	  "name":"nodes_used_collection",
   [junit4]   2> 	  "replicationFactor":"2"}
   [junit4]   2> 617018 T2036 oascc.ZkStateReader.updateClusterState Updating cloud state from ZooKeeper... 
   [junit4]   2> 617019 T2036 oasc.Overseer$ClusterStateUpdater.buildCollection building a new collection: nodes_used_collection
   [junit4]   2> 617020 T2036 oasc.Overseer$ClusterStateUpdater.createCollection Create collection nodes_used_collection with shards [shard1, shard2]
   [junit4]   2> 617026 T2040 oascc.ZkStateReader$2.process A cluster state change: WatchedEvent state:SyncConnected type:NodeDataChanged path:/clusterstate.json, has occurred - updating... (live nodes size: 5)
   [junit4]   2> 617026 T2095 oascc.ZkStateReader$2.process A cluster state change: WatchedEvent state:SyncConnected type:NodeDataChanged path:/clusterstate.json, has occurred - updating... (live nodes size: 5)
   [junit4]   2> 617027 T2053 oascc.ZkStateReader$2.process A cluster state change: WatchedEvent state:SyncConnected type:NodeDataChanged path:/clusterstate.json, has occurred - updating... (live nodes size: 5)
   [junit4]   2> 617027 T2081 oascc.ZkStateReader$2.process A cluster state change: WatchedEvent state:SyncConnected type:NodeDataChanged path:/clusterstate.json, has occurred - updating... (live nodes size: 5)
   [junit4]   2> 617027 T2067 oascc.ZkStateReader$2.process A cluster state change: WatchedEvent state:SyncConnected type:NodeDataChanged path:/clusterstate.json, has occurred - updating... (live nodes size: 5)
   [junit4]   2> 617026 T2035 oascc.ZkStateReader$2.process A cluster state change: WatchedEvent state:SyncConnected type:NodeDataChanged path:/clusterstate.json, has occurred - updating... (live nodes size: 5)
   [junit4]   2> 617087 T2037 oasc.OverseerCollectionProcessor.createCollection going to create cores replicas shardNames [shard1, shard2] , repFactor : 2
   [junit4]   2> 617087 T2037 oasc.OverseerCollectionProcessor.createCollection Creating shard nodes_used_collection_shard1_replica1 as part of slice shard1 of collection nodes_used_collection on 127.0.0.1:43193_wnpb%2Fk
   [junit4]   2> 617088 T2037 oasc.OverseerCollectionProcessor.createCollection Creating shard nodes_used_collection_shard1_replica2 as part of slice shard1 of collection nodes_used_collection on 127.0.0.1:57387_wnpb%2Fk
   [junit4]   2> 617089 T2037 oasc.OverseerCollectionProcessor.createCollection Creating shard nodes_used_collection_shard2_replica1 as part of slice shard2 of collection nodes_used_collection on 127.0.0.1:46579_wnpb%2Fk
   [junit4]   2> 617089 T2037 oasc.OverseerCollectionProcessor.createCollection Creating shard nodes_used_collection_shard2_replica2 as part of slice shard2 of collection nodes_used_collection on 127.0.0.1:50685_wnpb%2Fk
   [junit4]   2> 617092 T2049 oasc.ZkController.publish publishing core=nodes_used_collection_shard1_replica2 state=down
   [junit4]   2> 617092 T2075 oasc.ZkController.publish publishing core=nodes_used_collection_shard2_replica1 state=down
   [junit4]   2> 617092 T2030 oasc.ZkController.publish publishing core=nodes_used_collection_shard1_replica1 state=down
   [junit4]   2> 617093 T2089 oasc.ZkController.publish publishing core=nodes_used_collection_shard2_replica2 state=down
   [junit4]   2> 617094 T2049 oasc.ZkController.waitForCoreNodeName look for our core node name
   [junit4]   2> 617095 T2075 oasc.ZkController.waitForCoreNodeName look for our core node name
   [junit4]   2> 617095 T2089 oasc.ZkController.waitForCoreNodeName look for our core node name
   [junit4]   2> 617095 T2030 oasc.ZkController.waitForCoreNodeName look for our core node name
   [junit4]   2> 618541 T2036 oascc.ZkStateReader.updateClusterState Updating cloud state from ZooKeeper... 
   [junit4]   2> 618543 T2036 oasc.Overseer$ClusterStateUpdater.updateState WARN Could not find collection node for nodes_used_collection, skipping publish state
   [junit4]   2> 618543 T2036 oasc.Overseer$ClusterStateUpdater.updateState Update state numShards=2 message={
   [junit4]   2> 	  "operation":"state",
   [junit4]   2> 	  "core_node_name":"core_node1",
   [junit4]   2> 	  "numShards":"2",
   [junit4]   2> 	  "shard":"shard1",
   [junit4]   2> 	  "roles":null,
   [junit4]   2> 	  "state":"down",
   [junit4]   2> 	  "shard_state":"active",
   [junit4]   2> 	  "core":"nodes_used_collection_shard1_replica2",
   [junit4]   2> 	  "collection":"nodes_used_collection",
   [junit4]   2> 	  "shard_range":null,
   [junit4]   2> 	  "node_name":"127.0.0.1:57387_wnpb%2Fk",
   [junit4]   2> 	  "base_url":"http://127.0.0.1:57387/wnpb/k"}
   [junit4]   2> 618549 T2036 oasc.Overseer$ClusterStateUpdater.updateState WARN Could not find collection node for nodes_used_collection, skipping publish state
   [junit4]   2> 618549 T2036 oasc.Overseer$ClusterStateUpdater.updateState Update state numShards=2 message={
   [junit4]   2> 	  "operation":"state",
   [junit4]   2> 	  "core_node_name":"core_node2",
   [junit4]   2> 	  "numShards":"2",
   [junit4]   2> 	  "shard":"shard2",
   [junit4]   2> 	  "roles":null,
   [junit4]   2> 	  "state":"down",
   [junit4]   2> 	  "shard_state":"active",
   [junit4]   2> 	  "core":"nodes_used_collection_shard2_replica1",
   [junit4]   2> 	  "collection":"nodes_used_collection",
   [junit4]   2> 	  "shard_range":null,
   [junit4]   2> 	  "node_name":"127.0.0.1:46579_wnpb%2Fk",
   [junit4]   2> 	  "base_url":"http://127.0.0.1:46579/wnpb/k"}
   [junit4]   2> 618555 T2036 oasc.Overseer$ClusterStateUpdater.updateState WARN Could not find collection node for nodes_used_collection, skipping publish state
   [junit4]   2> 618556 T2036 oasc.Overseer$ClusterStateUpdater.updateState Update state numShards=2 message={
   [junit4]   2> 	  "operation":"state",
   [junit4]   2> 	  "core_node_name":"core_node3",
   [junit4]   2> 	  "numShards":"2",
   [junit4]   2> 	  "shard":"shard1",
   [junit4]   2> 	  "roles":null,
   [junit4]   2> 	  "state":"down",
   [junit4]   2> 	  "shard_state":"active",
   [junit4]   2> 	  "core":"nodes_used_collection_shard1_replica1",
   [junit4]   2> 	  "collection":"nodes_used_collection",
   [junit4]   2> 	  "shard_range":null,
   [junit4]   2> 	  "node_name":"127.0.0.1:43193_wnpb%2Fk",
   [junit4]   2> 	  "base_url":"http://127.0.0.1:43193/wnpb/k"}
   [junit4]   2> 618562 T2036 oasc.Overseer$ClusterStateUpdater.updateState WARN Could not find collection node for nodes_used_collection, skipping publish state
   [junit4]   2> 618562 T2036 oasc.Overseer$ClusterStateUpdater.updateState Update state numShards=2 message={
   [junit4]   2> 	  "operation":"state",
   [junit4]   2> 	  "core_node_name":"core_node4",
   [junit4]   2> 	  "numShards":"2",
   [junit4]   2> 	  "shard":"shard2",
   [junit4]   2> 	  "roles":null,
   [junit4]   2> 	  "state":"down",
   [junit4]   2> 	  "shard_state":"active",
   [junit4]   2> 	  "core":"nodes_used_collection_shard2_replica2",
   [junit4]   2> 	  "collection":"nodes_used_collection",
   [junit4]   2> 	  "shard_range":null,
   [junit4]   2> 	  "node_name":"127.0.0.1:50685_wnpb%2Fk",
   [junit4]   2> 	  "base_url":"http://127.0.0.1:50685/wnpb/k"}
   [junit4]   2> 618568 T2040 oascc.ZkStateReader$2.process A cluster state change: WatchedEvent state:SyncConnected type:NodeDataChanged path:/clusterstate.json, has occurred - updating... (live nodes size: 5)
   [junit4]   2> 618568 T2095 oascc.ZkStateReader$2.process A cluster state change: WatchedEvent state:SyncConnected type:NodeDataChanged path:/clusterstate.json, has occurred - updating... (live nodes size: 5)
   [junit4]   2> 618568 T2053 oascc.ZkStateReader$2.process A cluster state change: WatchedEvent state:SyncConnected type:NodeDataChanged path:/clusterstate.json, has occurred - updating... (live nodes size: 5)
   [junit4]   2> 618568 T2081 oascc.ZkStateReader$2.process A cluster state change: WatchedEvent state:SyncConnected type:NodeDataChanged path:/clusterstate.json, has occurred - updating... (live nodes size: 5)
   [junit4]   2> 618568 T2035 oascc.ZkStateReader$2.process A cluster state change: WatchedEvent state:SyncConnected type:NodeDataChanged path:/clusterstate.json, has occurred - updating... (live nodes size: 5)
   [junit4]   2> 618569 T2067 oascc.ZkStateReader$2.process A cluster state change: WatchedEvent state:SyncConnected type:NodeDataChanged path:/clusterstate.json, has occurred - updating... (live nodes size: 5)
   [junit4]   2> 619095 T2049 oasc.ZkController.waitForShardId waiting to find shard id in clusterstate for nodes_used_collection_shard1_replica2
   [junit4]   2> 619095 T2075 oasc.ZkController.waitForShardId waiting to find shard id in clusterstate for nodes_used_collection_shard2_replica1
   [junit4]   2> 619096 T2089 oasc.ZkController.waitForShardId waiting to find shard id in clusterstate for nodes_used_collection_shard2_replica2
   [junit4]   2> 619097 T2075 oasc.CorePropertiesLocator.writePropertiesFile ERROR Couldn't persist core properties to /mnt/ssd/jenkins/workspace/Lucene-Solr-4.x-Linux/solr/build/solr-core/test/J1/./org.apache.solr.cloud.CollectionsAPIDistributedZkTest-jetty3-1375373900117/nodes_used_collection_shard2_replica1/core.properties: java.io.FileNotFoundException: /mnt/ssd/jenkins/workspace/Lucene-Solr-4.x-Linux/solr/build/solr-core/test/J1/./org.apache.solr.cloud.CollectionsAPIDistributedZkTest-jetty3-1375373900117/nodes_used_collection_shard2_replica1/core.properties (No such file or directory)
   [junit4]   2> 619096 T2049 oasc.CorePropertiesLocator.writePropertiesFile ERROR Couldn't persist core properties to /mnt/ssd/jenkins/workspace/Lucene-Solr-4.x-Linux/solr/build/solr-core/test/J1/./org.apache.solr.cloud.CollectionsAPIDistributedZkTest-jetty1-1375373897719/nodes_used_collection_shard1_replica2/core.properties: java.io.FileNotFoundException: /mnt/ssd/jenkins/workspace/Lucene-Solr-4.x-Linux/solr/build/solr-core/test/J1/./org.apache.solr.cloud.CollectionsAPIDistributedZkTest-jetty1-1375373897719/nodes_used_collection_shard1_replica2/core.properties (No such file or directory)
   [junit4]   2> 619096 T2030 oasc.ZkController.waitForShardId waiting to find shard id in clusterstate for nodes_used_collection_shard1_replica1
   [junit4]   2> 619098 T2049 oasc.CoreContainer.create Creating SolrCore 'nodes_used_collection_shard1_replica2' using instanceDir: /mnt/ssd/jenkins/workspace/Lucene-Solr-4.x-Linux/solr/build/solr-core/test/J1/./org.apache.solr.cloud.CollectionsAPIDistributedZkTest-jetty1-1375373897719/nodes_used_collection_shard1_replica2
   [junit4]   2> 619098 T2075 oasc.CoreContainer.create Creating SolrCore 'nodes_used_collection_shard2_replica1' using instanceDir: /mnt/ssd/jenkins/workspace/Lucene-Solr-4.x-Linux/solr/build/solr-core/test/J1/./org.apache.solr.cloud.CollectionsAPIDistributedZkTest-jetty3-1375373900117/nodes_used_collection_shard2_replica1
   [junit4]   2> 619098 T2089 oasc.CorePropertiesLocator.writePropertiesFile ERROR Couldn't persist core properties to /mnt/ssd/jenkins/workspace/Lucene-Solr-4.x-Linux/solr/build/solr-core/test/J1/./org.apache.solr.cloud.CollectionsAPIDistributedZkTest-jetty4-1375373901320/nodes_used_collection_shard2_replica2/core.properties: java.io.FileNotFoundException: /mnt/ssd/jenkins/workspace/Lucene-Solr-4.x-Linux/solr/build/solr-core/test/J1/./org.apache.solr.cloud.CollectionsAPIDistributedZkTest-jetty4-1375373901320/nodes_used_collection_shard2_replica2/core.properties (No such file or directory)
   [junit4]   2> 619099 T2075 oasc.ZkController.createCollectionZkNode Check for collection zkNode:nodes_used_collection
   [junit4]   2> 619099 T2049 oasc.ZkController.createCollectionZkNode Check for collection zkNode:nodes_used_collection
   [junit4]   2> 619099 T2030 oasc.CorePropertiesLocator.writePropertiesFile ERROR Couldn't persist core properties to /mnt/ssd/jenkins/workspace/Lucene-Solr-4.x-Linux/solr/build/solr-core/test/J1/./org.apache.solr.cloud.CollectionsAPIDistributedZkTest-controljetty-1375373897431/nodes_used_collection_shard1_replica1/core.properties: java.io.FileNotFoundException: /mnt/ssd/jenkins/workspace/Lucene-Solr-4.x-Linux/solr/build/solr-core/test/J1/./org.apache.solr.cloud.CollectionsAPIDistributedZkTest-controljetty-1375373897431/nodes_used_collection_shard1_replica1/core.properties (No such file or directory)
   [junit4]   2> 619101 T2030 oasc.CoreContainer.create Creating SolrCore 'nodes_used_collection_shard1_replica1' using instanceDir: /mnt/ssd/jenkins/workspace/Lucene-Solr-4.x-Linux/solr/build/solr-core/test/J1/./org.apache.solr.cloud.CollectionsAPIDistributedZkTest-controljetty-1375373897431/nodes_used_collection_shard1_replica1
   [junit4]   2> 619101 T2030 oasc.ZkController.createCollectionZkNode Check for collection zkNode:nodes_used_collection
   [junit4]   2> 619100 T2089 oasc.CoreContainer.create Creating SolrCore 'nodes_used_collection_shard2_replica2' using instanceDir: /mnt/ssd/jenkins/workspace/Lucene-Solr-4.x-Linux/solr/build/solr-core/test/J1/./org.apache.solr.cloud.CollectionsAPIDistributedZkTest-jetty4-1375373901320/nodes_used_collection_shard2_replica2
   [junit4]   2> 619102 T2089 oasc.ZkController.createCollectionZkNode Check for collection zkNode:nodes_used_collection
   [junit4]   2> 619102 T2075 oasc.ZkController.createCollectionZkNode Creating collection in ZooKeeper:nodes_used_collection
   [junit4]   2> 619103 T2075 oasc.ZkController.getConfName Looking for collection configName
   [junit4]   2> 619103 T2049 oasc.ZkController.createCollectionZkNode Creating collection in ZooKeeper:nodes_used_collection
   [junit4]   2> 619103 T2030 oasc.ZkController.createCollectionZkNode Creating collection in ZooKeeper:nodes_used_collection
   [junit4]   2> 619104 T2049 oasc.ZkController.getConfName Looking for collection configName
   [junit4]   2> 619104 T2030 oasc.ZkController.getConfName Looking for collection configName
   [junit4]   2> 619104 T2089 oasc.ZkController.createCollectionZkNode Creating collection in ZooKeeper:nodes_used_collection
   [junit4]   2> 619105 T2089 oasc.ZkController.getConfName Looking for collection configName
   [junit4]   2> 619106 T2075 oasc.ZkController.getConfName Only one config set found in zk - using it:conf1
   [junit4]   2> 619106 T2075 oascc.SolrZkClient.makePath makePath: /collections/nodes_used_collection
   [junit4]   2> 619109 T2089 oasc.ZkController.getConfName Only one config set found in zk - using it:conf1
   [junit4]   2> 619109 T2089 oascc.SolrZkClient.makePath makePath: /collections/nodes_used_collection
   [junit4]   2> 619111 T2030 oasc.ZkController.getConfName Only one config set found in zk - using it:conf1
   [junit4]   2> 619111 T2030 oascc.SolrZkClient.makePath makePath: /collections/nodes_used_collection
   [junit4]   2> 619111 T2049 oasc.ZkController.getConfName Only one config set found in zk - using it:conf1
   [junit4]   2> 619111 T2049 oascc.SolrZkClient.makePath makePath: /collections/nodes_used_collection
   [junit4]   2> 619118 T2030 oasc.ZkController.readConfigName Load collection config from:/collections/nodes_used_collection
   [junit4]   2> 619118 T2049 oasc.ZkController.readConfigName Load collection config from:/collections/nodes_used_collection
   [junit4]   2> 619120 T2075 oasc.ZkController.readConfigName Load collection config from:/collections/nodes_used_collection
   [junit4]   2> 619121 T2089 oasc.ZkController.readConfigName Load collection config from:/collections/nodes_used_collection
   [junit4]   2> 619122 T2030 oasc.SolrResourceLoader.<init> new SolrResourceLoader for directory: '/mnt/ssd/jenkins/workspace/Lucene-Solr-4.x-Linux/solr/build/solr-core/test/J1/./org.apache.solr.cloud.CollectionsAPIDistributedZkTest-controljetty-1375373897431/nodes_used_collection_shard1_replica1/'
   [junit4]   2> 619122 T2049 oasc.SolrResourceLoader.<init> new SolrResourceLoader for directory: '/mnt/ssd/jenkins/workspace/Lucene-Solr-4.x-Linux/solr/build/solr-core/test/J1/./org.apache.solr.cloud.CollectionsAPIDistributedZkTest-jetty1-1375373897719/nodes_used_collection_shard1_replica2/'
   [junit4]   2> 619125 T2075 oasc.SolrResourceLoader.<init> new SolrResourceLoader for directory: '/mnt/ssd/jenkins/workspace/Lucene-Solr-4.x-Linux/solr/build/solr-core/test/J1/./org.apache.solr.cloud.CollectionsAPIDistributedZkTest-jetty3-1375373900117/nodes_used_collection_shard2_replica1/'
   [junit4]   2> 619126 T2089 oasc.SolrResourceLoader.<init> new SolrResourceLoader for directory: '/mnt/ssd/jenkins/workspace/Lucene-Solr-4.x-Linux/solr/build/solr-core/test/J1/./org.apache.solr.cloud.CollectionsAPIDistributedZkTest-jetty4-1375373901320/nodes_used_collection_shard2_replica2/'
   [junit4]   2> 619187 T2089 oasc.SolrConfig.<init> Using Lucene MatchVersion: LUCENE_45
   [junit4]   2> 619195 T2030 oasc.SolrConfig.<init> Using Lucene MatchVersion: LUCENE_45
   [junit4]   2> 619197 T2049 oasc.SolrConfig.<init> Using Lucene MatchVersion: LUCENE_45
   [junit4]   2> 619243 T2075 oasc.SolrConfig.<init> Using Lucene MatchVersion: LUCENE_45
   [junit4]   2> 619281 T2089 oasc.SolrConfig.<init> Loaded SolrConfig: solrconfig.xml
   [junit4]   2> 619283 T2089 oass.IndexSchema.readSchema Reading Solr Schema from schema.xml
   [junit4]   2> 619301 T2089 oass.IndexSchema.readSchema [nodes_used_collection_shard2_replica2] Schema name=test
   [junit4]   2> 619304 T2030 oasc.SolrConfig.<init> Loaded SolrConfig: solrconfig.xml
   [junit4]   2> 619308 T2030 oass.IndexSchema.readSchema Reading Solr Schema from schema.xml
   [junit4]   2> 619312 T2049 oasc.SolrConfig.<init> Loaded SolrConfig: solrconfig.xml
   [junit4]   2> 619331 T2030 oass.IndexSchema.readSchema [nodes_used_collection_shard1_replica1] Schema name=test
   [junit4]   2> 619336 T2049 oass.IndexSchema.readSchema Reading Solr Schema from schema.xml
   [junit4]   2> 619347 T2075 oasc.SolrConfig.<init> Loaded SolrConfig: solrconfig.xml
   [junit4]   2> 619354 T2049 oass.IndexSchema.readSchema [nodes_used_collection_shard1_replica2] Schema name=test
   [junit4]   2> 619358 T2075 oass.IndexSchema.readSchema Reading Solr Schema from schema.xml
   [junit4]   2> 619392 T2075 oass.IndexSchema.readSchema [nodes_used_collection_shard2_replica1] Schema name=test
   [junit4]   2> 620047 T2089 oass.ByteField.init WARN ByteField is deprecated and will be removed in 5.0. You should use TrieIntField instead.
   [junit4]   2> 620048 T2089 oass.ShortField.init WARN ShortField is deprecated and will be removed in 5.0. You should use TrieIntField instead.
   [junit4]   2> 620048 T2089 oass.OpenExchangeRatesOrgProvider.init Initialized with rates=open-exchange-rates.json, refreshInterval=1440.
   [junit4]   2> 620054 T2089 oass.IndexSchema.readSchema default search field in schema is text
   [junit4]   2> 620057 T2089 oass.IndexSchema.readSchema unique key field: id
   [junit4]   2> 620065 T2030 oass.ByteField.init WARN ByteField is deprecated and will be removed in 5.0. You should use TrieIntField instead.
   [junit4]   2> 620066 T2030 oass.ShortField.init WARN ShortField is deprecated and will be removed in 5.0. You should use TrieIntField instead.
   [junit4]   2> 620067 T2030 oass.OpenExchangeRatesOrgProvider.init Initialized with rates=open-exchange-rates.json, refreshInterval=1440.
   [junit4]   2> 620076 T2030 oass.IndexSchema.readSchema default search field in schema is text
   [junit4]   2> 620077 T2089 oass.FileExchangeRateProvider.reload Reloading exchange rates from file currency.xml
   [junit4]   2> 620081 T2030 oass.IndexSchema.readSchema unique key field: id
   [junit4]   2> 620081 T2089 oass.FileExchangeRateProvider.reload Reloading exchange rates from file currency.xml
   [junit4]   2> 620091 T2089 oass.OpenExchangeRatesOrgProvider.reload Reloading exchange rates from open-exchange-rates.json
   [junit4]   2> 620095 T2089 oass.OpenExchangeRatesOrgProvider$OpenExchangeRates.<init> WARN Unknown key IMPORTANT NOTE
   [junit4]   2> 620095 T2089 oass.OpenExchangeRatesOrgProvider$OpenExchangeRates.<init> WARN Expected key, got STRING
   [junit4]   2> 620096 T2089 oass.OpenExchangeRatesOrgProvider.reload Reloading exchange rates from open-exchange-rates.json
   [junit4]   2> 620099 T2089 oass.OpenExchangeRatesOrgProvider$OpenExchangeRates.<init> WARN Unknown key IMPORTANT NOTE
   [junit4]   2> 620099 T2089 oass.OpenExchangeRatesOrgProvider$OpenExchangeRates.<init> WARN Expected key, got STRING
   [junit4]   2> 620100 T2089 oasc.SolrCore.initDirectoryFactory org.apache.solr.core.MockDirectoryFactory
   [junit4]   2> 620100 T2089 oasc.SolrCore.<init> [nodes_used_collection_shard2_replica2] Opening new SolrCore at /mnt/ssd/jenkins/workspace/Lucene-Solr-4.x-Linux/solr/build/solr-core/test/J1/./org.apache.solr.cloud.CollectionsAPIDistributedZkTest-jetty4-1375373901320/nodes_used_collection_shard2_replica2/, dataDir=/mnt/ssd/jenkins/workspace/Lucene-Solr-4.x-Linux/solr/build/solr-core/test/J1/./org.apache.solr.cloud.CollectionsAPIDistributedZkTest-jetty4-1375373901320//nodes_used_collection_shard2_replica2/data/
   [junit4]   2> 620100 T2089 oasc.JmxMonitoredMap.<init> JMX monitoring is enabled. Adding Solr mbeans to JMX Server: com.sun.jmx.mbeanserver.JmxMBeanServer@160bc7c0
   [junit4]   2> 620101 T2089 oasc.CachingDirectoryFactory.get return new directory for /mnt/ssd/jenkins/workspace/Lucene-Solr-4.x-Linux/solr/build/solr-core/test/J1/./org.apache.solr.cloud.CollectionsAPIDistributedZkTest-jetty4-1375373901320//nodes_used_collection_shard2_replica2/data
   [junit4]   2> 620102 T2089 oasc.SolrCore.getNewIndexDir New index directory detected: old=null new=/mnt/ssd/jenkins/workspace/Lucene-Solr-4.x-Linux/solr/build/solr-core/test/J1/./org.apache.solr.cloud.CollectionsAPIDistributedZkTest-jetty4-1375373901320//nodes_used_collection_shard2_replica2/data/index/
   [junit4]   2> 620102 T2089 oasc.SolrCore.initIndex WARN [nodes_used_collection_shard2_replica2] Solr index directory '/mnt/ssd/jenkins/workspace/Lucene-Solr-4.x-Linux/solr/build/solr-core/test/J1/./org.apache.solr.cloud.CollectionsAPIDistributedZkTest-jetty4-1375373901320/nodes_used_collection_shard2_replica2/data/index' doesn't exist. Creating new index...
   [junit4]   2> 620103 T2089 oasc.CachingDirectoryFactory.get return new directory for /mnt/ssd/jenkins/workspace/Lucene-Solr-4.x-Linux/solr/build/solr-core/test/J1/./org.apache.solr.cloud.CollectionsAPIDistributedZkTest-jetty4-1375373901320//nodes_used_collection_shard2_replica2/data/index
   [junit4]   2> 620105 T2089 oasc.SolrDeletionPolicy.onCommit SolrDeletionPolicy.onCommit: commits: num=1
   [junit4]   2> 		commit{dir=MockDirWrapper(org.apache.lucene.store.RAMDirectory@3f99e9e2 lockFactory=org.apache.lucene.store.NativeFSLockFactory@7337cbea),segFN=segments_1,generation=1}
   [junit4]   2> 620106 T2089 oasc.SolrDeletionPolicy.updateCommits newest commit generation = 1
   [junit4]   2> 620105 T2049 oass.ByteField.init WARN ByteField is deprecated and will be removed in 5.0. You should use TrieIntField instead.
   [junit4]   2> 620106 T2049 oass.ShortField.init WARN ShortField is deprecated and will be removed in 5.0. You should use TrieIntField instead.
   [junit4]   2> 620108 T2049 oass.OpenExchangeRatesOrgProvider.init Initialized with rates=open-exchange-rates.json, refreshInterval=1440.
   [junit4]   2> 620110 T2089 oasup.UpdateRequestProcessorChain.init inserting DistributedUpdateProcessorFactory into updateRequestProcessorChain "dedupe"
   [junit4]   2> 620111 T2089 oasup.UpdateRequestProcessorChain.init inserting DistributedUpdateProcessorFactory into updateRequestProcessorChain "stored_sig"
   [junit4]   2> 620112 T2089 oasup.UpdateRequestProcessorChain.init inserting DistributedUpdateProcessorFactory into updateRequestProcessorChain "distrib-dup-test-chain-implicit"
   [junit4]   2> 620112 T2089 oasc.RequestHandlers.initHandlersFromConfig created standard: solr.StandardRequestHandler
   [junit4]   2> 620113 T2089 oasc.RequestHandlers.initHandlersFromConfig created /get: solr.RealTimeGetHandler
   [junit4]   2> 620114 T2089 oasc.RequestHandlers.initHandlersFromConfig adding lazy requestHandler: solr.ReplicationHandler
   [junit4]   2> 620114 T2089 oasc.RequestHandlers.initHandlersFromConfig created /replication: solr.ReplicationHandler
   [junit4]   2> 620115 T2089 oasc.RequestHandlers.initHandlersFromConfig created /update: solr.UpdateRequestHandler
   [junit4]   2> 620116 T2089 oasc.RequestHandlers.initHandlersFromConfig created /admin/: org.apache.solr.handler.admin.AdminHandlers
   [junit4]   2> 620117 T2030 oass.FileExchangeRateProvider.reload Reloading exchange rates from file currency.xml
   [junit4]   2> 620117 T2049 oass.IndexSchema.readSchema default search field in schema is text
   [junit4]   2> 620119 T2089 oashl.XMLLoader.init xsltCacheLifetimeSeconds=60
   [junit4]   2> 620121 T2049 oass.IndexSchema.readSchema unique key field: id
   [junit4]   2> 620122 T2089 oass.SolrIndexSearcher.<init> Opening Searcher@890415b main
   [junit4]   2> 620123 T2089 oasu.CommitTracker.<init> Hard AutoCommit: disabled
   [junit4]   2> 620123 T2089 oasu.CommitTracker.<init> Soft AutoCommit: disabled
   [junit4]   2> 620124 T2030 oass.FileExchangeRateProvider.reload Reloading exchange rates from file currency.xml
   [junit4]   2> 620125 T2075 oass.ByteField.init WARN ByteField is deprecated and will be removed in 5.0. You should use TrieIntField instead.
   [junit4]   2> 620126 T2075 oass.ShortField.init WARN ShortField is deprecated and will be removed in 5.0. You should use TrieIntField instead.
   [junit4]   2> 620126 T2075 oass.OpenExchangeRatesOrgProvider.init Initialized with rates=open-exchange-rates.json, refreshInterval=1440.
   [junit4]   2> 620130 T2101 oasc.SolrCore.registerSearcher [nodes_used_collection_shard2_replica2] Registered new searcher Searcher@890415b main{StandardDirectoryReader(segments_1:1)}
   [junit4]   2> 620131 T2030 oass.OpenExchangeRatesOrgProvider.reload Reloading exchange rates from open-exchange-rates.json
   [junit4]   2> 620132 T2075 oass.IndexSchema.readSchema default search field in schema is text
   [junit4]   2> 620134 T2030 oass.OpenExchangeRatesOrgProvider$OpenExchangeRates.<init> WARN Unknown key IMPORTANT NOTE
   [junit4]   2> 620134 T2030 oass.OpenExchangeRatesOrgProvider$OpenExchangeRates.<init> WARN Expected key, got STRING
   [junit4]   2> 620134 T2089 oasc.CoreContainer.registerCore registering core: nodes_used_collection_shard2_replica2
   [junit4]   2> 620135 T2030 oass.OpenExchangeRatesOrgProvider.reload Reloading exchange rates from open-exchange-rates.json
   [junit4]   2> 620134 T2075 oass.IndexSchema.readSchema unique key field: id
   [junit4]   2> 620135 T2089 oasc.ZkController.register Register replica - core:nodes_used_collection_shard2_replica2 address:http://127.0.0.1:50685/wnpb/k collection:nodes_used_collection shard:shard2
   [junit4]   2> 620136 T2089 oascsi.HttpClientUtil.createClient Creating new http client, config:maxConnections=10000&maxConnectionsPerHost=20&connTimeout=15000&socketTimeout=30000&retry=false
   [junit4]   2> 620138 T2030 oass.OpenExchangeRatesOrgProvider$OpenExchangeRates.<init> WARN Unknown key IMPORTANT NOTE
   [junit4]   2> 620138 T2030 oass.OpenExchangeRatesOrgProvider$OpenExchangeRates.<init> WARN Expected key, got STRING
   [junit4]   2> 620139 T2030 oasc.SolrCore.initDirectoryFactory org.apache.solr.core.MockDirectoryFactory
   [junit4]   2> 620139 T2030 oasc.SolrCore.<init> [nodes_used_collection_shard1_replica1] Opening new SolrCore at /mnt/ssd/jenkins/workspace/Lucene-Solr-4.x-Linux/solr/build/solr-core/test/J1/./org.apache.solr.cloud.CollectionsAPIDistributedZkTest-controljetty-1375373897431/nodes_used_collection_shard1_replica1/, dataDir=/mnt/ssd/jenkins/workspace/Lucene-Solr-4.x-Linux/solr/build/solr-core/test/J1/./org.apache.solr.cloud.CollectionsAPIDistributedZkTest-controljetty-1375373897431//nodes_used_collection_shard1_replica1/data/
   [junit4]   2> 620140 T2030 oasc.JmxMonitoredMap.<init> JMX monitoring is enabled. Adding Solr mbeans to JMX Server: com.sun.jmx.mbeanserver.JmxMBeanServer@160bc7c0
   [junit4]   2> 620141 T2030 oasc.CachingDirectoryFactory.get return new directory for /mnt/ssd/jenkins/workspace/Lucene-Solr-4.x-Linux/solr/build/solr-core/test/J1/./org.apache.solr.cloud.CollectionsAPIDistributedZkTest-controljetty-1375373897431//nodes_used_collection_shard1_replica1/data
   [junit4]   2> 620142 T2030 oasc.SolrCore.getNewIndexDir New index directory detected: old=null new=/mnt/ssd/jenkins/workspace/Lucene-Solr-4.x-Linux/solr/build/solr-core/test/J1/./org.apache.solr.cloud.CollectionsAPIDistributedZkTest-controljetty-1375373897431//nodes_used_collection_shard1_replica1/data/index/
   [junit4]   2> 620142 T2030 oasc.SolrCore.initIndex WARN [nodes_used_collection_shard1_replica1] Solr index directory '/mnt/ssd/jenkins/workspace/Lucene-Solr-4.x-Linux/solr/build/solr-core/test/J1/./org.apache.solr.cloud.CollectionsAPIDistributedZkTest-controljetty-1375373897431/nodes_used_collection_shard1_replica1/data/index' doesn't exist. Creating new index...
   [junit4]   2> 620143 T2030 oasc.CachingDirectoryFactory.get return new directory for /mnt/ssd/jenkins/workspace/Lucene-Solr-4.x-Linux/solr/build/solr-core/test/J1/./org.apache.solr.cloud.CollectionsAPIDistributedZkTest-controljetty-1375373897431//nodes_used_collection_shard1_replica1/data/index
   [junit4]   2> 620143 T2089 oascc.SolrZkClient.makePath makePath: /collections/nodes_used_collection/leader_elect/shard2/election
   [junit4]   2> 620145 T2030 oasc.SolrDeletionPolicy.onCommit SolrDeletionPolicy.onCommit: commits: num=1
   [junit4]   2> 		commit{dir=MockDirWrapper(org.apache.lucene.store.RAMDirectory@7d15266 lockFactory=org.apache.lucene.store.NativeFSLockFactory@709d9614),segFN=segments_1,generation=1}
   [junit4]   2> 620145 T2030 oasc.SolrDeletionPolicy.updateCommits newest commit generation = 1
   [junit4]   2> 620150 T2030 oasup.UpdateRequestProcessorChain.init inserting DistributedUpdateProcessorFactory into updateRequestProcessorChain "dedupe"
   [junit4]   2> 620150 T2030 oasup.UpdateRequestProcessorChain.init inserting DistributedUpdateProcessorFactory into updateRequestProcessorChain "stored_sig"
   [junit4]   2> 620151 T2030 oasup.UpdateRequestProcessorChain.init inserting DistributedUpdateProcessorFactory into updateRequestProcessorChain "distrib-dup-test-chain-implicit"
   [junit4]   2> 620151 T2030 oasc.RequestHandlers.initHandlersFromConfig created standard: solr.StandardRequestHandler
   [junit4]   2> 620152 T2030 oasc.RequestHandlers.initHandlersFromConfig created /get: solr.RealTimeGetHandler
   [junit4]   2> 620152 T2030 oasc.RequestHandlers.initHandlersFromConfig adding lazy requestHandler: solr.ReplicationHandler
   [junit4]   2> 620153 T2030 oasc.RequestHandlers.initHandlersFromConfig created /replication: solr.ReplicationHandler
   [junit4]   2> 620154 T2030 oasc.RequestHandlers.initHandlersFromConfig created /update: solr.UpdateRequestHandler
   [junit4]   2> 620154 T2030 oasc.RequestHandlers.initHandlersFromConfig created /admin/: org.apache.solr.handler.admin.AdminHandlers
   [junit4]   2> 620156 T2030 oashl.XMLLoader.init xsltCacheLifetimeSeconds=60
   [junit4]   2> 620166 T2030 oass.SolrIndexSearcher.<init> Opening Searcher@98c0ece main
   [junit4]   2> 620167 T2030 oasu.CommitTracker.<init> Hard AutoCommit: disabled
   [junit4]   2> 620167 T2030 oasu.CommitTracker.<init> Soft AutoCommit: disabled
   [junit4]   2> 620168 T2049 oass.FileExchangeRateProvider.reload Reloading exchange rates from file currency.xml
   [junit4]   2> 620173 T2102 oasc.SolrCore.registerSearcher [nodes_used_collection_shard1_replica1] Registered new searcher Searcher@98c0ece main{StandardDirectoryReader(segments_1:1)}
   [junit4]   2> 620175 T2089 oasc.ShardLeaderElectionContext.runLeaderProcess Running the leader process for shard shard2
   [junit4]   2> 620175 T2030 oasc.CoreContainer.registerCore registering core: nodes_used_collection_shard1_replica1
   [junit4]   2> 620176 T2030 oasc.ZkController.register Register replica - core:nodes_used_collection_shard1_replica1 address:http://127.0.0.1:43193/wnpb/k collection:nodes_used_collection shard:shard1
   [junit4]   2> 620176 T2030 oascsi.HttpClientUtil.createClient Creating new http client, config:maxConnections=10000&maxConnectionsPerHost=20&connTimeout=15000&socketTimeout=30000&retry=false
   [junit4]   2> 620177 T2075 oass.FileExchangeRateProvider.reload Reloading exchange rates from file currency.xml
   [junit4]   2> 620178 T2049 oass.FileExchangeRateProvider.reload Reloading exchange rates from file currency.xml
   [junit4]   2> 620181 T2030 oascc.SolrZkClient.makePath makePath: /collections/nodes_used_collection/leader_elect/shard1/election
   [junit4]   2> 620183 T2089 oasc.ShardLeaderElectionContext.waitForReplicasToComeUp Waiting until we see more replicas up for shard shard2: total=2 found=1 timeoutin=179998
   [junit4]   2> 620185 T2049 oass.OpenExchangeRatesOrgProvider.reload Reloading exchange rates from open-exchange-rates.json
   [junit4]   2> 620185 T2075 oass.FileExchangeRateProvider.reload Reloading exchange rates from file currency.xml
   [junit4]   2> 620187 T2049 oass.OpenExchangeRatesOrgProvider$OpenExchangeRates.<init> WARN Unknown key IMPORTANT NOTE
   [junit4]   2> 620188 T2049 oass.OpenExchangeRatesOrgProvider$OpenExchangeRates.<init> WARN Expected key, got STRING
   [junit4]   2> 620188 T2049 oass.OpenExchangeRatesOrgProvider.reload Reloading exchange rates from open-exchange-rates.json
   [junit4]   2> 620191 T2049 oass.OpenExchangeRatesOrgProvider$OpenExchangeRates.<init> WARN Unknown key IMPORTANT NOTE
   [junit4]   2> 620192 T2049 oass.OpenExchangeRatesOrgProvider$OpenExchangeRates.<init> WARN Expected key, got STRING
   [junit4]   2> 620192 T2075 oass.OpenExchangeRatesOrgProvider.reload Reloading exchange rates from open-exchange-rates.json
   [junit4]   2> 620192 T2049 oasc.SolrCore.initDirectoryFactory org.apache.solr.core.MockDirectoryFactory
   [junit4]   2> 620193 T2049 oasc.SolrCore.<init> [nodes_used_collection_shard1_replica2] Opening new SolrCore at /mnt/ssd/jenkins/workspace/Lucene-Solr-4.x-Linux/solr/build/solr-core/test/J1/./org.apache.solr.cloud.CollectionsAPIDistributedZkTest-jetty1-1375373897719/nodes_used_collection_shard1_replica2/, dataDir=/mnt/ssd/jenkins/workspace/Lucene-Solr-4.x-Linux/solr/build/solr-core/test/J1/./org.apache.solr.cloud.CollectionsAPIDistributedZkTest-jetty1-1375373897719//nodes_used_collection_shard1_replica2/data/
   [junit4]   2> 620194 T2049 oasc.JmxMonitoredMap.<init> JMX monitoring is enabled. Adding Solr mbeans to JMX Server: com.sun.jmx.mbeanserver.JmxMBeanServer@160bc7c0
   [junit4]   2> 620195 T2049 oasc.CachingDirectoryFactory.get return new directory for /mnt/ssd/jenkins/workspace/Lucene-Solr-4.x-Linux/solr/build/solr-core/test/J1/./org.apache.solr.cloud.CollectionsAPIDistributedZkTest-jetty1-1375373897719//nodes_used_collection_shard1_replica2/data
   [junit4]   2> 620195 T2049 oasc.SolrCore.getNewIndexDir New index directory detected: old=null new=/mnt/ssd/jenkins/workspace/Lucene-Solr-4.x-Linux/solr/build/solr-core/test/J1/./org.apache.solr.cloud.CollectionsAPIDistributedZkTest-jetty1-1375373897719//nodes_used_collection_shard1_replica2/data/index/
   [junit4]   2> 620196 T2049 oasc.SolrCore.initIndex WARN [nodes_used_collection_shard1_replica2] Solr index directory '/mnt/ssd/jenkins/workspace/Lucene-Solr-4.x-Linux/solr/build/solr-core/test/J1/./org.apache.solr.cloud.CollectionsAPIDistributedZkTest-jetty1-1375373897719/nodes_used_collection_shard1_replica2/data/index' doesn't exist. Creating new index...
   [junit4]   2> 620196 T2075 oass.OpenExchangeRatesOrgProvider$OpenExchangeRates.<init> WARN Unknown key IMPORTANT NOTE
   [junit4]   2> 620197 T2075 oass.OpenExchangeRatesOrgProvider$OpenExchangeRates.<init> WARN Expected key, got STRING
   [junit4]   2> 620197 T2049 oasc.CachingDirectoryFactory.get return new directory for /mnt/ssd/jenkins/workspace/Lucene-Solr-4.x-Linux/solr/build/solr-core/test/J1/./org.apache.solr.cloud.CollectionsAPIDistributedZkTest-jetty1-1375373897719//nodes_used_collection_shard1_replica2/data/index
   [junit4]   2> 620197 T2075 oass.OpenExchangeRatesOrgProvider.reload Reloading exchange rates from open-exchange-rates.json
   [junit4]   2> 620200 T2049 oasc.SolrDeletionPolicy.onCommit SolrDeletionPolicy.onCommit: commits: num=1
   [junit4]   2> 		commit{dir=MockDirWrapper(org.apache.lucene.store.RAMDirectory@358bcae5 lockFactory=org.apache.lucene.store.NativeFSLockFactory@61f98673),segFN=segments_1,generation=1}
   [junit4]   2> 620200 T2049 oasc.SolrDeletionPolicy.updateCommits newest commit generation = 1
   [junit4]   2> 620200 T2030 oasc.ShardLeaderElectionContext.runLeaderProcess Running the leader process for shard shard1
   [junit4]   2> 620200 T2075 oass.OpenExchangeRatesOrgProvider$OpenExchangeRates.<init> WARN Unknown key IMPORTANT NOTE
   [junit4]   2> 620201 T2075 oass.OpenExchangeRatesOrgProvider$OpenExchangeRates.<init> WARN Expected key, got STRING
   [junit4]   2> 620201 T2075 oasc.SolrCore.initDirectoryFactory org.apache.solr.core.MockDirectoryFactory
   [junit4]   2> 620202 T2075 oasc.SolrCore.<init> [nodes_used_collection_shard2_replica1] Opening new SolrCore at /mnt/ssd/jenkins/workspace/Lucene-Solr-4.x-Linux/solr/build/solr-core/test/J1/./org.apache.solr.cloud.CollectionsAPIDistributedZkTest-jetty3-1375373900117/nodes_used_collection_shard2_replica1/, dataDir=/mnt/ssd/jenkins/workspace/Lucene-Solr-4.x-Linux/solr/build/solr-core/test/J1/./org.apache.solr.cloud.CollectionsAPIDistributedZkTest-jetty3-1375373900117//nodes_used_collection_shard2_replica1/data/
   [junit4]   2> 620202 T2075 oasc.JmxMonitoredMap.<init> JMX monitoring is enabled. Adding Solr mbeans to JMX Server: com.sun.jmx.mbeanserver.JmxMBeanServer@160bc7c0
   [junit4]   2> 620204 T2075 oasc.CachingDirectoryFactory.get return new directory for /mnt/ssd/jenkins/workspace/Lucene-Solr-4.x-Linux/solr/build/solr-core/test/J1/./org.apache.solr.cloud.CollectionsAPIDistributedZkTest-jetty3-1375373900117//nodes_used_collection_shard2_replica1/data
   [junit4]   2> 620204 T2075 oasc.SolrCore.getNewIndexDir New index directory detected: old=null new=/mnt/ssd/jenkins/workspace/Lucene-Solr-4.x-Linux/solr/build/solr-core/test/J1/./org.apache.solr.cloud.CollectionsAPIDistributedZkTest-jetty3-1375373900117//nodes_used_collection_shard2_replica1/data/index/
   [junit4]   2> 620205 T2075 oasc.SolrCore.initIndex WARN [nodes_used_collection_shard2_replica1] Solr index directory '/mnt/ssd/jenkins/workspace/Lucene-Solr-4.x-Linux/solr/build/solr-core/test/J1/./org.apache.solr.cloud.CollectionsAPIDistributedZkTest-jetty3-1375373900117/nodes_used_collection_shard2_replica1/data/index' doesn't exist. Creating new index...
   [junit4]   2> 620205 T2030 oasc.ShardLeaderElectionContext.waitForReplicasToComeUp Waiting until we see more replicas up for shard shard1: total=2 found=1 timeoutin=179999
   [junit4]   2> 620205 T2075 oasc.CachingDirectoryFactory.get return new directory for /mnt/ssd/jenkins/workspace/Lucene-Solr-4.x-Linux/solr/build/solr-core/test/J1/./org.apache.solr.cloud.CollectionsAPIDistributedZkTest-jetty3-1375373900117//nodes_used_collection_shard2_replica1/data/index
   [junit4]   2> 620205 T2049 oasup.UpdateRequestProcessorChain.init inserting DistributedUpdateProcessorFactory into updateRequestProcessorChain "dedupe"
   [junit4]   2> 620206 T2049 oasup.UpdateRequestProcessorChain.init inserting DistributedUpdateProcessorFactory into updateRequestProcessorChain "stored_sig"
   [junit4]   2> 620207 T2075 oasc.SolrDeletionPolicy.onCommit SolrDeletionPolicy.onCommit: commits: num=1
   [junit4]   2> 		commit{dir=MockDirWrapper(org.apache.lucene.store.RAMDirectory@5066c295 lockFactory=org.apache.lucene.store.NativeFSLockFactory@671a7db9),segFN=segments_1,generation=1}
   [junit4]   2> 620207 T2075 oasc.SolrDeletionPolicy.updateCommits newest commit generation = 1
   [junit4]   2> 620207 T2049 oasup.UpdateRequestProcessorChain.init inserting DistributedUpdateProcessorFactory into updateRequestProcessorChain "distrib-dup-test-chain-implicit"
   [junit4]   2> 620209 T2049 oasc.RequestHandlers.initHandlersFromConfig created standard: solr.StandardRequestHandler
   [junit4]   2> 620210 T2049 oasc.RequestHandlers.initHandlersFromConfig created /get: solr.RealTimeGetHandler
   [junit4]   2> 620210 T2049 oasc.RequestHandlers.initHandlersFromConfig adding lazy requestHandler: solr.ReplicationHandler
   [junit4]   2> 620211 T2049 oasc.RequestHandlers.initHandlersFromConfig created /replication: solr.ReplicationHandler
   [junit4]   2> 620212 T2049 oasc.RequestHandlers.initHandlersFromConfig created /update: solr.UpdateRequestHandler
   [junit4]   2> 620212 T2075 oasup.UpdateRequestProcessorChain.init inserting DistributedUpdateProcessorFactory into updateRequestProcessorChain "dedupe"
   [junit4]   2> 620212 T2049 oasc.RequestHandlers.initHandlersFromConfig created /admin/: org.apache.solr.handler.admin.AdminHandlers
   [junit4]   2> 620212 T2075 oasup.UpdateRequestProcessorChain.init inserting DistributedUpdateProcessorFactory into updateRequestProcessorChain "stored_sig"
   [junit4]   2> 620213 T2075 oasup.UpdateRequestProcessorChain.init inserting DistributedUpdateProcessorFactory into updateRequestProcessorChain "distrib-dup-test-chain-implicit"
   [junit4]   2> 620214 T2075 oasc.RequestHandlers.initHandlersFromConfig created standard: solr.StandardRequestHandler
   [junit4]   2> 620215 T2075 oasc.RequestHandlers.initHandlersFromConfig created /get: solr.RealTimeGetHandler
   [junit4]   2> 620215 T2075 oasc.RequestHandlers.initHandlersFromConfig adding lazy requestHandler: solr.ReplicationHandler
   [junit4]   2> 620215 T2049 oashl.XMLLoader.init xsltCacheLifetimeSeconds=60
   [junit4]   2> 620216 T2075 oasc.RequestHandlers.initHandlersFromConfig created /replication: solr.ReplicationHandler
   [junit4]   2> 620217 T2075 oasc.RequestHandlers.initHandlersFromConfig created /update: solr.UpdateRequestHandler
   [junit4]   2> 620217 T2075 oasc.RequestHandlers.initHandlersFromConfig created /admin/: org.apache.solr.handler.admin.AdminHandlers
   [junit4]   2> 620219 T2075 oashl.XMLLoader.init xsltCacheLifetimeSeconds=60
   [junit4]   2> 620219 T2049 oass.SolrIndexSearcher.<init> Opening Searcher@296fa767 main
   [junit4]   2> 620220 T2049 oasu.CommitTracker.<init> Hard AutoCommit: disabled
   [junit4]   2> 620220 T2049 oasu.CommitTracker.<init> Soft AutoCommit: disabled
   [junit4]   2> 620221 T2075 oass.SolrIndexSearcher.<init> Opening Searcher@1bae6216 main
   [junit4]   2> 620222 T2075 oasu.CommitTracker.<init> Hard AutoCommit: disabled
   [junit4]   2> 620223 T2075 oasu.CommitTracker.<init> Soft AutoCommit: disabled
   [junit4]   2> 620227 T2104 oasc.SolrCore.registerSearcher [nodes_used_collection_shard2_replica1] Registered new searcher Searcher@1bae6216 main{StandardDirectoryReader(segments_1:1)}
   [junit4]   2> 620227 T2103 oasc.SolrCore.registerSearcher [nodes_used_collection_shard1_replica2] Registered new searcher Searcher@296fa767 main{StandardDirectoryReader(segments_1:1)}
   [junit4]   2> 620228 T2075 oasc.CoreContainer.registerCore registering core: nodes_used_collection_shard2_replica1
   [junit4]   2> 620229 T2075 oasc.ZkController.register Register replica - core:nodes_used_collection_shard2_replica1 address:http://127.0.0.1:46579/wnpb/k collection:nodes_used_collection shard:shard2
   [junit4]   2> 620229 T2075 oascsi.HttpClientUtil.createClient Creating new http client, config:maxConnections=10000&maxConnectionsPerHost=20&connTimeout=15000&socketTimeout=30000&retry=false
   [junit4]   2> 620230 T2049 oasc.CoreContainer.registerCore registering core: nodes_used_collection_shard1_replica2
   [junit4]   2> 620230 T2049 oasc.ZkController.register Register replica - core:nodes_used_collection_shard1_replica2 address:http://127.0.0.1:57387/wnpb/k collection:nodes_used_collection shard:shard1
   [junit4]   2> 620230 T2049 oascsi.HttpClientUtil.createClient Creating new http client, config:maxConnections=10000&maxConnectionsPerHost=20&connTimeout=15000&socketTimeout=30000&retry=false
   [junit4]   2> 620685 T2089 oasc.ShardLeaderElectionContext.waitForReplicasToComeUp Enough replicas found to continue.
   [junit4]   2> 620685 T2089 oasc.ShardLeaderElectionContext.runLeaderProcess I may be the new leader - try and sync
   [junit4]   2> 620686 T2089 oasc.SyncStrategy.sync Sync replicas to http://127.0.0.1:50685/wnpb/k/nodes_used_collection_shard2_replica2/
   [junit4]   2> 620686 T2089 oasu.PeerSync.sync PeerSync: core=nodes_used_collection_shard2_replica2 url=http://127.0.0.1:50685/wnpb/k START replicas=[http://127.0.0.1:46579/wnpb/k/nodes_used_collection_shard2_replica1/] nUpdates=100
   [junit4]   2> 620687 T2089 oasu.PeerSync.sync PeerSync: core=nodes_used_collection_shard2_replica2 url=http://127.0.0.1:50685/wnpb/k DONE.  We have no versions.  sync failed.
   [junit4]   2> 620687 T2089 oasc.SyncStrategy.syncReplicas Leader's attempt to sync with shard failed, moving to the next candidate
   [junit4]   2> 620687 T2089 oasc.ShardLeaderElectionContext.runLeaderProcess We failed sync, but we have no versions - we can't sync in that case - we were active before, so become leader anyway
   [junit4]   2> 620688 T2089 oasc.ShardLeaderElectionContext.runLeaderProcess I am the new leader: http://127.0.0.1:50685/wnpb/k/nodes_used_collection_shard2_replica2/ shard2
   [junit4]   2> 620688 T2089 oascc.SolrZkClient.makePath makePath: /collections/nodes_used_collection/leaders/shard2
   [junit4]   2> ASYNC  NEW_CORE C1607 name=nodes_used_collection_shard2_replica1 org.apache.solr.core.SolrCore@f7c17f2 url=http://127.0.0.1:46579/wnpb/k/nodes_used_collection_shard2_replica1 node=127.0.0.1:46579_wnpb%2Fk C1607_STATE=coll:nodes_used_collection core:nodes_used_collection_shard2_replica1 props:{state=down, core=nodes_used_collection_shard2_replica1, node_name=127.0.0.1:46579_wnpb%2Fk, base_url=http://127.0.0.1:46579/wnpb/k}
   [junit4]   2> 620692 T2074 C1607 P46579 oasc.SolrCore.execute [nodes_used_collection_shard2_replica1] webapp=/wnpb/k path=/get params={getVersions=100&distrib=false&wt=javabin&qt=/get&version=2} status=0 QTime=1 
   [junit4]   2> 620706 T2030 oasc.ShardLeaderElectionContext.waitForReplicasToComeUp Enough replicas found to continue.
   [junit4]   2> 620707 T2030 oasc.ShardLeaderElectionContext.runLeaderP

[...truncated too long message...]

kCmdExecutor.retryOperation(ZkCmdExecutor.java:65)
   [junit4]   2> 	at org.apache.solr.common.cloud.SolrZkClient.getChildren(SolrZkClient.java:232)
   [junit4]   2> 	at org.apache.solr.cloud.LeaderElector.checkIfIamLeader(LeaderElector.java:84)
   [junit4]   2> 	at org.apache.solr.cloud.LeaderElector.access$000(LeaderElector.java:55)
   [junit4]   2> 	at org.apache.solr.cloud.LeaderElector$1.process(LeaderElector.java:129)
   [junit4]   2> 	at org.apache.zookeeper.ClientCnxn$EventThread.processEvent(ClientCnxn.java:519)
   [junit4]   2> 	at org.apache.zookeeper.ClientCnxn$EventThread.run(ClientCnxn.java:495)
   [junit4]   2> 
   [junit4]   2> 722459 T2095 oasc.LeaderElector$1.process WARN  org.apache.zookeeper.KeeperException$SessionExpiredException: KeeperErrorCode = Session expired for /collections/new_implicit_coll_0/leader_elect/d/election
   [junit4]   2> 	at org.apache.zookeeper.KeeperException.create(KeeperException.java:127)
   [junit4]   2> 	at org.apache.zookeeper.KeeperException.create(KeeperException.java:51)
   [junit4]   2> 	at org.apache.zookeeper.ZooKeeper.getChildren(ZooKeeper.java:1468)
   [junit4]   2> 	at org.apache.solr.common.cloud.SolrZkClient$6.execute(SolrZkClient.java:235)
   [junit4]   2> 	at org.apache.solr.common.cloud.SolrZkClient$6.execute(SolrZkClient.java:232)
   [junit4]   2> 	at org.apache.solr.common.cloud.ZkCmdExecutor.retryOperation(ZkCmdExecutor.java:65)
   [junit4]   2> 	at org.apache.solr.common.cloud.SolrZkClient.getChildren(SolrZkClient.java:232)
   [junit4]   2> 	at org.apache.solr.cloud.LeaderElector.checkIfIamLeader(LeaderElector.java:84)
   [junit4]   2> 	at org.apache.solr.cloud.LeaderElector.access$000(LeaderElector.java:55)
   [junit4]   2> 	at org.apache.solr.cloud.LeaderElector$1.process(LeaderElector.java:129)
   [junit4]   2> 	at org.apache.zookeeper.ClientCnxn$EventThread.processEvent(ClientCnxn.java:519)
   [junit4]   2> 	at org.apache.zookeeper.ClientCnxn$EventThread.run(ClientCnxn.java:495)
   [junit4]   2> 
   [junit4]   2> 722459 T2095 oasc.LeaderElector$1.process WARN  org.apache.zookeeper.KeeperException$SessionExpiredException: KeeperErrorCode = Session expired for /collections/new_implicit_coll_0/leader_elect/a/election
   [junit4]   2> 	at org.apache.zookeeper.KeeperException.create(KeeperException.java:127)
   [junit4]   2> 	at org.apache.zookeeper.KeeperException.create(KeeperException.java:51)
   [junit4]   2> 	at org.apache.zookeeper.ZooKeeper.getChildren(ZooKeeper.java:1468)
   [junit4]   2> 	at org.apache.solr.common.cloud.SolrZkClient$6.execute(SolrZkClient.java:235)
   [junit4]   2> 	at org.apache.solr.common.cloud.SolrZkClient$6.execute(SolrZkClient.java:232)
   [junit4]   2> 	at org.apache.solr.common.cloud.ZkCmdExecutor.retryOperation(ZkCmdExecutor.java:65)
   [junit4]   2> 	at org.apache.solr.common.cloud.SolrZkClient.getChildren(SolrZkClient.java:232)
   [junit4]   2> 	at org.apache.solr.cloud.LeaderElector.checkIfIamLeader(LeaderElector.java:84)
   [junit4]   2> 	at org.apache.solr.cloud.LeaderElector.access$000(LeaderElector.java:55)
   [junit4]   2> 	at org.apache.solr.cloud.LeaderElector$1.process(LeaderElector.java:129)
   [junit4]   2> 	at org.apache.zookeeper.ClientCnxn$EventThread.processEvent(ClientCnxn.java:519)
   [junit4]   2> 	at org.apache.zookeeper.ClientCnxn$EventThread.run(ClientCnxn.java:495)
   [junit4]   2> 
   [junit4]   2> 722460 T2095 oasc.LeaderElector$1.process WARN  org.apache.zookeeper.KeeperException$SessionExpiredException: KeeperErrorCode = Session expired for /collections/new_implicit_coll_0/leader_elect/c/election
   [junit4]   2> 	at org.apache.zookeeper.KeeperException.create(KeeperException.java:127)
   [junit4]   2> 	at org.apache.zookeeper.KeeperException.create(KeeperException.java:51)
   [junit4]   2> 	at org.apache.zookeeper.ZooKeeper.getChildren(ZooKeeper.java:1468)
   [junit4]   2> 	at org.apache.solr.common.cloud.SolrZkClient$6.execute(SolrZkClient.java:235)
   [junit4]   2> 	at org.apache.solr.common.cloud.SolrZkClient$6.execute(SolrZkClient.java:232)
   [junit4]   2> 	at org.apache.solr.common.cloud.ZkCmdExecutor.retryOperation(ZkCmdExecutor.java:65)
   [junit4]   2> 	at org.apache.solr.common.cloud.SolrZkClient.getChildren(SolrZkClient.java:232)
   [junit4]   2> 	at org.apache.solr.cloud.LeaderElector.checkIfIamLeader(LeaderElector.java:84)
   [junit4]   2> 	at org.apache.solr.cloud.LeaderElector.access$000(LeaderElector.java:55)
   [junit4]   2> 	at org.apache.solr.cloud.LeaderElector$1.process(LeaderElector.java:129)
   [junit4]   2> 	at org.apache.zookeeper.ClientCnxn$EventThread.processEvent(ClientCnxn.java:519)
   [junit4]   2> 	at org.apache.zookeeper.ClientCnxn$EventThread.run(ClientCnxn.java:495)
   [junit4]   2> 
   [junit4]   2> 722460 T2095 oasc.LeaderElector$1.process WARN  org.apache.zookeeper.KeeperException$SessionExpiredException: KeeperErrorCode = Session expired for /collections/new_implicit_coll_1/leader_elect/d/election
   [junit4]   2> 	at org.apache.zookeeper.KeeperException.create(KeeperException.java:127)
   [junit4]   2> 	at org.apache.zookeeper.KeeperException.create(KeeperException.java:51)
   [junit4]   2> 	at org.apache.zookeeper.ZooKeeper.getChildren(ZooKeeper.java:1468)
   [junit4]   2> 	at org.apache.solr.common.cloud.SolrZkClient$6.execute(SolrZkClient.java:235)
   [junit4]   2> 	at org.apache.solr.common.cloud.SolrZkClient$6.execute(SolrZkClient.java:232)
   [junit4]   2> 	at org.apache.solr.common.cloud.ZkCmdExecutor.retryOperation(ZkCmdExecutor.java:65)
   [junit4]   2> 	at org.apache.solr.common.cloud.SolrZkClient.getChildren(SolrZkClient.java:232)
   [junit4]   2> 	at org.apache.solr.cloud.LeaderElector.checkIfIamLeader(LeaderElector.java:84)
   [junit4]   2> 	at org.apache.solr.cloud.LeaderElector.access$000(LeaderElector.java:55)
   [junit4]   2> 	at org.apache.solr.cloud.LeaderElector$1.process(LeaderElector.java:129)
   [junit4]   2> 	at org.apache.zookeeper.ClientCnxn$EventThread.processEvent(ClientCnxn.java:519)
   [junit4]   2> 	at org.apache.zookeeper.ClientCnxn$EventThread.run(ClientCnxn.java:495)
   [junit4]   2> 
   [junit4]   2> NOTE: test params are: codec=Lucene42: {timestamp=Lucene41(blocksize=128), range_facet_l=Lucene41(blocksize=128), id=PostingsFormat(name=NestedPulsing), range_facet_sl=PostingsFormat(name=MockSep), a_t=Lucene41(blocksize=128), text=PostingsFormat(name=MockSep), range_facet_si=MockVariableIntBlock(baseBlockSize=15), _version_=Lucene41(blocksize=128), other_tl1=Lucene41(blocksize=128), multiDefault=MockVariableIntBlock(baseBlockSize=15), a_si=MockVariableIntBlock(baseBlockSize=15), intDefault=Lucene41(blocksize=128)}, docValues:{}, sim=DefaultSimilarity, locale=fr_BE, timezone=Europe/Helsinki
   [junit4]   2> NOTE: Linux 3.2.0-51-generic amd64/Sun Microsystems Inc. 1.6.0_45 (64-bit)/cpus=8,threads=6,free=39403576,total=241037312
   [junit4]   2> NOTE: All tests run in this JVM: [TestIndexSearcher, FullSolrCloudDistribCmdsTest, TestPartialUpdateDeduplication, TestStressLucene, ChaosMonkeySafeLeaderTest, TestAtomicUpdateErrorCases, QueryResultKeyTest, TestDynamicFieldResource, PreAnalyzedUpdateProcessorTest, ClusterStateTest, TestClassNameShortening, DeleteShardTest, TestMergePolicyConfig, SuggesterTSTTest, TestAnalyzedSuggestions, TestFieldCollectionResource, ZkSolrClientTest, HdfsCollectionsAPIDistributedZkTest, DateMathParserTest, TestNumberUtils, TestRecovery, TestMultiCoreConfBootstrap, TestQuerySenderNoQuery, TestCloudManagedSchema, CoreContainerCoreInitFailuresTest, TestSolr4Spatial, FieldAnalysisRequestHandlerTest, TestCoreDiscovery, TestRangeQuery, TestLuceneMatchVersion, SolrCoreCheckLockOnStartupTest, TestWordDelimiterFilterFactory, TestRTGBase, TestFiltering, ShardRoutingCustomTest, TestComponentsName, HdfsRecoveryZkTest, TestOmitPositions, TestElisionMultitermQuery, OpenExchangeRatesOrgProviderTest, TestCSVResponseWriter, XsltUpdateRequestHandlerTest, TestSchemaResource, NotRequiredUniqueKeyTest, TestQueryTypes, TestCollationKeyRangeQueries, SolrIndexConfigTest, LeaderElectionIntegrationTest, TestPropInject, TestUpdate, TimeZoneUtilsTest, DirectUpdateHandlerTest, UniqFieldsUpdateProcessorFactoryTest, SuggesterWFSTTest, PathHierarchyTokenizerFactoryTest, ConvertedLegacyTest, DOMUtilTest, NumericFieldsTest, IndexBasedSpellCheckerTest, BasicZkTest, PingRequestHandlerTest, CopyFieldTest, SignatureUpdateProcessorFactoryTest, HighlighterConfigTest, TestDistributedSearch, BasicDistributedZk2Test, TestPostingsSolrHighlighter, SampleTest, TestSolrXMLSerializer, TestBinaryResponseWriter, TestSolrJ, TestCodecSupport, TestDistributedGrouping, TestArbitraryIndexDir, RequiredFieldsTest, TestJmxMonitoredMap, CollectionsAPIDistributedZkTest]
   [junit4] Completed on J1 in 111.96s, 1 test, 1 error <<< FAILURES!

[...truncated 503 lines...]
BUILD FAILED
/mnt/ssd/jenkins/workspace/Lucene-Solr-4.x-Linux/build.xml:395: The following error occurred while executing this line:
/mnt/ssd/jenkins/workspace/Lucene-Solr-4.x-Linux/build.xml:375: The following error occurred while executing this line:
/mnt/ssd/jenkins/workspace/Lucene-Solr-4.x-Linux/build.xml:39: The following error occurred while executing this line:
/mnt/ssd/jenkins/workspace/Lucene-Solr-4.x-Linux/solr/build.xml:181: The following error occurred while executing this line:
/mnt/ssd/jenkins/workspace/Lucene-Solr-4.x-Linux/solr/common-build.xml:449: The following error occurred while executing this line:
/mnt/ssd/jenkins/workspace/Lucene-Solr-4.x-Linux/lucene/common-build.xml:1233: The following error occurred while executing this line:
/mnt/ssd/jenkins/workspace/Lucene-Solr-4.x-Linux/lucene/common-build.xml:876: There were test failures: 321 suites, 1350 tests, 1 error, 34 ignored (6 assumptions)

Total time: 43 minutes 26 seconds
Build step 'Invoke Ant' marked build as failure
Description set: Java: 64bit/jdk1.6.0_45 -XX:-UseCompressedOops -XX:+UseSerialGC
Archiving artifacts
Recording test results
Email was triggered for: Failure
Sending email for trigger: Failure



Mime
View raw message