lucene-dev mailing list archives

Site index · List index
Message view « Date » · « Thread »
Top « Date » · « Thread »
From Apache Jenkins Server <jenk...@builds.apache.org>
Subject [JENKINS] Lucene-Solr-NightlyTests-4.x - Build # 332 - Still Failing
Date Thu, 01 Aug 2013 20:29:19 GMT
Build: https://builds.apache.org/job/Lucene-Solr-NightlyTests-4.x/332/

1 tests failed.
FAILED:  org.apache.solr.cloud.CollectionsAPIDistributedZkTest.testDistribSearch

Error Message:
IOException occured when talking to server at: http://127.0.0.1:17640/bv

Stack Trace:
org.apache.solr.client.solrj.SolrServerException: IOException occured when talking to server at: http://127.0.0.1:17640/bv
	at __randomizedtesting.SeedInfo.seed([C5252122A4103CD6:44C3AF3AD34F5CEA]:0)
	at org.apache.solr.client.solrj.impl.HttpSolrServer.request(HttpSolrServer.java:435)
	at org.apache.solr.client.solrj.impl.HttpSolrServer.request(HttpSolrServer.java:180)
	at org.apache.solr.cloud.AbstractFullDistribZkTestBase.createCollection(AbstractFullDistribZkTestBase.java:1535)
	at org.apache.solr.cloud.CollectionsAPIDistributedZkTest.testCustomCollectionsAPI(CollectionsAPIDistributedZkTest.java:677)
	at org.apache.solr.cloud.CollectionsAPIDistributedZkTest.doTest(CollectionsAPIDistributedZkTest.java:159)
	at org.apache.solr.BaseDistributedSearchTestCase.testDistribSearch(BaseDistributedSearchTestCase.java:835)
	at sun.reflect.NativeMethodAccessorImpl.invoke0(Native Method)
	at sun.reflect.NativeMethodAccessorImpl.invoke(NativeMethodAccessorImpl.java:57)
	at sun.reflect.DelegatingMethodAccessorImpl.invoke(DelegatingMethodAccessorImpl.java:43)
	at java.lang.reflect.Method.invoke(Method.java:616)
	at com.carrotsearch.randomizedtesting.RandomizedRunner.invoke(RandomizedRunner.java:1559)
	at com.carrotsearch.randomizedtesting.RandomizedRunner.access$600(RandomizedRunner.java:79)
	at com.carrotsearch.randomizedtesting.RandomizedRunner$6.evaluate(RandomizedRunner.java:737)
	at com.carrotsearch.randomizedtesting.RandomizedRunner$7.evaluate(RandomizedRunner.java:773)
	at com.carrotsearch.randomizedtesting.RandomizedRunner$8.evaluate(RandomizedRunner.java:787)
	at com.carrotsearch.randomizedtesting.rules.SystemPropertiesRestoreRule$1.evaluate(SystemPropertiesRestoreRule.java:53)
	at org.apache.lucene.util.TestRuleSetupTeardownChained$1.evaluate(TestRuleSetupTeardownChained.java:50)
	at org.apache.lucene.util.TestRuleFieldCacheSanity$1.evaluate(TestRuleFieldCacheSanity.java:51)
	at org.apache.lucene.util.AbstractBeforeAfterRule$1.evaluate(AbstractBeforeAfterRule.java:46)
	at com.carrotsearch.randomizedtesting.rules.SystemPropertiesInvariantRule$1.evaluate(SystemPropertiesInvariantRule.java:55)
	at org.apache.lucene.util.TestRuleThreadAndTestName$1.evaluate(TestRuleThreadAndTestName.java:49)
	at org.apache.lucene.util.TestRuleIgnoreAfterMaxFailures$1.evaluate(TestRuleIgnoreAfterMaxFailures.java:70)
	at org.apache.lucene.util.TestRuleMarkFailure$1.evaluate(TestRuleMarkFailure.java:48)
	at com.carrotsearch.randomizedtesting.rules.StatementAdapter.evaluate(StatementAdapter.java:36)
	at com.carrotsearch.randomizedtesting.ThreadLeakControl$StatementRunner.run(ThreadLeakControl.java:358)
	at com.carrotsearch.randomizedtesting.ThreadLeakControl.forkTimeoutingTask(ThreadLeakControl.java:782)
	at com.carrotsearch.randomizedtesting.ThreadLeakControl$3.evaluate(ThreadLeakControl.java:442)
	at com.carrotsearch.randomizedtesting.RandomizedRunner.runSingleTest(RandomizedRunner.java:746)
	at com.carrotsearch.randomizedtesting.RandomizedRunner$3.evaluate(RandomizedRunner.java:648)
	at com.carrotsearch.randomizedtesting.RandomizedRunner$4.evaluate(RandomizedRunner.java:682)
	at com.carrotsearch.randomizedtesting.RandomizedRunner$5.evaluate(RandomizedRunner.java:693)
	at com.carrotsearch.randomizedtesting.rules.StatementAdapter.evaluate(StatementAdapter.java:36)
	at com.carrotsearch.randomizedtesting.rules.SystemPropertiesRestoreRule$1.evaluate(SystemPropertiesRestoreRule.java:53)
	at org.apache.lucene.util.AbstractBeforeAfterRule$1.evaluate(AbstractBeforeAfterRule.java:46)
	at org.apache.lucene.util.TestRuleStoreClassName$1.evaluate(TestRuleStoreClassName.java:42)
	at com.carrotsearch.randomizedtesting.rules.SystemPropertiesInvariantRule$1.evaluate(SystemPropertiesInvariantRule.java:55)
	at com.carrotsearch.randomizedtesting.rules.NoShadowingOrOverridesOnMethodsRule$1.evaluate(NoShadowingOrOverridesOnMethodsRule.java:39)
	at com.carrotsearch.randomizedtesting.rules.NoShadowingOrOverridesOnMethodsRule$1.evaluate(NoShadowingOrOverridesOnMethodsRule.java:39)
	at com.carrotsearch.randomizedtesting.rules.StatementAdapter.evaluate(StatementAdapter.java:36)
	at org.apache.lucene.util.TestRuleAssertionsRequired$1.evaluate(TestRuleAssertionsRequired.java:43)
	at org.apache.lucene.util.TestRuleMarkFailure$1.evaluate(TestRuleMarkFailure.java:48)
	at org.apache.lucene.util.TestRuleIgnoreAfterMaxFailures$1.evaluate(TestRuleIgnoreAfterMaxFailures.java:70)
	at org.apache.lucene.util.TestRuleIgnoreTestSuites$1.evaluate(TestRuleIgnoreTestSuites.java:55)
	at com.carrotsearch.randomizedtesting.rules.StatementAdapter.evaluate(StatementAdapter.java:36)
	at com.carrotsearch.randomizedtesting.ThreadLeakControl$StatementRunner.run(ThreadLeakControl.java:358)
	at java.lang.Thread.run(Thread.java:679)
Caused by: org.apache.http.conn.ConnectTimeoutException: Connect to 127.0.0.1:17640 timed out
	at org.apache.http.conn.scheme.PlainSocketFactory.connectSocket(PlainSocketFactory.java:129)
	at org.apache.http.impl.conn.DefaultClientConnectionOperator.openConnection(DefaultClientConnectionOperator.java:180)
	at org.apache.http.impl.conn.ManagedClientConnectionImpl.open(ManagedClientConnectionImpl.java:294)
	at org.apache.http.impl.client.DefaultRequestDirector.tryConnect(DefaultRequestDirector.java:645)
	at org.apache.http.impl.client.DefaultRequestDirector.execute(DefaultRequestDirector.java:480)
	at org.apache.http.impl.client.AbstractHttpClient.execute(AbstractHttpClient.java:906)
	at org.apache.http.impl.client.AbstractHttpClient.execute(AbstractHttpClient.java:805)
	at org.apache.http.impl.client.AbstractHttpClient.execute(AbstractHttpClient.java:784)
	at org.apache.solr.client.solrj.impl.HttpSolrServer.request(HttpSolrServer.java:365)
	... 45 more




Build Log:
[...truncated 9149 lines...]
   [junit4] Suite: org.apache.solr.cloud.CollectionsAPIDistributedZkTest
   [junit4]   2> 1144712 T2300 oas.BaseDistributedSearchTestCase.initHostContext Setting hostContext system property: /bv/
   [junit4]   2> 1144716 T2300 oas.SolrTestCaseJ4.setUp ###Starting testDistribSearch
   [junit4]   2> Creating dataDir: /usr/home/hudson/hudson-slave/workspace/Lucene-Solr-NightlyTests-4.x/solr/build/solr-core/test/J1/./solrtest-CollectionsAPIDistributedZkTest-1375386931161
   [junit4]   2> 1144718 T2300 oasc.ZkTestServer.run STARTING ZK TEST SERVER
   [junit4]   2> 1144718 T2301 oasc.ZkTestServer$ZKServerMain.runFromConfig Starting server
   [junit4]   2> 1144819 T2300 oasc.ZkTestServer.run start zk server on port:17630
   [junit4]   2> 1144820 T2300 oascc.ConnectionManager.waitForConnected Waiting for client to connect to ZooKeeper
   [junit4]   2> 1144825 T2307 oascc.ConnectionManager.process Watcher org.apache.solr.common.cloud.ConnectionManager@6eee44aa name:ZooKeeperConnection Watcher:127.0.0.1:17630 got event WatchedEvent state:SyncConnected type:None path:null path:null type:None
   [junit4]   2> 1144825 T2300 oascc.ConnectionManager.waitForConnected Client is connected to ZooKeeper
   [junit4]   2> 1144825 T2300 oascc.SolrZkClient.makePath makePath: /solr
   [junit4]   2> 1144842 T2300 oascc.ConnectionManager.waitForConnected Waiting for client to connect to ZooKeeper
   [junit4]   2> 1144844 T2309 oascc.ConnectionManager.process Watcher org.apache.solr.common.cloud.ConnectionManager@29ba2299 name:ZooKeeperConnection Watcher:127.0.0.1:17630/solr got event WatchedEvent state:SyncConnected type:None path:null path:null type:None
   [junit4]   2> 1144844 T2300 oascc.ConnectionManager.waitForConnected Client is connected to ZooKeeper
   [junit4]   2> 1144844 T2300 oascc.SolrZkClient.makePath makePath: /collections/collection1
   [junit4]   2> 1144849 T2300 oascc.SolrZkClient.makePath makePath: /collections/collection1/shards
   [junit4]   2> 1144856 T2300 oascc.SolrZkClient.makePath makePath: /collections/control_collection
   [junit4]   2> 1144863 T2300 oascc.SolrZkClient.makePath makePath: /collections/control_collection/shards
   [junit4]   2> 1144865 T2300 oasc.AbstractZkTestCase.putConfig put /usr/home/hudson/hudson-slave/workspace/Lucene-Solr-NightlyTests-4.x/solr/build/solr-core/test-files/solr/collection1/conf/solrconfig-tlog.xml to /configs/conf1/solrconfig.xml
   [junit4]   2> 1144865 T2300 oascc.SolrZkClient.makePath makePath: /configs/conf1/solrconfig.xml
   [junit4]   2> 1144878 T2300 oasc.AbstractZkTestCase.putConfig put /usr/home/hudson/hudson-slave/workspace/Lucene-Solr-NightlyTests-4.x/solr/build/solr-core/test-files/solr/collection1/conf/schema.xml to /configs/conf1/schema.xml
   [junit4]   2> 1144879 T2300 oascc.SolrZkClient.makePath makePath: /configs/conf1/schema.xml
   [junit4]   2> 1144982 T2300 oasc.AbstractZkTestCase.putConfig put /usr/home/hudson/hudson-slave/workspace/Lucene-Solr-NightlyTests-4.x/solr/build/solr-core/test-files/solr/collection1/conf/stopwords.txt to /configs/conf1/stopwords.txt
   [junit4]   2> 1144983 T2300 oascc.SolrZkClient.makePath makePath: /configs/conf1/stopwords.txt
   [junit4]   2> 1144986 T2300 oasc.AbstractZkTestCase.putConfig put /usr/home/hudson/hudson-slave/workspace/Lucene-Solr-NightlyTests-4.x/solr/build/solr-core/test-files/solr/collection1/conf/protwords.txt to /configs/conf1/protwords.txt
   [junit4]   2> 1144986 T2300 oascc.SolrZkClient.makePath makePath: /configs/conf1/protwords.txt
   [junit4]   2> 1144997 T2300 oasc.AbstractZkTestCase.putConfig put /usr/home/hudson/hudson-slave/workspace/Lucene-Solr-NightlyTests-4.x/solr/build/solr-core/test-files/solr/collection1/conf/currency.xml to /configs/conf1/currency.xml
   [junit4]   2> 1144998 T2300 oascc.SolrZkClient.makePath makePath: /configs/conf1/currency.xml
   [junit4]   2> 1145000 T2300 oasc.AbstractZkTestCase.putConfig put /usr/home/hudson/hudson-slave/workspace/Lucene-Solr-NightlyTests-4.x/solr/build/solr-core/test-files/solr/collection1/conf/open-exchange-rates.json to /configs/conf1/open-exchange-rates.json
   [junit4]   2> 1145001 T2300 oascc.SolrZkClient.makePath makePath: /configs/conf1/open-exchange-rates.json
   [junit4]   2> 1145004 T2300 oasc.AbstractZkTestCase.putConfig put /usr/home/hudson/hudson-slave/workspace/Lucene-Solr-NightlyTests-4.x/solr/build/solr-core/test-files/solr/collection1/conf/mapping-ISOLatin1Accent.txt to /configs/conf1/mapping-ISOLatin1Accent.txt
   [junit4]   2> 1145004 T2300 oascc.SolrZkClient.makePath makePath: /configs/conf1/mapping-ISOLatin1Accent.txt
   [junit4]   2> 1145012 T2300 oasc.AbstractZkTestCase.putConfig put /usr/home/hudson/hudson-slave/workspace/Lucene-Solr-NightlyTests-4.x/solr/build/solr-core/test-files/solr/collection1/conf/old_synonyms.txt to /configs/conf1/old_synonyms.txt
   [junit4]   2> 1145012 T2300 oascc.SolrZkClient.makePath makePath: /configs/conf1/old_synonyms.txt
   [junit4]   2> 1145015 T2300 oasc.AbstractZkTestCase.putConfig put /usr/home/hudson/hudson-slave/workspace/Lucene-Solr-NightlyTests-4.x/solr/build/solr-core/test-files/solr/collection1/conf/synonyms.txt to /configs/conf1/synonyms.txt
   [junit4]   2> 1145015 T2300 oascc.SolrZkClient.makePath makePath: /configs/conf1/synonyms.txt
   [junit4]   2> 1145222 T2300 oejs.Server.doStart jetty-8.1.10.v20130312
   [junit4]   2> 1145225 T2300 oejs.AbstractConnector.doStart Started SocketConnector@127.0.0.1:17633
   [junit4]   2> 1145226 T2300 oass.SolrDispatchFilter.init SolrDispatchFilter.init()
   [junit4]   2> 1145226 T2300 oasc.SolrResourceLoader.locateSolrHome JNDI not configured for solr (NoInitialContextEx)
   [junit4]   2> 1145227 T2300 oasc.SolrResourceLoader.locateSolrHome using system property solr.solr.home: /usr/home/hudson/hudson-slave/workspace/Lucene-Solr-NightlyTests-4.x/solr/build/solr-core/test/J1/./org.apache.solr.cloud.CollectionsAPIDistributedZkTest-controljetty-1375386931470
   [junit4]   2> 1145227 T2300 oasc.SolrResourceLoader.<init> new SolrResourceLoader for directory: '/usr/home/hudson/hudson-slave/workspace/Lucene-Solr-NightlyTests-4.x/solr/build/solr-core/test/J1/./org.apache.solr.cloud.CollectionsAPIDistributedZkTest-controljetty-1375386931470/'
   [junit4]   2> 1145257 T2300 oasc.ConfigSolr.fromFile Loading container configuration from /usr/home/hudson/hudson-slave/workspace/Lucene-Solr-NightlyTests-4.x/solr/build/solr-core/test/J1/./org.apache.solr.cloud.CollectionsAPIDistributedZkTest-controljetty-1375386931470/solr.xml
   [junit4]   2> 1145344 T2300 oasc.ConfigSolrXml.<init> Config-defined core root directory: 
   [junit4]   2> 1145346 T2300 oasc.CoreContainer.<init> New CoreContainer 872313087
   [junit4]   2> 1145346 T2300 oasc.CoreContainer.load Loading cores into CoreContainer [instanceDir=/usr/home/hudson/hudson-slave/workspace/Lucene-Solr-NightlyTests-4.x/solr/build/solr-core/test/J1/./org.apache.solr.cloud.CollectionsAPIDistributedZkTest-controljetty-1375386931470/]
   [junit4]   2> 1145348 T2300 oashc.HttpShardHandlerFactory.getParameter Setting socketTimeout to: 120000
   [junit4]   2> 1145349 T2300 oashc.HttpShardHandlerFactory.getParameter Setting urlScheme to: http://
   [junit4]   2> 1145349 T2300 oashc.HttpShardHandlerFactory.getParameter Setting connTimeout to: 15000
   [junit4]   2> 1145350 T2300 oashc.HttpShardHandlerFactory.getParameter Setting maxConnectionsPerHost to: 20
   [junit4]   2> 1145350 T2300 oashc.HttpShardHandlerFactory.getParameter Setting corePoolSize to: 0
   [junit4]   2> 1145351 T2300 oashc.HttpShardHandlerFactory.getParameter Setting maximumPoolSize to: 2147483647
   [junit4]   2> 1145351 T2300 oashc.HttpShardHandlerFactory.getParameter Setting maxThreadIdleTime to: 5
   [junit4]   2> 1145352 T2300 oashc.HttpShardHandlerFactory.getParameter Setting sizeOfQueue to: -1
   [junit4]   2> 1145352 T2300 oashc.HttpShardHandlerFactory.getParameter Setting fairnessPolicy to: false
   [junit4]   2> 1145353 T2300 oascsi.HttpClientUtil.createClient Creating new http client, config:maxConnectionsPerHost=20&maxConnections=10000&socketTimeout=120000&connTimeout=15000&retry=false
   [junit4]   2> 1145371 T2300 oasc.ZkContainer.initZooKeeper Zookeeper client=127.0.0.1:17630/solr
   [junit4]   2> 1145371 T2300 oasc.ZkController.checkChrootPath zkHost includes chroot
   [junit4]   2> 1145372 T2300 oascc.ConnectionManager.waitForConnected Waiting for client to connect to ZooKeeper
   [junit4]   2> 1145375 T2320 oascc.ConnectionManager.process Watcher org.apache.solr.common.cloud.ConnectionManager@5ac9004 name:ZooKeeperConnection Watcher:127.0.0.1:17630 got event WatchedEvent state:SyncConnected type:None path:null path:null type:None
   [junit4]   2> 1145376 T2300 oascc.ConnectionManager.waitForConnected Client is connected to ZooKeeper
   [junit4]   2> 1145388 T2300 oascsi.HttpClientUtil.createClient Creating new http client, config:maxConnections=500&maxConnectionsPerHost=16&socketTimeout=120000&connTimeout=15000
   [junit4]   2> 1145400 T2300 oascc.ConnectionManager.waitForConnected Waiting for client to connect to ZooKeeper
   [junit4]   2> 1145402 T2322 oascc.ConnectionManager.process Watcher org.apache.solr.common.cloud.ConnectionManager@736cc760 name:ZooKeeperConnection Watcher:127.0.0.1:17630/solr got event WatchedEvent state:SyncConnected type:None path:null path:null type:None
   [junit4]   2> 1145402 T2300 oascc.ConnectionManager.waitForConnected Client is connected to ZooKeeper
   [junit4]   2> 1145409 T2300 oascc.SolrZkClient.makePath makePath: /overseer/queue
   [junit4]   2> 1145414 T2300 oascc.SolrZkClient.makePath makePath: /overseer/collection-queue-work
   [junit4]   2> 1145424 T2300 oascc.SolrZkClient.makePath makePath: /live_nodes
   [junit4]   2> 1145426 T2300 oasc.ZkController.createEphemeralLiveNode Register node as live in ZooKeeper:/live_nodes/127.0.0.1:17633_bv
   [junit4]   2> 1145428 T2300 oascc.SolrZkClient.makePath makePath: /live_nodes/127.0.0.1:17633_bv
   [junit4]   2> 1145438 T2300 oascc.SolrZkClient.makePath makePath: /overseer_elect/election
   [junit4]   2> 1145450 T2300 oascc.SolrZkClient.makePath makePath: /overseer_elect/leader
   [junit4]   2> 1145459 T2300 oasc.Overseer.start Overseer (id=90137357920894979-127.0.0.1:17633_bv-n_0000000000) starting
   [junit4]   2> 1145469 T2300 oascc.SolrZkClient.makePath makePath: /overseer/queue-work
   [junit4]   2> 1145481 T2324 oasc.OverseerCollectionProcessor.run Process current queue of collection creations
   [junit4]   2> 1145481 T2300 oascc.SolrZkClient.makePath makePath: /clusterstate.json
   [junit4]   2> 1145484 T2300 oascc.SolrZkClient.makePath makePath: /aliases.json
   [junit4]   2> 1145487 T2300 oascc.ZkStateReader.createClusterStateWatchersAndUpdate Updating cluster state from ZooKeeper... 
   [junit4]   2> 1145490 T2323 oasc.Overseer$ClusterStateUpdater.run Starting to work on the main queue
   [junit4]   2> 1145492 T2300 oasc.CorePropertiesLocator.discover Looking for core definitions underneath /usr/home/hudson/hudson-slave/workspace/Lucene-Solr-NightlyTests-4.x/solr/build/solr-core/test/J1/./org.apache.solr.cloud.CollectionsAPIDistributedZkTest-controljetty-1375386931470
   [junit4]   2> 1145495 T2300 oasc.CorePropertiesLocator.discoverUnder Found core conf in /usr/home/hudson/hudson-slave/workspace/Lucene-Solr-NightlyTests-4.x/solr/build/solr-core/test/J1/./org.apache.solr.cloud.CollectionsAPIDistributedZkTest-controljetty-1375386931470/conf/
   [junit4]   2> 1145661 T2300 oasc.CorePropertiesLocator.discover Found 1 core definitions
   [junit4]   2> 1145662 T2300 oass.SolrDispatchFilter.init user.dir=/usr/home/hudson/hudson-slave/workspace/Lucene-Solr-NightlyTests-4.x/solr/build/solr-core/test/J1
   [junit4]   2> 1145662 T2300 oass.SolrDispatchFilter.init SolrDispatchFilter.init() done
   [junit4]   2> 1145663 T2300 oascsi.HttpClientUtil.createClient Creating new http client, config:maxConnections=128&maxConnectionsPerHost=32&followRedirects=false
   [junit4]   2> 1145680 T2300 oascsi.HttpClientUtil.createClient Creating new http client, config:
   [junit4]   2> 1145681 T2300 oascc.ConnectionManager.waitForConnected Waiting for client to connect to ZooKeeper
   [junit4]   2> 1145688 T2327 oascc.ConnectionManager.process Watcher org.apache.solr.common.cloud.ConnectionManager@6fc0e02 name:ZooKeeperConnection Watcher:127.0.0.1:17630/solr got event WatchedEvent state:SyncConnected type:None path:null path:null type:None
   [junit4]   2> 1145688 T2300 oascc.ConnectionManager.waitForConnected Client is connected to ZooKeeper
   [junit4]   2> 1145690 T2300 oascc.ZkStateReader.createClusterStateWatchersAndUpdate Updating cluster state from ZooKeeper... 
   [junit4]   2> 1145692 T2300 oasc.ChaosMonkey.monkeyLog monkey: init - expire sessions:true cause connection loss:true
   [junit4]   2> 1145980 T2300 oejs.Server.doStart jetty-8.1.10.v20130312
   [junit4]   2> 1145983 T2300 oejs.AbstractConnector.doStart Started SocketConnector@127.0.0.1:17637
   [junit4]   2> 1145984 T2300 oass.SolrDispatchFilter.init SolrDispatchFilter.init()
   [junit4]   2> 1145984 T2300 oasc.SolrResourceLoader.locateSolrHome JNDI not configured for solr (NoInitialContextEx)
   [junit4]   2> 1145985 T2300 oasc.SolrResourceLoader.locateSolrHome using system property solr.solr.home: /usr/home/hudson/hudson-slave/workspace/Lucene-Solr-NightlyTests-4.x/solr/build/solr-core/test/J1/./org.apache.solr.cloud.CollectionsAPIDistributedZkTest-jetty1-1375386932137
   [junit4]   2> 1145985 T2300 oasc.SolrResourceLoader.<init> new SolrResourceLoader for directory: '/usr/home/hudson/hudson-slave/workspace/Lucene-Solr-NightlyTests-4.x/solr/build/solr-core/test/J1/./org.apache.solr.cloud.CollectionsAPIDistributedZkTest-jetty1-1375386932137/'
   [junit4]   2> 1146025 T2300 oasc.ConfigSolr.fromFile Loading container configuration from /usr/home/hudson/hudson-slave/workspace/Lucene-Solr-NightlyTests-4.x/solr/build/solr-core/test/J1/./org.apache.solr.cloud.CollectionsAPIDistributedZkTest-jetty1-1375386932137/solr.xml
   [junit4]   2> 1146101 T2300 oasc.ConfigSolrXml.<init> Config-defined core root directory: 
   [junit4]   2> 1146102 T2300 oasc.CoreContainer.<init> New CoreContainer 1354454610
   [junit4]   2> 1146103 T2300 oasc.CoreContainer.load Loading cores into CoreContainer [instanceDir=/usr/home/hudson/hudson-slave/workspace/Lucene-Solr-NightlyTests-4.x/solr/build/solr-core/test/J1/./org.apache.solr.cloud.CollectionsAPIDistributedZkTest-jetty1-1375386932137/]
   [junit4]   2> 1146104 T2300 oashc.HttpShardHandlerFactory.getParameter Setting socketTimeout to: 120000
   [junit4]   2> 1146105 T2300 oashc.HttpShardHandlerFactory.getParameter Setting urlScheme to: http://
   [junit4]   2> 1146105 T2300 oashc.HttpShardHandlerFactory.getParameter Setting connTimeout to: 15000
   [junit4]   2> 1146106 T2300 oashc.HttpShardHandlerFactory.getParameter Setting maxConnectionsPerHost to: 20
   [junit4]   2> 1146106 T2300 oashc.HttpShardHandlerFactory.getParameter Setting corePoolSize to: 0
   [junit4]   2> 1146107 T2300 oashc.HttpShardHandlerFactory.getParameter Setting maximumPoolSize to: 2147483647
   [junit4]   2> 1146107 T2300 oashc.HttpShardHandlerFactory.getParameter Setting maxThreadIdleTime to: 5
   [junit4]   2> 1146107 T2300 oashc.HttpShardHandlerFactory.getParameter Setting sizeOfQueue to: -1
   [junit4]   2> 1146108 T2300 oashc.HttpShardHandlerFactory.getParameter Setting fairnessPolicy to: false
   [junit4]   2> 1146108 T2300 oascsi.HttpClientUtil.createClient Creating new http client, config:maxConnectionsPerHost=20&maxConnections=10000&socketTimeout=120000&connTimeout=15000&retry=false
   [junit4]   2> 1146124 T2300 oasc.ZkContainer.initZooKeeper Zookeeper client=127.0.0.1:17630/solr
   [junit4]   2> 1146124 T2300 oasc.ZkController.checkChrootPath zkHost includes chroot
   [junit4]   2> 1146125 T2300 oascc.ConnectionManager.waitForConnected Waiting for client to connect to ZooKeeper
   [junit4]   2> 1146128 T2338 oascc.ConnectionManager.process Watcher org.apache.solr.common.cloud.ConnectionManager@3b204ae6 name:ZooKeeperConnection Watcher:127.0.0.1:17630 got event WatchedEvent state:SyncConnected type:None path:null path:null type:None
   [junit4]   2> 1146129 T2300 oascc.ConnectionManager.waitForConnected Client is connected to ZooKeeper
   [junit4]   2> 1146143 T2300 oascsi.HttpClientUtil.createClient Creating new http client, config:maxConnections=500&maxConnectionsPerHost=16&socketTimeout=120000&connTimeout=15000
   [junit4]   2> 1146153 T2300 oascc.ConnectionManager.waitForConnected Waiting for client to connect to ZooKeeper
   [junit4]   2> 1146155 T2340 oascc.ConnectionManager.process Watcher org.apache.solr.common.cloud.ConnectionManager@3d9cddd6 name:ZooKeeperConnection Watcher:127.0.0.1:17630/solr got event WatchedEvent state:SyncConnected type:None path:null path:null type:None
   [junit4]   2> 1146156 T2300 oascc.ConnectionManager.waitForConnected Client is connected to ZooKeeper
   [junit4]   2> 1146165 T2300 oascc.ZkStateReader.createClusterStateWatchersAndUpdate Updating cluster state from ZooKeeper... 
   [junit4]   2> 1147169 T2300 oasc.ZkController.createEphemeralLiveNode Register node as live in ZooKeeper:/live_nodes/127.0.0.1:17637_bv
   [junit4]   2> 1147172 T2300 oascc.SolrZkClient.makePath makePath: /live_nodes/127.0.0.1:17637_bv
   [junit4]   2> 1147176 T2327 oascc.ZkStateReader$3.process Updating live nodes... (2)
   [junit4]   2> 1147177 T2340 oascc.ZkStateReader$3.process Updating live nodes... (2)
   [junit4]   2> 1147177 T2322 oascc.ZkStateReader$3.process Updating live nodes... (2)
   [junit4]   2> 1147214 T2300 oasc.CorePropertiesLocator.discover Looking for core definitions underneath /usr/home/hudson/hudson-slave/workspace/Lucene-Solr-NightlyTests-4.x/solr/build/solr-core/test/J1/./org.apache.solr.cloud.CollectionsAPIDistributedZkTest-jetty1-1375386932137
   [junit4]   2> 1147405 T2300 oasc.CorePropertiesLocator.discoverUnder Found core conf in /usr/home/hudson/hudson-slave/workspace/Lucene-Solr-NightlyTests-4.x/solr/build/solr-core/test/J1/./org.apache.solr.cloud.CollectionsAPIDistributedZkTest-jetty1-1375386932137/conf/
   [junit4]   2> 1147409 T2300 oasc.CorePropertiesLocator.discover Found 1 core definitions
   [junit4]   2> 1147410 T2300 oass.SolrDispatchFilter.init user.dir=/usr/home/hudson/hudson-slave/workspace/Lucene-Solr-NightlyTests-4.x/solr/build/solr-core/test/J1
   [junit4]   2> 1147410 T2300 oass.SolrDispatchFilter.init SolrDispatchFilter.init() done
   [junit4]   2> 1147411 T2300 oascsi.HttpClientUtil.createClient Creating new http client, config:maxConnections=128&maxConnectionsPerHost=32&followRedirects=false
   [junit4]   2> 1147735 T2300 oejs.Server.doStart jetty-8.1.10.v20130312
   [junit4]   2> 1147738 T2300 oejs.AbstractConnector.doStart Started SocketConnector@127.0.0.1:17640
   [junit4]   2> 1147739 T2300 oass.SolrDispatchFilter.init SolrDispatchFilter.init()
   [junit4]   2> 1147740 T2300 oasc.SolrResourceLoader.locateSolrHome JNDI not configured for solr (NoInitialContextEx)
   [junit4]   2> 1147740 T2300 oasc.SolrResourceLoader.locateSolrHome using system property solr.solr.home: /usr/home/hudson/hudson-slave/workspace/Lucene-Solr-NightlyTests-4.x/solr/build/solr-core/test/J1/./org.apache.solr.cloud.CollectionsAPIDistributedZkTest-jetty2-1375386933871
   [junit4]   2> 1147741 T2300 oasc.SolrResourceLoader.<init> new SolrResourceLoader for directory: '/usr/home/hudson/hudson-slave/workspace/Lucene-Solr-NightlyTests-4.x/solr/build/solr-core/test/J1/./org.apache.solr.cloud.CollectionsAPIDistributedZkTest-jetty2-1375386933871/'
   [junit4]   2> 1147775 T2300 oasc.ConfigSolr.fromFile Loading container configuration from /usr/home/hudson/hudson-slave/workspace/Lucene-Solr-NightlyTests-4.x/solr/build/solr-core/test/J1/./org.apache.solr.cloud.CollectionsAPIDistributedZkTest-jetty2-1375386933871/solr.xml
   [junit4]   2> 1147831 T2300 oasc.ConfigSolrXml.<init> Config-defined core root directory: 
   [junit4]   2> 1147832 T2300 oasc.CoreContainer.<init> New CoreContainer 363953301
   [junit4]   2> 1147832 T2300 oasc.CoreContainer.load Loading cores into CoreContainer [instanceDir=/usr/home/hudson/hudson-slave/workspace/Lucene-Solr-NightlyTests-4.x/solr/build/solr-core/test/J1/./org.apache.solr.cloud.CollectionsAPIDistributedZkTest-jetty2-1375386933871/]
   [junit4]   2> 1147834 T2300 oashc.HttpShardHandlerFactory.getParameter Setting socketTimeout to: 120000
   [junit4]   2> 1147834 T2300 oashc.HttpShardHandlerFactory.getParameter Setting urlScheme to: http://
   [junit4]   2> 1147834 T2300 oashc.HttpShardHandlerFactory.getParameter Setting connTimeout to: 15000
   [junit4]   2> 1147835 T2300 oashc.HttpShardHandlerFactory.getParameter Setting maxConnectionsPerHost to: 20
   [junit4]   2> 1147835 T2300 oashc.HttpShardHandlerFactory.getParameter Setting corePoolSize to: 0
   [junit4]   2> 1147835 T2300 oashc.HttpShardHandlerFactory.getParameter Setting maximumPoolSize to: 2147483647
   [junit4]   2> 1147835 T2300 oashc.HttpShardHandlerFactory.getParameter Setting maxThreadIdleTime to: 5
   [junit4]   2> 1147836 T2300 oashc.HttpShardHandlerFactory.getParameter Setting sizeOfQueue to: -1
   [junit4]   2> 1147836 T2300 oashc.HttpShardHandlerFactory.getParameter Setting fairnessPolicy to: false
   [junit4]   2> 1147836 T2300 oascsi.HttpClientUtil.createClient Creating new http client, config:maxConnectionsPerHost=20&maxConnections=10000&socketTimeout=120000&connTimeout=15000&retry=false
   [junit4]   2> 1147847 T2300 oasc.ZkContainer.initZooKeeper Zookeeper client=127.0.0.1:17630/solr
   [junit4]   2> 1147848 T2300 oasc.ZkController.checkChrootPath zkHost includes chroot
   [junit4]   2> 1147849 T2300 oascc.ConnectionManager.waitForConnected Waiting for client to connect to ZooKeeper
   [junit4]   2> 1147948 T2352 oascc.ConnectionManager.process Watcher org.apache.solr.common.cloud.ConnectionManager@376a2553 name:ZooKeeperConnection Watcher:127.0.0.1:17630 got event WatchedEvent state:SyncConnected type:None path:null path:null type:None
   [junit4]   2> 1147949 T2300 oascc.ConnectionManager.waitForConnected Client is connected to ZooKeeper
   [junit4]   2> 1147951 T2300 oascsi.HttpClientUtil.createClient Creating new http client, config:maxConnections=500&maxConnectionsPerHost=16&socketTimeout=120000&connTimeout=15000
   [junit4]   2> 1147959 T2300 oascc.ConnectionManager.waitForConnected Waiting for client to connect to ZooKeeper
   [junit4]   2> 1147960 T2354 oascc.ConnectionManager.process Watcher org.apache.solr.common.cloud.ConnectionManager@6646967c name:ZooKeeperConnection Watcher:127.0.0.1:17630/solr got event WatchedEvent state:SyncConnected type:None path:null path:null type:None
   [junit4]   2> 1147960 T2300 oascc.ConnectionManager.waitForConnected Client is connected to ZooKeeper
   [junit4]   2> 1147976 T2300 oascc.ZkStateReader.createClusterStateWatchersAndUpdate Updating cluster state from ZooKeeper... 
   [junit4]   2> 1148979 T2300 oasc.ZkController.createEphemeralLiveNode Register node as live in ZooKeeper:/live_nodes/127.0.0.1:17640_bv
   [junit4]   2> 1148981 T2300 oascc.SolrZkClient.makePath makePath: /live_nodes/127.0.0.1:17640_bv
   [junit4]   2> 1148985 T2327 oascc.ZkStateReader$3.process Updating live nodes... (3)
   [junit4]   2> 1148985 T2322 oascc.ZkStateReader$3.process Updating live nodes... (3)
   [junit4]   2> 1148985 T2354 oascc.ZkStateReader$3.process Updating live nodes... (3)
   [junit4]   2> 1148985 T2340 oascc.ZkStateReader$3.process Updating live nodes... (3)
   [junit4]   2> 1148998 T2300 oasc.CorePropertiesLocator.discover Looking for core definitions underneath /usr/home/hudson/hudson-slave/workspace/Lucene-Solr-NightlyTests-4.x/solr/build/solr-core/test/J1/./org.apache.solr.cloud.CollectionsAPIDistributedZkTest-jetty2-1375386933871
   [junit4]   2> 1149000 T2300 oasc.CorePropertiesLocator.discoverUnder Found core conf in /usr/home/hudson/hudson-slave/workspace/Lucene-Solr-NightlyTests-4.x/solr/build/solr-core/test/J1/./org.apache.solr.cloud.CollectionsAPIDistributedZkTest-jetty2-1375386933871/conf/
   [junit4]   2> 1149209 T2300 oasc.CorePropertiesLocator.discover Found 1 core definitions
   [junit4]   2> 1149210 T2300 oass.SolrDispatchFilter.init user.dir=/usr/home/hudson/hudson-slave/workspace/Lucene-Solr-NightlyTests-4.x/solr/build/solr-core/test/J1
   [junit4]   2> 1149211 T2300 oass.SolrDispatchFilter.init SolrDispatchFilter.init() done
   [junit4]   2> 1149212 T2300 oascsi.HttpClientUtil.createClient Creating new http client, config:maxConnections=128&maxConnectionsPerHost=32&followRedirects=false
   [junit4]   2> 1149538 T2300 oejs.Server.doStart jetty-8.1.10.v20130312
   [junit4]   2> 1149541 T2300 oejs.AbstractConnector.doStart Started SocketConnector@127.0.0.1:17643
   [junit4]   2> 1149542 T2300 oass.SolrDispatchFilter.init SolrDispatchFilter.init()
   [junit4]   2> 1149543 T2300 oasc.SolrResourceLoader.locateSolrHome JNDI not configured for solr (NoInitialContextEx)
   [junit4]   2> 1149543 T2300 oasc.SolrResourceLoader.locateSolrHome using system property solr.solr.home: /usr/home/hudson/hudson-slave/workspace/Lucene-Solr-NightlyTests-4.x/solr/build/solr-core/test/J1/./org.apache.solr.cloud.CollectionsAPIDistributedZkTest-jetty3-1375386935674
   [junit4]   2> 1149544 T2300 oasc.SolrResourceLoader.<init> new SolrResourceLoader for directory: '/usr/home/hudson/hudson-slave/workspace/Lucene-Solr-NightlyTests-4.x/solr/build/solr-core/test/J1/./org.apache.solr.cloud.CollectionsAPIDistributedZkTest-jetty3-1375386935674/'
   [junit4]   2> 1149589 T2300 oasc.ConfigSolr.fromFile Loading container configuration from /usr/home/hudson/hudson-slave/workspace/Lucene-Solr-NightlyTests-4.x/solr/build/solr-core/test/J1/./org.apache.solr.cloud.CollectionsAPIDistributedZkTest-jetty3-1375386935674/solr.xml
   [junit4]   2> 1149670 T2300 oasc.ConfigSolrXml.<init> Config-defined core root directory: 
   [junit4]   2> 1149671 T2300 oasc.CoreContainer.<init> New CoreContainer 463046409
   [junit4]   2> 1149671 T2300 oasc.CoreContainer.load Loading cores into CoreContainer [instanceDir=/usr/home/hudson/hudson-slave/workspace/Lucene-Solr-NightlyTests-4.x/solr/build/solr-core/test/J1/./org.apache.solr.cloud.CollectionsAPIDistributedZkTest-jetty3-1375386935674/]
   [junit4]   2> 1149673 T2300 oashc.HttpShardHandlerFactory.getParameter Setting socketTimeout to: 120000
   [junit4]   2> 1149674 T2300 oashc.HttpShardHandlerFactory.getParameter Setting urlScheme to: http://
   [junit4]   2> 1149674 T2300 oashc.HttpShardHandlerFactory.getParameter Setting connTimeout to: 15000
   [junit4]   2> 1149675 T2300 oashc.HttpShardHandlerFactory.getParameter Setting maxConnectionsPerHost to: 20
   [junit4]   2> 1149675 T2300 oashc.HttpShardHandlerFactory.getParameter Setting corePoolSize to: 0
   [junit4]   2> 1149676 T2300 oashc.HttpShardHandlerFactory.getParameter Setting maximumPoolSize to: 2147483647
   [junit4]   2> 1149676 T2300 oashc.HttpShardHandlerFactory.getParameter Setting maxThreadIdleTime to: 5
   [junit4]   2> 1149677 T2300 oashc.HttpShardHandlerFactory.getParameter Setting sizeOfQueue to: -1
   [junit4]   2> 1149677 T2300 oashc.HttpShardHandlerFactory.getParameter Setting fairnessPolicy to: false
   [junit4]   2> 1149678 T2300 oascsi.HttpClientUtil.createClient Creating new http client, config:maxConnectionsPerHost=20&maxConnections=10000&socketTimeout=120000&connTimeout=15000&retry=false
   [junit4]   2> 1149696 T2300 oasc.ZkContainer.initZooKeeper Zookeeper client=127.0.0.1:17630/solr
   [junit4]   2> 1149696 T2300 oasc.ZkController.checkChrootPath zkHost includes chroot
   [junit4]   2> 1149698 T2300 oascc.ConnectionManager.waitForConnected Waiting for client to connect to ZooKeeper
   [junit4]   2> 1149726 T2366 oascc.ConnectionManager.process Watcher org.apache.solr.common.cloud.ConnectionManager@7c706e06 name:ZooKeeperConnection Watcher:127.0.0.1:17630 got event WatchedEvent state:SyncConnected type:None path:null path:null type:None
   [junit4]   2> 1149727 T2300 oascc.ConnectionManager.waitForConnected Client is connected to ZooKeeper
   [junit4]   2> 1149729 T2300 oascsi.HttpClientUtil.createClient Creating new http client, config:maxConnections=500&maxConnectionsPerHost=16&socketTimeout=120000&connTimeout=15000
   [junit4]   2> 1149741 T2300 oascc.ConnectionManager.waitForConnected Waiting for client to connect to ZooKeeper
   [junit4]   2> 1149743 T2368 oascc.ConnectionManager.process Watcher org.apache.solr.common.cloud.ConnectionManager@10359b5d name:ZooKeeperConnection Watcher:127.0.0.1:17630/solr got event WatchedEvent state:SyncConnected type:None path:null path:null type:None
   [junit4]   2> 1149743 T2300 oascc.ConnectionManager.waitForConnected Client is connected to ZooKeeper
   [junit4]   2> 1149755 T2300 oascc.ZkStateReader.createClusterStateWatchersAndUpdate Updating cluster state from ZooKeeper... 
   [junit4]   2> 1150759 T2300 oasc.ZkController.createEphemeralLiveNode Register node as live in ZooKeeper:/live_nodes/127.0.0.1:17643_bv
   [junit4]   2> 1150762 T2300 oascc.SolrZkClient.makePath makePath: /live_nodes/127.0.0.1:17643_bv
   [junit4]   2> 1150766 T2340 oascc.ZkStateReader$3.process Updating live nodes... (4)
   [junit4]   2> 1150766 T2327 oascc.ZkStateReader$3.process Updating live nodes... (4)
   [junit4]   2> 1150766 T2354 oascc.ZkStateReader$3.process Updating live nodes... (4)
   [junit4]   2> 1150766 T2368 oascc.ZkStateReader$3.process Updating live nodes... (4)
   [junit4]   2> 1150766 T2322 oascc.ZkStateReader$3.process Updating live nodes... (4)
   [junit4]   2> 1150779 T2300 oasc.CorePropertiesLocator.discover Looking for core definitions underneath /usr/home/hudson/hudson-slave/workspace/Lucene-Solr-NightlyTests-4.x/solr/build/solr-core/test/J1/./org.apache.solr.cloud.CollectionsAPIDistributedZkTest-jetty3-1375386935674
   [junit4]   2> 1150977 T2300 oasc.CorePropertiesLocator.discoverUnder Found core conf in /usr/home/hudson/hudson-slave/workspace/Lucene-Solr-NightlyTests-4.x/solr/build/solr-core/test/J1/./org.apache.solr.cloud.CollectionsAPIDistributedZkTest-jetty3-1375386935674/conf/
   [junit4]   2> 1150980 T2300 oasc.CorePropertiesLocator.discover Found 1 core definitions
   [junit4]   2> 1150980 T2300 oass.SolrDispatchFilter.init user.dir=/usr/home/hudson/hudson-slave/workspace/Lucene-Solr-NightlyTests-4.x/solr/build/solr-core/test/J1
   [junit4]   2> 1150981 T2300 oass.SolrDispatchFilter.init SolrDispatchFilter.init() done
   [junit4]   2> 1150982 T2300 oascsi.HttpClientUtil.createClient Creating new http client, config:maxConnections=128&maxConnectionsPerHost=32&followRedirects=false
   [junit4]   2> 1151297 T2300 oejs.Server.doStart jetty-8.1.10.v20130312
   [junit4]   2> 1151300 T2300 oejs.AbstractConnector.doStart Started SocketConnector@127.0.0.1:17646
   [junit4]   2> 1151300 T2300 oass.SolrDispatchFilter.init SolrDispatchFilter.init()
   [junit4]   2> 1151301 T2300 oasc.SolrResourceLoader.locateSolrHome JNDI not configured for solr (NoInitialContextEx)
   [junit4]   2> 1151301 T2300 oasc.SolrResourceLoader.locateSolrHome using system property solr.solr.home: /usr/home/hudson/hudson-slave/workspace/Lucene-Solr-NightlyTests-4.x/solr/build/solr-core/test/J1/./org.apache.solr.cloud.CollectionsAPIDistributedZkTest-jetty4-1375386937443
   [junit4]   2> 1151302 T2300 oasc.SolrResourceLoader.<init> new SolrResourceLoader for directory: '/usr/home/hudson/hudson-slave/workspace/Lucene-Solr-NightlyTests-4.x/solr/build/solr-core/test/J1/./org.apache.solr.cloud.CollectionsAPIDistributedZkTest-jetty4-1375386937443/'
   [junit4]   2> 1151344 T2300 oasc.ConfigSolr.fromFile Loading container configuration from /usr/home/hudson/hudson-slave/workspace/Lucene-Solr-NightlyTests-4.x/solr/build/solr-core/test/J1/./org.apache.solr.cloud.CollectionsAPIDistributedZkTest-jetty4-1375386937443/solr.xml
   [junit4]   2> 1151422 T2300 oasc.ConfigSolrXml.<init> Config-defined core root directory: 
   [junit4]   2> 1151423 T2300 oasc.CoreContainer.<init> New CoreContainer 257463547
   [junit4]   2> 1151423 T2300 oasc.CoreContainer.load Loading cores into CoreContainer [instanceDir=/usr/home/hudson/hudson-slave/workspace/Lucene-Solr-NightlyTests-4.x/solr/build/solr-core/test/J1/./org.apache.solr.cloud.CollectionsAPIDistributedZkTest-jetty4-1375386937443/]
   [junit4]   2> 1151425 T2300 oashc.HttpShardHandlerFactory.getParameter Setting socketTimeout to: 120000
   [junit4]   2> 1151425 T2300 oashc.HttpShardHandlerFactory.getParameter Setting urlScheme to: http://
   [junit4]   2> 1151426 T2300 oashc.HttpShardHandlerFactory.getParameter Setting connTimeout to: 15000
   [junit4]   2> 1151426 T2300 oashc.HttpShardHandlerFactory.getParameter Setting maxConnectionsPerHost to: 20
   [junit4]   2> 1151427 T2300 oashc.HttpShardHandlerFactory.getParameter Setting corePoolSize to: 0
   [junit4]   2> 1151427 T2300 oashc.HttpShardHandlerFactory.getParameter Setting maximumPoolSize to: 2147483647
   [junit4]   2> 1151428 T2300 oashc.HttpShardHandlerFactory.getParameter Setting maxThreadIdleTime to: 5
   [junit4]   2> 1151428 T2300 oashc.HttpShardHandlerFactory.getParameter Setting sizeOfQueue to: -1
   [junit4]   2> 1151428 T2300 oashc.HttpShardHandlerFactory.getParameter Setting fairnessPolicy to: false
   [junit4]   2> 1151429 T2300 oascsi.HttpClientUtil.createClient Creating new http client, config:maxConnectionsPerHost=20&maxConnections=10000&socketTimeout=120000&connTimeout=15000&retry=false
   [junit4]   2> 1151444 T2300 oasc.ZkContainer.initZooKeeper Zookeeper client=127.0.0.1:17630/solr
   [junit4]   2> 1151445 T2300 oasc.ZkController.checkChrootPath zkHost includes chroot
   [junit4]   2> 1151446 T2300 oascc.ConnectionManager.waitForConnected Waiting for client to connect to ZooKeeper
   [junit4]   2> 1151474 T2380 oascc.ConnectionManager.process Watcher org.apache.solr.common.cloud.ConnectionManager@9cf29c name:ZooKeeperConnection Watcher:127.0.0.1:17630 got event WatchedEvent state:SyncConnected type:None path:null path:null type:None
   [junit4]   2> 1151474 T2300 oascc.ConnectionManager.waitForConnected Client is connected to ZooKeeper
   [junit4]   2> 1151477 T2300 oascsi.HttpClientUtil.createClient Creating new http client, config:maxConnections=500&maxConnectionsPerHost=16&socketTimeout=120000&connTimeout=15000
   [junit4]   2> 1151486 T2300 oascc.ConnectionManager.waitForConnected Waiting for client to connect to ZooKeeper
   [junit4]   2> 1151488 T2382 oascc.ConnectionManager.process Watcher org.apache.solr.common.cloud.ConnectionManager@17ef0ec7 name:ZooKeeperConnection Watcher:127.0.0.1:17630/solr got event WatchedEvent state:SyncConnected type:None path:null path:null type:None
   [junit4]   2> 1151488 T2300 oascc.ConnectionManager.waitForConnected Client is connected to ZooKeeper
   [junit4]   2> 1151500 T2300 oascc.ZkStateReader.createClusterStateWatchersAndUpdate Updating cluster state from ZooKeeper... 
   [junit4]   2> 1152503 T2300 oasc.ZkController.createEphemeralLiveNode Register node as live in ZooKeeper:/live_nodes/127.0.0.1:17646_bv
   [junit4]   2> 1152506 T2300 oascc.SolrZkClient.makePath makePath: /live_nodes/127.0.0.1:17646_bv
   [junit4]   2> 1152510 T2340 oascc.ZkStateReader$3.process Updating live nodes... (5)
   [junit4]   2> 1152510 T2322 oascc.ZkStateReader$3.process Updating live nodes... (5)
   [junit4]   2> 1152510 T2368 oascc.ZkStateReader$3.process Updating live nodes... (5)
   [junit4]   2> 1152510 T2354 oascc.ZkStateReader$3.process Updating live nodes... (5)
   [junit4]   2> 1152510 T2327 oascc.ZkStateReader$3.process Updating live nodes... (5)
   [junit4]   2> 1152510 T2382 oascc.ZkStateReader$3.process Updating live nodes... (5)
   [junit4]   2> 1152525 T2300 oasc.CorePropertiesLocator.discover Looking for core definitions underneath /usr/home/hudson/hudson-slave/workspace/Lucene-Solr-NightlyTests-4.x/solr/build/solr-core/test/J1/./org.apache.solr.cloud.CollectionsAPIDistributedZkTest-jetty4-1375386937443
   [junit4]   2> 1152674 T2300 oasc.CorePropertiesLocator.discoverUnder Found core conf in /usr/home/hudson/hudson-slave/workspace/Lucene-Solr-NightlyTests-4.x/solr/build/solr-core/test/J1/./org.apache.solr.cloud.CollectionsAPIDistributedZkTest-jetty4-1375386937443/conf/
   [junit4]   2> 1152675 T2300 oasc.CorePropertiesLocator.discover Found 1 core definitions
   [junit4]   2> 1152676 T2300 oass.SolrDispatchFilter.init user.dir=/usr/home/hudson/hudson-slave/workspace/Lucene-Solr-NightlyTests-4.x/solr/build/solr-core/test/J1
   [junit4]   2> 1152676 T2300 oass.SolrDispatchFilter.init SolrDispatchFilter.init() done
   [junit4]   2> 1152677 T2300 oascsi.HttpClientUtil.createClient Creating new http client, config:maxConnections=128&maxConnectionsPerHost=32&followRedirects=false
   [junit4]   2> 1152688 T2300 oascsi.HttpClientUtil.createClient Creating new http client, config:maxConnections=128&maxConnectionsPerHost=32&followRedirects=false
   [junit4]   2> 1152696 T2330 oasha.CollectionsHandler.handleCreateAction Creating Collection : numShards=2&name=nodes_used_collection&replicationFactor=2&action=CREATE&wt=javabin&version=2
   [junit4]   2> 1152724 T2322 oasc.DistributedQueue$LatchChildWatcher.process Watcher fired on path: /overseer/collection-queue-work state: SyncConnected type NodeChildrenChanged
   [junit4]   2> 1152726 T2324 oasc.OverseerCollectionProcessor.run Overseer Collection Processor: Get the message id:/overseer/collection-queue-work/qn-0000000000 message:{
   [junit4]   2> 	  "operation":"createcollection",
   [junit4]   2> 	  "numShards":"2",
   [junit4]   2> 	  "name":"nodes_used_collection",
   [junit4]   2> 	  "replicationFactor":"2"}
   [junit4]   2> 1152726 T2324 oasc.OverseerCollectionProcessor.processMessage WARN OverseerCollectionProcessor.processMessage : createcollection , {
   [junit4]   2> 	  "operation":"createcollection",
   [junit4]   2> 	  "numShards":"2",
   [junit4]   2> 	  "name":"nodes_used_collection",
   [junit4]   2> 	  "replicationFactor":"2"}
   [junit4]   2> 1153002 T2323 oascc.ZkStateReader.updateClusterState Updating cloud state from ZooKeeper... 
   [junit4]   2> 1153003 T2323 oasc.Overseer$ClusterStateUpdater.buildCollection building a new collection: nodes_used_collection
   [junit4]   2> 1153003 T2323 oasc.Overseer$ClusterStateUpdater.createCollection Create collection nodes_used_collection with shards [shard1, shard2]
   [junit4]   2> 1153016 T2368 oascc.ZkStateReader$2.process A cluster state change: WatchedEvent state:SyncConnected type:NodeDataChanged path:/clusterstate.json, has occurred - updating... (live nodes size: 5)
   [junit4]   2> 1153016 T2354 oascc.ZkStateReader$2.process A cluster state change: WatchedEvent state:SyncConnected type:NodeDataChanged path:/clusterstate.json, has occurred - updating... (live nodes size: 5)
   [junit4]   2> 1153016 T2327 oascc.ZkStateReader$2.process A cluster state change: WatchedEvent state:SyncConnected type:NodeDataChanged path:/clusterstate.json, has occurred - updating... (live nodes size: 5)
   [junit4]   2> 1153016 T2340 oascc.ZkStateReader$2.process A cluster state change: WatchedEvent state:SyncConnected type:NodeDataChanged path:/clusterstate.json, has occurred - updating... (live nodes size: 5)
   [junit4]   2> 1153016 T2382 oascc.ZkStateReader$2.process A cluster state change: WatchedEvent state:SyncConnected type:NodeDataChanged path:/clusterstate.json, has occurred - updating... (live nodes size: 5)
   [junit4]   2> 1153016 T2322 oascc.ZkStateReader$2.process A cluster state change: WatchedEvent state:SyncConnected type:NodeDataChanged path:/clusterstate.json, has occurred - updating... (live nodes size: 5)
   [junit4]   2> 1153044 T2324 oasc.OverseerCollectionProcessor.createCollection going to create cores replicas shardNames [shard1, shard2] , repFactor : 2
   [junit4]   2> 1153044 T2324 oasc.OverseerCollectionProcessor.createCollection Creating shard nodes_used_collection_shard1_replica1 as part of slice shard1 of collection nodes_used_collection on 127.0.0.1:17640_bv
   [junit4]   2> 1153044 T2324 oasc.OverseerCollectionProcessor.createCollection Creating shard nodes_used_collection_shard1_replica2 as part of slice shard1 of collection nodes_used_collection on 127.0.0.1:17637_bv
   [junit4]   2> 1153046 T2324 oasc.OverseerCollectionProcessor.createCollection Creating shard nodes_used_collection_shard2_replica1 as part of slice shard2 of collection nodes_used_collection on 127.0.0.1:17643_bv
   [junit4]   2> 1153046 T2324 oasc.OverseerCollectionProcessor.createCollection Creating shard nodes_used_collection_shard2_replica2 as part of slice shard2 of collection nodes_used_collection on 127.0.0.1:17633_bv
   [junit4]   2> 1153050 T2344 oasc.ZkController.publish publishing core=nodes_used_collection_shard1_replica1 state=down
   [junit4]   2> 1153050 T2358 oasc.ZkController.publish publishing core=nodes_used_collection_shard2_replica1 state=down
   [junit4]   2> 1153050 T2331 oasc.ZkController.publish publishing core=nodes_used_collection_shard1_replica2 state=down
   [junit4]   2> 1153050 T2312 oasc.ZkController.publish publishing core=nodes_used_collection_shard2_replica2 state=down
   [junit4]   2> 1153052 T2344 oasc.ZkController.waitForCoreNodeName look for our core node name
   [junit4]   2> 1153053 T2358 oasc.ZkController.waitForCoreNodeName look for our core node name
   [junit4]   2> 1153062 T2331 oasc.ZkController.waitForCoreNodeName look for our core node name
   [junit4]   2> 1153062 T2312 oasc.ZkController.waitForCoreNodeName look for our core node name
   [junit4]   2> 1154522 T2323 oascc.ZkStateReader.updateClusterState Updating cloud state from ZooKeeper... 
   [junit4]   2> 1154523 T2323 oasc.Overseer$ClusterStateUpdater.updateState WARN Could not find collection node for nodes_used_collection, skipping publish state
   [junit4]   2> 1154524 T2323 oasc.Overseer$ClusterStateUpdater.updateState Update state numShards=2 message={
   [junit4]   2> 	  "operation":"state",
   [junit4]   2> 	  "core_node_name":"core_node1",
   [junit4]   2> 	  "numShards":"2",
   [junit4]   2> 	  "shard":"shard1",
   [junit4]   2> 	  "roles":null,
   [junit4]   2> 	  "state":"down",
   [junit4]   2> 	  "shard_state":"active",
   [junit4]   2> 	  "core":"nodes_used_collection_shard1_replica1",
   [junit4]   2> 	  "collection":"nodes_used_collection",
   [junit4]   2> 	  "shard_range":null,
   [junit4]   2> 	  "node_name":"127.0.0.1:17640_bv",
   [junit4]   2> 	  "base_url":"http://127.0.0.1:17640/bv"}
   [junit4]   2> 1154530 T2323 oasc.Overseer$ClusterStateUpdater.updateState WARN Could not find collection node for nodes_used_collection, skipping publish state
   [junit4]   2> 1154530 T2323 oasc.Overseer$ClusterStateUpdater.updateState Update state numShards=2 message={
   [junit4]   2> 	  "operation":"state",
   [junit4]   2> 	  "core_node_name":"core_node2",
   [junit4]   2> 	  "numShards":"2",
   [junit4]   2> 	  "shard":"shard2",
   [junit4]   2> 	  "roles":null,
   [junit4]   2> 	  "state":"down",
   [junit4]   2> 	  "shard_state":"active",
   [junit4]   2> 	  "core":"nodes_used_collection_shard2_replica1",
   [junit4]   2> 	  "collection":"nodes_used_collection",
   [junit4]   2> 	  "shard_range":null,
   [junit4]   2> 	  "node_name":"127.0.0.1:17643_bv",
   [junit4]   2> 	  "base_url":"http://127.0.0.1:17643/bv"}
   [junit4]   2> 1154546 T2323 oasc.Overseer$ClusterStateUpdater.updateState WARN Could not find collection node for nodes_used_collection, skipping publish state
   [junit4]   2> 1154546 T2323 oasc.Overseer$ClusterStateUpdater.updateState Update state numShards=2 message={
   [junit4]   2> 	  "operation":"state",
   [junit4]   2> 	  "core_node_name":"core_node3",
   [junit4]   2> 	  "numShards":"2",
   [junit4]   2> 	  "shard":"shard1",
   [junit4]   2> 	  "roles":null,
   [junit4]   2> 	  "state":"down",
   [junit4]   2> 	  "shard_state":"active",
   [junit4]   2> 	  "core":"nodes_used_collection_shard1_replica2",
   [junit4]   2> 	  "collection":"nodes_used_collection",
   [junit4]   2> 	  "shard_range":null,
   [junit4]   2> 	  "node_name":"127.0.0.1:17637_bv",
   [junit4]   2> 	  "base_url":"http://127.0.0.1:17637/bv"}
   [junit4]   2> 1154556 T2323 oasc.Overseer$ClusterStateUpdater.updateState WARN Could not find collection node for nodes_used_collection, skipping publish state
   [junit4]   2> 1154556 T2323 oasc.Overseer$ClusterStateUpdater.updateState Update state numShards=2 message={
   [junit4]   2> 	  "operation":"state",
   [junit4]   2> 	  "core_node_name":"core_node4",
   [junit4]   2> 	  "numShards":"2",
   [junit4]   2> 	  "shard":"shard2",
   [junit4]   2> 	  "roles":null,
   [junit4]   2> 	  "state":"down",
   [junit4]   2> 	  "shard_state":"active",
   [junit4]   2> 	  "core":"nodes_used_collection_shard2_replica2",
   [junit4]   2> 	  "collection":"nodes_used_collection",
   [junit4]   2> 	  "shard_range":null,
   [junit4]   2> 	  "node_name":"127.0.0.1:17633_bv",
   [junit4]   2> 	  "base_url":"http://127.0.0.1:17633/bv"}
   [junit4]   2> 1154561 T2322 oascc.ZkStateReader$2.process A cluster state change: WatchedEvent state:SyncConnected type:NodeDataChanged path:/clusterstate.json, has occurred - updating... (live nodes size: 5)
   [junit4]   2> 1154561 T2354 oascc.ZkStateReader$2.process A cluster state change: WatchedEvent state:SyncConnected type:NodeDataChanged path:/clusterstate.json, has occurred - updating... (live nodes size: 5)
   [junit4]   2> 1154561 T2327 oascc.ZkStateReader$2.process A cluster state change: WatchedEvent state:SyncConnected type:NodeDataChanged path:/clusterstate.json, has occurred - updating... (live nodes size: 5)
   [junit4]   2> 1154561 T2382 oascc.ZkStateReader$2.process A cluster state change: WatchedEvent state:SyncConnected type:NodeDataChanged path:/clusterstate.json, has occurred - updating... (live nodes size: 5)
   [junit4]   2> 1154561 T2340 oascc.ZkStateReader$2.process A cluster state change: WatchedEvent state:SyncConnected type:NodeDataChanged path:/clusterstate.json, has occurred - updating... (live nodes size: 5)
   [junit4]   2> 1154561 T2368 oascc.ZkStateReader$2.process A cluster state change: WatchedEvent state:SyncConnected type:NodeDataChanged path:/clusterstate.json, has occurred - updating... (live nodes size: 5)
   [junit4]   2> 1155054 T2344 oasc.ZkController.waitForShardId waiting to find shard id in clusterstate for nodes_used_collection_shard1_replica1
   [junit4]   2> 1155055 T2358 oasc.ZkController.waitForShardId waiting to find shard id in clusterstate for nodes_used_collection_shard2_replica1
   [junit4]   2> 1155055 T2344 oasc.CorePropertiesLocator.writePropertiesFile ERROR Couldn't persist core properties to /usr/home/hudson/hudson-slave/workspace/Lucene-Solr-NightlyTests-4.x/solr/build/solr-core/test/J1/./org.apache.solr.cloud.CollectionsAPIDistributedZkTest-jetty2-1375386933871/nodes_used_collection_shard1_replica1/core.properties: java.io.FileNotFoundException: /usr/home/hudson/hudson-slave/workspace/Lucene-Solr-NightlyTests-4.x/solr/build/solr-core/test/J1/./org.apache.solr.cloud.CollectionsAPIDistributedZkTest-jetty2-1375386933871/nodes_used_collection_shard1_replica1/core.properties (No such file or directory)
   [junit4]   2> 1155057 T2358 oasc.CorePropertiesLocator.writePropertiesFile ERROR Couldn't persist core properties to /usr/home/hudson/hudson-slave/workspace/Lucene-Solr-NightlyTests-4.x/solr/build/solr-core/test/J1/./org.apache.solr.cloud.CollectionsAPIDistributedZkTest-jetty3-1375386935674/nodes_used_collection_shard2_replica1/core.properties: java.io.FileNotFoundException: /usr/home/hudson/hudson-slave/workspace/Lucene-Solr-NightlyTests-4.x/solr/build/solr-core/test/J1/./org.apache.solr.cloud.CollectionsAPIDistributedZkTest-jetty3-1375386935674/nodes_used_collection_shard2_replica1/core.properties (No such file or directory)
   [junit4]   2> 1155057 T2344 oasc.CoreContainer.create Creating SolrCore 'nodes_used_collection_shard1_replica1' using instanceDir: /usr/home/hudson/hudson-slave/workspace/Lucene-Solr-NightlyTests-4.x/solr/build/solr-core/test/J1/./org.apache.solr.cloud.CollectionsAPIDistributedZkTest-jetty2-1375386933871/nodes_used_collection_shard1_replica1
   [junit4]   2> 1155057 T2358 oasc.CoreContainer.create Creating SolrCore 'nodes_used_collection_shard2_replica1' using instanceDir: /usr/home/hudson/hudson-slave/workspace/Lucene-Solr-NightlyTests-4.x/solr/build/solr-core/test/J1/./org.apache.solr.cloud.CollectionsAPIDistributedZkTest-jetty3-1375386935674/nodes_used_collection_shard2_replica1
   [junit4]   2> 1155058 T2344 oasc.ZkController.createCollectionZkNode Check for collection zkNode:nodes_used_collection
   [junit4]   2> 1155058 T2358 oasc.ZkController.createCollectionZkNode Check for collection zkNode:nodes_used_collection
   [junit4]   2> 1155059 T2344 oasc.ZkController.createCollectionZkNode Creating collection in ZooKeeper:nodes_used_collection
   [junit4]   2> 1155059 T2358 oasc.ZkController.createCollectionZkNode Creating collection in ZooKeeper:nodes_used_collection
   [junit4]   2> 1155060 T2344 oasc.ZkController.getConfName Looking for collection configName
   [junit4]   2> 1155060 T2358 oasc.ZkController.getConfName Looking for collection configName
   [junit4]   2> 1155061 T2344 oasc.ZkController.getConfName Only one config set found in zk - using it:conf1
   [junit4]   2> 1155062 T2358 oasc.ZkController.getConfName Only one config set found in zk - using it:conf1
   [junit4]   2> 1155062 T2344 oascc.SolrZkClient.makePath makePath: /collections/nodes_used_collection
   [junit4]   2> 1155062 T2358 oascc.SolrZkClient.makePath makePath: /collections/nodes_used_collection
   [junit4]   2> 1155064 T2331 oasc.ZkController.waitForShardId waiting to find shard id in clusterstate for nodes_used_collection_shard1_replica2
   [junit4]   2> 1155065 T2312 oasc.ZkController.waitForShardId waiting to find shard id in clusterstate for nodes_used_collection_shard2_replica2
   [junit4]   2> 1155065 T2331 oasc.CorePropertiesLocator.writePropertiesFile ERROR Couldn't persist core properties to /usr/home/hudson/hudson-slave/workspace/Lucene-Solr-NightlyTests-4.x/solr/build/solr-core/test/J1/./org.apache.solr.cloud.CollectionsAPIDistributedZkTest-jetty1-1375386932137/nodes_used_collection_shard1_replica2/core.properties: java.io.FileNotFoundException: /usr/home/hudson/hudson-slave/workspace/Lucene-Solr-NightlyTests-4.x/solr/build/solr-core/test/J1/./org.apache.solr.cloud.CollectionsAPIDistributedZkTest-jetty1-1375386932137/nodes_used_collection_shard1_replica2/core.properties (No such file or directory)
   [junit4]   2> 1155065 T2358 oasc.ZkController.readConfigName Load collection config from:/collections/nodes_used_collection
   [junit4]   2> 1155066 T2312 oasc.CorePropertiesLocator.writePropertiesFile ERROR Couldn't persist core properties to /usr/home/hudson/hudson-slave/workspace/Lucene-Solr-NightlyTests-4.x/solr/build/solr-core/test/J1/./org.apache.solr.cloud.CollectionsAPIDistributedZkTest-controljetty-1375386931470/nodes_used_collection_shard2_replica2/core.properties: java.io.FileNotFoundException: /usr/home/hudson/hudson-slave/workspace/Lucene-Solr-NightlyTests-4.x/solr/build/solr-core/test/J1/./org.apache.solr.cloud.CollectionsAPIDistributedZkTest-controljetty-1375386931470/nodes_used_collection_shard2_replica2/core.properties (No such file or directory)
   [junit4]   2> 1155066 T2331 oasc.CoreContainer.create Creating SolrCore 'nodes_used_collection_shard1_replica2' using instanceDir: /usr/home/hudson/hudson-slave/workspace/Lucene-Solr-NightlyTests-4.x/solr/build/solr-core/test/J1/./org.apache.solr.cloud.CollectionsAPIDistributedZkTest-jetty1-1375386932137/nodes_used_collection_shard1_replica2
   [junit4]   2> 1155065 T2344 oasc.ZkController.readConfigName Load collection config from:/collections/nodes_used_collection
   [junit4]   2> 1155067 T2358 oasc.SolrResourceLoader.<init> new SolrResourceLoader for directory: '/usr/home/hudson/hudson-slave/workspace/Lucene-Solr-NightlyTests-4.x/solr/build/solr-core/test/J1/./org.apache.solr.cloud.CollectionsAPIDistributedZkTest-jetty3-1375386935674/nodes_used_collection_shard2_replica1/'
   [junit4]   2> 1155067 T2331 oasc.ZkController.createCollectionZkNode Check for collection zkNode:nodes_used_collection
   [junit4]   2> 1155066 T2312 oasc.CoreContainer.create Creating SolrCore 'nodes_used_collection_shard2_replica2' using instanceDir: /usr/home/hudson/hudson-slave/workspace/Lucene-Solr-NightlyTests-4.x/solr/build/solr-core/test/J1/./org.apache.solr.cloud.CollectionsAPIDistributedZkTest-controljetty-1375386931470/nodes_used_collection_shard2_replica2
   [junit4]   2> 1155068 T2344 oasc.SolrResourceLoader.<init> new SolrResourceLoader for directory: '/usr/home/hudson/hudson-slave/workspace/Lucene-Solr-NightlyTests-4.x/solr/build/solr-core/test/J1/./org.apache.solr.cloud.CollectionsAPIDistributedZkTest-jetty2-1375386933871/nodes_used_collection_shard1_replica1/'
   [junit4]   2> 1155068 T2331 oasc.ZkController.createCollectionZkNode Collection zkNode exists
   [junit4]   2> 1155069 T2331 oasc.ZkController.readConfigName Load collection config from:/collections/nodes_used_collection
   [junit4]   2> 1155068 T2312 oasc.ZkController.createCollectionZkNode Check for collection zkNode:nodes_used_collection
   [junit4]   2> 1155070 T2312 oasc.ZkController.createCollectionZkNode Collection zkNode exists
   [junit4]   2> 1155071 T2312 oasc.ZkController.readConfigName Load collection config from:/collections/nodes_used_collection
   [junit4]   2> 1155071 T2331 oasc.SolrResourceLoader.<init> new SolrResourceLoader for directory: '/usr/home/hudson/hudson-slave/workspace/Lucene-Solr-NightlyTests-4.x/solr/build/solr-core/test/J1/./org.apache.solr.cloud.CollectionsAPIDistributedZkTest-jetty1-1375386932137/nodes_used_collection_shard1_replica2/'
   [junit4]   2> 1155072 T2312 oasc.SolrResourceLoader.<init> new SolrResourceLoader for directory: '/usr/home/hudson/hudson-slave/workspace/Lucene-Solr-NightlyTests-4.x/solr/build/solr-core/test/J1/./org.apache.solr.cloud.CollectionsAPIDistributedZkTest-controljetty-1375386931470/nodes_used_collection_shard2_replica2/'
   [junit4]   2> 1155200 T2358 oasc.SolrConfig.<init> Using Lucene MatchVersion: LUCENE_45
   [junit4]   2> 1155200 T2344 oasc.SolrConfig.<init> Using Lucene MatchVersion: LUCENE_45
   [junit4]   2> 1155202 T2312 oasc.SolrConfig.<init> Using Lucene MatchVersion: LUCENE_45
   [junit4]   2> 1155202 T2331 oasc.SolrConfig.<init> Using Lucene MatchVersion: LUCENE_45
   [junit4]   2> 1155278 T2358 oasc.SolrConfig.<init> Loaded SolrConfig: solrconfig.xml
   [junit4]   2> 1155278 T2344 oasc.SolrConfig.<init> Loaded SolrConfig: solrconfig.xml
   [junit4]   2> 1155279 T2312 oasc.SolrConfig.<init> Loaded SolrConfig: solrconfig.xml
   [junit4]   2> 1155280 T2331 oasc.SolrConfig.<init> Loaded SolrConfig: solrconfig.xml
   [junit4]   2> 1155380 T2344 oass.IndexSchema.readSchema Reading Solr Schema from schema.xml
   [junit4]   2> 1155380 T2358 oass.IndexSchema.readSchema Reading Solr Schema from schema.xml
   [junit4]   2> 1155381 T2312 oass.IndexSchema.readSchema Reading Solr Schema from schema.xml
   [junit4]   2> 1155381 T2331 oass.IndexSchema.readSchema Reading Solr Schema from schema.xml
   [junit4]   2> 1155394 T2312 oass.IndexSchema.readSchema [nodes_used_collection_shard2_replica2] Schema name=test
   [junit4]   2> 1155395 T2358 oass.IndexSchema.readSchema [nodes_used_collection_shard2_replica1] Schema name=test
   [junit4]   2> 1155395 T2344 oass.IndexSchema.readSchema [nodes_used_collection_shard1_replica1] Schema name=test
   [junit4]   2> 1155395 T2331 oass.IndexSchema.readSchema [nodes_used_collection_shard1_replica2] Schema name=test
   [junit4]   2> 1156209 T2331 oass.ByteField.init WARN ByteField is deprecated and will be removed in 5.0. You should use TrieIntField instead.
   [junit4]   2> 1156209 T2331 oass.ShortField.init WARN ShortField is deprecated and will be removed in 5.0. You should use TrieIntField instead.
   [junit4]   2> 1156211 T2331 oass.OpenExchangeRatesOrgProvider.init Initialized with rates=open-exchange-rates.json, refreshInterval=1440.
   [junit4]   2> 1156214 T2358 oass.ByteField.init WARN ByteField is deprecated and will be removed in 5.0. You should use TrieIntField instead.
   [junit4]   2> 1156215 T2358 oass.ShortField.init WARN ShortField is deprecated and will be removed in 5.0. You should use TrieIntField instead.
   [junit4]   2> 1156216 T2358 oass.OpenExchangeRatesOrgProvider.init Initialized with rates=open-exchange-rates.json, refreshInterval=1440.
   [junit4]   2> 1156217 T2312 oass.ByteField.init WARN ByteField is deprecated and will be removed in 5.0. You should use TrieIntField instead.
   [junit4]   2> 1156218 T2312 oass.ShortField.init WARN ShortField is deprecated and will be removed in 5.0. You should use TrieIntField instead.
   [junit4]   2> 1156231 T2312 oass.OpenExchangeRatesOrgProvider.init Initialized with rates=open-exchange-rates.json, refreshInterval=1440.
   [junit4]   2> 1156234 T2344 oass.ByteField.init WARN ByteField is deprecated and will be removed in 5.0. You should use TrieIntField instead.
   [junit4]   2> 1156234 T2331 oass.IndexSchema.readSchema default search field in schema is text
   [junit4]   2> 1156235 T2344 oass.ShortField.init WARN ShortField is deprecated and will be removed in 5.0. You should use TrieIntField instead.
   [junit4]   2> 1156236 T2358 oass.IndexSchema.readSchema default search field in schema is text
   [junit4]   2> 1156236 T2344 oass.OpenExchangeRatesOrgProvider.init Initialized with rates=open-exchange-rates.json, refreshInterval=1440.
   [junit4]   2> 1156240 T2331 oass.IndexSchema.readSchema unique key field: id
   [junit4]   2> 1156241 T2358 oass.IndexSchema.readSchema unique key field: id
   [junit4]   2> 1156242 T2312 oass.IndexSchema.readSchema default search field in schema is text
   [junit4]   2> 1156247 T2344 oass.IndexSchema.readSchema default search field in schema is text
   [junit4]   2> 1156248 T2312 oass.IndexSchema.readSchema unique key field: id
   [junit4]   2> 1156252 T2344 oass.IndexSchema.readSchema unique key field: id
   [junit4]   2> 1156259 T2331 oass.FileExchangeRateProvider.reload Reloading exchange rates from file currency.xml
   [junit4]   2> 1156259 T2358 oass.FileExchangeRateProvider.reload Reloading exchange rates from file currency.xml
   [junit4]   2> 1156265 T2331 oass.FileExchangeRateProvider.reload Reloading exchange rates from file currency.xml
   [junit4]   2> 1156266 T2358 oass.FileExchangeRateProvider.reload Reloading exchange rates from file currency.xml
   [junit4]   2> 1156265 T2312 oass.FileExchangeRateProvider.reload Reloading exchange rates from file currency.xml
   [junit4]   2> 1156270 T2344 oass.FileExchangeRateProvider.reload Reloading exchange rates from file currency.xml
   [junit4]   2> 1156271 T2331 oass.OpenExchangeRatesOrgProvider.reload Reloading exchange rates from open-exchange-rates.json
   [junit4]   2> 1156272 T2358 oass.OpenExchangeRatesOrgProvider.reload Reloading exchange rates from open-exchange-rates.json
   [junit4]   2> 1156273 T2331 oass.OpenExchangeRatesOrgProvider$OpenExchangeRates.<init> WARN Unknown key IMPORTANT NOTE
   [junit4]   2> 1156273 T2331 oass.OpenExchangeRatesOrgProvider$OpenExchangeRates.<init> WARN Expected key, got STRING
   [junit4]   2> 1156273 T2312 oass.FileExchangeRateProvider.reload Reloading exchange rates from file currency.xml
   [junit4]   2> 1156274 T2358 oass.OpenExchangeRatesOrgProvider$OpenExchangeRates.<init> WARN Unknown key IMPORTANT NOTE
   [junit4]   2> 1156275 T2358 oass.OpenExchangeRatesOrgProvider$OpenExchangeRates.<init> WARN Expected key, got STRING
   [junit4]   2> 1156274 T2331 oass.OpenExchangeRatesOrgProvider.reload Reloading exchange rates from open-exchange-rates.json
   [junit4]   2> 1156275 T2344 oass.FileExchangeRateProvider.reload Reloading exchange rates from file currency.xml
   [junit4]   2> 1156275 T2358 oass.OpenExchangeRatesOrgProvider.reload Reloading exchange rates from open-exchange-rates.json
   [junit4]   2> 1156277 T2331 oass.OpenExchangeRatesOrgProvider$OpenExchangeRates.<init> WARN Unknown key IMPORTANT NOTE
   [junit4]   2> 1156277 T2331 oass.OpenExchangeRatesOrgProvider$OpenExchangeRates.<init> WARN Expected key, got STRING
   [junit4]   2> 1156278 T2358 oass.OpenExchangeRatesOrgProvider$OpenExchangeRates.<init> WARN Unknown key IMPORTANT NOTE
   [junit4]   2> 1156278 T2331 oasc.SolrCore.initDirectoryFactory org.apache.solr.core.MockDirectoryFactory
   [junit4]   2> 1156278 T2358 oass.OpenExchangeRatesOrgProvider$OpenExchangeRates.<init> WARN Expected key, got STRING
   [junit4]   2> 1156279 T2331 oasc.SolrCore.<init> [nodes_used_collection_shard1_replica2] Opening new SolrCore at /usr/home/hudson/hudson-slave/workspace/Lucene-Solr-NightlyTests-4.x/solr/build/solr-core/test/J1/./org.apache.solr.cloud.CollectionsAPIDistributedZkTest-jetty1-1375386932137/nodes_used_collection_shard1_replica2/, dataDir=/usr/home/hudson/hudson-slave/workspace/Lucene-Solr-NightlyTests-4.x/solr/build/solr-core/test/J1/./org.apache.solr.cloud.CollectionsAPIDistributedZkTest-jetty1-1375386932137//nodes_used_collection_shard1_replica2/data/
   [junit4]   2> 1156279 T2312 oass.OpenExchangeRatesOrgProvider.reload Reloading exchange rates from open-exchange-rates.json
   [junit4]   2> 1156279 T2358 oasc.SolrCore.initDirectoryFactory org.apache.solr.core.MockDirectoryFactory
   [junit4]   2> 1156280 T2331 oasc.JmxMonitoredMap.<init> JMX monitoring is enabled. Adding Solr mbeans to JMX Server: com.sun.jmx.mbeanserver.JmxMBeanServer@1ba4806
   [junit4]   2> 1156281 T2358 oasc.SolrCore.<init> [nodes_used_collection_shard2_replica1] Opening new SolrCore at /usr/home/hudson/hudson-slave/workspace/Lucene-Solr-NightlyTests-4.x/solr/build/solr-core/test/J1/./org.apache.solr.cloud.CollectionsAPIDistributedZkTest-jetty3-1375386935674/nodes_used_collection_shard2_replica1/, dataDir=/usr/home/hudson/hudson-slave/workspace/Lucene-Solr-NightlyTests-4.x/solr/build/solr-core/test/J1/./org.apache.solr.cloud.CollectionsAPIDistributedZkTest-jetty3-1375386935674//nodes_used_collection_shard2_replica1/data/
   [junit4]   2> 1156281 T2344 oass.OpenExchangeRatesOrgProvider.reload Reloading exchange rates from open-exchange-rates.json
   [junit4]   2> 1156281 T2312 oass.OpenExchangeRatesOrgProvider$OpenExchangeRates.<init> WARN Unknown key IMPORTANT NOTE
   [junit4]   2> 1156282 T2312 oass.OpenExchangeRatesOrgProvider$OpenExchangeRates.<init> WARN Expected key, got STRING
   [junit4]   2> 1156282 T2331 oasc.CachingDirectoryFactory.get return new directory for /usr/home/hudson/hudson-slave/workspace/Lucene-Solr-NightlyTests-4.x/solr/build/solr-core/test/J1/./org.apache.solr.cloud.CollectionsAPIDistributedZkTest-jetty1-1375386932137//nodes_used_collection_shard1_replica2/data
   [junit4]   2> 1156282 T2358 oasc.JmxMonitoredMap.<init> JMX monitoring is enabled. Adding Solr mbeans to JMX Server: com.sun.jmx.mbeanserver.JmxMBeanServer@1ba4806
   [junit4]   2> 1156283 T2331 oasc.SolrCore.getNewIndexDir New index directory detected: old=null new=/usr/home/hudson/hudson-slave/workspace/Lucene-Solr-NightlyTests-4.x/solr/build/solr-core/test/J1/./org.apache.solr.cloud.CollectionsAPIDistributedZkTest-jetty1-1375386932137//nodes_used_collection_shard1_replica2/data/index/
   [junit4]   2> 1156283 T2344 oass.OpenExchangeRatesOrgProvider$OpenExchangeRates.<init> WARN Unknown key IMPORTANT NOTE
   [junit4]   2> 1156285 T2358 oasc.CachingDirectoryFactory.get return new directory for /usr/home/hudson/hudson-slave/workspace/Lucene-Solr-NightlyTests-4.x/solr/build/solr-core/test/J1/./org.apache.solr.cloud.CollectionsAPIDistributedZkTest-jetty3-1375386935674//nodes_used_collection_shard2_replica1/data
   [junit4]   2> 1156283 T2312 oass.OpenExchangeRatesOrgProvider.reload Reloading exchange rates from open-exchange-rates.json
   [junit4]   2> 1156285 T2358 oasc.SolrCore.getNewIndexDir New index directory detected: old=null new=/usr/home/hudson/hudson-slave/workspace/Lucene-Solr-NightlyTests-4.x/solr/build/solr-core/test/J1/./org.apache.solr.cloud.CollectionsAPIDistributedZkTest-jetty3-1375386935674//nodes_used_collection_shard2_replica1/data/index/
   [junit4]   2> 1156285 T2344 oass.OpenExchangeRatesOrgProvider$OpenExchangeRates.<init> WARN Expected key, got STRING
   [junit4]   2> 1156284 T2331 oasc.SolrCore.initIndex WARN [nodes_used_collection_shard1_replica2] Solr index directory '/usr/home/hudson/hudson-slave/workspace/Lucene-Solr-NightlyTests-4.x/solr/build/solr-core/test/J1/./org.apache.solr.cloud.CollectionsAPIDistributedZkTest-jetty1-1375386932137/nodes_used_collection_shard1_replica2/data/index' doesn't exist. Creating new index...
   [junit4]   2> 1156286 T2312 oass.OpenExchangeRatesOrgProvider$OpenExchangeRates.<init> WARN Unknown key IMPORTANT NOTE
   [junit4]   2> 1156286 T2344 oass.OpenExchangeRatesOrgProvider.reload Reloading exchange rates from open-exchange-rates.json
   [junit4]   2> 1156286 T2358 oasc.SolrCore.initIndex WARN [nodes_used_collection_shard2_replica1] Solr index directory '/usr/home/hudson/hudson-slave/workspace/Lucene-Solr-NightlyTests-4.x/solr/build/solr-core/test/J1/./org.apache.solr.cloud.CollectionsAPIDistributedZkTest-jetty3-1375386935674/nodes_used_collection_shard2_replica1/data/index' doesn't exist. Creating new index...
   [junit4]   2> 1156287 T2312 oass.OpenExchangeRatesOrgProvider$OpenExchangeRates.<init> WARN Expected key, got STRING
   [junit4]   2> 1156289 T2312 oasc.SolrCore.initDirectoryFactory org.apache.solr.core.MockDirectoryFactory
   [junit4]   2> 1156289 T2344 oass.OpenExchangeRatesOrgProvider$OpenExchangeRates.<init> WARN Unknown key IMPORTANT NOTE
   [junit4]   2> 1156289 T2344 oass.OpenExchangeRatesOrgProvider$OpenExchangeRates.<init> WARN Expected key, got STRING
   [junit4]   2> 1156289 T2312 oasc.SolrCore.<init> [nodes_used_collection_shard2_replica2] Opening new SolrCore at /usr/home/hudson/hudson-slave/workspace/Lucene-Solr-NightlyTests-4.x/solr/build/solr-core/test/J1/./org.apache.solr.cloud.CollectionsAPIDistributedZkTest-controljetty-1375386931470/nodes_used_collection_shard2_replica2/, dataDir=/usr/home/hudson/hudson-slave/workspace/Lucene-Solr-NightlyTests-4.x/solr/build/solr-core/test/J1/./org.apache.solr.cloud.CollectionsAPIDistributedZkTest-controljetty-1375386931470//nodes_used_collection_shard2_replica2/data/
   [junit4]   2> 1156290 T2344 oasc.SolrCore.initDirectoryFactory org.apache.solr.core.MockDirectoryFactory
   [junit4]   2> 1156290 T2331 oasc.CachingDirectoryFactory.get return new directory for /usr/home/hudson/hudson-slave/workspace/Lucene-Solr-NightlyTests-4.x/solr/build/solr-core/test/J1/./org.apache.solr.cloud.CollectionsAPIDistributedZkTest-jetty1-1375386932137//nodes_used_collection_shard1_replica2/data/index
   [junit4]   2> 1156291 T2344 oasc.SolrCore.<init> [nodes_used_collection_shard1_replica1] Opening new SolrCore at /usr/home/hudson/hudson-slave/workspace/Lucene-Solr-NightlyTests-4.x/solr/build/solr-core/test/J1/./org.apache.solr.cloud.CollectionsAPIDistributedZkTest-jetty2-1375386933871/nodes_used_collection_shard1_replica1/, dataDir=/usr/home/hudson/hudson-slave/workspace/Lucene-Solr-NightlyTests-4.x/solr/build/solr-core/test/J1/./org.apache.solr.cloud.CollectionsAPIDistributedZkTest-jetty2-1375386933871//nodes_used_collection_shard1_replica1/data/
   [junit4]   2> 1156290 T2358 oasc.CachingDirectoryFactory.get return new directory for /usr/home/hudson/hudson-slave/workspace/Lucene-Solr-NightlyTests-4.x/solr/build/solr-core/test/J1/./org.apache.solr.cloud.CollectionsAPIDistributedZkTest-jetty3-1375386935674//nodes_used_collection_shard2_replica1/data/index
   [junit4]   2> 1156290 T2312 oasc.JmxMonitoredMap.<init> JMX monitoring is enabled. Adding Solr mbeans to JMX Server: com.sun.jmx.mbeanserver.JmxMBeanServer@1ba4806
   [junit4]   2> 1156291 T2344 oasc.JmxMonitoredMap.<init> JMX monitoring is enabled. Adding Solr mbeans to JMX Server: com.sun.jmx.mbeanserver.JmxMBeanServer@1ba4806
   [junit4]   2> 1156293 T2312 oasc.CachingDirectoryFactory.get return new directory for /usr/home/hudson/hudson-slave/workspace/Lucene-Solr-NightlyTests-4.x/solr/build/solr-core/test/J1/./org.apache.solr.cloud.CollectionsAPIDistributedZkTest-controljetty-1375386931470//nodes_used_collection_shard2_replica2/data
   [junit4]   2> 1156293 T2312 oasc.SolrCore.getNewIndexDir New index directory detected: old=null new=/usr/home/hudson/hudson-slave/workspace/Lucene-Solr-NightlyTests-4.x/solr/build/solr-core/test/J1/./org.apache.solr.cloud.CollectionsAPIDistributedZkTest-controljetty-1375386931470//nodes_used_collection_shard2_replica2/data/index/
   [junit4]   2> 1156293 T2344 oasc.CachingDirectoryFactory.get return new directory for /usr/home/hudson/hudson-slave/workspace/Lucene-Solr-NightlyTests-4.x/solr/build/solr-core/test/J1/./org.apache.solr.cloud.CollectionsAPIDistributedZkTest-jetty2-1375386933871//nodes_used_collection_shard1_replica1/data
   [junit4]   2> 1156294 T2312 oasc.SolrCore.initIndex WARN [nodes_used_collection_shard2_replica2] Solr index directory '/usr/home/hudson/hudson-slave/workspace/Lucene-Solr-NightlyTests-4.x/solr/build/solr-core/test/J1/./org.apache.solr.cloud.CollectionsAPIDistributedZkTest-controljetty-1375386931470/nodes_used_collection_shard2_replica2/data/index' doesn't exist. Creating new index...
   [junit4]   2> 1156294 T2344 oasc.SolrCore.getNewIndexDir New index directory detected: old=null new=/usr/home/hudson/hudson-slave/workspace/Lucene-Solr-NightlyTests-4.x/solr/build/solr-core/test/J1/./org.apache.solr.cloud.CollectionsAPIDistributedZkTest-jetty2-1375386933871//nodes_used_collection_shard1_replica1/data/index/
   [junit4]   2> 1156295 T2344 oasc.SolrCore.initIndex WARN [nodes_used_collection_shard1_replica1] Solr index directory '/usr/home/hudson/hudson-slave/workspace/Lucene-Solr-NightlyTests-4.x/solr/build/solr-core/test/J1/./org.apache.solr.cloud.CollectionsAPIDistributedZkTest-jetty2-1375386933871/nodes_used_collection_shard1_replica1/data/index' doesn't exist. Creating new index...
   [junit4]   2> 1156298 T2331 oasc.SolrDeletionPolicy.onCommit SolrDeletionPolicy.onCommit: commits: num=1
   [junit4]   2> 		commit{dir=MockDirWrapper(org.apache.lucene.store.MMapDirectory@/usr/home/hudson/hudson-slave/workspace/Lucene-Solr-NightlyTests-4.x/solr/build/solr-core/test/J1/index4481044822tmp lockFactory=org.apache.lucene.store.NativeFSLockFactory@31012d26),segFN=segments_1,generation=1}
   [junit4]   2> 1156298 T2312 oasc.CachingDirectoryFactory.get return new directory for /usr/home/hudson/hudson-slave/workspace/Lucene-Solr-NightlyTests-4.x/solr/build/solr-core/test/J1/./org.apache.solr.cloud.CollectionsAPIDistributedZkTest-controljetty-1375386931470//nodes_used_collection_shard2_replica2/data/index
   [junit4]   2> 1156298 T2331 oasc.SolrDeletionPolicy.updateCommits newest commit generation = 1
   [junit4]   2> 1156299 T2358 oasc.SolrDeletionPolicy.onCommit SolrDeletionPolicy.onCommit: commits: num=1
   [junit4]   2> 		commit{dir=MockDirWrapper(org.apache.lucene.store.MMapDirectory@/usr/home/hudson/hudson-slave/workspace/Lucene-Solr-NightlyTests-4.x/solr/build/solr-core/test/J1/index4481044823tmp lockFactory=org.apache.lucene.store.NativeFSLockFactory@443b32ec),segFN=segments_1,generation=1}
   [junit4]   2> 1156300 T2358 oasc.SolrDeletionPolicy.updateCommits newest commit generation = 1
   [junit4]   2> 1156299 T2344 oasc.CachingDirectoryFactory.get return new directory for /usr/home/hudson/hudson-slave/workspace/Lucene-Solr-NightlyTests-4.x/solr/build/solr-core/test/J1/./org.apache.solr.cloud.CollectionsAPIDistributedZkTest-jetty2-1375386933871//nodes_used_collection_shard1_replica1/data/index
   [junit4]   2> 1156304 T2331 oasup.UpdateRequestProcessorChain.init inserting DistributedUpdateProcessorFactory into updateRequestProcessorChain "dedupe"
   [junit4]   2> 1156305 T2331 oasup.UpdateRequestProcessorChain.init inserting DistributedUpdateProcessorFactory into updateRequestProcessorChain "stored_sig"
   [junit4]   2> 1156306 T2358 oasup.UpdateRequestProcessorChain.init inserting DistributedUpdateProcessorFactory into updateRequestProcessorChain "dedupe"
   [junit4]   2> 1156306 T2331 oasup.UpdateRequestProcessorChain.init inserting DistributedUpdateProcessorFactory into updateRequestProcessorChain "distrib-dup-test-chain-implicit"
   [junit4]   2> 1156306 T2358 oasup.UpdateRequestProcessorChain.init inserting DistributedUpdateProcessorFactory into updateRequestProcessorChain "stored_sig"
   [junit4]   2> 1156307 T2312 oasc.SolrDeletionPolicy.onCommit SolrDeletionPolicy.onCommit: commits: num=1
   [junit4]   2> 		commit{dir=MockDirWrapper(org.apache.lucene.store.MMapDirectory@/usr/home/hudson/hudson-slave/workspace/Lucene-Solr-NightlyTests-4.x/solr/build/solr-core/test/J1/index4481044824tmp lockFactory=org.apache.lucene.store.NativeFSLockFactory@6350f8f),segFN=segments_1,generation=1}
   [junit4]   2> 1156307 T2358 oasup.UpdateRequestProcessorChain.init inserting DistributedUpdateProcessorFactory into updateRequestProcessorChain "distrib-dup-test-chain-implicit"
   [junit4]   2> 1156307 T2312 oasc.SolrDeletionPolicy.updateCommits newest commit generation = 1
   [junit4]   2> 1156308 T2358 oasc.RequestHandlers.initHandlersFromConfig created standard: solr.StandardRequestHandler
   [junit4]   2> 1156307 T2331 oasc.RequestHandlers.initHandlersFromConfig created standard: solr.StandardRequestHandler
   [junit4]   2> 1156309 T2358 oasc.RequestHandlers.initHandlersFromConfig created /get: solr.RealTimeGetHandler
   [junit4]   2> 1156308 T2344 oasc.SolrDeletionPolicy.onCommit SolrDeletionPolicy.onCommit: commits: num=1
   [junit4]   2> 		commit{dir=MockDirWrapper(org.apache.lucene.store.MMapDirectory@/usr/home/hudson/hudson-slave/workspace/Lucene-Solr-NightlyTests-4.x/solr/build/solr-core/test/J1/index4481044825tmp lockFactory=org.apache.lucene.store.NativeFSLockFactory@5907878),segFN=segments_1,generation=1}
   [junit4]   2> 1156309 T2331 oasc.RequestHandlers.initHandlersFromConfig created /get: solr.RealTimeGetHandler
   [junit4]   2> 1156310 T2331 oasc.RequestHandlers.initHandlersFromConfig adding lazy requestHandler: solr.ReplicationHandler
   [junit4]   2> 1156309 T2358 oasc.RequestHandlers.initHandlersFromConfig adding lazy requestHandler: solr.ReplicationHandler
   [junit4]   2> 1156311 T2331 oasc.RequestHandlers.initHandlersFromConfig created /replication: solr.ReplicationHandler
   [junit4]   2> 1156310 T2344 oasc.SolrDeletionPolicy.updateCommits newest commit generation = 1
   [junit4]   2> 1156312 T2331 oasc.RequestHandlers.initHandlersFromConfig created /update: solr.UpdateRequestHandler
   [junit4]   2> 1156311 T2358 oasc.RequestHandlers.initHandlersFromConfig created /replication: solr.ReplicationHandler
   [junit4]   2> 1156312 T2331 oasc.RequestHandlers.initHandlersFromConfig created /admin/: org.apache.solr.handler.admin.AdminHandlers
   [junit4]   2> 1156313 T2358 oasc.RequestHandlers.initHandlersFromConfig created /update: solr.UpdateRequestHandler
   [junit4]   2> 1156313 T2312 oasup.UpdateRequestProcessorChain.init inserting DistributedUpdateProcessorFactory into updateRequestProcessorChain "dedupe"
   [junit4]   2> 1156314 T2358 oasc.RequestHandlers.initHandlersFromConfig created /admin/: org.apache.solr.handler.admin.AdminHandlers
   [junit4]   2> 1156314 T2312 oasup.UpdateRequestProcessorChain.init inserting DistributedUpdateProcessorFactory into updateRequestProcessorChain "stored_sig"
   [junit4]   2> 1156315 T2312 oasup.UpdateRequestProcessorChain.init inserting DistributedUpdateProcessorFactory into updateRequestProcessorChain "distrib-dup-test-chain-implicit"
   [junit4]   2> 1156316 T2312 oasc.RequestHandlers.initHandlersFromConfig created standard: solr.StandardRequestHandler
   [junit4]   2> 1156317 T2312 oasc.RequestHandlers.initHandlersFromConfig created /get: solr.RealTimeGetHandler
   [junit4]   2> 1156317 T2312 oasc.RequestHandlers.initHandlersFromConfig adding lazy requestHandler: solr.ReplicationHandler
   [junit4]   2> 1156317 T2344 oasup.UpdateRequestProcessorChain.init inserting DistributedUpdateProcessorFactory into updateRequestProcessorChain "dedupe"
   [junit4]   2> 1156317 T2312 oasc.RequestHandlers.initHandlersFromConfig created /replication: solr.ReplicationHandler
   [junit4]   2> 1156318 T2344 oasup.UpdateRequestProcessorChain.init inserting DistributedUpdateProcessorFactory into updateRequestProcessorChain "stored_sig"
   [junit4]   2> 1156318 T2312 oasc.RequestHandlers.initHandlersFromConfig created /update: solr.UpdateRequestHandler
   [junit4]   2> 1156319 T2344 oasup.UpdateRequestProcessorChain.init inserting DistributedUpdateProcessorFactory into updateRequestProcessorChain "distrib-dup-test-chain-implicit"
   [junit4]   2> 1156319 T2312 oasc.RequestHandlers.initHandlersFromConfig created /admin/: org.apache.solr.handler.admin.AdminHandlers
   [junit4]   2> 1156320 T2344 oasc.RequestHandlers.initHandlersFromConfig created standard: solr.StandardRequestHandler
   [junit4]   2> 1156320 T2344 oasc.RequestHandlers.initHandlersFromConfig created /get: solr.RealTimeGetHandler
   [junit4]   2> 1156321 T2344 oasc.RequestHandlers.initHandlersFromConfig adding lazy requestHandler: solr.ReplicationHandler
   [junit4]   2> 1156321 T2344 oasc.RequestHandlers.initHandlersFromConfig created /replication: solr.ReplicationHandler
   [junit4]   2> 1156322 T2344 oasc.RequestHandlers.initHandlersFromConfig created /update: solr.UpdateRequestHandler
   [junit4]   2> 1156323 T2344 oasc.RequestHandlers.initHandlersFromConfig created /admin/: org.apache.solr.handler.admin.AdminHandlers
   [junit4]   2> 1156330 T2331 oashl.XMLLoader.init xsltCacheLifetimeSeconds=60
   [junit4]   2> 1156330 T2344 oashl.XMLLoader.init xsltCacheLifetimeSeconds=60
   [junit4]   2> 1156330 T2358 oashl.XMLLoader.init xsltCacheLifetimeSeconds=60
   [junit4]   2> 1156330 T2312 oashl.XMLLoader.init xsltCacheLifetimeSeconds=60
   [junit4]   2> 1156345 T2331 oass.SolrIndexSearcher.<init> Opening Searcher@6feab844 main
   [junit4]   2> 1156345 T2344 oass.SolrIndexSearcher.<init> Opening Searcher@408e1332 main
   [junit4]   2> 1156345 T2312 oass.SolrIndexSearcher.<init> Opening Searcher@61478701 main
   [junit4]   2> 1156345 T2358 oass.SolrIndexSearcher.<init> Opening Searcher@442b2df0 main
   [junit4]   2> 1156346 T2331 oasu.CommitTracker.<init> Hard AutoCommit: disabled
   [junit4]   2> 1156347 T2344 oasu.CommitTracker.<init> Hard AutoCommit: disabled
   [junit4]   2> 1156347 T2312 oasu.CommitTracker.<init> Hard AutoCommit: disabled
   [junit4]   2> 1156347 T2331 oasu.CommitTracker.<init> Soft AutoCommit: disabled
   [junit4]   2> 1156348 T2312 oasu.CommitTracker.<init> Soft AutoCommit: disabled
   [junit4]   2> 1156348 T2358 oasu.CommitTracker.<init> Hard AutoCommit: disabled
   [junit4]   2> 1156347 T2344 oasu.CommitTracker.<init> Soft AutoCommit: disabled
   [junit4]   2> 1156349 T2358 oasu.CommitTracker.<init> Soft AutoCommit: disabled
   [junit4]   2> 1156352 T2388 oasc.SolrCore.registerSearcher [nodes_used_collection_shard1_replica2] Registered new searcher Searcher@6feab844 main{StandardDirectoryReader(segments_1:1)}
   [junit4]   2> 1156353 T2389 oasc.SolrCore.registerSearcher [nodes_used_collection_shard2_replica2] Registered new searcher Searcher@61478701 main{StandardDirectoryReader(segments_1:1)}
   [junit4]   2> 1156353 T2390 oasc.SolrCore.registerSearcher [nodes_used_collection_shard1_replica1] Registered new searcher Searcher@408e1332 main{StandardDirectoryReader(segments_1:1)}
   [junit4]   2> 1156354 T2391 oasc.SolrCore.registerSearcher [nodes_used_collection_shard2_replica1] Registered new searcher Searcher@442b2df0 main{StandardDirectoryReader(segments_1:1)}
   [junit4]   2> 1156355 T2331 oasc.CoreContainer.registerCore registering core: nodes_used_collection_shard1_replica2
   [junit4]   2> 1156355 T2312 oasc.CoreContainer.registerCore registering core: nodes_used_collection_shard2_replica2
   [junit4]   2> 1156355 T2344 oasc.CoreContainer.registerCore registering core: nodes_used_collection_shard1_replica1
   [junit4]   2> 1156355 T2331 oasc.ZkController.register Register replica - core:nodes_used_collection_shard1_replica2 address:http://127.0.0.1:17637/bv collection:nodes_used_collection shard:shard1
   [junit4]   2> 1156356 T2358 oasc.CoreContainer.registerCore registering core: nodes_used_collection_shard2_replica1
   [junit4]   2> 1156356 T2344 oasc.ZkController.register Register replica - core:nodes_used_collection_shard1_replica1 address:http://127.0.0.1:17640/bv collection:nodes_used_collection shard:shard1
   [junit4]   2> 1156356 T2312 oasc.ZkController.register Register replica - core:nodes_used_collection_shard2_replica2 address:http://127.0.0.1:17633/bv collection:nodes_used_collection shard:shard2
   [junit4]   2> 1156357 T2344 oascsi.HttpClientUtil.createClient Creating new http client, config:maxConnections=10000&maxConnectionsPerHost=20&connTimeout=15000&socketTimeout=30000&retry=false
   [junit4]   2> 1156357 T2358 oasc.ZkController.register Register replica - core:nodes_used_collection_shard2_replica1 address:http://127.0.0.1:17643/bv collection:nodes_used_collection shard:shard2
   [junit4]   2> 1156356 T2331 oascsi.HttpClientUtil.createClient Creating new http client, config:maxConnections=10000&maxConnectionsPerHost=20&connTimeout=15000&socketTimeout=30000&retry=false
   [junit4]   2> 1156358 T2358 oascsi.HttpClientUtil.createClient Creating new http client, config:maxConnections=10000&maxConnectionsPerHost=20&connTimeout=15000&socketTimeout=30000&retry=false
   [junit4]   2> 1156358 T2312 oascsi.HttpClientUtil.createClient Creating new http client, config:maxConnections=10000&maxConnectionsPerHost=20&connTimeout=15000&socketTimeout=30000&retry=false
   [junit4]   2> 1156386 T2344 oascc.SolrZkClient.makePath makePath: /collections/nodes_used_collection/leader_elect/shard1/election
   [junit4]   2> 1156387 T2312 oascc.SolrZkClient.makePath makePath: /collections/nodes_used_collection/leader_elect/shard2/election
   [junit4]   2> 1156387 T2358 oascc.SolrZkClient.makePath makePath: /collections/nodes_used_collection/leader_elect/shard2/election
   [junit4]   2> 1156386 T2331 oascc.SolrZkClient.makePath makePath: /collections/nodes_used_collection/leader_elect/shard1/election
   [junit4]   2> 1156437 T2331 oasc.ShardLeaderElectionContext.runLeaderProcess Running the leader process for shard shard1
   [junit4]   2> 1156437 T2312 oasc.ShardLeaderElectionContext.runLeaderProcess Running the leader process for shard shard2
   [junit4]   2> 1156458 T2331 oasc.ShardLeaderElectionContext.waitForReplicasToComeUp Enough replicas found to continue.
   [junit4]   2> 1156459 T2312 oasc.ShardLeaderElectionContext.waitForReplicasToComeUp Enough replicas found to continue.
   [junit4]   2> 1156459 T2312 oasc.ShardLeaderElectionContext.runLeaderProcess I may be the new leader - try and sync
   [junit4]   2> 1156459 T2331 oasc.ShardLeaderElectionContext.runLeaderProcess I may be the new leader - try and sync
   [junit4]   2> 1156460 T2312 oasc.SyncStrategy.sync Sync replicas to http://127.0.0.1:17633/bv/nodes_used_collection_shard2_replica2/
   [junit4]   2> 1156460 T2331 oasc.SyncStrategy.sync Sync replicas to http://127.0.0.1:17637/bv/nodes_used_collection_shard1_replica2/
   [junit4]   2> 1156460 T2312 oasu.PeerSync.sync PeerSync: core=nodes_used_collection_shard2_replica2 url=http://127.0.0.1:17633/bv START replicas=[http://127.0.0.1:17643/bv/nodes_used_collection_shard2_replica1/] nUpdates=100
   [junit4]   2> 1156461 T2331 oasu.PeerSync.sync PeerSync: core=nodes_used_collection_shard1_replica2 url=http://127.0.0.1:17637/bv START replicas=[http://127.0.0.1:17640/bv/nodes_used_collection_shard1_replica1/] nUpdates=100
   [junit4]   2> 1156461 T2312 oasu.PeerSync.sync PeerSync: core=nodes_used_collection_shard2_replica2 url=http://127.0.0.1:17633/bv DON

[...truncated too long message...]

Base.createCollection(AbstractFullDistribZkTestBase.java:1535)
   [junit4]    > 	at org.apache.solr.cloud.CollectionsAPIDistributedZkTest.testCustomCollectionsAPI(CollectionsAPIDistributedZkTest.java:677)
   [junit4]    > 	at org.apache.solr.cloud.CollectionsAPIDistributedZkTest.doTest(CollectionsAPIDistributedZkTest.java:159)
   [junit4]    > 	at org.apache.solr.BaseDistributedSearchTestCase.testDistribSearch(BaseDistributedSearchTestCase.java:835)
   [junit4]    > 	at java.lang.Thread.run(Thread.java:679)
   [junit4]    > Caused by: org.apache.http.conn.ConnectTimeoutException: Connect to 127.0.0.1:17640 timed out
   [junit4]    > 	at org.apache.http.conn.scheme.PlainSocketFactory.connectSocket(PlainSocketFactory.java:129)
   [junit4]    > 	at org.apache.http.impl.conn.DefaultClientConnectionOperator.openConnection(DefaultClientConnectionOperator.java:180)
   [junit4]    > 	at org.apache.http.impl.conn.ManagedClientConnectionImpl.open(ManagedClientConnectionImpl.java:294)
   [junit4]    > 	at org.apache.http.impl.client.DefaultRequestDirector.tryConnect(DefaultRequestDirector.java:645)
   [junit4]    > 	at org.apache.http.impl.client.DefaultRequestDirector.execute(DefaultRequestDirector.java:480)
   [junit4]    > 	at org.apache.http.impl.client.AbstractHttpClient.execute(AbstractHttpClient.java:906)
   [junit4]    > 	at org.apache.http.impl.client.AbstractHttpClient.execute(AbstractHttpClient.java:805)
   [junit4]    > 	at org.apache.http.impl.client.AbstractHttpClient.execute(AbstractHttpClient.java:784)
   [junit4]    > 	at org.apache.solr.client.solrj.impl.HttpSolrServer.request(HttpSolrServer.java:365)
   [junit4]    > 	... 45 more
   [junit4]   2> 1271684 T2300 oas.SolrTestCaseJ4.deleteCore ###deleteCore
   [junit4]   2> 126982 T2299 ccr.ThreadLeakControl.checkThreadLeaks WARNING Will linger awaiting termination of 1 leaked thread(s).
   [junit4]   2> 1272708 T2382 oasc.LeaderElector$1.process WARN  org.apache.zookeeper.KeeperException$SessionExpiredException: KeeperErrorCode = Session expired for /collections/new_implicit_coll_1/leader_elect/a/election
   [junit4]   2> 	at org.apache.zookeeper.KeeperException.create(KeeperException.java:127)
   [junit4]   2> 	at org.apache.zookeeper.KeeperException.create(KeeperException.java:51)
   [junit4]   2> 	at org.apache.zookeeper.ZooKeeper.getChildren(ZooKeeper.java:1468)
   [junit4]   2> 	at org.apache.solr.common.cloud.SolrZkClient$6.execute(SolrZkClient.java:235)
   [junit4]   2> 	at org.apache.solr.common.cloud.SolrZkClient$6.execute(SolrZkClient.java:232)
   [junit4]   2> 	at org.apache.solr.common.cloud.ZkCmdExecutor.retryOperation(ZkCmdExecutor.java:65)
   [junit4]   2> 	at org.apache.solr.common.cloud.SolrZkClient.getChildren(SolrZkClient.java:232)
   [junit4]   2> 	at org.apache.solr.cloud.LeaderElector.checkIfIamLeader(LeaderElector.java:84)
   [junit4]   2> 	at org.apache.solr.cloud.LeaderElector.access$000(LeaderElector.java:55)
   [junit4]   2> 	at org.apache.solr.cloud.LeaderElector$1.process(LeaderElector.java:129)
   [junit4]   2> 	at org.apache.zookeeper.ClientCnxn$EventThread.processEvent(ClientCnxn.java:519)
   [junit4]   2> 	at org.apache.zookeeper.ClientCnxn$EventThread.run(ClientCnxn.java:495)
   [junit4]   2> 
   [junit4]   2> 1272708 T2382 oasc.LeaderElector$1.process WARN  org.apache.zookeeper.KeeperException$SessionExpiredException: KeeperErrorCode = Session expired for /collections/new_implicit_coll_1/leader_elect/d/election
   [junit4]   2> 	at org.apache.zookeeper.KeeperException.create(KeeperException.java:127)
   [junit4]   2> 	at org.apache.zookeeper.KeeperException.create(KeeperException.java:51)
   [junit4]   2> 	at org.apache.zookeeper.ZooKeeper.getChildren(ZooKeeper.java:1468)
   [junit4]   2> 	at org.apache.solr.common.cloud.SolrZkClient$6.execute(SolrZkClient.java:235)
   [junit4]   2> 	at org.apache.solr.common.cloud.SolrZkClient$6.execute(SolrZkClient.java:232)
   [junit4]   2> 	at org.apache.solr.common.cloud.ZkCmdExecutor.retryOperation(ZkCmdExecutor.java:65)
   [junit4]   2> 	at org.apache.solr.common.cloud.SolrZkClient.getChildren(SolrZkClient.java:232)
   [junit4]   2> 	at org.apache.solr.cloud.LeaderElector.checkIfIamLeader(LeaderElector.java:84)
   [junit4]   2> 	at org.apache.solr.cloud.LeaderElector.access$000(LeaderElector.java:55)
   [junit4]   2> 	at org.apache.solr.cloud.LeaderElector$1.process(LeaderElector.java:129)
   [junit4]   2> 	at org.apache.zookeeper.ClientCnxn$EventThread.processEvent(ClientCnxn.java:519)
   [junit4]   2> 	at org.apache.zookeeper.ClientCnxn$EventThread.run(ClientCnxn.java:495)
   [junit4]   2> 
   [junit4]   2> 1272709 T2382 oasc.LeaderElector$1.process WARN  org.apache.zookeeper.KeeperException$SessionExpiredException: KeeperErrorCode = Session expired for /collections/new_implicit_coll_1/leader_elect/c/election
   [junit4]   2> 	at org.apache.zookeeper.KeeperException.create(KeeperException.java:127)
   [junit4]   2> 	at org.apache.zookeeper.KeeperException.create(KeeperException.java:51)
   [junit4]   2> 	at org.apache.zookeeper.ZooKeeper.getChildren(ZooKeeper.java:1468)
   [junit4]   2> 	at org.apache.solr.common.cloud.SolrZkClient$6.execute(SolrZkClient.java:235)
   [junit4]   2> 	at org.apache.solr.common.cloud.SolrZkClient$6.execute(SolrZkClient.java:232)
   [junit4]   2> 	at org.apache.solr.common.cloud.ZkCmdExecutor.retryOperation(ZkCmdExecutor.java:65)
   [junit4]   2> 	at org.apache.solr.common.cloud.SolrZkClient.getChildren(SolrZkClient.java:232)
   [junit4]   2> 	at org.apache.solr.cloud.LeaderElector.checkIfIamLeader(LeaderElector.java:84)
   [junit4]   2> 	at org.apache.solr.cloud.LeaderElector.access$000(LeaderElector.java:55)
   [junit4]   2> 	at org.apache.solr.cloud.LeaderElector$1.process(LeaderElector.java:129)
   [junit4]   2> 	at org.apache.zookeeper.ClientCnxn$EventThread.processEvent(ClientCnxn.java:519)
   [junit4]   2> 	at org.apache.zookeeper.ClientCnxn$EventThread.run(ClientCnxn.java:495)
   [junit4]   2> 
   [junit4]   2> 1272709 T2382 oascc.ZkStateReader$3.process WARN ZooKeeper watch triggered, but Solr cannot talk to ZK
   [junit4]   2> 1272710 T2382 oascc.ZkStateReader$2.process A cluster state change: WatchedEvent state:SyncConnected type:NodeChildrenChanged path:/live_nodes, has occurred - updating... (live nodes size: 1)
   [junit4]   2> 1272710 T2382 oascc.ZkStateReader$2.process WARN ZooKeeper watch triggered, but Solr cannot talk to ZK
   [junit4]   2> NOTE: test params are: codec=Lucene42: {timestamp=PostingsFormat(name=Memory doPackFST= true), range_facet_l=PostingsFormat(name=Memory doPackFST= true), id=PostingsFormat(name=Direct), range_facet_sl=PostingsFormat(name=Direct), a_t=PostingsFormat(name=Memory doPackFST= true), text=Pulsing41(freqCutoff=8 minBlockSize=50 maxBlockSize=184), range_facet_si=PostingsFormat(name=Memory doPackFST= true), _version_=PostingsFormat(name=TestBloomFilteredLucene41Postings), other_tl1=PostingsFormat(name=TestBloomFilteredLucene41Postings), multiDefault=PostingsFormat(name=Memory doPackFST= true), a_si=PostingsFormat(name=TestBloomFilteredLucene41Postings), intDefault=PostingsFormat(name=TestBloomFilteredLucene41Postings)}, docValues:{}, sim=RandomSimilarityProvider(queryNorm=false,coord=yes): {}, locale=pt, timezone=America/Cordoba
   [junit4]   2> NOTE: FreeBSD 9.1-RELEASE-p3 amd64/Sun Microsystems Inc. 1.6.0_32 (64-bit)/cpus=16,threads=7,free=179023776,total=487456768
   [junit4]   2> NOTE: All tests run in this JVM: [TestReload, TestCopyFieldCollectionResource, HdfsSyncSliceTest, TermVectorComponentDistributedTest, CurrencyFieldOpenExchangeTest, SimplePostToolTest, TestCodecSupport, TestQueryTypes, SuggesterWFSTTest, TestRecovery, TestIndexingPerformance, TestCSVResponseWriter, SampleTest, TimeZoneUtilsTest, TestElisionMultitermQuery, CopyFieldTest, TestDefaultSimilarityFactory, RequestHandlersTest, DirectUpdateHandlerTest, JSONWriterTest, TestCloudManagedSchema, TestHashPartitioner, TestAtomicUpdateErrorCases, TestManagedSchemaFieldResource, TestBinaryField, DisMaxRequestHandlerTest, DOMUtilTest, TestSchemaResource, BasicZkTest, SortByFunctionTest, TestRangeQuery, TestSerializedLuceneMatchVersion, FileUtilsTest, TestPartialUpdateDeduplication, TestUpdate, TestSystemIdResolver, CoreAdminCreateDiscoverTest, SpellPossibilityIteratorTest, TestLazyCores, TestDistributedSearch, NumericFieldsTest, TestQuerySenderNoQuery, NotRequiredUniqueKeyTest, ShardSplitTest, HdfsRecoveryZkTest, ShardRoutingCustomTest, BadIndexSchemaTest, XsltUpdateRequestHandlerTest, HighlighterConfigTest, ClusterStateTest, TestComponentsName, TestSchemaVersionResource, CollectionsAPIDistributedZkTest]
   [junit4] Completed on J1 in 128.26s, 1 test, 1 error <<< FAILURES!

[...truncated 667 lines...]
BUILD FAILED
/usr/home/hudson/hudson-slave/workspace/Lucene-Solr-NightlyTests-4.x/build.xml:402: The following error occurred while executing this line:
/usr/home/hudson/hudson-slave/workspace/Lucene-Solr-NightlyTests-4.x/build.xml:375: The following error occurred while executing this line:
/usr/home/hudson/hudson-slave/workspace/Lucene-Solr-NightlyTests-4.x/build.xml:39: The following error occurred while executing this line:
/usr/home/hudson/hudson-slave/workspace/Lucene-Solr-NightlyTests-4.x/solr/build.xml:181: The following error occurred while executing this line:
/usr/home/hudson/hudson-slave/workspace/Lucene-Solr-NightlyTests-4.x/solr/common-build.xml:449: The following error occurred while executing this line:
/usr/home/hudson/hudson-slave/workspace/Lucene-Solr-NightlyTests-4.x/lucene/common-build.xml:1233: The following error occurred while executing this line:
/usr/home/hudson/hudson-slave/workspace/Lucene-Solr-NightlyTests-4.x/lucene/common-build.xml:876: There were test failures: 321 suites, 1350 tests, 1 error, 32 ignored (4 assumptions)

Total time: 114 minutes 3 seconds
Build step 'Invoke Ant' marked build as failure
Archiving artifacts
Recording test results
Email was triggered for: Failure
Sending email for trigger: Failure



Mime
View raw message