lucene-dev mailing list archives

Site index · List index
Message view « Date » · « Thread »
Top « Date » · « Thread »
From Apache Jenkins Server <jenk...@builds.apache.org>
Subject [JENKINS] Lucene-Solr-Tests-4.x-Java6 - Build # 1863 - Still Failing
Date Fri, 02 Aug 2013 07:58:52 GMT
Build: https://builds.apache.org/job/Lucene-Solr-Tests-4.x-Java6/1863/

1 tests failed.
FAILED:  org.apache.solr.cloud.CollectionsAPIDistributedZkTest.testDistribSearch

Error Message:
IOException occured when talking to server at: http://127.0.0.1:13859

Stack Trace:
org.apache.solr.client.solrj.SolrServerException: IOException occured when talking to server at: http://127.0.0.1:13859
	at __randomizedtesting.SeedInfo.seed([B701640FB7A6E045:36E7EA17C0F98079]:0)
	at org.apache.solr.client.solrj.impl.HttpSolrServer.request(HttpSolrServer.java:435)
	at org.apache.solr.client.solrj.impl.HttpSolrServer.request(HttpSolrServer.java:180)
	at org.apache.solr.cloud.CollectionsAPIDistributedZkTest.testCustomCollectionsAPI(CollectionsAPIDistributedZkTest.java:764)
	at org.apache.solr.cloud.CollectionsAPIDistributedZkTest.doTest(CollectionsAPIDistributedZkTest.java:159)
	at org.apache.solr.BaseDistributedSearchTestCase.testDistribSearch(BaseDistributedSearchTestCase.java:835)
	at sun.reflect.NativeMethodAccessorImpl.invoke0(Native Method)
	at sun.reflect.NativeMethodAccessorImpl.invoke(NativeMethodAccessorImpl.java:57)
	at sun.reflect.DelegatingMethodAccessorImpl.invoke(DelegatingMethodAccessorImpl.java:43)
	at java.lang.reflect.Method.invoke(Method.java:616)
	at com.carrotsearch.randomizedtesting.RandomizedRunner.invoke(RandomizedRunner.java:1559)
	at com.carrotsearch.randomizedtesting.RandomizedRunner.access$600(RandomizedRunner.java:79)
	at com.carrotsearch.randomizedtesting.RandomizedRunner$6.evaluate(RandomizedRunner.java:737)
	at com.carrotsearch.randomizedtesting.RandomizedRunner$7.evaluate(RandomizedRunner.java:773)
	at com.carrotsearch.randomizedtesting.RandomizedRunner$8.evaluate(RandomizedRunner.java:787)
	at com.carrotsearch.randomizedtesting.rules.SystemPropertiesRestoreRule$1.evaluate(SystemPropertiesRestoreRule.java:53)
	at org.apache.lucene.util.TestRuleSetupTeardownChained$1.evaluate(TestRuleSetupTeardownChained.java:50)
	at org.apache.lucene.util.TestRuleFieldCacheSanity$1.evaluate(TestRuleFieldCacheSanity.java:51)
	at org.apache.lucene.util.AbstractBeforeAfterRule$1.evaluate(AbstractBeforeAfterRule.java:46)
	at com.carrotsearch.randomizedtesting.rules.SystemPropertiesInvariantRule$1.evaluate(SystemPropertiesInvariantRule.java:55)
	at org.apache.lucene.util.TestRuleThreadAndTestName$1.evaluate(TestRuleThreadAndTestName.java:49)
	at org.apache.lucene.util.TestRuleIgnoreAfterMaxFailures$1.evaluate(TestRuleIgnoreAfterMaxFailures.java:70)
	at org.apache.lucene.util.TestRuleMarkFailure$1.evaluate(TestRuleMarkFailure.java:48)
	at com.carrotsearch.randomizedtesting.rules.StatementAdapter.evaluate(StatementAdapter.java:36)
	at com.carrotsearch.randomizedtesting.ThreadLeakControl$StatementRunner.run(ThreadLeakControl.java:358)
	at com.carrotsearch.randomizedtesting.ThreadLeakControl.forkTimeoutingTask(ThreadLeakControl.java:782)
	at com.carrotsearch.randomizedtesting.ThreadLeakControl$3.evaluate(ThreadLeakControl.java:442)
	at com.carrotsearch.randomizedtesting.RandomizedRunner.runSingleTest(RandomizedRunner.java:746)
	at com.carrotsearch.randomizedtesting.RandomizedRunner$3.evaluate(RandomizedRunner.java:648)
	at com.carrotsearch.randomizedtesting.RandomizedRunner$4.evaluate(RandomizedRunner.java:682)
	at com.carrotsearch.randomizedtesting.RandomizedRunner$5.evaluate(RandomizedRunner.java:693)
	at com.carrotsearch.randomizedtesting.rules.StatementAdapter.evaluate(StatementAdapter.java:36)
	at com.carrotsearch.randomizedtesting.rules.SystemPropertiesRestoreRule$1.evaluate(SystemPropertiesRestoreRule.java:53)
	at org.apache.lucene.util.AbstractBeforeAfterRule$1.evaluate(AbstractBeforeAfterRule.java:46)
	at org.apache.lucene.util.TestRuleStoreClassName$1.evaluate(TestRuleStoreClassName.java:42)
	at com.carrotsearch.randomizedtesting.rules.SystemPropertiesInvariantRule$1.evaluate(SystemPropertiesInvariantRule.java:55)
	at com.carrotsearch.randomizedtesting.rules.NoShadowingOrOverridesOnMethodsRule$1.evaluate(NoShadowingOrOverridesOnMethodsRule.java:39)
	at com.carrotsearch.randomizedtesting.rules.NoShadowingOrOverridesOnMethodsRule$1.evaluate(NoShadowingOrOverridesOnMethodsRule.java:39)
	at com.carrotsearch.randomizedtesting.rules.StatementAdapter.evaluate(StatementAdapter.java:36)
	at org.apache.lucene.util.TestRuleAssertionsRequired$1.evaluate(TestRuleAssertionsRequired.java:43)
	at org.apache.lucene.util.TestRuleMarkFailure$1.evaluate(TestRuleMarkFailure.java:48)
	at org.apache.lucene.util.TestRuleIgnoreAfterMaxFailures$1.evaluate(TestRuleIgnoreAfterMaxFailures.java:70)
	at org.apache.lucene.util.TestRuleIgnoreTestSuites$1.evaluate(TestRuleIgnoreTestSuites.java:55)
	at com.carrotsearch.randomizedtesting.rules.StatementAdapter.evaluate(StatementAdapter.java:36)
	at com.carrotsearch.randomizedtesting.ThreadLeakControl$StatementRunner.run(ThreadLeakControl.java:358)
	at java.lang.Thread.run(Thread.java:679)
Caused by: org.apache.http.conn.ConnectTimeoutException: Connect to 127.0.0.1:13859 timed out
	at org.apache.http.conn.scheme.PlainSocketFactory.connectSocket(PlainSocketFactory.java:129)
	at org.apache.http.impl.conn.DefaultClientConnectionOperator.openConnection(DefaultClientConnectionOperator.java:180)
	at org.apache.http.impl.conn.ManagedClientConnectionImpl.open(ManagedClientConnectionImpl.java:294)
	at org.apache.http.impl.client.DefaultRequestDirector.tryConnect(DefaultRequestDirector.java:645)
	at org.apache.http.impl.client.DefaultRequestDirector.execute(DefaultRequestDirector.java:480)
	at org.apache.http.impl.client.AbstractHttpClient.execute(AbstractHttpClient.java:906)
	at org.apache.http.impl.client.AbstractHttpClient.execute(AbstractHttpClient.java:805)
	at org.apache.http.impl.client.AbstractHttpClient.execute(AbstractHttpClient.java:784)
	at org.apache.solr.client.solrj.impl.HttpSolrServer.request(HttpSolrServer.java:365)
	... 44 more




Build Log:
[...truncated 9261 lines...]
   [junit4] Suite: org.apache.solr.cloud.CollectionsAPIDistributedZkTest
   [junit4]   2> 822556 T1966 oas.BaseDistributedSearchTestCase.initHostContext Setting hostContext system property: /
   [junit4]   2> 822561 T1966 oas.SolrTestCaseJ4.setUp ###Starting testDistribSearch
   [junit4]   2> Creating dataDir: /usr/home/hudson/hudson-slave/workspace/Lucene-Solr-Tests-4.x-Java6/solr/build/solr-core/test/J0/./solrtest-CollectionsAPIDistributedZkTest-1375428991098
   [junit4]   2> 822563 T1966 oasc.ZkTestServer.run STARTING ZK TEST SERVER
   [junit4]   2> 822563 T1967 oasc.ZkTestServer$ZKServerMain.runFromConfig Starting server
   [junit4]   2> 822664 T1966 oasc.ZkTestServer.run start zk server on port:61734
   [junit4]   2> 822665 T1966 oascc.ConnectionManager.waitForConnected Waiting for client to connect to ZooKeeper
   [junit4]   2> 822669 T1973 oascc.ConnectionManager.process Watcher org.apache.solr.common.cloud.ConnectionManager@534cd876 name:ZooKeeperConnection Watcher:127.0.0.1:61734 got event WatchedEvent state:SyncConnected type:None path:null path:null type:None
   [junit4]   2> 822669 T1966 oascc.ConnectionManager.waitForConnected Client is connected to ZooKeeper
   [junit4]   2> 822670 T1966 oascc.SolrZkClient.makePath makePath: /solr
   [junit4]   2> 822692 T1966 oascc.ConnectionManager.waitForConnected Waiting for client to connect to ZooKeeper
   [junit4]   2> 822697 T1975 oascc.ConnectionManager.process Watcher org.apache.solr.common.cloud.ConnectionManager@3954e1b1 name:ZooKeeperConnection Watcher:127.0.0.1:61734/solr got event WatchedEvent state:SyncConnected type:None path:null path:null type:None
   [junit4]   2> 822698 T1966 oascc.ConnectionManager.waitForConnected Client is connected to ZooKeeper
   [junit4]   2> 822698 T1966 oascc.SolrZkClient.makePath makePath: /collections/collection1
   [junit4]   2> 822702 T1966 oascc.SolrZkClient.makePath makePath: /collections/collection1/shards
   [junit4]   2> 822712 T1966 oascc.SolrZkClient.makePath makePath: /collections/control_collection
   [junit4]   2> 822715 T1966 oascc.SolrZkClient.makePath makePath: /collections/control_collection/shards
   [junit4]   2> 822718 T1966 oasc.AbstractZkTestCase.putConfig put /usr/home/hudson/hudson-slave/workspace/Lucene-Solr-Tests-4.x-Java6/solr/build/solr-core/test-files/solr/collection1/conf/solrconfig-tlog.xml to /configs/conf1/solrconfig.xml
   [junit4]   2> 822719 T1966 oascc.SolrZkClient.makePath makePath: /configs/conf1/solrconfig.xml
   [junit4]   2> 822724 T1966 oasc.AbstractZkTestCase.putConfig put /usr/home/hudson/hudson-slave/workspace/Lucene-Solr-Tests-4.x-Java6/solr/build/solr-core/test-files/solr/collection1/conf/schema.xml to /configs/conf1/schema.xml
   [junit4]   2> 822725 T1966 oascc.SolrZkClient.makePath makePath: /configs/conf1/schema.xml
   [junit4]   2> 822864 T1966 oasc.AbstractZkTestCase.putConfig put /usr/home/hudson/hudson-slave/workspace/Lucene-Solr-Tests-4.x-Java6/solr/build/solr-core/test-files/solr/collection1/conf/stopwords.txt to /configs/conf1/stopwords.txt
   [junit4]   2> 822865 T1966 oascc.SolrZkClient.makePath makePath: /configs/conf1/stopwords.txt
   [junit4]   2> 822868 T1966 oasc.AbstractZkTestCase.putConfig put /usr/home/hudson/hudson-slave/workspace/Lucene-Solr-Tests-4.x-Java6/solr/build/solr-core/test-files/solr/collection1/conf/protwords.txt to /configs/conf1/protwords.txt
   [junit4]   2> 822869 T1966 oascc.SolrZkClient.makePath makePath: /configs/conf1/protwords.txt
   [junit4]   2> 822872 T1966 oasc.AbstractZkTestCase.putConfig put /usr/home/hudson/hudson-slave/workspace/Lucene-Solr-Tests-4.x-Java6/solr/build/solr-core/test-files/solr/collection1/conf/currency.xml to /configs/conf1/currency.xml
   [junit4]   2> 822873 T1966 oascc.SolrZkClient.makePath makePath: /configs/conf1/currency.xml
   [junit4]   2> 822876 T1966 oasc.AbstractZkTestCase.putConfig put /usr/home/hudson/hudson-slave/workspace/Lucene-Solr-Tests-4.x-Java6/solr/build/solr-core/test-files/solr/collection1/conf/open-exchange-rates.json to /configs/conf1/open-exchange-rates.json
   [junit4]   2> 822877 T1966 oascc.SolrZkClient.makePath makePath: /configs/conf1/open-exchange-rates.json
   [junit4]   2> 822880 T1966 oasc.AbstractZkTestCase.putConfig put /usr/home/hudson/hudson-slave/workspace/Lucene-Solr-Tests-4.x-Java6/solr/build/solr-core/test-files/solr/collection1/conf/mapping-ISOLatin1Accent.txt to /configs/conf1/mapping-ISOLatin1Accent.txt
   [junit4]   2> 822880 T1966 oascc.SolrZkClient.makePath makePath: /configs/conf1/mapping-ISOLatin1Accent.txt
   [junit4]   2> 822883 T1966 oasc.AbstractZkTestCase.putConfig put /usr/home/hudson/hudson-slave/workspace/Lucene-Solr-Tests-4.x-Java6/solr/build/solr-core/test-files/solr/collection1/conf/old_synonyms.txt to /configs/conf1/old_synonyms.txt
   [junit4]   2> 822884 T1966 oascc.SolrZkClient.makePath makePath: /configs/conf1/old_synonyms.txt
   [junit4]   2> 822887 T1966 oasc.AbstractZkTestCase.putConfig put /usr/home/hudson/hudson-slave/workspace/Lucene-Solr-Tests-4.x-Java6/solr/build/solr-core/test-files/solr/collection1/conf/synonyms.txt to /configs/conf1/synonyms.txt
   [junit4]   2> 822887 T1966 oascc.SolrZkClient.makePath makePath: /configs/conf1/synonyms.txt
   [junit4]   2> 823162 T1966 oejs.Server.doStart jetty-8.1.10.v20130312
   [junit4]   2> 823167 T1966 oejs.AbstractConnector.doStart Started SocketConnector@127.0.0.1:48259
   [junit4]   2> 823168 T1966 oass.SolrDispatchFilter.init SolrDispatchFilter.init()
   [junit4]   2> 823168 T1966 oasc.SolrResourceLoader.locateSolrHome JNDI not configured for solr (NoInitialContextEx)
   [junit4]   2> 823169 T1966 oasc.SolrResourceLoader.locateSolrHome using system property solr.solr.home: /usr/home/hudson/hudson-slave/workspace/Lucene-Solr-Tests-4.x-Java6/solr/build/solr-core/test/J0/./org.apache.solr.cloud.CollectionsAPIDistributedZkTest-controljetty-1375428991433
   [junit4]   2> 823169 T1966 oasc.SolrResourceLoader.<init> new SolrResourceLoader for directory: '/usr/home/hudson/hudson-slave/workspace/Lucene-Solr-Tests-4.x-Java6/solr/build/solr-core/test/J0/./org.apache.solr.cloud.CollectionsAPIDistributedZkTest-controljetty-1375428991433/'
   [junit4]   2> 823206 T1966 oasc.ConfigSolr.fromFile Loading container configuration from /usr/home/hudson/hudson-slave/workspace/Lucene-Solr-Tests-4.x-Java6/solr/build/solr-core/test/J0/./org.apache.solr.cloud.CollectionsAPIDistributedZkTest-controljetty-1375428991433/solr.xml
   [junit4]   2> 823282 T1966 oasc.ConfigSolrXml.<init> Config-defined core root directory: 
   [junit4]   2> 823283 T1966 oasc.CoreContainer.<init> New CoreContainer 17930413
   [junit4]   2> 823284 T1966 oasc.CoreContainer.load Loading cores into CoreContainer [instanceDir=/usr/home/hudson/hudson-slave/workspace/Lucene-Solr-Tests-4.x-Java6/solr/build/solr-core/test/J0/./org.apache.solr.cloud.CollectionsAPIDistributedZkTest-controljetty-1375428991433/]
   [junit4]   2> 823286 T1966 oashc.HttpShardHandlerFactory.getParameter Setting socketTimeout to: 120000
   [junit4]   2> 823286 T1966 oashc.HttpShardHandlerFactory.getParameter Setting urlScheme to: http://
   [junit4]   2> 823287 T1966 oashc.HttpShardHandlerFactory.getParameter Setting connTimeout to: 15000
   [junit4]   2> 823287 T1966 oashc.HttpShardHandlerFactory.getParameter Setting maxConnectionsPerHost to: 20
   [junit4]   2> 823287 T1966 oashc.HttpShardHandlerFactory.getParameter Setting corePoolSize to: 0
   [junit4]   2> 823288 T1966 oashc.HttpShardHandlerFactory.getParameter Setting maximumPoolSize to: 2147483647
   [junit4]   2> 823288 T1966 oashc.HttpShardHandlerFactory.getParameter Setting maxThreadIdleTime to: 5
   [junit4]   2> 823289 T1966 oashc.HttpShardHandlerFactory.getParameter Setting sizeOfQueue to: -1
   [junit4]   2> 823289 T1966 oashc.HttpShardHandlerFactory.getParameter Setting fairnessPolicy to: false
   [junit4]   2> 823290 T1966 oascsi.HttpClientUtil.createClient Creating new http client, config:maxConnectionsPerHost=20&maxConnections=10000&socketTimeout=120000&connTimeout=15000&retry=false
   [junit4]   2> 823307 T1966 oasc.ZkContainer.initZooKeeper Zookeeper client=127.0.0.1:61734/solr
   [junit4]   2> 823308 T1966 oasc.ZkController.checkChrootPath zkHost includes chroot
   [junit4]   2> 823309 T1966 oascc.ConnectionManager.waitForConnected Waiting for client to connect to ZooKeeper
   [junit4]   2> 823311 T1986 oascc.ConnectionManager.process Watcher org.apache.solr.common.cloud.ConnectionManager@2a3e8667 name:ZooKeeperConnection Watcher:127.0.0.1:61734 got event WatchedEvent state:SyncConnected type:None path:null path:null type:None
   [junit4]   2> 823312 T1966 oascc.ConnectionManager.waitForConnected Client is connected to ZooKeeper
   [junit4]   2> 823325 T1966 oascsi.HttpClientUtil.createClient Creating new http client, config:maxConnections=500&maxConnectionsPerHost=16&socketTimeout=120000&connTimeout=15000
   [junit4]   2> 823337 T1966 oascc.ConnectionManager.waitForConnected Waiting for client to connect to ZooKeeper
   [junit4]   2> 823339 T1988 oascc.ConnectionManager.process Watcher org.apache.solr.common.cloud.ConnectionManager@53815a8e name:ZooKeeperConnection Watcher:127.0.0.1:61734/solr got event WatchedEvent state:SyncConnected type:None path:null path:null type:None
   [junit4]   2> 823340 T1966 oascc.ConnectionManager.waitForConnected Client is connected to ZooKeeper
   [junit4]   2> 823347 T1966 oascc.SolrZkClient.makePath makePath: /overseer/queue
   [junit4]   2> 823388 T1966 oascc.SolrZkClient.makePath makePath: /overseer/collection-queue-work
   [junit4]   2> 823391 T1966 oascc.SolrZkClient.makePath makePath: /live_nodes
   [junit4]   2> 823403 T1966 oasc.ZkController.createEphemeralLiveNode Register node as live in ZooKeeper:/live_nodes/127.0.0.1:48259_
   [junit4]   2> 823405 T1966 oascc.SolrZkClient.makePath makePath: /live_nodes/127.0.0.1:48259_
   [junit4]   2> 823408 T1966 oascc.SolrZkClient.makePath makePath: /overseer_elect/election
   [junit4]   2> 823476 T1966 oascc.SolrZkClient.makePath makePath: /overseer_elect/leader
   [junit4]   2> 823479 T1966 oasc.Overseer.start Overseer (id=90140114361122819-127.0.0.1:48259_-n_0000000000) starting
   [junit4]   2> 823534 T1966 oascc.SolrZkClient.makePath makePath: /overseer/queue-work
   [junit4]   2> 823590 T1990 oasc.OverseerCollectionProcessor.run Process current queue of collection creations
   [junit4]   2> 823591 T1966 oascc.SolrZkClient.makePath makePath: /clusterstate.json
   [junit4]   2> 823624 T1966 oascc.SolrZkClient.makePath makePath: /aliases.json
   [junit4]   2> 823661 T1966 oascc.ZkStateReader.createClusterStateWatchersAndUpdate Updating cluster state from ZooKeeper... 
   [junit4]   2> 823664 T1989 oasc.Overseer$ClusterStateUpdater.run Starting to work on the main queue
   [junit4]   2> 823667 T1966 oasc.CorePropertiesLocator.discover Looking for core definitions underneath /usr/home/hudson/hudson-slave/workspace/Lucene-Solr-Tests-4.x-Java6/solr/build/solr-core/test/J0/./org.apache.solr.cloud.CollectionsAPIDistributedZkTest-controljetty-1375428991433
   [junit4]   2> 823671 T1966 oasc.CorePropertiesLocator.discoverUnder Found core conf in /usr/home/hudson/hudson-slave/workspace/Lucene-Solr-Tests-4.x-Java6/solr/build/solr-core/test/J0/./org.apache.solr.cloud.CollectionsAPIDistributedZkTest-controljetty-1375428991433/conf/
   [junit4]   2> 823837 T1966 oasc.CorePropertiesLocator.discover Found 1 core definitions
   [junit4]   2> 823838 T1966 oass.SolrDispatchFilter.init user.dir=/usr/home/hudson/hudson-slave/workspace/Lucene-Solr-Tests-4.x-Java6/solr/build/solr-core/test/J0
   [junit4]   2> 823838 T1966 oass.SolrDispatchFilter.init SolrDispatchFilter.init() done
   [junit4]   2> 823839 T1966 oascsi.HttpClientUtil.createClient Creating new http client, config:maxConnections=128&maxConnectionsPerHost=32&followRedirects=false
   [junit4]   2> 823856 T1966 oascsi.HttpClientUtil.createClient Creating new http client, config:
   [junit4]   2> 823857 T1966 oascc.ConnectionManager.waitForConnected Waiting for client to connect to ZooKeeper
   [junit4]   2> 823860 T1993 oascc.ConnectionManager.process Watcher org.apache.solr.common.cloud.ConnectionManager@235657c8 name:ZooKeeperConnection Watcher:127.0.0.1:61734/solr got event WatchedEvent state:SyncConnected type:None path:null path:null type:None
   [junit4]   2> 823860 T1966 oascc.ConnectionManager.waitForConnected Client is connected to ZooKeeper
   [junit4]   2> 823862 T1966 oascc.ZkStateReader.createClusterStateWatchersAndUpdate Updating cluster state from ZooKeeper... 
   [junit4]   2> 823864 T1966 oasc.ChaosMonkey.monkeyLog monkey: init - expire sessions:true cause connection loss:true
   [junit4]   2> 824129 T1966 oejs.Server.doStart jetty-8.1.10.v20130312
   [junit4]   2> 824132 T1966 oejs.AbstractConnector.doStart Started SocketConnector@127.0.0.1:13859
   [junit4]   2> 824133 T1966 oass.SolrDispatchFilter.init SolrDispatchFilter.init()
   [junit4]   2> 824133 T1966 oasc.SolrResourceLoader.locateSolrHome JNDI not configured for solr (NoInitialContextEx)
   [junit4]   2> 824134 T1966 oasc.SolrResourceLoader.locateSolrHome using system property solr.solr.home: /usr/home/hudson/hudson-slave/workspace/Lucene-Solr-Tests-4.x-Java6/solr/build/solr-core/test/J0/./org.apache.solr.cloud.CollectionsAPIDistributedZkTest-jetty1-1375428992400
   [junit4]   2> 824134 T1966 oasc.SolrResourceLoader.<init> new SolrResourceLoader for directory: '/usr/home/hudson/hudson-slave/workspace/Lucene-Solr-Tests-4.x-Java6/solr/build/solr-core/test/J0/./org.apache.solr.cloud.CollectionsAPIDistributedZkTest-jetty1-1375428992400/'
   [junit4]   2> 824171 T1966 oasc.ConfigSolr.fromFile Loading container configuration from /usr/home/hudson/hudson-slave/workspace/Lucene-Solr-Tests-4.x-Java6/solr/build/solr-core/test/J0/./org.apache.solr.cloud.CollectionsAPIDistributedZkTest-jetty1-1375428992400/solr.xml
   [junit4]   2> 824242 T1966 oasc.ConfigSolrXml.<init> Config-defined core root directory: 
   [junit4]   2> 824243 T1966 oasc.CoreContainer.<init> New CoreContainer 1308007533
   [junit4]   2> 824243 T1966 oasc.CoreContainer.load Loading cores into CoreContainer [instanceDir=/usr/home/hudson/hudson-slave/workspace/Lucene-Solr-Tests-4.x-Java6/solr/build/solr-core/test/J0/./org.apache.solr.cloud.CollectionsAPIDistributedZkTest-jetty1-1375428992400/]
   [junit4]   2> 824245 T1966 oashc.HttpShardHandlerFactory.getParameter Setting socketTimeout to: 120000
   [junit4]   2> 824245 T1966 oashc.HttpShardHandlerFactory.getParameter Setting urlScheme to: http://
   [junit4]   2> 824246 T1966 oashc.HttpShardHandlerFactory.getParameter Setting connTimeout to: 15000
   [junit4]   2> 824246 T1966 oashc.HttpShardHandlerFactory.getParameter Setting maxConnectionsPerHost to: 20
   [junit4]   2> 824247 T1966 oashc.HttpShardHandlerFactory.getParameter Setting corePoolSize to: 0
   [junit4]   2> 824247 T1966 oashc.HttpShardHandlerFactory.getParameter Setting maximumPoolSize to: 2147483647
   [junit4]   2> 824247 T1966 oashc.HttpShardHandlerFactory.getParameter Setting maxThreadIdleTime to: 5
   [junit4]   2> 824248 T1966 oashc.HttpShardHandlerFactory.getParameter Setting sizeOfQueue to: -1
   [junit4]   2> 824248 T1966 oashc.HttpShardHandlerFactory.getParameter Setting fairnessPolicy to: false
   [junit4]   2> 824249 T1966 oascsi.HttpClientUtil.createClient Creating new http client, config:maxConnectionsPerHost=20&maxConnections=10000&socketTimeout=120000&connTimeout=15000&retry=false
   [junit4]   2> 824266 T1966 oasc.ZkContainer.initZooKeeper Zookeeper client=127.0.0.1:61734/solr
   [junit4]   2> 824266 T1966 oasc.ZkController.checkChrootPath zkHost includes chroot
   [junit4]   2> 824267 T1966 oascc.ConnectionManager.waitForConnected Waiting for client to connect to ZooKeeper
   [junit4]   2> 824271 T2004 oascc.ConnectionManager.process Watcher org.apache.solr.common.cloud.ConnectionManager@7997e017 name:ZooKeeperConnection Watcher:127.0.0.1:61734 got event WatchedEvent state:SyncConnected type:None path:null path:null type:None
   [junit4]   2> 824271 T1966 oascc.ConnectionManager.waitForConnected Client is connected to ZooKeeper
   [junit4]   2> 824293 T1966 oascsi.HttpClientUtil.createClient Creating new http client, config:maxConnections=500&maxConnectionsPerHost=16&socketTimeout=120000&connTimeout=15000
   [junit4]   2> 824304 T1966 oascc.ConnectionManager.waitForConnected Waiting for client to connect to ZooKeeper
   [junit4]   2> 824306 T2006 oascc.ConnectionManager.process Watcher org.apache.solr.common.cloud.ConnectionManager@7751eccd name:ZooKeeperConnection Watcher:127.0.0.1:61734/solr got event WatchedEvent state:SyncConnected type:None path:null path:null type:None
   [junit4]   2> 824307 T1966 oascc.ConnectionManager.waitForConnected Client is connected to ZooKeeper
   [junit4]   2> 824320 T1966 oascc.ZkStateReader.createClusterStateWatchersAndUpdate Updating cluster state from ZooKeeper... 
   [junit4]   2> 825323 T1966 oasc.ZkController.createEphemeralLiveNode Register node as live in ZooKeeper:/live_nodes/127.0.0.1:13859_
   [junit4]   2> 825350 T1966 oascc.SolrZkClient.makePath makePath: /live_nodes/127.0.0.1:13859_
   [junit4]   2> 825353 T1993 oascc.ZkStateReader$3.process Updating live nodes... (2)
   [junit4]   2> 825353 T2006 oascc.ZkStateReader$3.process Updating live nodes... (2)
   [junit4]   2> 825353 T1988 oascc.ZkStateReader$3.process Updating live nodes... (2)
   [junit4]   2> 825365 T1966 oasc.CorePropertiesLocator.discover Looking for core definitions underneath /usr/home/hudson/hudson-slave/workspace/Lucene-Solr-Tests-4.x-Java6/solr/build/solr-core/test/J0/./org.apache.solr.cloud.CollectionsAPIDistributedZkTest-jetty1-1375428992400
   [junit4]   2> 825535 T1966 oasc.CorePropertiesLocator.discoverUnder Found core conf in /usr/home/hudson/hudson-slave/workspace/Lucene-Solr-Tests-4.x-Java6/solr/build/solr-core/test/J0/./org.apache.solr.cloud.CollectionsAPIDistributedZkTest-jetty1-1375428992400/conf/
   [junit4]   2> 825536 T1966 oasc.CorePropertiesLocator.discover Found 1 core definitions
   [junit4]   2> 825537 T1966 oass.SolrDispatchFilter.init user.dir=/usr/home/hudson/hudson-slave/workspace/Lucene-Solr-Tests-4.x-Java6/solr/build/solr-core/test/J0
   [junit4]   2> 825538 T1966 oass.SolrDispatchFilter.init SolrDispatchFilter.init() done
   [junit4]   2> 825538 T1966 oascsi.HttpClientUtil.createClient Creating new http client, config:maxConnections=128&maxConnectionsPerHost=32&followRedirects=false
   [junit4]   2> 825822 T1966 oejs.Server.doStart jetty-8.1.10.v20130312
   [junit4]   2> 825824 T1966 oejs.AbstractConnector.doStart Started SocketConnector@127.0.0.1:13378
   [junit4]   2> 825825 T1966 oass.SolrDispatchFilter.init SolrDispatchFilter.init()
   [junit4]   2> 825826 T1966 oasc.SolrResourceLoader.locateSolrHome JNDI not configured for solr (NoInitialContextEx)
   [junit4]   2> 825826 T1966 oasc.SolrResourceLoader.locateSolrHome using system property solr.solr.home: /usr/home/hudson/hudson-slave/workspace/Lucene-Solr-Tests-4.x-Java6/solr/build/solr-core/test/J0/./org.apache.solr.cloud.CollectionsAPIDistributedZkTest-jetty2-1375428994089
   [junit4]   2> 825827 T1966 oasc.SolrResourceLoader.<init> new SolrResourceLoader for directory: '/usr/home/hudson/hudson-slave/workspace/Lucene-Solr-Tests-4.x-Java6/solr/build/solr-core/test/J0/./org.apache.solr.cloud.CollectionsAPIDistributedZkTest-jetty2-1375428994089/'
   [junit4]   2> 825864 T1966 oasc.ConfigSolr.fromFile Loading container configuration from /usr/home/hudson/hudson-slave/workspace/Lucene-Solr-Tests-4.x-Java6/solr/build/solr-core/test/J0/./org.apache.solr.cloud.CollectionsAPIDistributedZkTest-jetty2-1375428994089/solr.xml
   [junit4]   2> 825935 T1966 oasc.ConfigSolrXml.<init> Config-defined core root directory: 
   [junit4]   2> 825936 T1966 oasc.CoreContainer.<init> New CoreContainer 944036831
   [junit4]   2> 825937 T1966 oasc.CoreContainer.load Loading cores into CoreContainer [instanceDir=/usr/home/hudson/hudson-slave/workspace/Lucene-Solr-Tests-4.x-Java6/solr/build/solr-core/test/J0/./org.apache.solr.cloud.CollectionsAPIDistributedZkTest-jetty2-1375428994089/]
   [junit4]   2> 825938 T1966 oashc.HttpShardHandlerFactory.getParameter Setting socketTimeout to: 120000
   [junit4]   2> 825939 T1966 oashc.HttpShardHandlerFactory.getParameter Setting urlScheme to: http://
   [junit4]   2> 825939 T1966 oashc.HttpShardHandlerFactory.getParameter Setting connTimeout to: 15000
   [junit4]   2> 825940 T1966 oashc.HttpShardHandlerFactory.getParameter Setting maxConnectionsPerHost to: 20
   [junit4]   2> 825940 T1966 oashc.HttpShardHandlerFactory.getParameter Setting corePoolSize to: 0
   [junit4]   2> 825941 T1966 oashc.HttpShardHandlerFactory.getParameter Setting maximumPoolSize to: 2147483647
   [junit4]   2> 825941 T1966 oashc.HttpShardHandlerFactory.getParameter Setting maxThreadIdleTime to: 5
   [junit4]   2> 825942 T1966 oashc.HttpShardHandlerFactory.getParameter Setting sizeOfQueue to: -1
   [junit4]   2> 825942 T1966 oashc.HttpShardHandlerFactory.getParameter Setting fairnessPolicy to: false
   [junit4]   2> 825943 T1966 oascsi.HttpClientUtil.createClient Creating new http client, config:maxConnectionsPerHost=20&maxConnections=10000&socketTimeout=120000&connTimeout=15000&retry=false
   [junit4]   2> 825958 T1966 oasc.ZkContainer.initZooKeeper Zookeeper client=127.0.0.1:61734/solr
   [junit4]   2> 825959 T1966 oasc.ZkController.checkChrootPath zkHost includes chroot
   [junit4]   2> 825960 T1966 oascc.ConnectionManager.waitForConnected Waiting for client to connect to ZooKeeper
   [junit4]   2> 825990 T2018 oascc.ConnectionManager.process Watcher org.apache.solr.common.cloud.ConnectionManager@30bf2a55 name:ZooKeeperConnection Watcher:127.0.0.1:61734 got event WatchedEvent state:SyncConnected type:None path:null path:null type:None
   [junit4]   2> 825990 T1966 oascc.ConnectionManager.waitForConnected Client is connected to ZooKeeper
   [junit4]   2> 825993 T1966 oascsi.HttpClientUtil.createClient Creating new http client, config:maxConnections=500&maxConnectionsPerHost=16&socketTimeout=120000&connTimeout=15000
   [junit4]   2> 826003 T1966 oascc.ConnectionManager.waitForConnected Waiting for client to connect to ZooKeeper
   [junit4]   2> 826005 T2020 oascc.ConnectionManager.process Watcher org.apache.solr.common.cloud.ConnectionManager@3899bc9a name:ZooKeeperConnection Watcher:127.0.0.1:61734/solr got event WatchedEvent state:SyncConnected type:None path:null path:null type:None
   [junit4]   2> 826005 T1966 oascc.ConnectionManager.waitForConnected Client is connected to ZooKeeper
   [junit4]   2> 826017 T1966 oascc.ZkStateReader.createClusterStateWatchersAndUpdate Updating cluster state from ZooKeeper... 
   [junit4]   2> 827020 T1966 oasc.ZkController.createEphemeralLiveNode Register node as live in ZooKeeper:/live_nodes/127.0.0.1:13378_
   [junit4]   2> 827025 T1966 oascc.SolrZkClient.makePath makePath: /live_nodes/127.0.0.1:13378_
   [junit4]   2> 827029 T2006 oascc.ZkStateReader$3.process Updating live nodes... (3)
   [junit4]   2> 827029 T1988 oascc.ZkStateReader$3.process Updating live nodes... (3)
   [junit4]   2> 827029 T2020 oascc.ZkStateReader$3.process Updating live nodes... (3)
   [junit4]   2> 827029 T1993 oascc.ZkStateReader$3.process Updating live nodes... (3)
   [junit4]   2> 827042 T1966 oasc.CorePropertiesLocator.discover Looking for core definitions underneath /usr/home/hudson/hudson-slave/workspace/Lucene-Solr-Tests-4.x-Java6/solr/build/solr-core/test/J0/./org.apache.solr.cloud.CollectionsAPIDistributedZkTest-jetty2-1375428994089
   [junit4]   2> 827206 T1966 oasc.CorePropertiesLocator.discoverUnder Found core conf in /usr/home/hudson/hudson-slave/workspace/Lucene-Solr-Tests-4.x-Java6/solr/build/solr-core/test/J0/./org.apache.solr.cloud.CollectionsAPIDistributedZkTest-jetty2-1375428994089/conf/
   [junit4]   2> 827213 T1966 oasc.CorePropertiesLocator.discover Found 1 core definitions
   [junit4]   2> 827214 T1966 oass.SolrDispatchFilter.init user.dir=/usr/home/hudson/hudson-slave/workspace/Lucene-Solr-Tests-4.x-Java6/solr/build/solr-core/test/J0
   [junit4]   2> 827214 T1966 oass.SolrDispatchFilter.init SolrDispatchFilter.init() done
   [junit4]   2> 827215 T1966 oascsi.HttpClientUtil.createClient Creating new http client, config:maxConnections=128&maxConnectionsPerHost=32&followRedirects=false
   [junit4]   2> 827560 T1966 oejs.Server.doStart jetty-8.1.10.v20130312
   [junit4]   2> 827563 T1966 oejs.AbstractConnector.doStart Started SocketConnector@127.0.0.1:62110
   [junit4]   2> 827564 T1966 oass.SolrDispatchFilter.init SolrDispatchFilter.init()
   [junit4]   2> 827564 T1966 oasc.SolrResourceLoader.locateSolrHome JNDI not configured for solr (NoInitialContextEx)
   [junit4]   2> 827565 T1966 oasc.SolrResourceLoader.locateSolrHome using system property solr.solr.home: /usr/home/hudson/hudson-slave/workspace/Lucene-Solr-Tests-4.x-Java6/solr/build/solr-core/test/J0/./org.apache.solr.cloud.CollectionsAPIDistributedZkTest-jetty3-1375428995766
   [junit4]   2> 827565 T1966 oasc.SolrResourceLoader.<init> new SolrResourceLoader for directory: '/usr/home/hudson/hudson-slave/workspace/Lucene-Solr-Tests-4.x-Java6/solr/build/solr-core/test/J0/./org.apache.solr.cloud.CollectionsAPIDistributedZkTest-jetty3-1375428995766/'
   [junit4]   2> 827602 T1966 oasc.ConfigSolr.fromFile Loading container configuration from /usr/home/hudson/hudson-slave/workspace/Lucene-Solr-Tests-4.x-Java6/solr/build/solr-core/test/J0/./org.apache.solr.cloud.CollectionsAPIDistributedZkTest-jetty3-1375428995766/solr.xml
   [junit4]   2> 827678 T1966 oasc.ConfigSolrXml.<init> Config-defined core root directory: 
   [junit4]   2> 827679 T1966 oasc.CoreContainer.<init> New CoreContainer 1548639928
   [junit4]   2> 827679 T1966 oasc.CoreContainer.load Loading cores into CoreContainer [instanceDir=/usr/home/hudson/hudson-slave/workspace/Lucene-Solr-Tests-4.x-Java6/solr/build/solr-core/test/J0/./org.apache.solr.cloud.CollectionsAPIDistributedZkTest-jetty3-1375428995766/]
   [junit4]   2> 827681 T1966 oashc.HttpShardHandlerFactory.getParameter Setting socketTimeout to: 120000
   [junit4]   2> 827681 T1966 oashc.HttpShardHandlerFactory.getParameter Setting urlScheme to: http://
   [junit4]   2> 827682 T1966 oashc.HttpShardHandlerFactory.getParameter Setting connTimeout to: 15000
   [junit4]   2> 827682 T1966 oashc.HttpShardHandlerFactory.getParameter Setting maxConnectionsPerHost to: 20
   [junit4]   2> 827683 T1966 oashc.HttpShardHandlerFactory.getParameter Setting corePoolSize to: 0
   [junit4]   2> 827683 T1966 oashc.HttpShardHandlerFactory.getParameter Setting maximumPoolSize to: 2147483647
   [junit4]   2> 827683 T1966 oashc.HttpShardHandlerFactory.getParameter Setting maxThreadIdleTime to: 5
   [junit4]   2> 827684 T1966 oashc.HttpShardHandlerFactory.getParameter Setting sizeOfQueue to: -1
   [junit4]   2> 827684 T1966 oashc.HttpShardHandlerFactory.getParameter Setting fairnessPolicy to: false
   [junit4]   2> 827685 T1966 oascsi.HttpClientUtil.createClient Creating new http client, config:maxConnectionsPerHost=20&maxConnections=10000&socketTimeout=120000&connTimeout=15000&retry=false
   [junit4]   2> 827700 T1966 oasc.ZkContainer.initZooKeeper Zookeeper client=127.0.0.1:61734/solr
   [junit4]   2> 827701 T1966 oasc.ZkController.checkChrootPath zkHost includes chroot
   [junit4]   2> 827702 T1966 oascc.ConnectionManager.waitForConnected Waiting for client to connect to ZooKeeper
   [junit4]   2> 827740 T2032 oascc.ConnectionManager.process Watcher org.apache.solr.common.cloud.ConnectionManager@1d2cb160 name:ZooKeeperConnection Watcher:127.0.0.1:61734 got event WatchedEvent state:SyncConnected type:None path:null path:null type:None
   [junit4]   2> 827741 T1966 oascc.ConnectionManager.waitForConnected Client is connected to ZooKeeper
   [junit4]   2> 827743 T1966 oascsi.HttpClientUtil.createClient Creating new http client, config:maxConnections=500&maxConnectionsPerHost=16&socketTimeout=120000&connTimeout=15000
   [junit4]   2> 827753 T1966 oascc.ConnectionManager.waitForConnected Waiting for client to connect to ZooKeeper
   [junit4]   2> 827755 T2034 oascc.ConnectionManager.process Watcher org.apache.solr.common.cloud.ConnectionManager@93480eb name:ZooKeeperConnection Watcher:127.0.0.1:61734/solr got event WatchedEvent state:SyncConnected type:None path:null path:null type:None
   [junit4]   2> 827755 T1966 oascc.ConnectionManager.waitForConnected Client is connected to ZooKeeper
   [junit4]   2> 827767 T1966 oascc.ZkStateReader.createClusterStateWatchersAndUpdate Updating cluster state from ZooKeeper... 
   [junit4]   2> 828770 T1966 oasc.ZkController.createEphemeralLiveNode Register node as live in ZooKeeper:/live_nodes/127.0.0.1:62110_
   [junit4]   2> 828772 T1966 oascc.SolrZkClient.makePath makePath: /live_nodes/127.0.0.1:62110_
   [junit4]   2> 828776 T1993 oascc.ZkStateReader$3.process Updating live nodes... (4)
   [junit4]   2> 828776 T1988 oascc.ZkStateReader$3.process Updating live nodes... (4)
   [junit4]   2> 828777 T2034 oascc.ZkStateReader$3.process Updating live nodes... (4)
   [junit4]   2> 828776 T2020 oascc.ZkStateReader$3.process Updating live nodes... (4)
   [junit4]   2> 828776 T2006 oascc.ZkStateReader$3.process Updating live nodes... (4)
   [junit4]   2> 828827 T1966 oasc.CorePropertiesLocator.discover Looking for core definitions underneath /usr/home/hudson/hudson-slave/workspace/Lucene-Solr-Tests-4.x-Java6/solr/build/solr-core/test/J0/./org.apache.solr.cloud.CollectionsAPIDistributedZkTest-jetty3-1375428995766
   [junit4]   2> 828834 T1966 oasc.CorePropertiesLocator.discoverUnder Found core conf in /usr/home/hudson/hudson-slave/workspace/Lucene-Solr-Tests-4.x-Java6/solr/build/solr-core/test/J0/./org.apache.solr.cloud.CollectionsAPIDistributedZkTest-jetty3-1375428995766/conf/
   [junit4]   2> 828994 T1966 oasc.CorePropertiesLocator.discover Found 1 core definitions
   [junit4]   2> 828995 T1966 oass.SolrDispatchFilter.init user.dir=/usr/home/hudson/hudson-slave/workspace/Lucene-Solr-Tests-4.x-Java6/solr/build/solr-core/test/J0
   [junit4]   2> 828995 T1966 oass.SolrDispatchFilter.init SolrDispatchFilter.init() done
   [junit4]   2> 828996 T1966 oascsi.HttpClientUtil.createClient Creating new http client, config:maxConnections=128&maxConnectionsPerHost=32&followRedirects=false
   [junit4]   2> 829274 T1966 oejs.Server.doStart jetty-8.1.10.v20130312
   [junit4]   2> 829277 T1966 oejs.AbstractConnector.doStart Started SocketConnector@127.0.0.1:52807
   [junit4]   2> 829277 T1966 oass.SolrDispatchFilter.init SolrDispatchFilter.init()
   [junit4]   2> 829278 T1966 oasc.SolrResourceLoader.locateSolrHome JNDI not configured for solr (NoInitialContextEx)
   [junit4]   2> 829278 T1966 oasc.SolrResourceLoader.locateSolrHome using system property solr.solr.home: /usr/home/hudson/hudson-slave/workspace/Lucene-Solr-Tests-4.x-Java6/solr/build/solr-core/test/J0/./org.apache.solr.cloud.CollectionsAPIDistributedZkTest-jetty4-1375428997547
   [junit4]   2> 829279 T1966 oasc.SolrResourceLoader.<init> new SolrResourceLoader for directory: '/usr/home/hudson/hudson-slave/workspace/Lucene-Solr-Tests-4.x-Java6/solr/build/solr-core/test/J0/./org.apache.solr.cloud.CollectionsAPIDistributedZkTest-jetty4-1375428997547/'
   [junit4]   2> 829316 T1966 oasc.ConfigSolr.fromFile Loading container configuration from /usr/home/hudson/hudson-slave/workspace/Lucene-Solr-Tests-4.x-Java6/solr/build/solr-core/test/J0/./org.apache.solr.cloud.CollectionsAPIDistributedZkTest-jetty4-1375428997547/solr.xml
   [junit4]   2> 829371 T1966 oasc.ConfigSolrXml.<init> Config-defined core root directory: 
   [junit4]   2> 829372 T1966 oasc.CoreContainer.<init> New CoreContainer 1496803414
   [junit4]   2> 829372 T1966 oasc.CoreContainer.load Loading cores into CoreContainer [instanceDir=/usr/home/hudson/hudson-slave/workspace/Lucene-Solr-Tests-4.x-Java6/solr/build/solr-core/test/J0/./org.apache.solr.cloud.CollectionsAPIDistributedZkTest-jetty4-1375428997547/]
   [junit4]   2> 829373 T1966 oashc.HttpShardHandlerFactory.getParameter Setting socketTimeout to: 120000
   [junit4]   2> 829374 T1966 oashc.HttpShardHandlerFactory.getParameter Setting urlScheme to: http://
   [junit4]   2> 829374 T1966 oashc.HttpShardHandlerFactory.getParameter Setting connTimeout to: 15000
   [junit4]   2> 829374 T1966 oashc.HttpShardHandlerFactory.getParameter Setting maxConnectionsPerHost to: 20
   [junit4]   2> 829374 T1966 oashc.HttpShardHandlerFactory.getParameter Setting corePoolSize to: 0
   [junit4]   2> 829375 T1966 oashc.HttpShardHandlerFactory.getParameter Setting maximumPoolSize to: 2147483647
   [junit4]   2> 829375 T1966 oashc.HttpShardHandlerFactory.getParameter Setting maxThreadIdleTime to: 5
   [junit4]   2> 829375 T1966 oashc.HttpShardHandlerFactory.getParameter Setting sizeOfQueue to: -1
   [junit4]   2> 829376 T1966 oashc.HttpShardHandlerFactory.getParameter Setting fairnessPolicy to: false
   [junit4]   2> 829376 T1966 oascsi.HttpClientUtil.createClient Creating new http client, config:maxConnectionsPerHost=20&maxConnections=10000&socketTimeout=120000&connTimeout=15000&retry=false
   [junit4]   2> 829386 T1966 oasc.ZkContainer.initZooKeeper Zookeeper client=127.0.0.1:61734/solr
   [junit4]   2> 829387 T1966 oasc.ZkController.checkChrootPath zkHost includes chroot
   [junit4]   2> 829388 T1966 oascc.ConnectionManager.waitForConnected Waiting for client to connect to ZooKeeper
   [junit4]   2> 829392 T2046 oascc.ConnectionManager.process Watcher org.apache.solr.common.cloud.ConnectionManager@44a313dc name:ZooKeeperConnection Watcher:127.0.0.1:61734 got event WatchedEvent state:SyncConnected type:None path:null path:null type:None
   [junit4]   2> 829392 T1966 oascc.ConnectionManager.waitForConnected Client is connected to ZooKeeper
   [junit4]   2> 829395 T1966 oascsi.HttpClientUtil.createClient Creating new http client, config:maxConnections=500&maxConnectionsPerHost=16&socketTimeout=120000&connTimeout=15000
   [junit4]   2> 829408 T1966 oascc.ConnectionManager.waitForConnected Waiting for client to connect to ZooKeeper
   [junit4]   2> 829410 T2048 oascc.ConnectionManager.process Watcher org.apache.solr.common.cloud.ConnectionManager@57c78edb name:ZooKeeperConnection Watcher:127.0.0.1:61734/solr got event WatchedEvent state:SyncConnected type:None path:null path:null type:None
   [junit4]   2> 829410 T1966 oascc.ConnectionManager.waitForConnected Client is connected to ZooKeeper
   [junit4]   2> 829422 T1966 oascc.ZkStateReader.createClusterStateWatchersAndUpdate Updating cluster state from ZooKeeper... 
   [junit4]   2> 830425 T1966 oasc.ZkController.createEphemeralLiveNode Register node as live in ZooKeeper:/live_nodes/127.0.0.1:52807_
   [junit4]   2> 830450 T1966 oascc.SolrZkClient.makePath makePath: /live_nodes/127.0.0.1:52807_
   [junit4]   2> 830454 T2006 oascc.ZkStateReader$3.process Updating live nodes... (5)
   [junit4]   2> 830455 T2034 oascc.ZkStateReader$3.process Updating live nodes... (5)
   [junit4]   2> 830455 T2020 oascc.ZkStateReader$3.process Updating live nodes... (5)
   [junit4]   2> 830455 T2048 oascc.ZkStateReader$3.process Updating live nodes... (5)
   [junit4]   2> 830454 T1993 oascc.ZkStateReader$3.process Updating live nodes... (5)
   [junit4]   2> 830454 T1988 oascc.ZkStateReader$3.process Updating live nodes... (5)
   [junit4]   2> 830470 T1966 oasc.CorePropertiesLocator.discover Looking for core definitions underneath /usr/home/hudson/hudson-slave/workspace/Lucene-Solr-Tests-4.x-Java6/solr/build/solr-core/test/J0/./org.apache.solr.cloud.CollectionsAPIDistributedZkTest-jetty4-1375428997547
   [junit4]   2> 830635 T1966 oasc.CorePropertiesLocator.discoverUnder Found core conf in /usr/home/hudson/hudson-slave/workspace/Lucene-Solr-Tests-4.x-Java6/solr/build/solr-core/test/J0/./org.apache.solr.cloud.CollectionsAPIDistributedZkTest-jetty4-1375428997547/conf/
   [junit4]   2> 830635 T1966 oasc.CorePropertiesLocator.discover Found 1 core definitions
   [junit4]   2> 830636 T1966 oass.SolrDispatchFilter.init user.dir=/usr/home/hudson/hudson-slave/workspace/Lucene-Solr-Tests-4.x-Java6/solr/build/solr-core/test/J0
   [junit4]   2> 830636 T1966 oass.SolrDispatchFilter.init SolrDispatchFilter.init() done
   [junit4]   2> 830637 T1966 oascsi.HttpClientUtil.createClient Creating new http client, config:maxConnections=128&maxConnectionsPerHost=32&followRedirects=false
   [junit4]   2> 830654 T1966 oascsi.HttpClientUtil.createClient Creating new http client, config:maxConnections=128&maxConnectionsPerHost=32&followRedirects=false
   [junit4]   2> 830666 T1996 oasha.CollectionsHandler.handleCreateAction Creating Collection : numShards=2&name=nodes_used_collection&replicationFactor=2&action=CREATE&wt=javabin&version=2
   [junit4]   2> 830668 T1988 oasc.DistributedQueue$LatchChildWatcher.process Watcher fired on path: /overseer/collection-queue-work state: SyncConnected type NodeChildrenChanged
   [junit4]   2> 830670 T1990 oasc.OverseerCollectionProcessor.run Overseer Collection Processor: Get the message id:/overseer/collection-queue-work/qn-0000000000 message:{
   [junit4]   2> 	  "operation":"createcollection",
   [junit4]   2> 	  "numShards":"2",
   [junit4]   2> 	  "name":"nodes_used_collection",
   [junit4]   2> 	  "replicationFactor":"2"}
   [junit4]   2> 830670 T1990 oasc.OverseerCollectionProcessor.processMessage WARN OverseerCollectionProcessor.processMessage : createcollection , {
   [junit4]   2> 	  "operation":"createcollection",
   [junit4]   2> 	  "numShards":"2",
   [junit4]   2> 	  "name":"nodes_used_collection",
   [junit4]   2> 	  "replicationFactor":"2"}
   [junit4]   2> 831175 T1989 oascc.ZkStateReader.updateClusterState Updating cloud state from ZooKeeper... 
   [junit4]   2> 831176 T1989 oasc.Overseer$ClusterStateUpdater.buildCollection building a new collection: nodes_used_collection
   [junit4]   2> 831176 T1989 oasc.Overseer$ClusterStateUpdater.createCollection Create collection nodes_used_collection with shards [shard1, shard2]
   [junit4]   2> 831189 T2006 oascc.ZkStateReader$2.process A cluster state change: WatchedEvent state:SyncConnected type:NodeDataChanged path:/clusterstate.json, has occurred - updating... (live nodes size: 5)
   [junit4]   2> 831190 T2020 oascc.ZkStateReader$2.process A cluster state change: WatchedEvent state:SyncConnected type:NodeDataChanged path:/clusterstate.json, has occurred - updating... (live nodes size: 5)
   [junit4]   2> 831190 T2034 oascc.ZkStateReader$2.process A cluster state change: WatchedEvent state:SyncConnected type:NodeDataChanged path:/clusterstate.json, has occurred - updating... (live nodes size: 5)
   [junit4]   2> 831190 T1993 oascc.ZkStateReader$2.process A cluster state change: WatchedEvent state:SyncConnected type:NodeDataChanged path:/clusterstate.json, has occurred - updating... (live nodes size: 5)
   [junit4]   2> 831189 T1988 oascc.ZkStateReader$2.process A cluster state change: WatchedEvent state:SyncConnected type:NodeDataChanged path:/clusterstate.json, has occurred - updating... (live nodes size: 5)
   [junit4]   2> 831189 T2048 oascc.ZkStateReader$2.process A cluster state change: WatchedEvent state:SyncConnected type:NodeDataChanged path:/clusterstate.json, has occurred - updating... (live nodes size: 5)
   [junit4]   2> 831279 T1990 oasc.OverseerCollectionProcessor.createCollection going to create cores replicas shardNames [shard1, shard2] , repFactor : 2
   [junit4]   2> 831279 T1990 oasc.OverseerCollectionProcessor.createCollection Creating shard nodes_used_collection_shard1_replica1 as part of slice shard1 of collection nodes_used_collection on 127.0.0.1:48259_
   [junit4]   2> 831279 T1990 oasc.OverseerCollectionProcessor.createCollection Creating shard nodes_used_collection_shard1_replica2 as part of slice shard1 of collection nodes_used_collection on 127.0.0.1:13378_
   [junit4]   2> 831280 T1990 oasc.OverseerCollectionProcessor.createCollection Creating shard nodes_used_collection_shard2_replica1 as part of slice shard2 of collection nodes_used_collection on 127.0.0.1:52807_
   [junit4]   2> 831281 T1990 oasc.OverseerCollectionProcessor.createCollection Creating shard nodes_used_collection_shard2_replica2 as part of slice shard2 of collection nodes_used_collection on 127.0.0.1:62110_
   [junit4]   2> 831283 T1978 oasc.ZkController.publish publishing core=nodes_used_collection_shard1_replica1 state=down
   [junit4]   2> 831284 T2038 oasc.ZkController.publish publishing core=nodes_used_collection_shard2_replica1 state=down
   [junit4]   2> 831283 T2010 oasc.ZkController.publish publishing core=nodes_used_collection_shard1_replica2 state=down
   [junit4]   2> 831284 T2024 oasc.ZkController.publish publishing core=nodes_used_collection_shard2_replica2 state=down
   [junit4]   2> 831285 T1978 oasc.ZkController.waitForCoreNodeName look for our core node name
   [junit4]   2> 831286 T2038 oasc.ZkController.waitForCoreNodeName look for our core node name
   [junit4]   2> 831297 T2010 oasc.ZkController.waitForCoreNodeName look for our core node name
   [junit4]   2> 831297 T2024 oasc.ZkController.waitForCoreNodeName look for our core node name
   [junit4]   2> 832694 T1989 oascc.ZkStateReader.updateClusterState Updating cloud state from ZooKeeper... 
   [junit4]   2> 832696 T1989 oasc.Overseer$ClusterStateUpdater.updateState WARN Could not find collection node for nodes_used_collection, skipping publish state
   [junit4]   2> 832696 T1989 oasc.Overseer$ClusterStateUpdater.updateState Update state numShards=2 message={
   [junit4]   2> 	  "operation":"state",
   [junit4]   2> 	  "core_node_name":"core_node1",
   [junit4]   2> 	  "numShards":"2",
   [junit4]   2> 	  "shard":"shard1",
   [junit4]   2> 	  "roles":null,
   [junit4]   2> 	  "state":"down",
   [junit4]   2> 	  "shard_state":"active",
   [junit4]   2> 	  "core":"nodes_used_collection_shard1_replica1",
   [junit4]   2> 	  "collection":"nodes_used_collection",
   [junit4]   2> 	  "shard_range":null,
   [junit4]   2> 	  "node_name":"127.0.0.1:48259_",
   [junit4]   2> 	  "base_url":"http://127.0.0.1:48259"}
   [junit4]   2> 832700 T1989 oasc.Overseer$ClusterStateUpdater.updateState WARN Could not find collection node for nodes_used_collection, skipping publish state
   [junit4]   2> 832700 T1989 oasc.Overseer$ClusterStateUpdater.updateState Update state numShards=2 message={
   [junit4]   2> 	  "operation":"state",
   [junit4]   2> 	  "core_node_name":"core_node2",
   [junit4]   2> 	  "numShards":"2",
   [junit4]   2> 	  "shard":"shard2",
   [junit4]   2> 	  "roles":null,
   [junit4]   2> 	  "state":"down",
   [junit4]   2> 	  "shard_state":"active",
   [junit4]   2> 	  "core":"nodes_used_collection_shard2_replica1",
   [junit4]   2> 	  "collection":"nodes_used_collection",
   [junit4]   2> 	  "shard_range":null,
   [junit4]   2> 	  "node_name":"127.0.0.1:52807_",
   [junit4]   2> 	  "base_url":"http://127.0.0.1:52807"}
   [junit4]   2> 832715 T1989 oasc.Overseer$ClusterStateUpdater.updateState WARN Could not find collection node for nodes_used_collection, skipping publish state
   [junit4]   2> 832715 T1989 oasc.Overseer$ClusterStateUpdater.updateState Update state numShards=2 message={
   [junit4]   2> 	  "operation":"state",
   [junit4]   2> 	  "core_node_name":"core_node3",
   [junit4]   2> 	  "numShards":"2",
   [junit4]   2> 	  "shard":"shard1",
   [junit4]   2> 	  "roles":null,
   [junit4]   2> 	  "state":"down",
   [junit4]   2> 	  "shard_state":"active",
   [junit4]   2> 	  "core":"nodes_used_collection_shard1_replica2",
   [junit4]   2> 	  "collection":"nodes_used_collection",
   [junit4]   2> 	  "shard_range":null,
   [junit4]   2> 	  "node_name":"127.0.0.1:13378_",
   [junit4]   2> 	  "base_url":"http://127.0.0.1:13378"}
   [junit4]   2> 832719 T1989 oasc.Overseer$ClusterStateUpdater.updateState WARN Could not find collection node for nodes_used_collection, skipping publish state
   [junit4]   2> 832719 T1989 oasc.Overseer$ClusterStateUpdater.updateState Update state numShards=2 message={
   [junit4]   2> 	  "operation":"state",
   [junit4]   2> 	  "core_node_name":"core_node4",
   [junit4]   2> 	  "numShards":"2",
   [junit4]   2> 	  "shard":"shard2",
   [junit4]   2> 	  "roles":null,
   [junit4]   2> 	  "state":"down",
   [junit4]   2> 	  "shard_state":"active",
   [junit4]   2> 	  "core":"nodes_used_collection_shard2_replica2",
   [junit4]   2> 	  "collection":"nodes_used_collection",
   [junit4]   2> 	  "shard_range":null,
   [junit4]   2> 	  "node_name":"127.0.0.1:62110_",
   [junit4]   2> 	  "base_url":"http://127.0.0.1:62110"}
   [junit4]   2> 832723 T2006 oascc.ZkStateReader$2.process A cluster state change: WatchedEvent state:SyncConnected type:NodeDataChanged path:/clusterstate.json, has occurred - updating... (live nodes size: 5)
   [junit4]   2> 832723 T2034 oascc.ZkStateReader$2.process A cluster state change: WatchedEvent state:SyncConnected type:NodeDataChanged path:/clusterstate.json, has occurred - updating... (live nodes size: 5)
   [junit4]   2> 832723 T1993 oascc.ZkStateReader$2.process A cluster state change: WatchedEvent state:SyncConnected type:NodeDataChanged path:/clusterstate.json, has occurred - updating... (live nodes size: 5)
   [junit4]   2> 832723 T2020 oascc.ZkStateReader$2.process A cluster state change: WatchedEvent state:SyncConnected type:NodeDataChanged path:/clusterstate.json, has occurred - updating... (live nodes size: 5)
   [junit4]   2> 832723 T1988 oascc.ZkStateReader$2.process A cluster state change: WatchedEvent state:SyncConnected type:NodeDataChanged path:/clusterstate.json, has occurred - updating... (live nodes size: 5)
   [junit4]   2> 832723 T2048 oascc.ZkStateReader$2.process A cluster state change: WatchedEvent state:SyncConnected type:NodeDataChanged path:/clusterstate.json, has occurred - updating... (live nodes size: 5)
   [junit4]   2> 833287 T1978 oasc.ZkController.waitForShardId waiting to find shard id in clusterstate for nodes_used_collection_shard1_replica1
   [junit4]   2> 833288 T2038 oasc.ZkController.waitForShardId waiting to find shard id in clusterstate for nodes_used_collection_shard2_replica1
   [junit4]   2> 833288 T1978 oasc.CorePropertiesLocator.writePropertiesFile ERROR Couldn't persist core properties to /usr/home/hudson/hudson-slave/workspace/Lucene-Solr-Tests-4.x-Java6/solr/build/solr-core/test/J0/./org.apache.solr.cloud.CollectionsAPIDistributedZkTest-controljetty-1375428991433/nodes_used_collection_shard1_replica1/core.properties: java.io.FileNotFoundException: /usr/home/hudson/hudson-slave/workspace/Lucene-Solr-Tests-4.x-Java6/solr/build/solr-core/test/J0/./org.apache.solr.cloud.CollectionsAPIDistributedZkTest-controljetty-1375428991433/nodes_used_collection_shard1_replica1/core.properties (No such file or directory)
   [junit4]   2> 833288 T1978 oasc.CoreContainer.create Creating SolrCore 'nodes_used_collection_shard1_replica1' using instanceDir: /usr/home/hudson/hudson-slave/workspace/Lucene-Solr-Tests-4.x-Java6/solr/build/solr-core/test/J0/./org.apache.solr.cloud.CollectionsAPIDistributedZkTest-controljetty-1375428991433/nodes_used_collection_shard1_replica1
   [junit4]   2> 833289 T2038 oasc.CorePropertiesLocator.writePropertiesFile ERROR Couldn't persist core properties to /usr/home/hudson/hudson-slave/workspace/Lucene-Solr-Tests-4.x-Java6/solr/build/solr-core/test/J0/./org.apache.solr.cloud.CollectionsAPIDistributedZkTest-jetty4-1375428997547/nodes_used_collection_shard2_replica1/core.properties: java.io.FileNotFoundException: /usr/home/hudson/hudson-slave/workspace/Lucene-Solr-Tests-4.x-Java6/solr/build/solr-core/test/J0/./org.apache.solr.cloud.CollectionsAPIDistributedZkTest-jetty4-1375428997547/nodes_used_collection_shard2_replica1/core.properties (No such file or directory)
   [junit4]   2> 833289 T1978 oasc.ZkController.createCollectionZkNode Check for collection zkNode:nodes_used_collection
   [junit4]   2> 833289 T2038 oasc.CoreContainer.create Creating SolrCore 'nodes_used_collection_shard2_replica1' using instanceDir: /usr/home/hudson/hudson-slave/workspace/Lucene-Solr-Tests-4.x-Java6/solr/build/solr-core/test/J0/./org.apache.solr.cloud.CollectionsAPIDistributedZkTest-jetty4-1375428997547/nodes_used_collection_shard2_replica1
   [junit4]   2> 833290 T1978 oasc.ZkController.createCollectionZkNode Creating collection in ZooKeeper:nodes_used_collection
   [junit4]   2> 833290 T2038 oasc.ZkController.createCollectionZkNode Check for collection zkNode:nodes_used_collection
   [junit4]   2> 833291 T1978 oasc.ZkController.getConfName Looking for collection configName
   [junit4]   2> 833291 T2038 oasc.ZkController.createCollectionZkNode Creating collection in ZooKeeper:nodes_used_collection
   [junit4]   2> 833292 T2038 oasc.ZkController.getConfName Looking for collection configName
   [junit4]   2> 833292 T1978 oasc.ZkController.getConfName Only one config set found in zk - using it:conf1
   [junit4]   2> 833292 T1978 oascc.SolrZkClient.makePath makePath: /collections/nodes_used_collection
   [junit4]   2> 833293 T2038 oasc.ZkController.getConfName Only one config set found in zk - using it:conf1
   [junit4]   2> 833293 T2038 oascc.SolrZkClient.makePath makePath: /collections/nodes_used_collection
   [junit4]   2> 833295 T1978 oasc.ZkController.readConfigName Load collection config from:/collections/nodes_used_collection
   [junit4]   2> 833296 T2038 oasc.ZkController.readConfigName Load collection config from:/collections/nodes_used_collection
   [junit4]   2> 833296 T1978 oasc.SolrResourceLoader.<init> new SolrResourceLoader for directory: '/usr/home/hudson/hudson-slave/workspace/Lucene-Solr-Tests-4.x-Java6/solr/build/solr-core/test/J0/./org.apache.solr.cloud.CollectionsAPIDistributedZkTest-controljetty-1375428991433/nodes_used_collection_shard1_replica1/'
   [junit4]   2> 833297 T2038 oasc.SolrResourceLoader.<init> new SolrResourceLoader for directory: '/usr/home/hudson/hudson-slave/workspace/Lucene-Solr-Tests-4.x-Java6/solr/build/solr-core/test/J0/./org.apache.solr.cloud.CollectionsAPIDistributedZkTest-jetty4-1375428997547/nodes_used_collection_shard2_replica1/'
   [junit4]   2> 833300 T2010 oasc.ZkController.waitForShardId waiting to find shard id in clusterstate for nodes_used_collection_shard1_replica2
   [junit4]   2> 833300 T2024 oasc.ZkController.waitForShardId waiting to find shard id in clusterstate for nodes_used_collection_shard2_replica2
   [junit4]   2> 833301 T2010 oasc.CorePropertiesLocator.writePropertiesFile ERROR Couldn't persist core properties to /usr/home/hudson/hudson-slave/workspace/Lucene-Solr-Tests-4.x-Java6/solr/build/solr-core/test/J0/./org.apache.solr.cloud.CollectionsAPIDistributedZkTest-jetty2-1375428994089/nodes_used_collection_shard1_replica2/core.properties: java.io.FileNotFoundException: /usr/home/hudson/hudson-slave/workspace/Lucene-Solr-Tests-4.x-Java6/solr/build/solr-core/test/J0/./org.apache.solr.cloud.CollectionsAPIDistributedZkTest-jetty2-1375428994089/nodes_used_collection_shard1_replica2/core.properties (No such file or directory)
   [junit4]   2> 833301 T2010 oasc.CoreContainer.create Creating SolrCore 'nodes_used_collection_shard1_replica2' using instanceDir: /usr/home/hudson/hudson-slave/workspace/Lucene-Solr-Tests-4.x-Java6/solr/build/solr-core/test/J0/./org.apache.solr.cloud.CollectionsAPIDistributedZkTest-jetty2-1375428994089/nodes_used_collection_shard1_replica2
   [junit4]   2> 833302 T2010 oasc.ZkController.createCollectionZkNode Check for collection zkNode:nodes_used_collection
   [junit4]   2> 833301 T2024 oasc.CorePropertiesLocator.writePropertiesFile ERROR Couldn't persist core properties to /usr/home/hudson/hudson-slave/workspace/Lucene-Solr-Tests-4.x-Java6/solr/build/solr-core/test/J0/./org.apache.solr.cloud.CollectionsAPIDistributedZkTest-jetty3-1375428995766/nodes_used_collection_shard2_replica2/core.properties: java.io.FileNotFoundException: /usr/home/hudson/hudson-slave/workspace/Lucene-Solr-Tests-4.x-Java6/solr/build/solr-core/test/J0/./org.apache.solr.cloud.CollectionsAPIDistributedZkTest-jetty3-1375428995766/nodes_used_collection_shard2_replica2/core.properties (No such file or directory)
   [junit4]   2> 833302 T2010 oasc.ZkController.createCollectionZkNode Collection zkNode exists
   [junit4]   2> 833303 T2010 oasc.ZkController.readConfigName Load collection config from:/collections/nodes_used_collection
   [junit4]   2> 833302 T2024 oasc.CoreContainer.create Creating SolrCore 'nodes_used_collection_shard2_replica2' using instanceDir: /usr/home/hudson/hudson-slave/workspace/Lucene-Solr-Tests-4.x-Java6/solr/build/solr-core/test/J0/./org.apache.solr.cloud.CollectionsAPIDistributedZkTest-jetty3-1375428995766/nodes_used_collection_shard2_replica2
   [junit4]   2> 833303 T2024 oasc.ZkController.createCollectionZkNode Check for collection zkNode:nodes_used_collection
   [junit4]   2> 833304 T2010 oasc.SolrResourceLoader.<init> new SolrResourceLoader for directory: '/usr/home/hudson/hudson-slave/workspace/Lucene-Solr-Tests-4.x-Java6/solr/build/solr-core/test/J0/./org.apache.solr.cloud.CollectionsAPIDistributedZkTest-jetty2-1375428994089/nodes_used_collection_shard1_replica2/'
   [junit4]   2> 833305 T2024 oasc.ZkController.createCollectionZkNode Collection zkNode exists
   [junit4]   2> 833305 T2024 oasc.ZkController.readConfigName Load collection config from:/collections/nodes_used_collection
   [junit4]   2> 833306 T2024 oasc.SolrResourceLoader.<init> new SolrResourceLoader for directory: '/usr/home/hudson/hudson-slave/workspace/Lucene-Solr-Tests-4.x-Java6/solr/build/solr-core/test/J0/./org.apache.solr.cloud.CollectionsAPIDistributedZkTest-jetty3-1375428995766/nodes_used_collection_shard2_replica2/'
   [junit4]   2> 833422 T2024 oasc.SolrConfig.<init> Using Lucene MatchVersion: LUCENE_45
   [junit4]   2> 833422 T1978 oasc.SolrConfig.<init> Using Lucene MatchVersion: LUCENE_45
   [junit4]   2> 833423 T2010 oasc.SolrConfig.<init> Using Lucene MatchVersion: LUCENE_45
   [junit4]   2> 833424 T2038 oasc.SolrConfig.<init> Using Lucene MatchVersion: LUCENE_45
   [junit4]   2> 833501 T2024 oasc.SolrConfig.<init> Loaded SolrConfig: solrconfig.xml
   [junit4]   2> 833501 T1978 oasc.SolrConfig.<init> Loaded SolrConfig: solrconfig.xml
   [junit4]   2> 833502 T2010 oasc.SolrConfig.<init> Loaded SolrConfig: solrconfig.xml
   [junit4]   2> 833502 T2038 oasc.SolrConfig.<init> Loaded SolrConfig: solrconfig.xml
   [junit4]   2> 833602 T2024 oass.IndexSchema.readSchema Reading Solr Schema from schema.xml
   [junit4]   2> 833603 T1978 oass.IndexSchema.readSchema Reading Solr Schema from schema.xml
   [junit4]   2> 833603 T2010 oass.IndexSchema.readSchema Reading Solr Schema from schema.xml
   [junit4]   2> 833603 T2038 oass.IndexSchema.readSchema Reading Solr Schema from schema.xml
   [junit4]   2> 833613 T2024 oass.IndexSchema.readSchema [nodes_used_collection_shard2_replica2] Schema name=test
   [junit4]   2> 833614 T1978 oass.IndexSchema.readSchema [nodes_used_collection_shard1_replica1] Schema name=test
   [junit4]   2> 833615 T2038 oass.IndexSchema.readSchema [nodes_used_collection_shard2_replica1] Schema name=test
   [junit4]   2> 833615 T2010 oass.IndexSchema.readSchema [nodes_used_collection_shard1_replica2] Schema name=test
   [junit4]   2> 834405 T2024 oass.ByteField.init WARN ByteField is deprecated and will be removed in 5.0. You should use TrieIntField instead.
   [junit4]   2> 834405 T2024 oass.ShortField.init WARN ShortField is deprecated and will be removed in 5.0. You should use TrieIntField instead.
   [junit4]   2> 834405 T2038 oass.ByteField.init WARN ByteField is deprecated and will be removed in 5.0. You should use TrieIntField instead.
   [junit4]   2> 834406 T2024 oass.OpenExchangeRatesOrgProvider.init Initialized with rates=open-exchange-rates.json, refreshInterval=1440.
   [junit4]   2> 834405 T2010 oass.ByteField.init WARN ByteField is deprecated and will be removed in 5.0. You should use TrieIntField instead.
   [junit4]   2> 834406 T2038 oass.ShortField.init WARN ShortField is deprecated and will be removed in 5.0. You should use TrieIntField instead.
   [junit4]   2> 834407 T2010 oass.ShortField.init WARN ShortField is deprecated and will be removed in 5.0. You should use TrieIntField instead.
   [junit4]   2> 834408 T2038 oass.OpenExchangeRatesOrgProvider.init Initialized with rates=open-exchange-rates.json, refreshInterval=1440.
   [junit4]   2> 834408 T2010 oass.OpenExchangeRatesOrgProvider.init Initialized with rates=open-exchange-rates.json, refreshInterval=1440.
   [junit4]   2> 834419 T1978 oass.ByteField.init WARN ByteField is deprecated and will be removed in 5.0. You should use TrieIntField instead.
   [junit4]   2> 834419 T2024 oass.IndexSchema.readSchema default search field in schema is text
   [junit4]   2> 834420 T1978 oass.ShortField.init WARN ShortField is deprecated and will be removed in 5.0. You should use TrieIntField instead.
   [junit4]   2> 834421 T2010 oass.IndexSchema.readSchema default search field in schema is text
   [junit4]   2> 834421 T1978 oass.OpenExchangeRatesOrgProvider.init Initialized with rates=open-exchange-rates.json, refreshInterval=1440.
   [junit4]   2> 834421 T2038 oass.IndexSchema.readSchema default search field in schema is text
   [junit4]   2> 834424 T2024 oass.IndexSchema.readSchema unique key field: id
   [junit4]   2> 834425 T2010 oass.IndexSchema.readSchema unique key field: id
   [junit4]   2> 834426 T2038 oass.IndexSchema.readSchema unique key field: id
   [junit4]   2> 834430 T1978 oass.IndexSchema.readSchema default search field in schema is text
   [junit4]   2> 834434 T1978 oass.IndexSchema.readSchema unique key field: id
   [junit4]   2> 834440 T2024 oass.FileExchangeRateProvider.reload Reloading exchange rates from file currency.xml
   [junit4]   2> 834440 T2010 oass.FileExchangeRateProvider.reload Reloading exchange rates from file currency.xml
   [junit4]   2> 834441 T2038 oass.FileExchangeRateProvider.reload Reloading exchange rates from file currency.xml
   [junit4]   2> 834445 T2024 oass.FileExchangeRateProvider.reload Reloading exchange rates from file currency.xml
   [junit4]   2> 834446 T2038 oass.FileExchangeRateProvider.reload Reloading exchange rates from file currency.xml
   [junit4]   2> 834446 T2010 oass.FileExchangeRateProvider.reload Reloading exchange rates from file currency.xml
   [junit4]   2> 834448 T1978 oass.FileExchangeRateProvider.reload Reloading exchange rates from file currency.xml
   [junit4]   2> 834450 T2024 oass.OpenExchangeRatesOrgProvider.reload Reloading exchange rates from open-exchange-rates.json
   [junit4]   2> 834451 T2038 oass.OpenExchangeRatesOrgProvider.reload Reloading exchange rates from open-exchange-rates.json
   [junit4]   2> 834451 T2010 oass.OpenExchangeRatesOrgProvider.reload Reloading exchange rates from open-exchange-rates.json
   [junit4]   2> 834451 T2024 oass.OpenExchangeRatesOrgProvider$OpenExchangeRates.<init> WARN Unknown key IMPORTANT NOTE
   [junit4]   2> 834452 T2038 oass.OpenExchangeRatesOrgProvider$OpenExchangeRates.<init> WARN Unknown key IMPORTANT NOTE
   [junit4]   2> 834452 T2024 oass.OpenExchangeRatesOrgProvider$OpenExchangeRates.<init> WARN Expected key, got STRING
   [junit4]   2> 834453 T1978 oass.FileExchangeRateProvider.reload Reloading exchange rates from file currency.xml
   [junit4]   2> 834452 T2010 oass.OpenExchangeRatesOrgProvider$OpenExchangeRates.<init> WARN Unknown key IMPORTANT NOTE
   [junit4]   2> 834452 T2038 oass.OpenExchangeRatesOrgProvider$OpenExchangeRates.<init> WARN Expected key, got STRING
   [junit4]   2> 834453 T2010 oass.OpenExchangeRatesOrgProvider$OpenExchangeRates.<init> WARN Expected key, got STRING
   [junit4]   2> 834453 T2024 oass.OpenExchangeRatesOrgProvider.reload Reloading exchange rates from open-exchange-rates.json
   [junit4]   2> 834454 T2010 oass.OpenExchangeRatesOrgProvider.reload Reloading exchange rates from open-exchange-rates.json
   [junit4]   2> 834454 T2038 oass.OpenExchangeRatesOrgProvider.reload Reloading exchange rates from open-exchange-rates.json
   [junit4]   2> 834455 T2024 oass.OpenExchangeRatesOrgProvider$OpenExchangeRates.<init> WARN Unknown key IMPORTANT NOTE
   [junit4]   2> 834456 T2024 oass.OpenExchangeRatesOrgProvider$OpenExchangeRates.<init> WARN Expected key, got STRING
   [junit4]   2> 834456 T2038 oass.OpenExchangeRatesOrgProvider$OpenExchangeRates.<init> WARN Unknown key IMPORTANT NOTE
   [junit4]   2> 834456 T2024 oasc.SolrCore.initDirectoryFactory org.apache.solr.core.MockDirectoryFactory
   [junit4]   2> 834456 T2010 oass.OpenExchangeRatesOrgProvider$OpenExchangeRates.<init> WARN Unknown key IMPORTANT NOTE
   [junit4]   2> 834457 T2024 oasc.SolrCore.<init> [nodes_used_collection_shard2_replica2] Opening new SolrCore at /usr/home/hudson/hudson-slave/workspace/Lucene-Solr-Tests-4.x-Java6/solr/build/solr-core/test/J0/./org.apache.solr.cloud.CollectionsAPIDistributedZkTest-jetty3-1375428995766/nodes_used_collection_shard2_replica2/, dataDir=/usr/home/hudson/hudson-slave/workspace/Lucene-Solr-Tests-4.x-Java6/solr/build/solr-core/test/J0/./org.apache.solr.cloud.CollectionsAPIDistributedZkTest-jetty3-1375428995766//nodes_used_collection_shard2_replica2/data/
   [junit4]   2> 834456 T2038 oass.OpenExchangeRatesOrgProvider$OpenExchangeRates.<init> WARN Expected key, got STRING
   [junit4]   2> 834458 T2024 oasc.JmxMonitoredMap.<init> JMX monitoring is enabled. Adding Solr mbeans to JMX Server: com.sun.jmx.mbeanserver.JmxMBeanServer@715f1f9c
   [junit4]   2> 834457 T1978 oass.OpenExchangeRatesOrgProvider.reload Reloading exchange rates from open-exchange-rates.json
   [junit4]   2> 834457 T2010 oass.OpenExchangeRatesOrgProvider$OpenExchangeRates.<init> WARN Expected key, got STRING
   [junit4]   2> 834458 T2038 oasc.SolrCore.initDirectoryFactory org.apache.solr.core.MockDirectoryFactory
   [junit4]   2> 834459 T2010 oasc.SolrCore.initDirectoryFactory org.apache.solr.core.MockDirectoryFactory
   [junit4]   2> 834459 T2024 oasc.CachingDirectoryFactory.get return new directory for /usr/home/hudson/hudson-slave/workspace/Lucene-Solr-Tests-4.x-Java6/solr/build/solr-core/test/J0/./org.apache.solr.cloud.CollectionsAPIDistributedZkTest-jetty3-1375428995766//nodes_used_collection_shard2_replica2/data
   [junit4]   2> 834460 T2010 oasc.SolrCore.<init> [nodes_used_collection_shard1_replica2] Opening new SolrCore at /usr/home/hudson/hudson-slave/workspace/Lucene-Solr-Tests-4.x-Java6/solr/build/solr-core/test/J0/./org.apache.solr.cloud.CollectionsAPIDistributedZkTest-jetty2-1375428994089/nodes_used_collection_shard1_replica2/, dataDir=/usr/home/hudson/hudson-slave/workspace/Lucene-Solr-Tests-4.x-Java6/solr/build/solr-core/test/J0/./org.apache.solr.cloud.CollectionsAPIDistributedZkTest-jetty2-1375428994089//nodes_used_collection_shard1_replica2/data/
   [junit4]   2> 834460 T1978 oass.OpenExchangeRatesOrgProvider$OpenExchangeRates.<init> WARN Unknown key IMPORTANT NOTE
   [junit4]   2> 834461 T1978 oass.OpenExchangeRatesOrgProvider$OpenExchangeRates.<init> WARN Expected key, got STRING
   [junit4]   2> 834460 T2038 oasc.SolrCore.<init> [nodes_used_collection_shard2_replica1] Opening new SolrCore at /usr/home/hudson/hudson-slave/workspace/Lucene-Solr-Tests-4.x-Java6/solr/build/solr-core/test/J0/./org.apache.solr.cloud.CollectionsAPIDistributedZkTest-jetty4-1375428997547/nodes_used_collection_shard2_replica1/, dataDir=/usr/home/hudson/hudson-slave/workspace/Lucene-Solr-Tests-4.x-Java6/solr/build/solr-core/test/J0/./org.apache.solr.cloud.CollectionsAPIDistributedZkTest-jetty4-1375428997547//nodes_used_collection_shard2_replica1/data/
   [junit4]   2> 834461 T1978 oass.OpenExchangeRatesOrgProvider.reload Reloading exchange rates from open-exchange-rates.json
   [junit4]   2> 834461 T2010 oasc.JmxMonitoredMap.<init> JMX monitoring is enabled. Adding Solr mbeans to JMX Server: com.sun.jmx.mbeanserver.JmxMBeanServer@715f1f9c
   [junit4]   2> 834460 T2024 oasc.SolrCore.getNewIndexDir New index directory detected: old=null new=/usr/home/hudson/hudson-slave/workspace/Lucene-Solr-Tests-4.x-Java6/solr/build/solr-core/test/J0/./org.apache.solr.cloud.CollectionsAPIDistributedZkTest-jetty3-1375428995766//nodes_used_collection_shard2_replica2/data/index/
   [junit4]   2> 834462 T2038 oasc.JmxMonitoredMap.<init> JMX monitoring is enabled. Adding Solr mbeans to JMX Server: com.sun.jmx.mbeanserver.JmxMBeanServer@715f1f9c
   [junit4]   2> 834463 T1978 oass.OpenExchangeRatesOrgProvider$OpenExchangeRates.<init> WARN Unknown key IMPORTANT NOTE
   [junit4]   2> 834463 T1978 oass.OpenExchangeRatesOrgProvider$OpenExchangeRates.<init> WARN Expected key, got STRING
   [junit4]   2> 834463 T2024 oasc.SolrCore.initIndex WARN [nodes_used_collection_shard2_replica2] Solr index directory '/usr/home/hudson/hudson-slave/workspace/Lucene-Solr-Tests-4.x-Java6/solr/build/solr-core/test/J0/./org.apache.solr.cloud.CollectionsAPIDistributedZkTest-jetty3-1375428995766/nodes_used_collection_shard2_replica2/data/index' doesn't exist. Creating new index...
   [junit4]   2> 834464 T1978 oasc.SolrCore.initDirectoryFactory org.apache.solr.core.MockDirectoryFactory
   [junit4]   2> 834464 T2038 oasc.CachingDirectoryFactory.get return new directory for /usr/home/hudson/hudson-slave/workspace/Lucene-Solr-Tests-4.x-Java6/solr/build/solr-core/test/J0/./org.apache.solr.cloud.CollectionsAPIDistributedZkTest-jetty4-1375428997547//nodes_used_collection_shard2_replica1/data
   [junit4]   2> 834463 T2010 oasc.CachingDirectoryFactory.get return new directory for /usr/home/hudson/hudson-slave/workspace/Lucene-Solr-Tests-4.x-Java6/solr/build/solr-core/test/J0/./org.apache.solr.cloud.CollectionsAPIDistributedZkTest-jetty2-1375428994089//nodes_used_collection_shard1_replica2/data
   [junit4]   2> 834465 T2038 oasc.SolrCore.getNewIndexDir New index directory detected: old=null new=/usr/home/hudson/hudson-slave/workspace/Lucene-Solr-Tests-4.x-Java6/solr/build/solr-core/test/J0/./org.apache.solr.cloud.CollectionsAPIDistributedZkTest-jetty4-1375428997547//nodes_used_collection_shard2_replica1/data/index/
   [junit4]   2> 834464 T1978 oasc.SolrCore.<init> [nodes_used_collection_shard1_replica1] Opening new SolrCore at /usr/home/hudson/hudson-slave/workspace/Lucene-Solr-Tests-4.x-Java6/solr/build/solr-core/test/J0/./org.apache.solr.cloud.CollectionsAPIDistributedZkTest-controljetty-1375428991433/nodes_used_collection_shard1_replica1/, dataDir=/usr/home/hudson/hudson-slave/workspace/Lucene-Solr-Tests-4.x-Java6/solr/build/solr-core/test/J0/./org.apache.solr.cloud.CollectionsAPIDistributedZkTest-controljetty-1375428991433//nodes_used_collection_shard1_replica1/data/
   [junit4]   2> 834464 T2024 oasc.CachingDirectoryFactory.get return new directory for /usr/home/hudson/hudson-slave/workspace/Lucene-Solr-Tests-4.x-Java6/solr/build/solr-core/test/J0/./org.apache.solr.cloud.CollectionsAPIDistributedZkTest-jetty3-1375428995766//nodes_used_collection_shard2_replica2/data/index
   [junit4]   2> 834466 T1978 oasc.JmxMonitoredMap.<init> JMX monitoring is enabled. Adding Solr mbeans to JMX Server: com.sun.jmx.mbeanserver.JmxMBeanServer@715f1f9c
   [junit4]   2> 834466 T2038 oasc.SolrCore.initIndex WARN [nodes_used_collection_shard2_replica1] Solr index directory '/usr/home/hudson/hudson-slave/workspace/Lucene-Solr-Tests-4.x-Java6/solr/build/solr-core/test/J0/./org.apache.solr.cloud.CollectionsAPIDistributedZkTest-jetty4-1375428997547/nodes_used_collection_shard2_replica1/data/index' doesn't exist. Creating new index...
   [junit4]   2> 834465 T2010 oasc.SolrCore.getNewIndexDir New index directory detected: old=null new=/usr/home/hudson/hudson-slave/workspace/Lucene-Solr-Tests-4.x-Java6/solr/build/solr-core/test/J0/./org.apache.solr.cloud.CollectionsAPIDistributedZkTest-jetty2-1375428994089//nodes_used_collection_shard1_replica2/data/index/
   [junit4]   2> 834467 T1978 oasc.CachingDirectoryFactory.get return new directory for /usr/home/hudson/hudson-slave/workspace/Lucene-Solr-Tests-4.x-Java6/solr/build/solr-core/test/J0/./org.apache.solr.cloud.CollectionsAPIDistributedZkTest-controljetty-1375428991433//nodes_used_collection_shard1_replica1/data
   [junit4]   2> 834467 T2038 oasc.CachingDirectoryFactory.get return new directory for /usr/home/hudson/hudson-slave/workspace/Lucene-Solr-Tests-4.x-Java6/solr/build/solr-core/test/J0/./org.apache.solr.cloud.CollectionsAPIDistributedZkTest-jetty4-1375428997547//nodes_used_collection_shard2_replica1/data/index
   [junit4]   2> 834467 T2010 oasc.SolrCore.initIndex WARN [nodes_used_collection_shard1_replica2] Solr index directory '/usr/home/hudson/hudson-slave/workspace/Lucene-Solr-Tests-4.x-Java6/solr/build/solr-core/test/J0/./org.apache.solr.cloud.CollectionsAPIDistributedZkTest-jetty2-1375428994089/nodes_used_collection_shard1_replica2/data/index' doesn't exist. Creating new index...
   [junit4]   2> 834468 T1978 oasc.SolrCore.getNewIndexDir New index directory detected: old=null new=/usr/home/hudson/hudson-slave/workspace/Lucene-Solr-Tests-4.x-Java6/solr/build/solr-core/test/J0/./org.apache.solr.cloud.CollectionsAPIDistributedZkTest-controljetty-1375428991433//nodes_used_collection_shard1_replica1/data/index/
   [junit4]   2> 834469 T2010 oasc.CachingDirectoryFactory.get return new directory for /usr/home/hudson/hudson-slave/workspace/Lucene-Solr-Tests-4.x-Java6/solr/build/solr-core/test/J0/./org.apache.solr.cloud.CollectionsAPIDistributedZkTest-jetty2-1375428994089//nodes_used_collection_shard1_replica2/data/index
   [junit4]   2> 834469 T1978 oasc.SolrCore.initIndex WARN [nodes_used_collection_shard1_replica1] Solr index directory '/usr/home/hudson/hudson-slave/workspace/Lucene-Solr-Tests-4.x-Java6/solr/build/solr-core/test/J0/./org.apache.solr.cloud.CollectionsAPIDistributedZkTest-controljetty-1375428991433/nodes_used_collection_shard1_replica1/data/index' doesn't exist. Creating new index...
   [junit4]   2> 834470 T1978 oasc.CachingDirectoryFactory.get return new directory for /usr/home/hudson/hudson-slave/workspace/Lucene-Solr-Tests-4.x-Java6/solr/build/solr-core/test/J0/./org.apache.solr.cloud.CollectionsAPIDistributedZkTest-controljetty-1375428991433//nodes_used_collection_shard1_replica1/data/index
   [junit4]   2> 834471 T2024 oasc.SolrDeletionPolicy.onCommit SolrDeletionPolicy.onCommit: commits: num=1
   [junit4]   2> 		commit{dir=MockDirWrapper(org.apache.lucene.store.RAMDirectory@14fb9870 lockFactory=org.apache.lucene.store.NativeFSLockFactory@5b9a454d),segFN=segments_1,generation=1}
   [junit4]   2> 834471 T2024 oasc.SolrDeletionPolicy.updateCommits newest commit generation = 1
   [junit4]   2> 834474 T2038 oasc.SolrDeletionPolicy.onCommit SolrDeletionPolicy.onCommit: commits: num=1
   [junit4]   2> 		commit{dir=MockDirWrapper(org.apache.lucene.store.RAMDirectory@346bc54d lockFactory=org.apache.lucene.store.NativeFSLockFactory@517e17f7),segFN=segments_1,generation=1}
   [junit4]   2> 834474 T2038 oasc.SolrDeletionPolicy.updateCommits newest commit generation = 1
   [junit4]   2> 834476 T2010 oasc.SolrDeletionPolicy.onCommit SolrDeletionPolicy.onCommit: commits: num=1
   [junit4]   2> 		commit{dir=MockDirWrapper(org.apache.lucene.store.RAMDirectory@4c54acdc lockFactory=org.apache.lucene.store.NativeFSLockFactory@62db6043),segFN=segments_1,generation=1}
   [junit4]   2> 834476 T2024 oasup.UpdateRequestProcessorChain.init inserting DistributedUpdateProcessorFactory into updateRequestProcessorChain "dedupe"
   [junit4]   2> 834476 T1978 oasc.SolrDeletionPolicy.onCommit SolrDeletionPolicy.onCommit: commits: num=1
   [junit4]   2> 		commit{dir=MockDirWrapper(org.apache.lucene.store.RAMDirectory@7957ad65 lockFactory=org.apache.lucene.store.NativeFSLockFactory@72b4b7de),segFN=segments_1,generation=1}
   [junit4]   2> 834477 T2024 oasup.UpdateRequestProcessorChain.init inserting DistributedUpdateProcessorFactory into updateRequestProcessorChain "stored_sig"
   [junit4]   2> 834476 T2010 oasc.SolrDeletionPolicy.updateCommits newest commit generation = 1
   [junit4]   2> 834478 T2024 oasup.UpdateRequestProcessorChain.init inserting DistributedUpdateProcessorFactory into updateRequestProcessorChain "distrib-dup-test-chain-implicit"
   [junit4]   2> 834477 T1978 oasc.SolrDeletionPolicy.updateCommits newest commit generation = 1
   [junit4]   2> 834478 T2024 oasc.RequestHandlers.initHandlersFromConfig created standard: solr.StandardRequestHandler
   [junit4]   2> 834478 T2038 oasup.UpdateRequestProcessorChain.init inserting DistributedUpdateProcessorFactory into updateRequestProcessorChain "dedupe"
   [junit4]   2> 834479 T2024 oasc.RequestHandlers.initHandlersFromConfig created /get: solr.RealTimeGetHandler
   [junit4]   2> 834479 T2038 oasup.UpdateRequestProcessorChain.init inserting DistributedUpdateProcessorFactory into updateRequestProcessorChain "stored_sig"
   [junit4]   2> 834479 T2024 oasc.RequestHandlers.initHandlersFromConfig adding lazy requestHandler: solr.ReplicationHandler
   [junit4]   2> 834480 T2038 oasup.UpdateRequestProcessorChain.init inserting DistributedUpdateProcessorFactory into updateRequestProcessorChain "distrib-dup-test-chain-implicit"
   [junit4]   2> 834480 T2024 oasc.RequestHandlers.initHandlersFromConfig created /replication: solr.ReplicationHandler
   [junit4]   2> 834481 T2038 oasc.RequestHandlers.initHandlersFromConfig created standard: solr.StandardRequestHandler
   [junit4]   2> 834481 T2024 oasc.RequestHandlers.initHandlersFromConfig created /update: solr.UpdateRequestHandler
   [junit4]   2> 834481 T2038 oasc.RequestHandlers.initHandlersFromConfig created /get: solr.RealTimeGetHandler
   [junit4]   2> 834482 T2038 oasc.RequestHandlers.initHandlersFromConfig adding lazy requestHandler: solr.ReplicationHandler
   [junit4]   2> 834482 T2024 oasc.RequestHandlers.initHandlersFromConfig created /admin/: org.apache.solr.handler.admin.AdminHandlers
   [junit4]   2> 834481 T2010 oasup.UpdateRequestProcessorChain.init inserting DistributedUpdateProcessorFactory into updateRequestProcessorChain "dedupe"
   [junit4]   2> 834482 T1978 oasup.UpdateRequestProcessorChain.init inserting DistributedUpdateProcessorFactory into updateRequestProcessorChain "dedupe"
   [junit4]   2> 834482 T2038 oasc.RequestHandlers.initHandlersFromConfig created /replication: solr.ReplicationHandler
   [junit4]   2> 834483 T1978 oasup.UpdateRequestProcessorChain.init inserting DistributedUpdateProcessorFactory into updateRequestProcessorChain "stored_sig"
   [junit4]   2> 834484 T2038 oasc.RequestHandlers.initHandlersFromConfig created /update: solr.UpdateRequestHandler
   [junit4]   2> 834483 T2010 oasup.UpdateRequestProcessorChain.init inserting DistributedUpdateProcessorFactory into updateRequestProcessorChain "stored_sig"
   [junit4]   2> 834484 T2038 oasc.RequestHandlers.initHandlersFromConfig created /admin/: org.apache.solr.handler.admin.AdminHandlers
   [junit4]   2> 834484 T1978 oasup.UpdateRequestProcessorChain.init inserting DistributedUpdateProcessorFactory into updateRequestProcessorChain "distrib-dup-test-chain-implicit"
   [junit4]   2> 834485 T2010 oasup.UpdateRequestProcessorChain.init inserting DistributedUpdateProcessorFactory into updateRequestProcessorChain "distrib-dup-test-chain-implicit"
   [junit4]   2> 834485 T1978 oasc.RequestHandlers.initHandlersFromConfig created standard: solr.StandardRequestHandler
   [junit4]   2> 834486 T2010 oasc.RequestHandlers.initHandlersFromConfig created standard: solr.StandardRequestHandler
   [junit4]   2> 834486 T1978 oasc.RequestHandlers.initHandlersFromConfig created /get: solr.RealTimeGetHandler
   [junit4]   2> 834486 T1978 oasc.RequestHandlers.initHandlersFromConfig adding lazy requestHandler: solr.ReplicationHandler
   [junit4]   2> 834486 T2010 oasc.RequestHandlers.initHandlersFromConfig created /get: solr.RealTimeGetHandler
   [junit4]   2> 834487 T2010 oasc.RequestHandlers.initHandlersFromConfig adding lazy requestHandler: solr.ReplicationHandler
   [junit4]   2> 834487 T1978 oasc.RequestHandlers.initHandlersFromConfig created /replication: solr.ReplicationHandler
   [junit4]   2> 834488 T2010 oasc.RequestHandlers.initHandlersFromConfig created /replication: solr.ReplicationHandler
   [junit4]   2> 834488 T1978 oasc.RequestHandlers.initHandlersFromConfig created /update: solr.UpdateRequestHandler
   [junit4]   2> 834488 T2010 oasc.RequestHandlers.initHandlersFromConfig created /update: solr.UpdateRequestHandler
   [junit4]   2> 834489 T1978 oasc.RequestHandlers.initHandlersFromConfig created /admin/: org.apache.solr.handler.admin.AdminHandlers
   [junit4]   2> 834489 T2010 oasc.RequestHandlers.initHandlersFromConfig created /admin/: org.apache.solr.handler.admin.AdminHandlers
   [junit4]   2> 834494 T2038 oashl.XMLLoader.init xsltCacheLifetimeSeconds=60
   [junit4]   2> 834494 T2024 oashl.XMLLoader.init xsltCacheLifetimeSeconds=60
   [junit4]   2> 834494 T2010 oashl.XMLLoader.init xsltCacheLifetimeSeconds=60
   [junit4]   2> 834494 T1978 oashl.XMLLoader.init xsltCacheLifetimeSeconds=60
   [junit4]   2> 834505 T2038 oass.SolrIndexSearcher.<init> Opening Searcher@89fbf93 main
   [junit4]   2> 834505 T2010 oass.SolrIndexSearcher.<init> Opening Searcher@643a345c main
   [junit4]   2> 834505 T2024 oass.SolrIndexSearcher.<init> Opening Searcher@2e467c49 main
   [junit4]   2> 834505 T1978 oass.SolrIndexSearcher.<init> Opening Searcher@13540ae0 main
   [junit4]   2> 834506 T2038 oasu.CommitTracker.<init> Hard AutoCommit: disabled
   [junit4]   2> 834507 T2038 oasu.CommitTracker.<init> Soft AutoCommit: disabled
   [junit4]   2> 834507 T2010 oasu.CommitTracker.<init> Hard AutoCommit: disabled
   [junit4]   2> 834507 T1978 oasu.CommitTracker.<init> Hard AutoCommit: disabled
   [junit4]   2> 834507 T2010 oasu.CommitTracker.<init> Soft AutoCommit: disabled
   [junit4]   2> 834507 T2024 oasu.CommitTracker.<init> Hard AutoCommit: disabled
   [junit4]   2> 834508 T1978 oasu.CommitTracker.<init> Soft AutoCommit: disabled
   [junit4]   2> 834509 T2024 oasu.CommitTracker.<init> Soft AutoCommit: disabled
   [junit4]   2> 834510 T2054 oasc.SolrCore.registerSearcher [nodes_used_collection_shard2_replica1] Registered new searcher Searcher@89fbf93 main{StandardDirectoryReader(segments_1:1)}
   [junit4]   2> 834511 T2057 oasc.SolrCore.registerSearcher [nodes_used_collection_shard1_replica2] Registered new searcher Searcher@643a345c main{StandardDirectoryReader(segments_1:1)}
   [junit4]   2> 834512 T2055 oasc.SolrCore.registerSearcher [nodes_used_collection_shard1_replica1] Registered new searcher Searcher@13540ae0 main{StandardDirectoryReader(segments_1:1)}
   [junit4]   2> 834512 T2038 oasc.CoreContainer.registerCore registering core: nodes_used_collection_shard2_replica1
   [junit4]   2> 834513 T2056 oasc.SolrCore.registerSearcher [nodes_used_collection_shard2_replica2] Registered new searcher Searcher@2e467c49 main{StandardDirectoryReader(segments_1:1)}
   [junit4]   2> 834513 T2038 oasc.ZkController.register Register replica - core:nodes_used_collection_shard2_replica1 address:http://127.0.0.1:52807 collection:nodes_used_collection shard:shard2
   [junit4]   2> 834513 T2038 oascsi.HttpClientUtil.createClient Creating new http client, config:maxConnections=10000&maxConnectionsPerHost=20&connTimeout=15000&socketTimeout=30000&retry=false
   [junit4]   2> 834514 T1978 oasc.CoreContainer.registerCore registering core: nodes_used_collection_shard1_replica1
   [junit4]   2> 834514 T2010 oasc.CoreContainer.registerCore registering core: nodes_used_collection_shard1_replica2
   [junit4]   2> 834514 T1978 oasc.ZkController.register Register replica - core:nodes_used_collection_shard1_replica1 address:http://127.0.0.1:48259 collection:nodes_used_collection shard:shard1
   [junit4]   2> 834514 T2024 oasc.CoreContainer.registerCore registering core: nodes_used_collection_shard2_replica2
   [junit4]   2> 834515 T1978 oascsi.HttpClientUtil.createClient Creating new http client, config:maxConnections=10000&maxConnectionsPerHost=20&connTimeout=15000&socketTimeout=30000&retry=false
   [junit4]   2> 834514 T2010 oasc.ZkController.register Register replica - core:nodes_used_collection_shard1_replica2 address:http://127.0.0.1:13378 collection:nodes_used_collection shard:shard1
   [junit4]   2> 834515 T2024 oasc.ZkController.register Register replica - core:nodes_used_collection_shard2_replica2 address:http://127.0.0.1:62110 collection:nodes_used_collection shard:shard2
   [junit4]   2> 834516 T2010 oascsi.HttpClientUtil.createClient Creating new http client, config:maxConnections=10000&maxConnectionsPerHost=20&connTimeout=15000&socketTimeout=30000&retry=false
   [junit4]   2> 834516 T2024 oascsi.HttpClientUtil.createClient Creating new http client, config:maxConnections=10000&maxConnectionsPerHost=20&connTimeout=15000&socketTimeout=30000&retry=false
   [junit4]   2> 834542 T2038 oascc.SolrZkClient.makePath makePath: /collections/nodes_used_collection/leader_elect/shard2/election
   [junit4]   2> 834542 T1978 oascc.SolrZkClient.makePath makePath: /collections/nodes_used_collection/leader_elect/shard1/election
   [junit4]   2> 834542 T2010 oascc.SolrZkClient.makePath makePath: /collections/nodes_used_collection/leader_elect/shard1/election
   [junit4]   2> 834542 T2024 oascc.SolrZkClient.makePath makePath: /collections/nodes_used_collection/leader_elect/shard2/election
   [junit4]   2> 834577 T2010 oasc.ShardLeaderElectionContext.runLeaderProcess Running the leader process for shard shard1
   [junit4]   2> 834578 T2038 oasc.ShardLeaderElectionContext.runLeaderProcess Running the leader process for shard shard2
   [junit4]   2> 834580 T2010 oasc.ShardLeaderElectionContext.waitForReplicasToComeUp Enough replicas found to continue.
   [junit4]   2> 834581 T2038 oasc.ShardLeaderElectionContext.waitForReplicasToComeUp Enough replicas found to continue.
   [junit4]   2> 834581 T2010 oasc.ShardLeaderElectionContext.runLeaderProcess I may be the new leader - try and sync
   [junit4]   2> 834581 T2038 oasc.ShardLeaderElectionContext.runLeaderProcess I may be the new leader - try and sync
   [junit4]   2> 834582 T2010 oasc.SyncStrategy.sync Sync replicas to http://127.0.0.1:13378/nodes_used_collection_shard1_replica2/
   [junit4]   2> 834582 T2038 oasc.SyncStrategy.sync Sync replicas to http://127.0.0.1:52807/nodes_used_collection_shard2_replica1/
   [junit4]   2> 834582 T2010 oasu.PeerSync.sync PeerSync: core=nodes_used_collection_shard1_replica2 url=http://127.0.0.1:13378 START replicas=[http://127.0.0.1:48259/nodes_used_collection_shard1_replica1/] nUpdates=100
   [junit4]   2> 834583 T2038 oasu.PeerSync.sync PeerSync: core=nodes_used_collection_shard2_replica1 url=http://127.0.0.1:52807 START replicas=[http://127.0.0.1:62110/nodes_used_collection_shard2_replica2/] nUpdates=100
   [junit4]   2> 834583 T2010 oasu.PeerSync.sync PeerSync: core=nodes_used_collection_shard1_replica2 url=http://127.0.0.1:13378 DONE.  We have no versions.  sync failed.
   [junit4]   2> 834584 T2010 oasc.SyncStrategy.syncReplicas Leader's attempt to sync with shard failed, moving to the next candidate
   [junit4]   2> 834584 T2038 oasu.PeerSync.sync PeerSync: core=nodes_used_collection_shard2_replica1 url=http://127.0.0.1:52807 DONE.  We have no versions.  sync failed.
   [junit4]   2> 834585 T2038 oasc.SyncStrategy.syncReplicas Leader's attempt to sync with shard failed, moving to the next candidate
   [junit4]   2> 834584 T2010 oasc.ShardLeaderElectionContext.runLeaderProcess We failed sync, but we have no versions - we can't sync in that case - we were active before, so become leader anyway
   [junit4]   2> 834585 T2038 oasc.ShardLeaderElectionContext.runLeaderProcess We failed sync, but we have no versions - we can't sync in that case - we were active before, so become leader anyway
   [junit4]   2> 834586 T2010 oasc.ShardLeaderElectionContext.runLeaderProcess I am the new leader: http://127.0.0.1:13378/nodes_used_collection_shard1_replica2/ shard1
   [junit4]   2> 834586 T2038 oasc.ShardLeaderElectionContext.runLeaderProcess I am the new leader: http://127.0.0.1:52807/nodes_used_collection_shard2_replica1/ shard2
   [junit4]   2> 834587 T2010 o

[...truncated too long message...]

s.slow=true -Dtests.locale=ar_EG -Dtests.timezone=America/Lima -Dtests.file.encoding=US-ASCII
   [junit4] ERROR    154s J0 | CollectionsAPIDistributedZkTest.testDistribSearch <<<
   [junit4]    > Throwable #1: org.apache.solr.client.solrj.SolrServerException: IOException occured when talking to server at: http://127.0.0.1:13859
   [junit4]    > 	at __randomizedtesting.SeedInfo.seed([B701640FB7A6E045:36E7EA17C0F98079]:0)
   [junit4]    > 	at org.apache.solr.client.solrj.impl.HttpSolrServer.request(HttpSolrServer.java:435)
   [junit4]    > 	at org.apache.solr.client.solrj.impl.HttpSolrServer.request(HttpSolrServer.java:180)
   [junit4]    > 	at org.apache.solr.cloud.CollectionsAPIDistributedZkTest.testCustomCollectionsAPI(CollectionsAPIDistributedZkTest.java:764)
   [junit4]    > 	at org.apache.solr.cloud.CollectionsAPIDistributedZkTest.doTest(CollectionsAPIDistributedZkTest.java:159)
   [junit4]    > 	at org.apache.solr.BaseDistributedSearchTestCase.testDistribSearch(BaseDistributedSearchTestCase.java:835)
   [junit4]    > 	at java.lang.Thread.run(Thread.java:679)
   [junit4]    > Caused by: org.apache.http.conn.ConnectTimeoutException: Connect to 127.0.0.1:13859 timed out
   [junit4]    > 	at org.apache.http.conn.scheme.PlainSocketFactory.connectSocket(PlainSocketFactory.java:129)
   [junit4]    > 	at org.apache.http.impl.conn.DefaultClientConnectionOperator.openConnection(DefaultClientConnectionOperator.java:180)
   [junit4]    > 	at org.apache.http.impl.conn.ManagedClientConnectionImpl.open(ManagedClientConnectionImpl.java:294)
   [junit4]    > 	at org.apache.http.impl.client.DefaultRequestDirector.tryConnect(DefaultRequestDirector.java:645)
   [junit4]    > 	at org.apache.http.impl.client.DefaultRequestDirector.execute(DefaultRequestDirector.java:480)
   [junit4]    > 	at org.apache.http.impl.client.AbstractHttpClient.execute(AbstractHttpClient.java:906)
   [junit4]    > 	at org.apache.http.impl.client.AbstractHttpClient.execute(AbstractHttpClient.java:805)
   [junit4]    > 	at org.apache.http.impl.client.AbstractHttpClient.execute(AbstractHttpClient.java:784)
   [junit4]    > 	at org.apache.solr.client.solrj.impl.HttpSolrServer.request(HttpSolrServer.java:365)
   [junit4]    > 	... 44 more
   [junit4]   2> 976835 T1966 oas.SolrTestCaseJ4.deleteCore ###deleteCore
   [junit4]   2> 154289 T1965 ccr.ThreadLeakControl.checkThreadLeaks WARNING Will linger awaiting termination of 2 leaked thread(s).
   [junit4]   2> 977945 T2048 oasc.LeaderElector$1.process WARN  org.apache.zookeeper.KeeperException$SessionExpiredException: KeeperErrorCode = Session expired for /collections/new_implicit_coll_0/leader_elect/b/election
   [junit4]   2> 	at org.apache.zookeeper.KeeperException.create(KeeperException.java:127)
   [junit4]   2> 	at org.apache.zookeeper.KeeperException.create(KeeperException.java:51)
   [junit4]   2> 	at org.apache.zookeeper.ZooKeeper.getChildren(ZooKeeper.java:1468)
   [junit4]   2> 	at org.apache.solr.common.cloud.SolrZkClient$6.execute(SolrZkClient.java:235)
   [junit4]   2> 	at org.apache.solr.common.cloud.SolrZkClient$6.execute(SolrZkClient.java:232)
   [junit4]   2> 	at org.apache.solr.common.cloud.ZkCmdExecutor.retryOperation(ZkCmdExecutor.java:65)
   [junit4]   2> 	at org.apache.solr.common.cloud.SolrZkClient.getChildren(SolrZkClient.java:232)
   [junit4]   2> 	at org.apache.solr.cloud.LeaderElector.checkIfIamLeader(LeaderElector.java:84)
   [junit4]   2> 	at org.apache.solr.cloud.LeaderElector.access$000(LeaderElector.java:55)
   [junit4]   2> 	at org.apache.solr.cloud.LeaderElector$1.process(LeaderElector.java:129)
   [junit4]   2> 	at org.apache.zookeeper.ClientCnxn$EventThread.processEvent(ClientCnxn.java:519)
   [junit4]   2> 	at org.apache.zookeeper.ClientCnxn$EventThread.run(ClientCnxn.java:495)
   [junit4]   2> 
   [junit4]   2> 977945 T2048 oasc.LeaderElector$1.process WARN  org.apache.zookeeper.KeeperException$SessionExpiredException: KeeperErrorCode = Session expired for /collections/new_implicit_coll_1/leader_elect/c/election
   [junit4]   2> 	at org.apache.zookeeper.KeeperException.create(KeeperException.java:127)
   [junit4]   2> 	at org.apache.zookeeper.KeeperException.create(KeeperException.java:51)
   [junit4]   2> 	at org.apache.zookeeper.ZooKeeper.getChildren(ZooKeeper.java:1468)
   [junit4]   2> 	at org.apache.solr.common.cloud.SolrZkClient$6.execute(SolrZkClient.java:235)
   [junit4]   2> 	at org.apache.solr.common.cloud.SolrZkClient$6.execute(SolrZkClient.java:232)
   [junit4]   2> 	at org.apache.solr.common.cloud.ZkCmdExecutor.retryOperation(ZkCmdExecutor.java:65)
   [junit4]   2> 	at org.apache.solr.common.cloud.SolrZkClient.getChildren(SolrZkClient.java:232)
   [junit4]   2> 	at org.apache.solr.cloud.LeaderElector.checkIfIamLeader(LeaderElector.java:84)
   [junit4]   2> 	at org.apache.solr.cloud.LeaderElector.access$000(LeaderElector.java:55)
   [junit4]   2> 	at org.apache.solr.cloud.LeaderElector$1.process(LeaderElector.java:129)
   [junit4]   2> 	at org.apache.zookeeper.ClientCnxn$EventThread.processEvent(ClientCnxn.java:519)
   [junit4]   2> 	at org.apache.zookeeper.ClientCnxn$EventThread.run(ClientCnxn.java:495)
   [junit4]   2> 
   [junit4]   2> 977946 T2048 oascc.ZkStateReader$3.process WARN ZooKeeper watch triggered, but Solr cannot talk to ZK
   [junit4]   2> 977946 T2048 oascc.ZkStateReader$2.process A cluster state change: WatchedEvent state:SyncConnected type:NodeChildrenChanged path:/live_nodes, has occurred - updating... (live nodes size: 1)
   [junit4]   2> 977946 T2048 oascc.ZkStateReader$2.process WARN ZooKeeper watch triggered, but Solr cannot talk to ZK
   [junit4]   2> NOTE: test params are: codec=Lucene42: {range_facet_l=Pulsing41(freqCutoff=16 minBlockSize=50 maxBlockSize=126), _route_=PostingsFormat(name=TestBloomFilteredLucene41Postings), text=PostingsFormat(name=TestBloomFilteredLucene41Postings), _version_=Pulsing41(freqCutoff=16 minBlockSize=50 maxBlockSize=126), intDefault=Pulsing41(freqCutoff=16 minBlockSize=50 maxBlockSize=126), id=Lucene41(blocksize=128), timestamp=Pulsing41(freqCutoff=16 minBlockSize=50 maxBlockSize=126), a_t=Pulsing41(freqCutoff=16 minBlockSize=50 maxBlockSize=126), range_facet_sl=PostingsFormat(name=TestBloomFilteredLucene41Postings), range_facet_si=PostingsFormat(name=Memory doPackFST= false), other_tl1=Pulsing41(freqCutoff=16 minBlockSize=50 maxBlockSize=126), multiDefault=PostingsFormat(name=Memory doPackFST= false), a_si=PostingsFormat(name=Memory doPackFST= false)}, docValues:{}, sim=RandomSimilarityProvider(queryNorm=false,coord=no): {}, locale=ar_EG, timezone=America/Lima
   [junit4]   2> NOTE: FreeBSD 9.1-RELEASE-p3 amd64/Sun Microsystems Inc. 1.6.0_32 (64-bit)/cpus=16,threads=2,free=158501872,total=444858368
   [junit4]   2> NOTE: All tests run in this JVM: [ChaosMonkeyNothingIsSafeTest, LoggingHandlerTest, SolrInfoMBeanTest, TestStressVersions, CSVRequestHandlerTest, TestSearchPerf, TestJoin, ResponseLogComponentTest, BlockDirectoryTest, PeerSyncTest, QueryParsingTest, CoreMergeIndexesAdminHandlerTest, SOLR749Test, TestPHPSerializedResponseWriter, CacheHeaderTest, MinimalSchemaTest, TestDefaultSearchFieldResource, SolrTestCaseJ4Test, TestRandomDVFaceting, TestSolrDeletionPolicy1, UnloadDistributedZkTest, SuggesterFSTTest, CoreAdminHandlerTest, SystemInfoHandlerTest, LegacyHTMLStripCharFilterTest, TestPhraseSuggestions, TestExtendedDismaxParser, RAMDirectoryFactoryTest, TestSolrDeletionPolicy2, TestFuzzyAnalyzedSuggestions, TestPropInjectDefaults, TestReversedWildcardFilterFactory, SpellingQueryConverterTest, HdfsDirectoryTest, WordBreakSolrSpellCheckerTest, StressHdfsTest, MBeansHandlerTest, TestValueSourceCache, ShowFileRequestHandlerTest, TestStressRecovery, IndexSchemaTest, TestShardHandlerFactory, HdfsChaosMonkeySafeLeaderTest, TestSolrXml, SchemaVersionSpecificBehaviorTest, SynonymTokenizerTest, HdfsUnloadDistributedZkTest, TestMaxScoreQueryParser, DirectSolrConnectionTest, TestSolrXmlPersistence, ReturnFieldsTest, SoftAutoCommitTest, SliceStateUpdateTest, ZkControllerTest, TestUniqueKeyFieldResource, PluginInfoTest, AutoCommitTest, BasicFunctionalityTest, TestFieldTypeCollectionResource, ClusterStateUpdateTest, QueryEqualityTest, StatelessScriptUpdateProcessorFactoryTest, TestSort, RegexBoostProcessorTest, TestRecoveryHdfs, ExternalFileFieldSortTest, SearchHandlerTest, AliasIntegrationTest, TestFastLRUCache, TestWriterPerf, AlternateDirectoryTest, SliceStateTest, TestCharFilters, DocumentBuilderTest, PreAnalyzedFieldTest, SuggesterTest, ZkCLITest, TestSolrIndexConfig, PolyFieldTest, DirectUpdateHandlerOptimizeTest, ChaosMonkeySafeLeaderTest, CollectionsAPIDistributedZkTest]
   [junit4] Completed on J0 in 155.58s, 1 test, 1 error <<< FAILURES!

[...truncated 510 lines...]
BUILD FAILED
/usr/home/hudson/hudson-slave/workspace/Lucene-Solr-Tests-4.x-Java6/build.xml:395: The following error occurred while executing this line:
/usr/home/hudson/hudson-slave/workspace/Lucene-Solr-Tests-4.x-Java6/build.xml:375: The following error occurred while executing this line:
/usr/home/hudson/hudson-slave/workspace/Lucene-Solr-Tests-4.x-Java6/build.xml:39: The following error occurred while executing this line:
/usr/home/hudson/hudson-slave/workspace/Lucene-Solr-Tests-4.x-Java6/solr/build.xml:181: The following error occurred while executing this line:
/usr/home/hudson/hudson-slave/workspace/Lucene-Solr-Tests-4.x-Java6/solr/common-build.xml:449: The following error occurred while executing this line:
/usr/home/hudson/hudson-slave/workspace/Lucene-Solr-Tests-4.x-Java6/lucene/common-build.xml:1233: The following error occurred while executing this line:
/usr/home/hudson/hudson-slave/workspace/Lucene-Solr-Tests-4.x-Java6/lucene/common-build.xml:876: There were test failures: 321 suites, 1352 tests, 1 error, 35 ignored (7 assumptions)

Total time: 56 minutes 20 seconds
Build step 'Invoke Ant' marked build as failure
Archiving artifacts
Recording test results
Email was triggered for: Failure
Sending email for trigger: Failure



Mime
View raw message