lucene-dev mailing list archives

Site index · List index
Message view « Date » · « Thread »
Top « Date » · « Thread »
From Policeman Jenkins Server <jenk...@thetaphi.de>
Subject [JENKINS] Lucene-Solr-4.x-Windows (64bit/jdk1.7.0_25) - Build # 3047 - Failure!
Date Sat, 03 Aug 2013 20:05:26 GMT
Build: http://jenkins.thetaphi.de/job/Lucene-Solr-4.x-Windows/3047/
Java: 64bit/jdk1.7.0_25 -XX:-UseCompressedOops -XX:+UseG1GC

4 tests failed.
FAILED:  junit.framework.TestSuite.org.apache.solr.core.TestLazyCores

Error Message:
ERROR: SolrIndexSearcher opens=36 closes=35

Stack Trace:
java.lang.AssertionError: ERROR: SolrIndexSearcher opens=36 closes=35
	at __randomizedtesting.SeedInfo.seed([E9A8C75E789CABD9]:0)
	at org.junit.Assert.fail(Assert.java:93)
	at org.apache.solr.SolrTestCaseJ4.endTrackingSearchers(SolrTestCaseJ4.java:301)
	at org.apache.solr.SolrTestCaseJ4.afterClass(SolrTestCaseJ4.java:129)
	at sun.reflect.GeneratedMethodAccessor77.invoke(Unknown Source)
	at sun.reflect.DelegatingMethodAccessorImpl.invoke(DelegatingMethodAccessorImpl.java:43)
	at java.lang.reflect.Method.invoke(Method.java:606)
	at com.carrotsearch.randomizedtesting.RandomizedRunner.invoke(RandomizedRunner.java:1559)
	at com.carrotsearch.randomizedtesting.RandomizedRunner.access$600(RandomizedRunner.java:79)
	at com.carrotsearch.randomizedtesting.RandomizedRunner$5.evaluate(RandomizedRunner.java:700)
	at com.carrotsearch.randomizedtesting.rules.StatementAdapter.evaluate(StatementAdapter.java:36)
	at com.carrotsearch.randomizedtesting.rules.SystemPropertiesRestoreRule$1.evaluate(SystemPropertiesRestoreRule.java:53)
	at org.apache.lucene.util.AbstractBeforeAfterRule$1.evaluate(AbstractBeforeAfterRule.java:46)
	at org.apache.lucene.util.TestRuleStoreClassName$1.evaluate(TestRuleStoreClassName.java:42)
	at com.carrotsearch.randomizedtesting.rules.SystemPropertiesInvariantRule$1.evaluate(SystemPropertiesInvariantRule.java:55)
	at com.carrotsearch.randomizedtesting.rules.NoShadowingOrOverridesOnMethodsRule$1.evaluate(NoShadowingOrOverridesOnMethodsRule.java:39)
	at com.carrotsearch.randomizedtesting.rules.NoShadowingOrOverridesOnMethodsRule$1.evaluate(NoShadowingOrOverridesOnMethodsRule.java:39)
	at com.carrotsearch.randomizedtesting.rules.StatementAdapter.evaluate(StatementAdapter.java:36)
	at org.apache.lucene.util.TestRuleAssertionsRequired$1.evaluate(TestRuleAssertionsRequired.java:43)
	at org.apache.lucene.util.TestRuleMarkFailure$1.evaluate(TestRuleMarkFailure.java:48)
	at org.apache.lucene.util.TestRuleIgnoreAfterMaxFailures$1.evaluate(TestRuleIgnoreAfterMaxFailures.java:70)
	at org.apache.lucene.util.TestRuleIgnoreTestSuites$1.evaluate(TestRuleIgnoreTestSuites.java:55)
	at com.carrotsearch.randomizedtesting.rules.StatementAdapter.evaluate(StatementAdapter.java:36)
	at com.carrotsearch.randomizedtesting.ThreadLeakControl$StatementRunner.run(ThreadLeakControl.java:358)
	at java.lang.Thread.run(Thread.java:724)


FAILED:  junit.framework.TestSuite.org.apache.solr.core.TestLazyCores

Error Message:
1 thread leaked from SUITE scope at org.apache.solr.core.TestLazyCores:     1) Thread[id=6781, name=searcherExecutor-3920-thread-1, state=WAITING, group=TGRP-TestLazyCores]         at sun.misc.Unsafe.park(Native Method)         at java.util.concurrent.locks.LockSupport.park(LockSupport.java:186)         at java.util.concurrent.locks.AbstractQueuedSynchronizer$ConditionObject.await(AbstractQueuedSynchronizer.java:2043)         at java.util.concurrent.LinkedBlockingQueue.take(LinkedBlockingQueue.java:442)         at java.util.concurrent.ThreadPoolExecutor.getTask(ThreadPoolExecutor.java:1068)         at java.util.concurrent.ThreadPoolExecutor.runWorker(ThreadPoolExecutor.java:1130)         at java.util.concurrent.ThreadPoolExecutor$Worker.run(ThreadPoolExecutor.java:615)         at java.lang.Thread.run(Thread.java:724)

Stack Trace:
com.carrotsearch.randomizedtesting.ThreadLeakError: 1 thread leaked from SUITE scope at org.apache.solr.core.TestLazyCores: 
   1) Thread[id=6781, name=searcherExecutor-3920-thread-1, state=WAITING, group=TGRP-TestLazyCores]
        at sun.misc.Unsafe.park(Native Method)
        at java.util.concurrent.locks.LockSupport.park(LockSupport.java:186)
        at java.util.concurrent.locks.AbstractQueuedSynchronizer$ConditionObject.await(AbstractQueuedSynchronizer.java:2043)
        at java.util.concurrent.LinkedBlockingQueue.take(LinkedBlockingQueue.java:442)
        at java.util.concurrent.ThreadPoolExecutor.getTask(ThreadPoolExecutor.java:1068)
        at java.util.concurrent.ThreadPoolExecutor.runWorker(ThreadPoolExecutor.java:1130)
        at java.util.concurrent.ThreadPoolExecutor$Worker.run(ThreadPoolExecutor.java:615)
        at java.lang.Thread.run(Thread.java:724)
	at __randomizedtesting.SeedInfo.seed([E9A8C75E789CABD9]:0)


FAILED:  junit.framework.TestSuite.org.apache.solr.core.TestLazyCores

Error Message:
There are still zombie threads that couldn't be terminated:    1) Thread[id=6781, name=searcherExecutor-3920-thread-1, state=WAITING, group=TGRP-TestLazyCores]         at sun.misc.Unsafe.park(Native Method)         at java.util.concurrent.locks.LockSupport.park(LockSupport.java:186)         at java.util.concurrent.locks.AbstractQueuedSynchronizer$ConditionObject.await(AbstractQueuedSynchronizer.java:2043)         at java.util.concurrent.LinkedBlockingQueue.take(LinkedBlockingQueue.java:442)         at java.util.concurrent.ThreadPoolExecutor.getTask(ThreadPoolExecutor.java:1068)         at java.util.concurrent.ThreadPoolExecutor.runWorker(ThreadPoolExecutor.java:1130)         at java.util.concurrent.ThreadPoolExecutor$Worker.run(ThreadPoolExecutor.java:615)         at java.lang.Thread.run(Thread.java:724)

Stack Trace:
com.carrotsearch.randomizedtesting.ThreadLeakError: There are still zombie threads that couldn't be terminated:
   1) Thread[id=6781, name=searcherExecutor-3920-thread-1, state=WAITING, group=TGRP-TestLazyCores]
        at sun.misc.Unsafe.park(Native Method)
        at java.util.concurrent.locks.LockSupport.park(LockSupport.java:186)
        at java.util.concurrent.locks.AbstractQueuedSynchronizer$ConditionObject.await(AbstractQueuedSynchronizer.java:2043)
        at java.util.concurrent.LinkedBlockingQueue.take(LinkedBlockingQueue.java:442)
        at java.util.concurrent.ThreadPoolExecutor.getTask(ThreadPoolExecutor.java:1068)
        at java.util.concurrent.ThreadPoolExecutor.runWorker(ThreadPoolExecutor.java:1130)
        at java.util.concurrent.ThreadPoolExecutor$Worker.run(ThreadPoolExecutor.java:615)
        at java.lang.Thread.run(Thread.java:724)
	at __randomizedtesting.SeedInfo.seed([E9A8C75E789CABD9]:0)


FAILED:  org.apache.solr.cloud.CollectionsAPIDistributedZkTest.testDistribSearch

Error Message:
Server refused connection at: http://127.0.0.1:53567/y/f

Stack Trace:
org.apache.solr.client.solrj.SolrServerException: Server refused connection at: http://127.0.0.1:53567/y/f
	at __randomizedtesting.SeedInfo.seed([E9A8C75E789CABD9:684E49460FC3CBE5]:0)
	at org.apache.solr.client.solrj.impl.HttpSolrServer.request(HttpSolrServer.java:428)
	at org.apache.solr.client.solrj.impl.HttpSolrServer.request(HttpSolrServer.java:180)
	at org.apache.solr.cloud.CollectionsAPIDistributedZkTest.testCustomCollectionsAPI(CollectionsAPIDistributedZkTest.java:764)
	at org.apache.solr.cloud.CollectionsAPIDistributedZkTest.doTest(CollectionsAPIDistributedZkTest.java:159)
	at org.apache.solr.BaseDistributedSearchTestCase.testDistribSearch(BaseDistributedSearchTestCase.java:835)
	at sun.reflect.NativeMethodAccessorImpl.invoke0(Native Method)
	at sun.reflect.NativeMethodAccessorImpl.invoke(NativeMethodAccessorImpl.java:57)
	at sun.reflect.DelegatingMethodAccessorImpl.invoke(DelegatingMethodAccessorImpl.java:43)
	at java.lang.reflect.Method.invoke(Method.java:606)
	at com.carrotsearch.randomizedtesting.RandomizedRunner.invoke(RandomizedRunner.java:1559)
	at com.carrotsearch.randomizedtesting.RandomizedRunner.access$600(RandomizedRunner.java:79)
	at com.carrotsearch.randomizedtesting.RandomizedRunner$6.evaluate(RandomizedRunner.java:737)
	at com.carrotsearch.randomizedtesting.RandomizedRunner$7.evaluate(RandomizedRunner.java:773)
	at com.carrotsearch.randomizedtesting.RandomizedRunner$8.evaluate(RandomizedRunner.java:787)
	at com.carrotsearch.randomizedtesting.rules.SystemPropertiesRestoreRule$1.evaluate(SystemPropertiesRestoreRule.java:53)
	at org.apache.lucene.util.TestRuleSetupTeardownChained$1.evaluate(TestRuleSetupTeardownChained.java:50)
	at org.apache.lucene.util.TestRuleFieldCacheSanity$1.evaluate(TestRuleFieldCacheSanity.java:51)
	at org.apache.lucene.util.AbstractBeforeAfterRule$1.evaluate(AbstractBeforeAfterRule.java:46)
	at com.carrotsearch.randomizedtesting.rules.SystemPropertiesInvariantRule$1.evaluate(SystemPropertiesInvariantRule.java:55)
	at org.apache.lucene.util.TestRuleThreadAndTestName$1.evaluate(TestRuleThreadAndTestName.java:49)
	at org.apache.lucene.util.TestRuleIgnoreAfterMaxFailures$1.evaluate(TestRuleIgnoreAfterMaxFailures.java:70)
	at org.apache.lucene.util.TestRuleMarkFailure$1.evaluate(TestRuleMarkFailure.java:48)
	at com.carrotsearch.randomizedtesting.rules.StatementAdapter.evaluate(StatementAdapter.java:36)
	at com.carrotsearch.randomizedtesting.ThreadLeakControl$StatementRunner.run(ThreadLeakControl.java:358)
	at com.carrotsearch.randomizedtesting.ThreadLeakControl.forkTimeoutingTask(ThreadLeakControl.java:782)
	at com.carrotsearch.randomizedtesting.ThreadLeakControl$3.evaluate(ThreadLeakControl.java:442)
	at com.carrotsearch.randomizedtesting.RandomizedRunner.runSingleTest(RandomizedRunner.java:746)
	at com.carrotsearch.randomizedtesting.RandomizedRunner$3.evaluate(RandomizedRunner.java:648)
	at com.carrotsearch.randomizedtesting.RandomizedRunner$4.evaluate(RandomizedRunner.java:682)
	at com.carrotsearch.randomizedtesting.RandomizedRunner$5.evaluate(RandomizedRunner.java:693)
	at com.carrotsearch.randomizedtesting.rules.StatementAdapter.evaluate(StatementAdapter.java:36)
	at com.carrotsearch.randomizedtesting.rules.SystemPropertiesRestoreRule$1.evaluate(SystemPropertiesRestoreRule.java:53)
	at org.apache.lucene.util.AbstractBeforeAfterRule$1.evaluate(AbstractBeforeAfterRule.java:46)
	at org.apache.lucene.util.TestRuleStoreClassName$1.evaluate(TestRuleStoreClassName.java:42)
	at com.carrotsearch.randomizedtesting.rules.SystemPropertiesInvariantRule$1.evaluate(SystemPropertiesInvariantRule.java:55)
	at com.carrotsearch.randomizedtesting.rules.NoShadowingOrOverridesOnMethodsRule$1.evaluate(NoShadowingOrOverridesOnMethodsRule.java:39)
	at com.carrotsearch.randomizedtesting.rules.NoShadowingOrOverridesOnMethodsRule$1.evaluate(NoShadowingOrOverridesOnMethodsRule.java:39)
	at com.carrotsearch.randomizedtesting.rules.StatementAdapter.evaluate(StatementAdapter.java:36)
	at org.apache.lucene.util.TestRuleAssertionsRequired$1.evaluate(TestRuleAssertionsRequired.java:43)
	at org.apache.lucene.util.TestRuleMarkFailure$1.evaluate(TestRuleMarkFailure.java:48)
	at org.apache.lucene.util.TestRuleIgnoreAfterMaxFailures$1.evaluate(TestRuleIgnoreAfterMaxFailures.java:70)
	at org.apache.lucene.util.TestRuleIgnoreTestSuites$1.evaluate(TestRuleIgnoreTestSuites.java:55)
	at com.carrotsearch.randomizedtesting.rules.StatementAdapter.evaluate(StatementAdapter.java:36)
	at com.carrotsearch.randomizedtesting.ThreadLeakControl$StatementRunner.run(ThreadLeakControl.java:358)
	at java.lang.Thread.run(Thread.java:724)
Caused by: org.apache.http.conn.HttpHostConnectException: Connection to http://127.0.0.1:53567 refused
	at org.apache.http.impl.conn.DefaultClientConnectionOperator.openConnection(DefaultClientConnectionOperator.java:190)
	at org.apache.http.impl.conn.ManagedClientConnectionImpl.open(ManagedClientConnectionImpl.java:294)
	at org.apache.http.impl.client.DefaultRequestDirector.tryConnect(DefaultRequestDirector.java:645)
	at org.apache.http.impl.client.DefaultRequestDirector.execute(DefaultRequestDirector.java:480)
	at org.apache.http.impl.client.AbstractHttpClient.execute(AbstractHttpClient.java:906)
	at org.apache.http.impl.client.AbstractHttpClient.execute(AbstractHttpClient.java:805)
	at org.apache.http.impl.client.AbstractHttpClient.execute(AbstractHttpClient.java:784)
	at org.apache.solr.client.solrj.impl.HttpSolrServer.request(HttpSolrServer.java:365)
	... 44 more
Caused by: java.net.ConnectException: Connection refused: connect
	at java.net.DualStackPlainSocketImpl.waitForConnect(Native Method)
	at java.net.DualStackPlainSocketImpl.socketConnect(DualStackPlainSocketImpl.java:85)
	at java.net.AbstractPlainSocketImpl.doConnect(AbstractPlainSocketImpl.java:339)
	at java.net.AbstractPlainSocketImpl.connectToAddress(AbstractPlainSocketImpl.java:200)
	at java.net.AbstractPlainSocketImpl.connect(AbstractPlainSocketImpl.java:182)
	at java.net.PlainSocketImpl.connect(PlainSocketImpl.java:172)
	at java.net.SocksSocketImpl.connect(SocksSocketImpl.java:392)
	at java.net.Socket.connect(Socket.java:579)
	at org.apache.http.conn.scheme.PlainSocketFactory.connectSocket(PlainSocketFactory.java:127)
	at org.apache.http.impl.conn.DefaultClientConnectionOperator.openConnection(DefaultClientConnectionOperator.java:180)
	... 51 more




Build Log:
[...truncated 9497 lines...]
   [junit4] Suite: org.apache.solr.cloud.CollectionsAPIDistributedZkTest
   [junit4]   2> 361163 T1179 oas.BaseDistributedSearchTestCase.initHostContext Setting hostContext system property: /y/f
   [junit4]   2> 361168 T1179 oas.SolrTestCaseJ4.setUp ###Starting testDistribSearch
   [junit4]   2> Creating dataDir: C:\Users\JenkinsSlave\workspace\Lucene-Solr-4.x-Windows\solr\build\solr-core\test\J0\.\solrtest-CollectionsAPIDistributedZkTest-1375557602691
   [junit4]   2> 361169 T1179 oasc.ZkTestServer.run STARTING ZK TEST SERVER
   [junit4]   2> 361170 T1180 oasc.ZkTestServer$ZKServerMain.runFromConfig Starting server
   [junit4]   2> 361250 T1179 oasc.ZkTestServer.run start zk server on port:53548
   [junit4]   2> 361252 T1179 oascc.ConnectionManager.waitForConnected Waiting for client to connect to ZooKeeper
   [junit4]   2> 361260 T1186 oascc.ConnectionManager.process Watcher org.apache.solr.common.cloud.ConnectionManager@30ddd035 name:ZooKeeperConnection Watcher:127.0.0.1:53548 got event WatchedEvent state:SyncConnected type:None path:null path:null type:None
   [junit4]   2> 361260 T1179 oascc.ConnectionManager.waitForConnected Client is connected to ZooKeeper
   [junit4]   2> 361260 T1179 oascc.SolrZkClient.makePath makePath: /solr
   [junit4]   2> 361267 T1179 oascc.ConnectionManager.waitForConnected Waiting for client to connect to ZooKeeper
   [junit4]   2> 361271 T1188 oascc.ConnectionManager.process Watcher org.apache.solr.common.cloud.ConnectionManager@53805ade name:ZooKeeperConnection Watcher:127.0.0.1:53548/solr got event WatchedEvent state:SyncConnected type:None path:null path:null type:None
   [junit4]   2> 361271 T1179 oascc.ConnectionManager.waitForConnected Client is connected to ZooKeeper
   [junit4]   2> 361271 T1179 oascc.SolrZkClient.makePath makePath: /collections/collection1
   [junit4]   2> 361277 T1179 oascc.SolrZkClient.makePath makePath: /collections/collection1/shards
   [junit4]   2> 361282 T1179 oascc.SolrZkClient.makePath makePath: /collections/control_collection
   [junit4]   2> 361286 T1179 oascc.SolrZkClient.makePath makePath: /collections/control_collection/shards
   [junit4]   2> 361292 T1179 oasc.AbstractZkTestCase.putConfig put C:\Users\JenkinsSlave\workspace\Lucene-Solr-4.x-Windows\solr\build\solr-core\test-files\solr\collection1\conf\solrconfig-tlog.xml to /configs/conf1/solrconfig.xml
   [junit4]   2> 361293 T1179 oascc.SolrZkClient.makePath makePath: /configs/conf1/solrconfig.xml
   [junit4]   2> 361300 T1179 oasc.AbstractZkTestCase.putConfig put C:\Users\JenkinsSlave\workspace\Lucene-Solr-4.x-Windows\solr\build\solr-core\test-files\solr\collection1\conf\schema.xml to /configs/conf1/schema.xml
   [junit4]   2> 361301 T1179 oascc.SolrZkClient.makePath makePath: /configs/conf1/schema.xml
   [junit4]   2> 361307 T1179 oasc.AbstractZkTestCase.putConfig put C:\Users\JenkinsSlave\workspace\Lucene-Solr-4.x-Windows\solr\build\solr-core\test-files\solr\collection1\conf\stopwords.txt to /configs/conf1/stopwords.txt
   [junit4]   2> 361308 T1179 oascc.SolrZkClient.makePath makePath: /configs/conf1/stopwords.txt
   [junit4]   2> 361312 T1179 oasc.AbstractZkTestCase.putConfig put C:\Users\JenkinsSlave\workspace\Lucene-Solr-4.x-Windows\solr\build\solr-core\test-files\solr\collection1\conf\protwords.txt to /configs/conf1/protwords.txt
   [junit4]   2> 361313 T1179 oascc.SolrZkClient.makePath makePath: /configs/conf1/protwords.txt
   [junit4]   2> 361316 T1179 oasc.AbstractZkTestCase.putConfig put C:\Users\JenkinsSlave\workspace\Lucene-Solr-4.x-Windows\solr\build\solr-core\test-files\solr\collection1\conf\currency.xml to /configs/conf1/currency.xml
   [junit4]   2> 361317 T1179 oascc.SolrZkClient.makePath makePath: /configs/conf1/currency.xml
   [junit4]   2> 361321 T1179 oasc.AbstractZkTestCase.putConfig put C:\Users\JenkinsSlave\workspace\Lucene-Solr-4.x-Windows\solr\build\solr-core\test-files\solr\collection1\conf\open-exchange-rates.json to /configs/conf1/open-exchange-rates.json
   [junit4]   2> 361322 T1179 oascc.SolrZkClient.makePath makePath: /configs/conf1/open-exchange-rates.json
   [junit4]   2> 361326 T1179 oasc.AbstractZkTestCase.putConfig put C:\Users\JenkinsSlave\workspace\Lucene-Solr-4.x-Windows\solr\build\solr-core\test-files\solr\collection1\conf\mapping-ISOLatin1Accent.txt to /configs/conf1/mapping-ISOLatin1Accent.txt
   [junit4]   2> 361327 T1179 oascc.SolrZkClient.makePath makePath: /configs/conf1/mapping-ISOLatin1Accent.txt
   [junit4]   2> 361331 T1179 oasc.AbstractZkTestCase.putConfig put C:\Users\JenkinsSlave\workspace\Lucene-Solr-4.x-Windows\solr\build\solr-core\test-files\solr\collection1\conf\old_synonyms.txt to /configs/conf1/old_synonyms.txt
   [junit4]   2> 361332 T1179 oascc.SolrZkClient.makePath makePath: /configs/conf1/old_synonyms.txt
   [junit4]   2> 361336 T1179 oasc.AbstractZkTestCase.putConfig put C:\Users\JenkinsSlave\workspace\Lucene-Solr-4.x-Windows\solr\build\solr-core\test-files\solr\collection1\conf\synonyms.txt to /configs/conf1/synonyms.txt
   [junit4]   2> 361337 T1179 oascc.SolrZkClient.makePath makePath: /configs/conf1/synonyms.txt
   [junit4]   2> 361715 T1179 oejs.Server.doStart jetty-8.1.10.v20130312
   [junit4]   2> 361721 T1179 oejs.AbstractConnector.doStart Started SelectChannelConnector@127.0.0.1:53555
   [junit4]   2> 361721 T1179 oass.SolrDispatchFilter.init SolrDispatchFilter.init()
   [junit4]   2> 361722 T1179 oasc.SolrResourceLoader.locateSolrHome JNDI not configured for solr (NoInitialContextEx)
   [junit4]   2> 361722 T1179 oasc.SolrResourceLoader.locateSolrHome using system property solr.solr.home: C:\Users\JenkinsSlave\workspace\Lucene-Solr-4.x-Windows\solr\build\solr-core\test\J0\.\org.apache.solr.cloud.CollectionsAPIDistributedZkTest-controljetty-1375557602865
   [junit4]   2> 361722 T1179 oasc.SolrResourceLoader.<init> new SolrResourceLoader for directory: 'C:\Users\JenkinsSlave\workspace\Lucene-Solr-4.x-Windows\solr\build\solr-core\test\J0\.\org.apache.solr.cloud.CollectionsAPIDistributedZkTest-controljetty-1375557602865\'
   [junit4]   2> 361745 T1179 oasc.ConfigSolr.fromFile Loading container configuration from C:\Users\JenkinsSlave\workspace\Lucene-Solr-4.x-Windows\solr\build\solr-core\test\J0\.\org.apache.solr.cloud.CollectionsAPIDistributedZkTest-controljetty-1375557602865\solr.xml
   [junit4]   2> 361807 T1179 oasc.ConfigSolrXml.<init> Config-defined core root directory: 
   [junit4]   2> 361811 T1179 oasc.CoreContainer.<init> New CoreContainer 1869580386
   [junit4]   2> 361812 T1179 oasc.CoreContainer.load Loading cores into CoreContainer [instanceDir=C:\Users\JenkinsSlave\workspace\Lucene-Solr-4.x-Windows\solr\build\solr-core\test\J0\.\org.apache.solr.cloud.CollectionsAPIDistributedZkTest-controljetty-1375557602865\]
   [junit4]   2> 361814 T1179 oashc.HttpShardHandlerFactory.getParameter Setting socketTimeout to: 120000
   [junit4]   2> 361814 T1179 oashc.HttpShardHandlerFactory.getParameter Setting urlScheme to: http://
   [junit4]   2> 361814 T1179 oashc.HttpShardHandlerFactory.getParameter Setting connTimeout to: 15000
   [junit4]   2> 361814 T1179 oashc.HttpShardHandlerFactory.getParameter Setting maxConnectionsPerHost to: 20
   [junit4]   2> 361814 T1179 oashc.HttpShardHandlerFactory.getParameter Setting corePoolSize to: 0
   [junit4]   2> 361815 T1179 oashc.HttpShardHandlerFactory.getParameter Setting maximumPoolSize to: 2147483647
   [junit4]   2> 361815 T1179 oashc.HttpShardHandlerFactory.getParameter Setting maxThreadIdleTime to: 5
   [junit4]   2> 361815 T1179 oashc.HttpShardHandlerFactory.getParameter Setting sizeOfQueue to: -1
   [junit4]   2> 361816 T1179 oashc.HttpShardHandlerFactory.getParameter Setting fairnessPolicy to: false
   [junit4]   2> 361816 T1179 oascsi.HttpClientUtil.createClient Creating new http client, config:maxConnectionsPerHost=20&maxConnections=10000&socketTimeout=120000&connTimeout=15000&retry=false
   [junit4]   2> 361823 T1179 oasc.ZkContainer.initZooKeeper Zookeeper client=127.0.0.1:53548/solr
   [junit4]   2> 361823 T1179 oasc.ZkController.checkChrootPath zkHost includes chroot
   [junit4]   2> 361824 T1179 oascc.ConnectionManager.waitForConnected Waiting for client to connect to ZooKeeper
   [junit4]   2> 361837 T1199 oascc.ConnectionManager.process Watcher org.apache.solr.common.cloud.ConnectionManager@776e014b name:ZooKeeperConnection Watcher:127.0.0.1:53548 got event WatchedEvent state:SyncConnected type:None path:null path:null type:None
   [junit4]   2> 361837 T1179 oascc.ConnectionManager.waitForConnected Client is connected to ZooKeeper
   [junit4]   2> 361840 T1179 oascsi.HttpClientUtil.createClient Creating new http client, config:maxConnections=500&maxConnectionsPerHost=16&socketTimeout=120000&connTimeout=15000
   [junit4]   2> 361845 T1179 oascc.ConnectionManager.waitForConnected Waiting for client to connect to ZooKeeper
   [junit4]   2> 361848 T1201 oascc.ConnectionManager.process Watcher org.apache.solr.common.cloud.ConnectionManager@44c8ddb8 name:ZooKeeperConnection Watcher:127.0.0.1:53548/solr got event WatchedEvent state:SyncConnected type:None path:null path:null type:None
   [junit4]   2> 361848 T1179 oascc.ConnectionManager.waitForConnected Client is connected to ZooKeeper
   [junit4]   2> 361850 T1179 oascc.SolrZkClient.makePath makePath: /overseer/queue
   [junit4]   2> 361856 T1179 oascc.SolrZkClient.makePath makePath: /overseer/collection-queue-work
   [junit4]   2> 361860 T1179 oascc.SolrZkClient.makePath makePath: /live_nodes
   [junit4]   2> 361863 T1179 oasc.ZkController.createEphemeralLiveNode Register node as live in ZooKeeper:/live_nodes/127.0.0.1:53555_y%2Ff
   [junit4]   2> 361865 T1179 oascc.SolrZkClient.makePath makePath: /live_nodes/127.0.0.1:53555_y%2Ff
   [junit4]   2> 361870 T1179 oascc.SolrZkClient.makePath makePath: /overseer_elect/election
   [junit4]   2> 361887 T1179 oascc.SolrZkClient.makePath makePath: /overseer_elect/leader
   [junit4]   2> 361891 T1179 oasc.Overseer.start Overseer (id=90148543050416131-127.0.0.1:53555_y%2Ff-n_0000000000) starting
   [junit4]   2> 361898 T1179 oascc.SolrZkClient.makePath makePath: /overseer/queue-work
   [junit4]   2> 361906 T1203 oasc.OverseerCollectionProcessor.run Process current queue of collection creations
   [junit4]   2> 361908 T1179 oascc.SolrZkClient.makePath makePath: /clusterstate.json
   [junit4]   2> 361912 T1179 oascc.SolrZkClient.makePath makePath: /aliases.json
   [junit4]   2> 361916 T1179 oascc.ZkStateReader.createClusterStateWatchersAndUpdate Updating cluster state from ZooKeeper... 
   [junit4]   2> 361926 T1179 oasc.CorePropertiesLocator.discover Looking for core definitions underneath C:\Users\JenkinsSlave\workspace\Lucene-Solr-4.x-Windows\solr\build\solr-core\test\J0\.\org.apache.solr.cloud.CollectionsAPIDistributedZkTest-controljetty-1375557602865
   [junit4]   2> 361957 T1202 oasc.Overseer$ClusterStateUpdater.run Starting to work on the main queue
   [junit4]   2> 362226 T1179 oasc.CorePropertiesLocator.discoverUnder Found core conf in C:\Users\JenkinsSlave\workspace\Lucene-Solr-4.x-Windows\solr\build\solr-core\test\J0\.\org.apache.solr.cloud.CollectionsAPIDistributedZkTest-controljetty-1375557602865\conf\
   [junit4]   2> 362237 T1179 oasc.CorePropertiesLocator.discover Found 1 core definitions
   [junit4]   2> 362238 T1179 oass.SolrDispatchFilter.init user.dir=C:\Users\JenkinsSlave\workspace\Lucene-Solr-4.x-Windows\solr\build\solr-core\test\J0
   [junit4]   2> 362238 T1179 oass.SolrDispatchFilter.init SolrDispatchFilter.init() done
   [junit4]   2> 362239 T1179 oascsi.HttpClientUtil.createClient Creating new http client, config:maxConnections=128&maxConnectionsPerHost=32&followRedirects=false
   [junit4]   2> 362244 T1179 oascsi.HttpClientUtil.createClient Creating new http client, config:
   [junit4]   2> 362247 T1179 oascc.ConnectionManager.waitForConnected Waiting for client to connect to ZooKeeper
   [junit4]   2> 362250 T1206 oascc.ConnectionManager.process Watcher org.apache.solr.common.cloud.ConnectionManager@6def3929 name:ZooKeeperConnection Watcher:127.0.0.1:53548/solr got event WatchedEvent state:SyncConnected type:None path:null path:null type:None
   [junit4]   2> 362251 T1179 oascc.ConnectionManager.waitForConnected Client is connected to ZooKeeper
   [junit4]   2> 362252 T1179 oascc.ZkStateReader.createClusterStateWatchersAndUpdate Updating cluster state from ZooKeeper... 
   [junit4]   2> 362255 T1179 oasc.ChaosMonkey.monkeyLog monkey: init - expire sessions:true cause connection loss:true
   [junit4]   2> 362706 T1179 oejs.Server.doStart jetty-8.1.10.v20130312
   [junit4]   2> 362711 T1179 oejs.AbstractConnector.doStart Started SelectChannelConnector@127.0.0.1:53567
   [junit4]   2> 362713 T1179 oass.SolrDispatchFilter.init SolrDispatchFilter.init()
   [junit4]   2> 362713 T1179 oasc.SolrResourceLoader.locateSolrHome JNDI not configured for solr (NoInitialContextEx)
   [junit4]   2> 362713 T1179 oasc.SolrResourceLoader.locateSolrHome using system property solr.solr.home: C:\Users\JenkinsSlave\workspace\Lucene-Solr-4.x-Windows\solr\build\solr-core\test\J0\.\org.apache.solr.cloud.CollectionsAPIDistributedZkTest-jetty1-1375557603778
   [junit4]   2> 362714 T1179 oasc.SolrResourceLoader.<init> new SolrResourceLoader for directory: 'C:\Users\JenkinsSlave\workspace\Lucene-Solr-4.x-Windows\solr\build\solr-core\test\J0\.\org.apache.solr.cloud.CollectionsAPIDistributedZkTest-jetty1-1375557603778\'
   [junit4]   2> 362737 T1179 oasc.ConfigSolr.fromFile Loading container configuration from C:\Users\JenkinsSlave\workspace\Lucene-Solr-4.x-Windows\solr\build\solr-core\test\J0\.\org.apache.solr.cloud.CollectionsAPIDistributedZkTest-jetty1-1375557603778\solr.xml
   [junit4]   2> 362824 T1179 oasc.ConfigSolrXml.<init> Config-defined core root directory: 
   [junit4]   2> 362825 T1179 oasc.CoreContainer.<init> New CoreContainer 1760809723
   [junit4]   2> 362826 T1179 oasc.CoreContainer.load Loading cores into CoreContainer [instanceDir=C:\Users\JenkinsSlave\workspace\Lucene-Solr-4.x-Windows\solr\build\solr-core\test\J0\.\org.apache.solr.cloud.CollectionsAPIDistributedZkTest-jetty1-1375557603778\]
   [junit4]   2> 362827 T1179 oashc.HttpShardHandlerFactory.getParameter Setting socketTimeout to: 120000
   [junit4]   2> 362827 T1179 oashc.HttpShardHandlerFactory.getParameter Setting urlScheme to: http://
   [junit4]   2> 362827 T1179 oashc.HttpShardHandlerFactory.getParameter Setting connTimeout to: 15000
   [junit4]   2> 362829 T1179 oashc.HttpShardHandlerFactory.getParameter Setting maxConnectionsPerHost to: 20
   [junit4]   2> 362829 T1179 oashc.HttpShardHandlerFactory.getParameter Setting corePoolSize to: 0
   [junit4]   2> 362829 T1179 oashc.HttpShardHandlerFactory.getParameter Setting maximumPoolSize to: 2147483647
   [junit4]   2> 362829 T1179 oashc.HttpShardHandlerFactory.getParameter Setting maxThreadIdleTime to: 5
   [junit4]   2> 362830 T1179 oashc.HttpShardHandlerFactory.getParameter Setting sizeOfQueue to: -1
   [junit4]   2> 362830 T1179 oashc.HttpShardHandlerFactory.getParameter Setting fairnessPolicy to: false
   [junit4]   2> 362831 T1179 oascsi.HttpClientUtil.createClient Creating new http client, config:maxConnectionsPerHost=20&maxConnections=10000&socketTimeout=120000&connTimeout=15000&retry=false
   [junit4]   2> 362840 T1179 oasc.ZkContainer.initZooKeeper Zookeeper client=127.0.0.1:53548/solr
   [junit4]   2> 362842 T1179 oasc.ZkController.checkChrootPath zkHost includes chroot
   [junit4]   2> 362844 T1179 oascc.ConnectionManager.waitForConnected Waiting for client to connect to ZooKeeper
   [junit4]   2> 362857 T1217 oascc.ConnectionManager.process Watcher org.apache.solr.common.cloud.ConnectionManager@928f351 name:ZooKeeperConnection Watcher:127.0.0.1:53548 got event WatchedEvent state:SyncConnected type:None path:null path:null type:None
   [junit4]   2> 362858 T1179 oascc.ConnectionManager.waitForConnected Client is connected to ZooKeeper
   [junit4]   2> 362860 T1179 oascsi.HttpClientUtil.createClient Creating new http client, config:maxConnections=500&maxConnectionsPerHost=16&socketTimeout=120000&connTimeout=15000
   [junit4]   2> 362865 T1179 oascc.ConnectionManager.waitForConnected Waiting for client to connect to ZooKeeper
   [junit4]   2> 362868 T1219 oascc.ConnectionManager.process Watcher org.apache.solr.common.cloud.ConnectionManager@74924258 name:ZooKeeperConnection Watcher:127.0.0.1:53548/solr got event WatchedEvent state:SyncConnected type:None path:null path:null type:None
   [junit4]   2> 362868 T1179 oascc.ConnectionManager.waitForConnected Client is connected to ZooKeeper
   [junit4]   2> 362875 T1179 oascc.ZkStateReader.createClusterStateWatchersAndUpdate Updating cluster state from ZooKeeper... 
   [junit4]   2> 363698 T1179 oasc.ZkController.createEphemeralLiveNode Register node as live in ZooKeeper:/live_nodes/127.0.0.1:53567_y%2Ff
   [junit4]   2> 363704 T1179 oascc.SolrZkClient.makePath makePath: /live_nodes/127.0.0.1:53567_y%2Ff
   [junit4]   2> 363710 T1206 oascc.ZkStateReader$3.process Updating live nodes... (2)
   [junit4]   2> 363711 T1219 oascc.ZkStateReader$3.process Updating live nodes... (2)
   [junit4]   2> 363711 T1201 oascc.ZkStateReader$3.process Updating live nodes... (2)
   [junit4]   2> 363721 T1179 oasc.CorePropertiesLocator.discover Looking for core definitions underneath C:\Users\JenkinsSlave\workspace\Lucene-Solr-4.x-Windows\solr\build\solr-core\test\J0\.\org.apache.solr.cloud.CollectionsAPIDistributedZkTest-jetty1-1375557603778
   [junit4]   2> 363927 T1179 oasc.CorePropertiesLocator.discoverUnder Found core conf in C:\Users\JenkinsSlave\workspace\Lucene-Solr-4.x-Windows\solr\build\solr-core\test\J0\.\org.apache.solr.cloud.CollectionsAPIDistributedZkTest-jetty1-1375557603778\conf\
   [junit4]   2> 363937 T1179 oasc.CorePropertiesLocator.discover Found 1 core definitions
   [junit4]   2> 363938 T1179 oass.SolrDispatchFilter.init user.dir=C:\Users\JenkinsSlave\workspace\Lucene-Solr-4.x-Windows\solr\build\solr-core\test\J0
   [junit4]   2> 363939 T1179 oass.SolrDispatchFilter.init SolrDispatchFilter.init() done
   [junit4]   2> 363939 T1179 oascsi.HttpClientUtil.createClient Creating new http client, config:maxConnections=128&maxConnectionsPerHost=32&followRedirects=false
   [junit4]   2> 364436 T1179 oejs.Server.doStart jetty-8.1.10.v20130312
   [junit4]   2> 364441 T1179 oejs.AbstractConnector.doStart Started SelectChannelConnector@127.0.0.1:53576
   [junit4]   2> 364442 T1179 oass.SolrDispatchFilter.init SolrDispatchFilter.init()
   [junit4]   2> 364442 T1179 oasc.SolrResourceLoader.locateSolrHome JNDI not configured for solr (NoInitialContextEx)
   [junit4]   2> 364443 T1179 oasc.SolrResourceLoader.locateSolrHome using system property solr.solr.home: C:\Users\JenkinsSlave\workspace\Lucene-Solr-4.x-Windows\solr\build\solr-core\test\J0\.\org.apache.solr.cloud.CollectionsAPIDistributedZkTest-jetty2-1375557605473
   [junit4]   2> 364444 T1179 oasc.SolrResourceLoader.<init> new SolrResourceLoader for directory: 'C:\Users\JenkinsSlave\workspace\Lucene-Solr-4.x-Windows\solr\build\solr-core\test\J0\.\org.apache.solr.cloud.CollectionsAPIDistributedZkTest-jetty2-1375557605473\'
   [junit4]   2> 364503 T1179 oasc.ConfigSolr.fromFile Loading container configuration from C:\Users\JenkinsSlave\workspace\Lucene-Solr-4.x-Windows\solr\build\solr-core\test\J0\.\org.apache.solr.cloud.CollectionsAPIDistributedZkTest-jetty2-1375557605473\solr.xml
   [junit4]   2> 364571 T1179 oasc.ConfigSolrXml.<init> Config-defined core root directory: 
   [junit4]   2> 364571 T1179 oasc.CoreContainer.<init> New CoreContainer 1075523123
   [junit4]   2> 364571 T1179 oasc.CoreContainer.load Loading cores into CoreContainer [instanceDir=C:\Users\JenkinsSlave\workspace\Lucene-Solr-4.x-Windows\solr\build\solr-core\test\J0\.\org.apache.solr.cloud.CollectionsAPIDistributedZkTest-jetty2-1375557605473\]
   [junit4]   2> 364574 T1179 oashc.HttpShardHandlerFactory.getParameter Setting socketTimeout to: 120000
   [junit4]   2> 364574 T1179 oashc.HttpShardHandlerFactory.getParameter Setting urlScheme to: http://
   [junit4]   2> 364574 T1179 oashc.HttpShardHandlerFactory.getParameter Setting connTimeout to: 15000
   [junit4]   2> 364574 T1179 oashc.HttpShardHandlerFactory.getParameter Setting maxConnectionsPerHost to: 20
   [junit4]   2> 364574 T1179 oashc.HttpShardHandlerFactory.getParameter Setting corePoolSize to: 0
   [junit4]   2> 364574 T1179 oashc.HttpShardHandlerFactory.getParameter Setting maximumPoolSize to: 2147483647
   [junit4]   2> 364574 T1179 oashc.HttpShardHandlerFactory.getParameter Setting maxThreadIdleTime to: 5
   [junit4]   2> 364575 T1179 oashc.HttpShardHandlerFactory.getParameter Setting sizeOfQueue to: -1
   [junit4]   2> 364576 T1179 oashc.HttpShardHandlerFactory.getParameter Setting fairnessPolicy to: false
   [junit4]   2> 364576 T1179 oascsi.HttpClientUtil.createClient Creating new http client, config:maxConnectionsPerHost=20&maxConnections=10000&socketTimeout=120000&connTimeout=15000&retry=false
   [junit4]   2> 364582 T1179 oasc.ZkContainer.initZooKeeper Zookeeper client=127.0.0.1:53548/solr
   [junit4]   2> 364583 T1179 oasc.ZkController.checkChrootPath zkHost includes chroot
   [junit4]   2> 364585 T1179 oascc.ConnectionManager.waitForConnected Waiting for client to connect to ZooKeeper
   [junit4]   2> 364602 T1231 oascc.ConnectionManager.process Watcher org.apache.solr.common.cloud.ConnectionManager@70f9cd4e name:ZooKeeperConnection Watcher:127.0.0.1:53548 got event WatchedEvent state:SyncConnected type:None path:null path:null type:None
   [junit4]   2> 364603 T1179 oascc.ConnectionManager.waitForConnected Client is connected to ZooKeeper
   [junit4]   2> 364605 T1179 oascsi.HttpClientUtil.createClient Creating new http client, config:maxConnections=500&maxConnectionsPerHost=16&socketTimeout=120000&connTimeout=15000
   [junit4]   2> 364606 T1181 oazs.NIOServerCnxn.doIO WARN caught end of stream exception EndOfStreamException: Unable to read additional data from client sessionid 0x140459f4d8a0007, likely client has closed socket
   [junit4]   2> 	at org.apache.zookeeper.server.NIOServerCnxn.doIO(NIOServerCnxn.java:220)
   [junit4]   2> 	at org.apache.zookeeper.server.NIOServerCnxnFactory.run(NIOServerCnxnFactory.java:208)
   [junit4]   2> 	at java.lang.Thread.run(Thread.java:724)
   [junit4]   2> 
   [junit4]   2> 364615 T1179 oascc.ConnectionManager.waitForConnected Waiting for client to connect to ZooKeeper
   [junit4]   2> 364619 T1233 oascc.ConnectionManager.process Watcher org.apache.solr.common.cloud.ConnectionManager@243fc886 name:ZooKeeperConnection Watcher:127.0.0.1:53548/solr got event WatchedEvent state:SyncConnected type:None path:null path:null type:None
   [junit4]   2> 364620 T1179 oascc.ConnectionManager.waitForConnected Client is connected to ZooKeeper
   [junit4]   2> 364628 T1179 oascc.ZkStateReader.createClusterStateWatchersAndUpdate Updating cluster state from ZooKeeper... 
   [junit4]   2> 365511 T1179 oasc.ZkController.createEphemeralLiveNode Register node as live in ZooKeeper:/live_nodes/127.0.0.1:53576_y%2Ff
   [junit4]   2> 365514 T1179 oascc.SolrZkClient.makePath makePath: /live_nodes/127.0.0.1:53576_y%2Ff
   [junit4]   2> 365519 T1206 oascc.ZkStateReader$3.process Updating live nodes... (3)
   [junit4]   2> 365520 T1233 oascc.ZkStateReader$3.process Updating live nodes... (3)
   [junit4]   2> 365520 T1201 oascc.ZkStateReader$3.process Updating live nodes... (3)
   [junit4]   2> 365520 T1219 oascc.ZkStateReader$3.process Updating live nodes... (3)
   [junit4]   2> 365530 T1179 oasc.CorePropertiesLocator.discover Looking for core definitions underneath C:\Users\JenkinsSlave\workspace\Lucene-Solr-4.x-Windows\solr\build\solr-core\test\J0\.\org.apache.solr.cloud.CollectionsAPIDistributedZkTest-jetty2-1375557605473
   [junit4]   2> 365758 T1179 oasc.CorePropertiesLocator.discoverUnder Found core conf in C:\Users\JenkinsSlave\workspace\Lucene-Solr-4.x-Windows\solr\build\solr-core\test\J0\.\org.apache.solr.cloud.CollectionsAPIDistributedZkTest-jetty2-1375557605473\conf\
   [junit4]   2> 365771 T1179 oasc.CorePropertiesLocator.discover Found 1 core definitions
   [junit4]   2> 365774 T1179 oass.SolrDispatchFilter.init user.dir=C:\Users\JenkinsSlave\workspace\Lucene-Solr-4.x-Windows\solr\build\solr-core\test\J0
   [junit4]   2> 365774 T1179 oass.SolrDispatchFilter.init SolrDispatchFilter.init() done
   [junit4]   2> 365775 T1179 oascsi.HttpClientUtil.createClient Creating new http client, config:maxConnections=128&maxConnectionsPerHost=32&followRedirects=false
   [junit4]   2> 366173 T1179 oejs.Server.doStart jetty-8.1.10.v20130312
   [junit4]   2> 366177 T1179 oejs.AbstractConnector.doStart Started SelectChannelConnector@127.0.0.1:53585
   [junit4]   2> 366178 T1179 oass.SolrDispatchFilter.init SolrDispatchFilter.init()
   [junit4]   2> 366178 T1179 oasc.SolrResourceLoader.locateSolrHome JNDI not configured for solr (NoInitialContextEx)
   [junit4]   2> 366178 T1179 oasc.SolrResourceLoader.locateSolrHome using system property solr.solr.home: C:\Users\JenkinsSlave\workspace\Lucene-Solr-4.x-Windows\solr\build\solr-core\test\J0\.\org.apache.solr.cloud.CollectionsAPIDistributedZkTest-jetty3-1375557607308
   [junit4]   2> 366180 T1179 oasc.SolrResourceLoader.<init> new SolrResourceLoader for directory: 'C:\Users\JenkinsSlave\workspace\Lucene-Solr-4.x-Windows\solr\build\solr-core\test\J0\.\org.apache.solr.cloud.CollectionsAPIDistributedZkTest-jetty3-1375557607308\'
   [junit4]   2> 366211 T1179 oasc.ConfigSolr.fromFile Loading container configuration from C:\Users\JenkinsSlave\workspace\Lucene-Solr-4.x-Windows\solr\build\solr-core\test\J0\.\org.apache.solr.cloud.CollectionsAPIDistributedZkTest-jetty3-1375557607308\solr.xml
   [junit4]   2> 366285 T1179 oasc.ConfigSolrXml.<init> Config-defined core root directory: 
   [junit4]   2> 366285 T1179 oasc.CoreContainer.<init> New CoreContainer 1290243488
   [junit4]   2> 366286 T1179 oasc.CoreContainer.load Loading cores into CoreContainer [instanceDir=C:\Users\JenkinsSlave\workspace\Lucene-Solr-4.x-Windows\solr\build\solr-core\test\J0\.\org.apache.solr.cloud.CollectionsAPIDistributedZkTest-jetty3-1375557607308\]
   [junit4]   2> 366286 T1179 oashc.HttpShardHandlerFactory.getParameter Setting socketTimeout to: 120000
   [junit4]   2> 366287 T1179 oashc.HttpShardHandlerFactory.getParameter Setting urlScheme to: http://
   [junit4]   2> 366287 T1179 oashc.HttpShardHandlerFactory.getParameter Setting connTimeout to: 15000
   [junit4]   2> 366288 T1179 oashc.HttpShardHandlerFactory.getParameter Setting maxConnectionsPerHost to: 20
   [junit4]   2> 366288 T1179 oashc.HttpShardHandlerFactory.getParameter Setting corePoolSize to: 0
   [junit4]   2> 366288 T1179 oashc.HttpShardHandlerFactory.getParameter Setting maximumPoolSize to: 2147483647
   [junit4]   2> 366289 T1179 oashc.HttpShardHandlerFactory.getParameter Setting maxThreadIdleTime to: 5
   [junit4]   2> 366289 T1179 oashc.HttpShardHandlerFactory.getParameter Setting sizeOfQueue to: -1
   [junit4]   2> 366289 T1179 oashc.HttpShardHandlerFactory.getParameter Setting fairnessPolicy to: false
   [junit4]   2> 366290 T1179 oascsi.HttpClientUtil.createClient Creating new http client, config:maxConnectionsPerHost=20&maxConnections=10000&socketTimeout=120000&connTimeout=15000&retry=false
   [junit4]   2> 366296 T1179 oasc.ZkContainer.initZooKeeper Zookeeper client=127.0.0.1:53548/solr
   [junit4]   2> 366297 T1179 oasc.ZkController.checkChrootPath zkHost includes chroot
   [junit4]   2> 366298 T1179 oascc.ConnectionManager.waitForConnected Waiting for client to connect to ZooKeeper
   [junit4]   2> 366303 T1245 oascc.ConnectionManager.process Watcher org.apache.solr.common.cloud.ConnectionManager@3aea91be name:ZooKeeperConnection Watcher:127.0.0.1:53548 got event WatchedEvent state:SyncConnected type:None path:null path:null type:None
   [junit4]   2> 366304 T1179 oascc.ConnectionManager.waitForConnected Client is connected to ZooKeeper
   [junit4]   2> 366307 T1179 oascsi.HttpClientUtil.createClient Creating new http client, config:maxConnections=500&maxConnectionsPerHost=16&socketTimeout=120000&connTimeout=15000
   [junit4]   2> 366316 T1179 oascc.ConnectionManager.waitForConnected Waiting for client to connect to ZooKeeper
   [junit4]   2> 366320 T1247 oascc.ConnectionManager.process Watcher org.apache.solr.common.cloud.ConnectionManager@499e602a name:ZooKeeperConnection Watcher:127.0.0.1:53548/solr got event WatchedEvent state:SyncConnected type:None path:null path:null type:None
   [junit4]   2> 366320 T1179 oascc.ConnectionManager.waitForConnected Client is connected to ZooKeeper
   [junit4]   2> 366329 T1179 oascc.ZkStateReader.createClusterStateWatchersAndUpdate Updating cluster state from ZooKeeper... 
   [junit4]   2> 367212 T1179 oasc.ZkController.createEphemeralLiveNode Register node as live in ZooKeeper:/live_nodes/127.0.0.1:53585_y%2Ff
   [junit4]   2> 367214 T1179 oascc.SolrZkClient.makePath makePath: /live_nodes/127.0.0.1:53585_y%2Ff
   [junit4]   2> 367221 T1233 oascc.ZkStateReader$3.process Updating live nodes... (4)
   [junit4]   2> 367221 T1201 oascc.ZkStateReader$3.process Updating live nodes... (4)
   [junit4]   2> 367222 T1247 oascc.ZkStateReader$3.process Updating live nodes... (4)
   [junit4]   2> 367221 T1219 oascc.ZkStateReader$3.process Updating live nodes... (4)
   [junit4]   2> 367221 T1206 oascc.ZkStateReader$3.process Updating live nodes... (4)
   [junit4]   2> 367232 T1179 oasc.CorePropertiesLocator.discover Looking for core definitions underneath C:\Users\JenkinsSlave\workspace\Lucene-Solr-4.x-Windows\solr\build\solr-core\test\J0\.\org.apache.solr.cloud.CollectionsAPIDistributedZkTest-jetty3-1375557607308
   [junit4]   2> 367444 T1179 oasc.CorePropertiesLocator.discoverUnder Found core conf in C:\Users\JenkinsSlave\workspace\Lucene-Solr-4.x-Windows\solr\build\solr-core\test\J0\.\org.apache.solr.cloud.CollectionsAPIDistributedZkTest-jetty3-1375557607308\conf\
   [junit4]   2> 367454 T1179 oasc.CorePropertiesLocator.discover Found 1 core definitions
   [junit4]   2> 367455 T1179 oass.SolrDispatchFilter.init user.dir=C:\Users\JenkinsSlave\workspace\Lucene-Solr-4.x-Windows\solr\build\solr-core\test\J0
   [junit4]   2> 367455 T1179 oass.SolrDispatchFilter.init SolrDispatchFilter.init() done
   [junit4]   2> 367456 T1179 oascsi.HttpClientUtil.createClient Creating new http client, config:maxConnections=128&maxConnectionsPerHost=32&followRedirects=false
   [junit4]   2> 367881 T1179 oejs.Server.doStart jetty-8.1.10.v20130312
   [junit4]   2> 367885 T1179 oejs.AbstractConnector.doStart Started SelectChannelConnector@127.0.0.1:53594
   [junit4]   2> 367887 T1179 oass.SolrDispatchFilter.init SolrDispatchFilter.init()
   [junit4]   2> 367887 T1179 oasc.SolrResourceLoader.locateSolrHome JNDI not configured for solr (NoInitialContextEx)
   [junit4]   2> 367888 T1179 oasc.SolrResourceLoader.locateSolrHome using system property solr.solr.home: C:\Users\JenkinsSlave\workspace\Lucene-Solr-4.x-Windows\solr\build\solr-core\test\J0\.\org.apache.solr.cloud.CollectionsAPIDistributedZkTest-jetty4-1375557608986
   [junit4]   2> 367888 T1179 oasc.SolrResourceLoader.<init> new SolrResourceLoader for directory: 'C:\Users\JenkinsSlave\workspace\Lucene-Solr-4.x-Windows\solr\build\solr-core\test\J0\.\org.apache.solr.cloud.CollectionsAPIDistributedZkTest-jetty4-1375557608986\'
   [junit4]   2> 367915 T1179 oasc.ConfigSolr.fromFile Loading container configuration from C:\Users\JenkinsSlave\workspace\Lucene-Solr-4.x-Windows\solr\build\solr-core\test\J0\.\org.apache.solr.cloud.CollectionsAPIDistributedZkTest-jetty4-1375557608986\solr.xml
   [junit4]   2> 367987 T1179 oasc.ConfigSolrXml.<init> Config-defined core root directory: 
   [junit4]   2> 367987 T1179 oasc.CoreContainer.<init> New CoreContainer 2140173991
   [junit4]   2> 367988 T1179 oasc.CoreContainer.load Loading cores into CoreContainer [instanceDir=C:\Users\JenkinsSlave\workspace\Lucene-Solr-4.x-Windows\solr\build\solr-core\test\J0\.\org.apache.solr.cloud.CollectionsAPIDistributedZkTest-jetty4-1375557608986\]
   [junit4]   2> 367990 T1179 oashc.HttpShardHandlerFactory.getParameter Setting socketTimeout to: 120000
   [junit4]   2> 367990 T1179 oashc.HttpShardHandlerFactory.getParameter Setting urlScheme to: http://
   [junit4]   2> 367991 T1179 oashc.HttpShardHandlerFactory.getParameter Setting connTimeout to: 15000
   [junit4]   2> 367991 T1179 oashc.HttpShardHandlerFactory.getParameter Setting maxConnectionsPerHost to: 20
   [junit4]   2> 367991 T1179 oashc.HttpShardHandlerFactory.getParameter Setting corePoolSize to: 0
   [junit4]   2> 367992 T1179 oashc.HttpShardHandlerFactory.getParameter Setting maximumPoolSize to: 2147483647
   [junit4]   2> 367992 T1179 oashc.HttpShardHandlerFactory.getParameter Setting maxThreadIdleTime to: 5
   [junit4]   2> 367993 T1179 oashc.HttpShardHandlerFactory.getParameter Setting sizeOfQueue to: -1
   [junit4]   2> 367993 T1179 oashc.HttpShardHandlerFactory.getParameter Setting fairnessPolicy to: false
   [junit4]   2> 367993 T1179 oascsi.HttpClientUtil.createClient Creating new http client, config:maxConnectionsPerHost=20&maxConnections=10000&socketTimeout=120000&connTimeout=15000&retry=false
   [junit4]   2> 368000 T1179 oasc.ZkContainer.initZooKeeper Zookeeper client=127.0.0.1:53548/solr
   [junit4]   2> 368001 T1179 oasc.ZkController.checkChrootPath zkHost includes chroot
   [junit4]   2> 368003 T1179 oascc.ConnectionManager.waitForConnected Waiting for client to connect to ZooKeeper
   [junit4]   2> 368023 T1259 oascc.ConnectionManager.process Watcher org.apache.solr.common.cloud.ConnectionManager@2f12d59 name:ZooKeeperConnection Watcher:127.0.0.1:53548 got event WatchedEvent state:SyncConnected type:None path:null path:null type:None
   [junit4]   2> 368023 T1179 oascc.ConnectionManager.waitForConnected Client is connected to ZooKeeper
   [junit4]   2> 368026 T1179 oascsi.HttpClientUtil.createClient Creating new http client, config:maxConnections=500&maxConnectionsPerHost=16&socketTimeout=120000&connTimeout=15000
   [junit4]   2> 368026 T1181 oazs.NIOServerCnxn.doIO WARN caught end of stream exception EndOfStreamException: Unable to read additional data from client sessionid 0x140459f4d8a000b, likely client has closed socket
   [junit4]   2> 	at org.apache.zookeeper.server.NIOServerCnxn.doIO(NIOServerCnxn.java:220)
   [junit4]   2> 	at org.apache.zookeeper.server.NIOServerCnxnFactory.run(NIOServerCnxnFactory.java:208)
   [junit4]   2> 	at java.lang.Thread.run(Thread.java:724)
   [junit4]   2> 
   [junit4]   2> 368033 T1179 oascc.ConnectionManager.waitForConnected Waiting for client to connect to ZooKeeper
   [junit4]   2> 368036 T1261 oascc.ConnectionManager.process Watcher org.apache.solr.common.cloud.ConnectionManager@61e69d29 name:ZooKeeperConnection Watcher:127.0.0.1:53548/solr got event WatchedEvent state:SyncConnected type:None path:null path:null type:None
   [junit4]   2> 368037 T1179 oascc.ConnectionManager.waitForConnected Client is connected to ZooKeeper
   [junit4]   2> 368045 T1179 oascc.ZkStateReader.createClusterStateWatchersAndUpdate Updating cluster state from ZooKeeper... 
   [junit4]   2> 368927 T1179 oasc.ZkController.createEphemeralLiveNode Register node as live in ZooKeeper:/live_nodes/127.0.0.1:53594_y%2Ff
   [junit4]   2> 368928 T1179 oascc.SolrZkClient.makePath makePath: /live_nodes/127.0.0.1:53594_y%2Ff
   [junit4]   2> 368935 T1206 oascc.ZkStateReader$3.process Updating live nodes... (5)
   [junit4]   2> 368936 T1219 oascc.ZkStateReader$3.process Updating live nodes... (5)
   [junit4]   2> 368936 T1201 oascc.ZkStateReader$3.process Updating live nodes... (5)
   [junit4]   2> 368936 T1247 oascc.ZkStateReader$3.process Updating live nodes... (5)
   [junit4]   2> 368937 T1261 oascc.ZkStateReader$3.process Updating live nodes... (5)
   [junit4]   2> 368937 T1233 oascc.ZkStateReader$3.process Updating live nodes... (5)
   [junit4]   2> 368945 T1179 oasc.CorePropertiesLocator.discover Looking for core definitions underneath C:\Users\JenkinsSlave\workspace\Lucene-Solr-4.x-Windows\solr\build\solr-core\test\J0\.\org.apache.solr.cloud.CollectionsAPIDistributedZkTest-jetty4-1375557608986
   [junit4]   2> 369142 T1179 oasc.CorePropertiesLocator.discoverUnder Found core conf in C:\Users\JenkinsSlave\workspace\Lucene-Solr-4.x-Windows\solr\build\solr-core\test\J0\.\org.apache.solr.cloud.CollectionsAPIDistributedZkTest-jetty4-1375557608986\conf\
   [junit4]   2> 369151 T1179 oasc.CorePropertiesLocator.discover Found 1 core definitions
   [junit4]   2> 369153 T1179 oass.SolrDispatchFilter.init user.dir=C:\Users\JenkinsSlave\workspace\Lucene-Solr-4.x-Windows\solr\build\solr-core\test\J0
   [junit4]   2> 369153 T1179 oass.SolrDispatchFilter.init SolrDispatchFilter.init() done
   [junit4]   2> 369154 T1179 oascsi.HttpClientUtil.createClient Creating new http client, config:maxConnections=128&maxConnectionsPerHost=32&followRedirects=false
   [junit4]   2> 369160 T1179 oascsi.HttpClientUtil.createClient Creating new http client, config:maxConnections=128&maxConnectionsPerHost=32&followRedirects=false
   [junit4]   2> 369165 T1213 oasha.CollectionsHandler.handleCreateAction Creating Collection : numShards=2&name=nodes_used_collection&replicationFactor=2&action=CREATE&wt=javabin&version=2
   [junit4]   2> 369168 T1201 oasc.DistributedQueue$LatchChildWatcher.process Watcher fired on path: /overseer/collection-queue-work state: SyncConnected type NodeChildrenChanged
   [junit4]   2> 369171 T1203 oasc.OverseerCollectionProcessor.run Overseer Collection Processor: Get the message id:/overseer/collection-queue-work/qn-0000000000 message:{
   [junit4]   2> 	  "operation":"createcollection",
   [junit4]   2> 	  "numShards":"2",
   [junit4]   2> 	  "name":"nodes_used_collection",
   [junit4]   2> 	  "replicationFactor":"2"}
   [junit4]   2> 369171 T1203 oasc.OverseerCollectionProcessor.processMessage WARN OverseerCollectionProcessor.processMessage : createcollection , {
   [junit4]   2> 	  "operation":"createcollection",
   [junit4]   2> 	  "numShards":"2",
   [junit4]   2> 	  "name":"nodes_used_collection",
   [junit4]   2> 	  "replicationFactor":"2"}
   [junit4]   2> 369717 T1202 oascc.ZkStateReader.updateClusterState Updating cloud state from ZooKeeper... 
   [junit4]   2> 369719 T1202 oasc.Overseer$ClusterStateUpdater.buildCollection building a new collection: nodes_used_collection
   [junit4]   2> 369719 T1202 oasc.Overseer$ClusterStateUpdater.createCollection Create collection nodes_used_collection with shards [shard1, shard2]
   [junit4]   2> 369734 T1233 oascc.ZkStateReader$2.process A cluster state change: WatchedEvent state:SyncConnected type:NodeDataChanged path:/clusterstate.json, has occurred - updating... (live nodes size: 5)
   [junit4]   2> 369735 T1219 oascc.ZkStateReader$2.process A cluster state change: WatchedEvent state:SyncConnected type:NodeDataChanged path:/clusterstate.json, has occurred - updating... (live nodes size: 5)
   [junit4]   2> 369735 T1261 oascc.ZkStateReader$2.process A cluster state change: WatchedEvent state:SyncConnected type:NodeDataChanged path:/clusterstate.json, has occurred - updating... (live nodes size: 5)
   [junit4]   2> 369735 T1201 oascc.ZkStateReader$2.process A cluster state change: WatchedEvent state:SyncConnected type:NodeDataChanged path:/clusterstate.json, has occurred - updating... (live nodes size: 5)
   [junit4]   2> 369734 T1206 oascc.ZkStateReader$2.process A cluster state change: WatchedEvent state:SyncConnected type:NodeDataChanged path:/clusterstate.json, has occurred - updating... (live nodes size: 5)
   [junit4]   2> 369735 T1247 oascc.ZkStateReader$2.process A cluster state change: WatchedEvent state:SyncConnected type:NodeDataChanged path:/clusterstate.json, has occurred - updating... (live nodes size: 5)
   [junit4]   2> 369806 T1203 oasc.OverseerCollectionProcessor.createCollection going to create cores replicas shardNames [shard1, shard2] , repFactor : 2
   [junit4]   2> 369806 T1203 oasc.OverseerCollectionProcessor.createCollection Creating shard nodes_used_collection_shard1_replica1 as part of slice shard1 of collection nodes_used_collection on 127.0.0.1:53585_y%2Ff
   [junit4]   2> 369807 T1203 oasc.OverseerCollectionProcessor.createCollection Creating shard nodes_used_collection_shard1_replica2 as part of slice shard1 of collection nodes_used_collection on 127.0.0.1:53576_y%2Ff
   [junit4]   2> 369807 T1203 oasc.OverseerCollectionProcessor.createCollection Creating shard nodes_used_collection_shard2_replica1 as part of slice shard2 of collection nodes_used_collection on 127.0.0.1:53594_y%2Ff
   [junit4]   2> 369808 T1203 oasc.OverseerCollectionProcessor.createCollection Creating shard nodes_used_collection_shard2_replica2 as part of slice shard2 of collection nodes_used_collection on 127.0.0.1:53555_y%2Ff
   [junit4]   2> 369818 T1243 oasc.ZkController.publish publishing core=nodes_used_collection_shard1_replica1 state=down
   [junit4]   2> 369819 T1197 oasc.ZkController.publish publishing core=nodes_used_collection_shard2_replica2 state=down
   [junit4]   2> 369819 T1225 oasc.ZkController.publish publishing core=nodes_used_collection_shard1_replica2 state=down
   [junit4]   2> 369820 T1255 oasc.ZkController.publish publishing core=nodes_used_collection_shard2_replica1 state=down
   [junit4]   2> 369821 T1243 oasc.ZkController.waitForCoreNodeName look for our core node name
   [junit4]   2> 369822 T1197 oasc.ZkController.waitForCoreNodeName look for our core node name
   [junit4]   2> 369823 T1225 oasc.ZkController.waitForCoreNodeName look for our core node name
   [junit4]   2> 369824 T1255 oasc.ZkController.waitForCoreNodeName look for our core node name
   [junit4]   2> 371059 T1202 oascc.ZkStateReader.updateClusterState Updating cloud state from ZooKeeper... 
   [junit4]   2> 371061 T1202 oasc.Overseer$ClusterStateUpdater.updateState WARN Could not find collection node for nodes_used_collection, skipping publish state
   [junit4]   2> 371061 T1202 oasc.Overseer$ClusterStateUpdater.updateState Update state numShards=2 message={
   [junit4]   2> 	  "operation":"state",
   [junit4]   2> 	  "core_node_name":"core_node1",
   [junit4]   2> 	  "numShards":"2",
   [junit4]   2> 	  "shard":"shard1",
   [junit4]   2> 	  "roles":null,
   [junit4]   2> 	  "state":"down",
   [junit4]   2> 	  "shard_state":"active",
   [junit4]   2> 	  "core":"nodes_used_collection_shard1_replica1",
   [junit4]   2> 	  "collection":"nodes_used_collection",
   [junit4]   2> 	  "shard_range":null,
   [junit4]   2> 	  "node_name":"127.0.0.1:53585_y%2Ff",
   [junit4]   2> 	  "base_url":"http://127.0.0.1:53585/y/f"}
   [junit4]   2> 371075 T1202 oasc.Overseer$ClusterStateUpdater.updateState WARN Could not find collection node for nodes_used_collection, skipping publish state
   [junit4]   2> 371076 T1202 oasc.Overseer$ClusterStateUpdater.updateState Update state numShards=2 message={
   [junit4]   2> 	  "operation":"state",
   [junit4]   2> 	  "core_node_name":"core_node2",
   [junit4]   2> 	  "numShards":"2",
   [junit4]   2> 	  "shard":"shard2",
   [junit4]   2> 	  "roles":null,
   [junit4]   2> 	  "state":"down",
   [junit4]   2> 	  "shard_state":"active",
   [junit4]   2> 	  "core":"nodes_used_collection_shard2_replica2",
   [junit4]   2> 	  "collection":"nodes_used_collection",
   [junit4]   2> 	  "shard_range":null,
   [junit4]   2> 	  "node_name":"127.0.0.1:53555_y%2Ff",
   [junit4]   2> 	  "base_url":"http://127.0.0.1:53555/y/f"}
   [junit4]   2> 371084 T1202 oasc.Overseer$ClusterStateUpdater.updateState WARN Could not find collection node for nodes_used_collection, skipping publish state
   [junit4]   2> 371085 T1202 oasc.Overseer$ClusterStateUpdater.updateState Update state numShards=2 message={
   [junit4]   2> 	  "operation":"state",
   [junit4]   2> 	  "core_node_name":"core_node3",
   [junit4]   2> 	  "numShards":"2",
   [junit4]   2> 	  "shard":"shard1",
   [junit4]   2> 	  "roles":null,
   [junit4]   2> 	  "state":"down",
   [junit4]   2> 	  "shard_state":"active",
   [junit4]   2> 	  "core":"nodes_used_collection_shard1_replica2",
   [junit4]   2> 	  "collection":"nodes_used_collection",
   [junit4]   2> 	  "shard_range":null,
   [junit4]   2> 	  "node_name":"127.0.0.1:53576_y%2Ff",
   [junit4]   2> 	  "base_url":"http://127.0.0.1:53576/y/f"}
   [junit4]   2> 371094 T1202 oasc.Overseer$ClusterStateUpdater.updateState WARN Could not find collection node for nodes_used_collection, skipping publish state
   [junit4]   2> 371094 T1202 oasc.Overseer$ClusterStateUpdater.updateState Update state numShards=2 message={
   [junit4]   2> 	  "operation":"state",
   [junit4]   2> 	  "core_node_name":"core_node4",
   [junit4]   2> 	  "numShards":"2",
   [junit4]   2> 	  "shard":"shard2",
   [junit4]   2> 	  "roles":null,
   [junit4]   2> 	  "state":"down",
   [junit4]   2> 	  "shard_state":"active",
   [junit4]   2> 	  "core":"nodes_used_collection_shard2_replica1",
   [junit4]   2> 	  "collection":"nodes_used_collection",
   [junit4]   2> 	  "shard_range":null,
   [junit4]   2> 	  "node_name":"127.0.0.1:53594_y%2Ff",
   [junit4]   2> 	  "base_url":"http://127.0.0.1:53594/y/f"}
   [junit4]   2> 371103 T1233 oascc.ZkStateReader$2.process A cluster state change: WatchedEvent state:SyncConnected type:NodeDataChanged path:/clusterstate.json, has occurred - updating... (live nodes size: 5)
   [junit4]   2> 371103 T1219 oascc.ZkStateReader$2.process A cluster state change: WatchedEvent state:SyncConnected type:NodeDataChanged path:/clusterstate.json, has occurred - updating... (live nodes size: 5)
   [junit4]   2> 371103 T1206 oascc.ZkStateReader$2.process A cluster state change: WatchedEvent state:SyncConnected type:NodeDataChanged path:/clusterstate.json, has occurred - updating... (live nodes size: 5)
   [junit4]   2> 371104 T1247 oascc.ZkStateReader$2.process A cluster state change: WatchedEvent state:SyncConnected type:NodeDataChanged path:/clusterstate.json, has occurred - updating... (live nodes size: 5)
   [junit4]   2> 371104 T1201 oascc.ZkStateReader$2.process A cluster state change: WatchedEvent state:SyncConnected type:NodeDataChanged path:/clusterstate.json, has occurred - updating... (live nodes size: 5)
   [junit4]   2> 371104 T1261 oascc.ZkStateReader$2.process A cluster state change: WatchedEvent state:SyncConnected type:NodeDataChanged path:/clusterstate.json, has occurred - updating... (live nodes size: 5)
   [junit4]   2> 371576 T1243 oasc.ZkController.waitForShardId waiting to find shard id in clusterstate for nodes_used_collection_shard1_replica1
   [junit4]   2> 371578 T1197 oasc.ZkController.waitForShardId waiting to find shard id in clusterstate for nodes_used_collection_shard2_replica2
   [junit4]   2> 371579 T1225 oasc.ZkController.waitForShardId waiting to find shard id in clusterstate for nodes_used_collection_shard1_replica2
   [junit4]   2> 371578 T1243 oasc.CorePropertiesLocator.writePropertiesFile ERROR Couldn't persist core properties to C:\Users\JenkinsSlave\workspace\Lucene-Solr-4.x-Windows\solr\build\solr-core\test\J0\.\org.apache.solr.cloud.CollectionsAPIDistributedZkTest-jetty3-1375557607308\nodes_used_collection_shard1_replica1\core.properties: java.io.FileNotFoundException: C:\Users\JenkinsSlave\workspace\Lucene-Solr-4.x-Windows\solr\build\solr-core\test\J0\.\org.apache.solr.cloud.CollectionsAPIDistributedZkTest-jetty3-1375557607308\nodes_used_collection_shard1_replica1\core.properties (The system cannot find the path specified)
   [junit4]   2> 371580 T1243 oasc.CoreContainer.create Creating SolrCore 'nodes_used_collection_shard1_replica1' using instanceDir: C:\Users\JenkinsSlave\workspace\Lucene-Solr-4.x-Windows\solr\build\solr-core\test\J0\.\org.apache.solr.cloud.CollectionsAPIDistributedZkTest-jetty3-1375557607308\nodes_used_collection_shard1_replica1
   [junit4]   2> 371580 T1243 oasc.ZkController.createCollectionZkNode Check for collection zkNode:nodes_used_collection
   [junit4]   2> 371580 T1225 oasc.CorePropertiesLocator.writePropertiesFile ERROR Couldn't persist core properties to C:\Users\JenkinsSlave\workspace\Lucene-Solr-4.x-Windows\solr\build\solr-core\test\J0\.\org.apache.solr.cloud.CollectionsAPIDistributedZkTest-jetty2-1375557605473\nodes_used_collection_shard1_replica2\core.properties: java.io.FileNotFoundException: C:\Users\JenkinsSlave\workspace\Lucene-Solr-4.x-Windows\solr\build\solr-core\test\J0\.\org.apache.solr.cloud.CollectionsAPIDistributedZkTest-jetty2-1375557605473\nodes_used_collection_shard1_replica2\core.properties (The system cannot find the path specified)
   [junit4]   2> 371580 T1255 oasc.ZkController.waitForShardId waiting to find shard id in clusterstate for nodes_used_collection_shard2_replica1
   [junit4]   2> 371580 T1197 oasc.CorePropertiesLocator.writePropertiesFile ERROR Couldn't persist core properties to C:\Users\JenkinsSlave\workspace\Lucene-Solr-4.x-Windows\solr\build\solr-core\test\J0\.\org.apache.solr.cloud.CollectionsAPIDistributedZkTest-controljetty-1375557602865\nodes_used_collection_shard2_replica2\core.properties: java.io.FileNotFoundException: C:\Users\JenkinsSlave\workspace\Lucene-Solr-4.x-Windows\solr\build\solr-core\test\J0\.\org.apache.solr.cloud.CollectionsAPIDistributedZkTest-controljetty-1375557602865\nodes_used_collection_shard2_replica2\core.properties (The system cannot find the path specified)
   [junit4]   2> 371582 T1197 oasc.CoreContainer.create Creating SolrCore 'nodes_used_collection_shard2_replica2' using instanceDir: C:\Users\JenkinsSlave\workspace\Lucene-Solr-4.x-Windows\solr\build\solr-core\test\J0\.\org.apache.solr.cloud.CollectionsAPIDistributedZkTest-controljetty-1375557602865\nodes_used_collection_shard2_replica2
   [junit4]   2> 371583 T1197 oasc.ZkController.createCollectionZkNode Check for collection zkNode:nodes_used_collection
   [junit4]   2> 371581 T1225 oasc.CoreContainer.create Creating SolrCore 'nodes_used_collection_shard1_replica2' using instanceDir: C:\Users\JenkinsSlave\workspace\Lucene-Solr-4.x-Windows\solr\build\solr-core\test\J0\.\org.apache.solr.cloud.CollectionsAPIDistributedZkTest-jetty2-1375557605473\nodes_used_collection_shard1_replica2
   [junit4]   2> 371583 T1243 oasc.ZkController.createCollectionZkNode Creating collection in ZooKeeper:nodes_used_collection
   [junit4]   2> 371584 T1197 oasc.ZkController.createCollectionZkNode Creating collection in ZooKeeper:nodes_used_collection
   [junit4]   2> 371584 T1197 oasc.ZkController.getConfName Looking for collection configName
   [junit4]   2> 371583 T1255 oasc.CorePropertiesLocator.writePropertiesFile ERROR Couldn't persist core properties to C:\Users\JenkinsSlave\workspace\Lucene-Solr-4.x-Windows\solr\build\solr-core\test\J0\.\org.apache.solr.cloud.CollectionsAPIDistributedZkTest-jetty4-1375557608986\nodes_used_collection_shard2_replica1\core.properties: java.io.FileNotFoundException: C:\Users\JenkinsSlave\workspace\Lucene-Solr-4.x-Windows\solr\build\solr-core\test\J0\.\org.apache.solr.cloud.CollectionsAPIDistributedZkTest-jetty4-1375557608986\nodes_used_collection_shard2_replica1\core.properties (The system cannot find the path specified)
   [junit4]   2> 371584 T1243 oasc.ZkController.getConfName Looking for collection configName
   [junit4]   2> 371584 T1225 oasc.ZkController.createCollectionZkNode Check for collection zkNode:nodes_used_collection
   [junit4]   2> 371585 T1255 oasc.CoreContainer.create Creating SolrCore 'nodes_used_collection_shard2_replica1' using instanceDir: C:\Users\JenkinsSlave\workspace\Lucene-Solr-4.x-Windows\solr\build\solr-core\test\J0\.\org.apache.solr.cloud.CollectionsAPIDistributedZkTest-jetty4-1375557608986\nodes_used_collection_shard2_replica1
   [junit4]   2> 371586 T1255 oasc.ZkController.createCollectionZkNode Check for collection zkNode:nodes_used_collection
   [junit4]   2> 371587 T1243 oasc.ZkController.getConfName Only one config set found in zk - using it:conf1
   [junit4]   2> 371587 T1243 oascc.SolrZkClient.makePath makePath: /collections/nodes_used_collection
   [junit4]   2> 371586 T1197 oasc.ZkController.getConfName Only one config set found in zk - using it:conf1
   [junit4]   2> 371588 T1255 oasc.ZkController.createCollectionZkNode Creating collection in ZooKeeper:nodes_used_collection
   [junit4]   2> 371589 T1255 oasc.ZkController.getConfName Looking for collection configName
   [junit4]   2> 371587 T1225 oasc.ZkController.createCollectionZkNode Creating collection in ZooKeeper:nodes_used_collection
   [junit4]   2> 371590 T1225 oasc.ZkController.getConfName Looking for collection configName
   [junit4]   2> 371588 T1197 oascc.SolrZkClient.makePath makePath: /collections/nodes_used_collection
   [junit4]   2> 371600 T1255 oasc.ZkController.getConfName Only one config set found in zk - using it:conf1
   [junit4]   2> 371601 T1243 oasc.ZkController.readConfigName Load collection config from:/collections/nodes_used_collection
   [junit4]   2> 371602 T1225 oascc.SolrZkClient.makePath makePath: /collections/nodes_used_collection
   [junit4]   2> 371601 T1255 oascc.SolrZkClient.makePath makePath: /collections/nodes_used_collection
   [junit4]   2> 371605 T1197 oasc.ZkController.readConfigName Load collection config from:/collections/nodes_used_collection
   [junit4]   2> 371605 T1243 oasc.SolrResourceLoader.<init> new SolrResourceLoader for directory: 'C:\Users\JenkinsSlave\workspace\Lucene-Solr-4.x-Windows\solr\build\solr-core\test\J0\.\org.apache.solr.cloud.CollectionsAPIDistributedZkTest-jetty3-1375557607308\nodes_used_collection_shard1_replica1\'
   [junit4]   2> 371610 T1225 oasc.ZkController.readConfigName Load collection config from:/collections/nodes_used_collection
   [junit4]   2> 371614 T1255 oasc.ZkController.readConfigName Load collection config from:/collections/nodes_used_collection
   [junit4]   2> 371616 T1197 oasc.SolrResourceLoader.<init> new SolrResourceLoader for directory: 'C:\Users\JenkinsSlave\workspace\Lucene-Solr-4.x-Windows\solr\build\solr-core\test\J0\.\org.apache.solr.cloud.CollectionsAPIDistributedZkTest-controljetty-1375557602865\nodes_used_collection_shard2_replica2\'
   [junit4]   2> 371617 T1225 oasc.SolrResourceLoader.<init> new SolrResourceLoader for directory: 'C:\Users\JenkinsSlave\workspace\Lucene-Solr-4.x-Windows\solr\build\solr-core\test\J0\.\org.apache.solr.cloud.CollectionsAPIDistributedZkTest-jetty2-1375557605473\nodes_used_collection_shard1_replica2\'
   [junit4]   2> 371627 T1255 oasc.SolrResourceLoader.<init> new SolrResourceLoader for directory: 'C:\Users\JenkinsSlave\workspace\Lucene-Solr-4.x-Windows\solr\build\solr-core\test\J0\.\org.apache.solr.cloud.CollectionsAPIDistributedZkTest-jetty4-1375557608986\nodes_used_collection_shard2_replica1\'
   [junit4]   2> 371712 T1197 oasc.SolrConfig.<init> Using Lucene MatchVersion: LUCENE_45
   [junit4]   2> 371717 T1243 oasc.SolrConfig.<init> Using Lucene MatchVersion: LUCENE_45
   [junit4]   2> 371775 T1243 oasc.SolrConfig.<init> Loaded SolrConfig: solrconfig.xml
   [junit4]   2> 371782 T1225 oasc.SolrConfig.<init> Using Lucene MatchVersion: LUCENE_45
   [junit4]   2> 371793 T1197 oasc.SolrConfig.<init> Loaded SolrConfig: solrconfig.xml
   [junit4]   2> 371797 T1255 oasc.SolrConfig.<init> Using Lucene MatchVersion: LUCENE_45
   [junit4]   2> 371830 T1243 oass.IndexSchema.readSchema Reading Solr Schema from schema.xml
   [junit4]   2> 371881 T1243 oass.IndexSchema.readSchema [nodes_used_collection_shard1_replica1] Schema name=test
   [junit4]   2> 371884 T1197 oass.IndexSchema.readSchema Reading Solr Schema from schema.xml
   [junit4]   2> 371891 T1225 oasc.SolrConfig.<init> Loaded SolrConfig: solrconfig.xml
   [junit4]   2> 371895 T1197 oass.IndexSchema.readSchema [nodes_used_collection_shard2_replica2] Schema name=test
   [junit4]   2> 371885 T1255 oasc.SolrConfig.<init> Loaded SolrConfig: solrconfig.xml
   [junit4]   2> 371962 T1225 oass.IndexSchema.readSchema Reading Solr Schema from schema.xml
   [junit4]   2> 371972 T1225 oass.IndexSchema.readSchema [nodes_used_collection_shard1_replica2] Schema name=test
   [junit4]   2> 372041 T1255 oass.IndexSchema.readSchema Reading Solr Schema from schema.xml
   [junit4]   2> 372092 T1255 oass.IndexSchema.readSchema [nodes_used_collection_shard2_replica1] Schema name=test
   [junit4]   2> 373009 T1197 oass.ByteField.init WARN ByteField is deprecated and will be removed in 5.0. You should use TrieIntField instead.
   [junit4]   2> 373009 T1197 oass.ShortField.init WARN ShortField is deprecated and will be removed in 5.0. You should use TrieIntField instead.
   [junit4]   2> 373009 T1197 oass.OpenExchangeRatesOrgProvider.init Initialized with rates=open-exchange-rates.json, refreshInterval=1440.
   [junit4]   2> 373028 T1243 oass.ByteField.init WARN ByteField is deprecated and will be removed in 5.0. You should use TrieIntField instead.
   [junit4]   2> 373028 T1243 oass.ShortField.init WARN ShortField is deprecated and will be removed in 5.0. You should use TrieIntField instead.
   [junit4]   2> 373030 T1243 oass.OpenExchangeRatesOrgProvider.init Initialized with rates=open-exchange-rates.json, refreshInterval=1440.
   [junit4]   2> 373032 T1197 oass.IndexSchema.readSchema default search field in schema is text
   [junit4]   2> 373037 T1197 oass.IndexSchema.readSchema unique key field: id
   [junit4]   2> 373048 T1243 oass.IndexSchema.readSchema default search field in schema is text
   [junit4]   2> 373053 T1243 oass.IndexSchema.readSchema unique key field: id
   [junit4]   2> 373326 T1225 oass.ByteField.init WARN ByteField is deprecated and will be removed in 5.0. You should use TrieIntField instead.
   [junit4]   2> 373327 T1225 oass.ShortField.init WARN ShortField is deprecated and will be removed in 5.0. You should use TrieIntField instead.
   [junit4]   2> 373328 T1225 oass.OpenExchangeRatesOrgProvider.init Initialized with rates=open-exchange-rates.json, refreshInterval=1440.
   [junit4]   2> 373342 T1225 oass.IndexSchema.readSchema default search field in schema is text
   [junit4]   2> 373351 T1197 oass.FileExchangeRateProvider.reload Reloading exchange rates from file currency.xml
   [junit4]   2> 373358 T1197 oass.FileExchangeRateProvider.reload Reloading exchange rates from file currency.xml
   [junit4]   2> 373366 T1197 oass.OpenExchangeRatesOrgProvider.reload Reloading exchange rates from open-exchange-rates.json
   [junit4]   2> 373370 T1197 oass.OpenExchangeRatesOrgProvider$OpenExchangeRates.<init> WARN Unknown key IMPORTANT NOTE
   [junit4]   2> 373370 T1197 oass.OpenExchangeRatesOrgProvider$OpenExchangeRates.<init> WARN Expected key, got STRING
   [junit4]   2> 373371 T1197 oass.OpenExchangeRatesOrgProvider.reload Reloading exchange rates from open-exchange-rates.json
   [junit4]   2> 373371 T1243 oass.FileExchangeRateProvider.reload Reloading exchange rates from file currency.xml
   [junit4]   2> 373374 T1197 oass.OpenExchangeRatesOrgProvider$OpenExchangeRates.<init> WARN Unknown key IMPORTANT NOTE
   [junit4]   2> 373375 T1197 oass.OpenExchangeRatesOrgProvider$OpenExchangeRates.<init> WARN Expected key, got STRING
   [junit4]   2> 373375 T1197 oasc.SolrCore.initDirectoryFactory org.apache.solr.core.MockDirectoryFactory
   [junit4]   2> 373376 T1197 oasc.SolrCore.<init> [nodes_used_collection_shard2_replica2] Opening new SolrCore at C:\Users\JenkinsSlave\workspace\Lucene-Solr-4.x-Windows\solr\build\solr-core\test\J0\.\org.apache.solr.cloud.CollectionsAPIDistributedZkTest-controljetty-1375557602865\nodes_used_collection_shard2_replica2\, dataDir=C:\Users\JenkinsSlave\workspace\Lucene-Solr-4.x-Windows\solr\build\solr-core\test\J0\.\org.apache.solr.cloud.CollectionsAPIDistributedZkTest-controljetty-1375557602865\\nodes_used_collection_shard2_replica2\data\
   [junit4]   2> 373382 T1243 oass.FileExchangeRateProvider.reload Reloading exchange rates from file currency.xml
   [junit4]   2> 373383 T1197 oasc.JmxMonitoredMap.<init> JMX monitoring is enabled. Adding Solr mbeans to JMX Server: com.sun.jmx.mbeanserver.JmxMBeanServer@615e992
   [junit4]   2> 373386 T1225 oass.IndexSchema.readSchema unique key field: id
   [junit4]   2> 373386 T1197 oasc.CachingDirectoryFactory.get return new directory for C:\Users\JenkinsSlave\workspace\Lucene-Solr-4.x-Windows\solr\build\solr-core\test\J0\.\org.apache.solr.cloud.CollectionsAPIDistributedZkTest-controljetty-1375557602865\\nodes_used_collection_shard2_replica2\data\
   [junit4]   2> 373387 T1197 oasc.SolrCore.getNewIndexDir New index directory detected: old=null new=C:\Users\JenkinsSlave\workspace\Lucene-Solr-4.x-Windows\solr\build\solr-core\test\J0\.\org.apache.solr.cloud.CollectionsAPIDistributedZkTest-controljetty-1375557602865\\nodes_used_collection_shard2_replica2\data\index/
   [junit4]   2> 373387 T1197 oasc.SolrCore.initIndex WARN [nodes_used_collection_shard2_replica2] Solr index directory 'C:\Users\JenkinsSlave\workspace\Lucene-Solr-4.x-Windows\solr\build\solr-core\test\J0\.\org.apache.solr.cloud.CollectionsAPIDistributedZkTest-controljetty-1375557602865\nodes_used_collection_shard2_replica2\data\index' doesn't exist. Creating new index...
   [junit4]   2> 373388 T1197 oasc.CachingDirectoryFactory.get return new directory for C:\Users\JenkinsSlave\workspace\Lucene-Solr-4.x-Windows\solr\build\solr-core\test\J0\.\org.apache.solr.cloud.CollectionsAPIDistributedZkTest-controljetty-1375557602865\\nodes_used_collection_shard2_replica2\data\index
   [junit4]   2> 373401 T1243 oass.OpenExchangeRatesOrgProvider.reload Reloading exchange rates from open-exchange-rates.json
   [junit4]   2> 373404 T1197 oasc.SolrDeletionPolicy.onCommit SolrDeletionPolicy.onCommit: commits: num=1
   [junit4]   2> 		commit{dir=MockDirWrapper(org.apache.lucene.store.RAMDirectory@3f0c7d62 lockFactory=org.apache.lucene.store.NativeFSLockFactory@6685f71a),segFN=segments_1,generation=1}
   [junit4]   2> 373404 T1197 oasc.SolrDeletionPolicy.updateCommits newest commit generation = 1
   [junit4]   2> 373410 T1197 oasup.UpdateRequestProcessorChain.init inserting DistributedUpdateProcessorFactory into updateRequestProcessorChain "dedupe"
   [junit4]   2> 373410 T1197 oasup.UpdateRequestProcessorChain.init inserting DistributedUpdateProcessorFactory into updateRequestProcessorChain "stored_sig"
   [junit4]   2> 373412 T1197 oasup.UpdateRequestProcessorChain.init inserting DistributedUpdateProcessorFactory into updateRequestProcessorChain "distrib-dup-test-chain-implicit"
   [junit4]   2> 373413 T1197 oasc.RequestHandlers.initHandlersFromConfig created standard: solr.StandardRequestHandler
   [junit4]   2> 373413 T1197 oasc.RequestHandlers.initHandlersFromConfig created /get: solr.RealTimeGetHandler
   [junit4]   2> 373413 T1197 oasc.RequestHandlers.initHandlersFromConfig adding lazy requestHandler: solr.ReplicationHandler
   [junit4]   2> 373414 T1197 oasc.RequestHandlers.initHandlersFromConfig created /replication: solr.ReplicationHandler
   [junit4]   2> 373414 T1197 oasc.RequestHandlers.initHandlersFromConfig created /update: solr.UpdateRequestHandler
   [junit4]   2> 373415 T1197 oasc.RequestHandlers.initHandlersFromConfig created /admin/: org.apache.solr.handler.admin.AdminHandlers
   [junit4]   2> 373419 T1243 oass.OpenExchangeRatesOrgProvider$OpenExchangeRates.<init> WARN Unknown key IMPORTANT NOTE
   [junit4]   2> 373419 T1243 oass.OpenExchangeRatesOrgProvider$OpenExchangeRates.<init> WARN Expected key, got STRING
   [junit4]   2> 373419 T1243 oass.OpenExchangeRatesOrgProvider.reload Reloading exchange rates from open-exchange-rates.json
   [junit4]   2> 373422 T1243 oass.OpenExchangeRatesOrgProvider$OpenExchangeRates.<init> WARN Unknown key IMPORTANT NOTE
   [junit4]   2> 373422 T1243 oass.OpenExchangeRatesOrgProvider$OpenExchangeRates.<init> WARN Expected key, got STRING
   [junit4]   2> 373423 T1243 oasc.SolrCore.initDirectoryFactory org.apache.solr.core.MockDirectoryFactory
   [junit4]   2> 373423 T1243 oasc.SolrCore.<init> [nodes_used_collection_shard1_replica1] Opening new SolrCore at C:\Users\JenkinsSlave\workspace\Lucene-Solr-4.x-Windows\solr\build\solr-core\test\J0\.\org.apache.solr.cloud.CollectionsAPIDistributedZkTest-jetty3-1375557607308\nodes_used_collection_shard1_replica1\, dataDir=C:\Users\JenkinsSlave\workspace\Lucene-Solr-4.x-Windows\solr\build\solr-core\test\J0\.\org.apache.solr.cloud.CollectionsAPIDistributedZkTest-jetty3-1375557607308\\nodes_used_collection_shard1_replica1\data\
   [junit4]   2> 373423 T1243 oasc.JmxMonitoredMap.<init> JMX monitoring is enabled. Adding Solr mbeans to JMX Server: com.sun.jmx.mbeanserver.JmxMBeanServer@615e992
   [junit4]   2> 373424 T1243 oasc.CachingDirectoryFactory.get return new directory for C:\Users\JenkinsSlave\workspace\Lucene-Solr-4.x-Windows\solr\build\solr-core\test\J0\.\org.apache.solr.cloud.CollectionsAPIDistributedZkTest-jetty3-1375557607308\\nodes_used_collection_shard1_replica1\data\
   [junit4]   2> 373424 T1243 oasc.SolrCore.getNewIndexDir New index directory detected: old=null new=C:\Users\JenkinsSlave\workspace\Lucene-Solr-4.x-Windows\solr\build\solr-core\test\J0\.\org.apache.solr.cloud.CollectionsAPIDistributedZkTest-jetty3-1375557607308\\nodes_used_collection_shard1_replica1\data\index/
   [junit4]   2> 373424 T1243 oasc.SolrCore.initIndex WARN [nodes_used_collection_shard1_replica1] Solr index directory 'C:\Users\JenkinsSlave\workspace\Lucene-Solr-4.x-Windows\solr\build\solr-core\test\J0\.\org.apache.solr.cloud.CollectionsAPIDistributedZkTest-jetty3-1375557607308\nodes_used_collection_shard1_replica1\data\index' doesn't exist. Creating new index...
   [junit4]   2> 373425 T1243 oasc.CachingDirectoryFactory.get return new directory for C:\Users\JenkinsSlave\workspace\Lucene-Solr-4.x-Windows\solr\build\solr-core\test\J0\.\org.apache.solr.cloud.CollectionsAPIDistributedZkTest-jetty3-1375557607308\\nodes_used_collection_shard1_replica1\data\index
   [junit4]   2> 373448 T1225 oass.FileExchangeRateProvider.reload Reloading exchange rates from file currency.xml
   [junit4]   2> 373452 T1197 oashl.XMLLoader.init xsltCacheLifetimeSeconds=60
   [junit4]   2> 373488 T1197 oass.SolrIndexSearcher.<init> Opening Searcher@45d39891 main
   [junit4]   2> 373490 T1243 oasc.SolrDeletionPolicy.onCommit SolrDeletionPolicy.onCommit: commits: num=1
   [junit4]   2> 		commit{dir=MockDirWrapper(org.apache.lucene.store.RAMDirectory@1b5e9c62 lockFactory=org.apache.lucene.store.NativeFSLockFactory@6300a294),segFN=segments_1,generation=1}
   [junit4]   2> 373490 T1243 oasc.SolrDeletionPolicy.updateCommits newest commit generation = 1
   [junit4]   2> 373491 T1197 oasu.CommitTracker.<init> Hard AutoCommit: disabled
   [junit4]   2> 373492 T1197 oasu.CommitTracker.<init> Soft AutoCommit: disabled
   [junit4]   2> 373497 T1243 oasup.UpdateRequestProcessorChain.init inserting DistributedUpdateProcessorFactory into updateRequestProcessorChain "dedupe"
   [junit4]   2> 373498 T1243 oasup.UpdateRequestProcessorChain.init inserting DistributedUpdateProcessorFactory into updateRequestProcessorChain "stored_sig"
   [junit4]   2> 373499 T1243 oasup.UpdateRequestProcessorChain.init inserting DistributedUpdateProcessorFactory into updateRequestProcessorChain "distrib-dup-test-chain-implicit"
   [junit4]   2> 373500 T1243 oasc.RequestHandlers.initHandlersFromConfig created standard: solr.StandardRequestHandler
   [junit4]   2> 373500 T1243 oasc.RequestHandlers.initHandlersFromConfig created /get: solr.RealTimeGetHandler
   [junit4]   2> 373500 T1243 oasc.RequestHandlers.initHandlersFromConfig adding lazy requestHandler: solr.ReplicationHandler
   [junit4]   2> 373501 T1243 oasc.RequestHandlers.initHandlersFromConfig created /replication: solr.ReplicationHandler
   [junit4]   2> 373501 T1243 oasc.RequestHandlers.initHandlersFromConfig created /update: solr.UpdateRequestHandler
   [junit4]   2> 373501 T1243 oasc.RequestHandlers.initHandlersFromConfig created /admin/: org.apache.solr.handler.admin.AdminHandlers
   [junit4]   2> 373508 T1225 oass.FileExchangeRateProvider.reload Reloading exchange rates from file currency.xml
   [junit4]   2> 373511 T1243 oashl.XMLLoader.init xsltCacheLifetimeSeconds=60
   [junit4]   2> 373516 T1243 oass.SolrIndexSearcher.<init> Opening Searcher@65ca1676 main
   [junit4]   2> 373521 T1225 oass.OpenExchangeRatesOrgProvider.reload Reloading exchange rates from open-exchange-rates.json
   [junit4]   2> 373524 T1225 oass.OpenExchangeRatesOrgProvider$OpenExchangeRates.<init> WARN Unknown key IMPORTANT NOTE
   [junit4]   2> 373524 T1225 oass.OpenExchangeRatesOrgProvider$OpenExchangeRates.<init> WARN Expected key, got STRING
   [junit4]   2> 373525 T1225 oass.OpenExchangeRatesOrgProvider.reload Reloading exchange rates from open-exchange-rates.json
   [junit4]   2> 373526 T1225 oass.OpenExchangeRatesOrgProvider$OpenExchangeRates.<init> WARN Unknown key IMPORTANT NOTE
   [junit4]   2> 373526 T1225 oass.OpenExchangeRatesOrgProvider$OpenExchangeRates.<init> WARN Expected key, got STRING
   [junit4]   2> 373527 T1225 oasc.SolrCore.initDirectoryFactory org.apache.solr.core.MockDirectoryFactory
   [junit4]   2> 373527 T1225 oasc.SolrCore.<init> [nodes_used_collection_shard1_replica2] Opening new SolrCore at C:\Users\JenkinsSlave\workspace\Lucene-Solr-4.x-Windows\solr\build\solr-core\test\J0\.\org.apache.solr.cloud.CollectionsAPIDistributedZkTest-jetty2-1375557605473\nodes_used_collection_shard1_replica2\, dataDir=C:\Users\JenkinsSlave\workspace\Lucene-Solr-4.x-Windows\solr\build\solr-core\test\J0\.\org.apache.solr.cloud.CollectionsAPIDistributedZkTest-jetty2-1375557605473\\nodes_used_collection_shard1_replica2\data\
   [junit4]   2> 373528 T1225 oasc.JmxMonitoredMap.<init> JMX monitoring is enabled. Adding Solr mbeans to JMX Server: com.sun.jmx.mbeanserver.JmxMBeanServer@615e992
   [junit4]   2> 373528 T1225 oasc.CachingDirectoryFactory.get return new directory for C:\Users\JenkinsSlave\workspace\Lucene-Solr-4.x-Windows\solr\build\solr-core\test\J0\.\org.apache.solr.cloud.CollectionsAPIDistributedZkTest-jetty2-1375557605473\\nodes_used_collection_shard1_replica2\data\
   [junit4]   2> 373529 T1225 oasc.SolrCore.getNewIndexDir New index directory detected: old=null new=C:\Users\JenkinsSlave\workspace\Lucene-Solr-4.x-Windows\solr\build\solr-core\test\J0\.\org.apache.solr.cloud.CollectionsAPIDistributedZkTest-jetty2-1375557605473\\nodes_used_collection_shard1_replica2\data\index/
   [junit4]   2> 373529 T1225 oasc.SolrCore.initIndex WARN [nodes_used_collection_shard1_replica2] Solr index directory 'C:\Users\JenkinsSlave\workspace\Lucene-Solr-4.x-Windows\solr\build\solr-core\test\J0\.\org.apache.solr.cloud.CollectionsAPIDistributedZkTest-jetty2-1375557605473\nodes_used_collection_shard1_replica2\data\index' doesn't exist. Creating new index...
   [junit4]   2> 373530 T1225 oasc.CachingDirectoryFactory.get return new directory for C:\Users\JenkinsSlave\workspace\Lucene-Solr-4.x-Windows\solr\build\solr-core\test\J0\.\org.apache.solr.cloud.CollectionsAPIDistributedZkTest-jetty2-1375557605473\\nodes_used_collection_shard1_replica2\data\index
   [junit4]   2> 373534 T1225 oasc.SolrDeletionPolicy.onCommit SolrDeletionPolicy.onCommit: commits: num=1
   [junit4]   2> 		commit{dir=MockDirWrapper(org.apache.lucene.store.RAMDirectory@34104c1a lockFactory=org.apache.lucene.store.NativeFSLockFactory@62dee8b8),segFN=segments_1,generation=1}
   [junit4]   2> 373535 T1225 oasc.SolrDeletionPolicy.updateCommits newest commit generation = 1
   [junit4]   2> 373538 T1243 oasu.CommitTracker.<init> Hard AutoCommit: disabled
   [junit4]   2> 373538 T1243 oasu.CommitTracker.<init> Soft AutoCommit: disabled
   [junit4]   2> 373544 T1225 oasup.UpdateRequestProcessorChain.init inserting DistributedUpdateProcessorFactory into updateRequestProcessorChain "dedupe"
   [junit4]   2> 373545 T1225 oasup.UpdateRequestProcessorChain.init inserting DistributedUpdateProcessorFactory into updateRequestProcessorChain "stored_sig"
   [junit4]   2> 373546 T1225 oasup.UpdateRequestProcessorChain.init inserting DistributedUpdateProcessorFactory into updateRequestProcessorChain "distrib-dup-test-chain-implicit"
   [junit4]   2> 373546 T1225 oasc.RequestHandlers.initHandlersFromConfig created standard: solr.StandardRequestHandler
   [junit4]   2> 373547 T1225 oasc.RequestHandlers.initHandlersFromConfig created /get: solr.RealTimeGetHandler
   [junit4]   2> 373547 T1225 oasc.RequestHandlers.initHandlersFromConfig adding lazy requestHandler: solr.ReplicationHandler
   [junit4]   2> 373547 T1225 oasc.RequestHandlers.initHandlersFromConfig created /replication: solr.ReplicationHandler
   [junit4]   2> 373549 T1225 oasc.RequestHandlers.initHandlersFromConfig created /update: solr.UpdateRequestHandler
   [junit4]   2> 373549 T1225 oasc.RequestHandlers.initHandlersFromConfig created /admin/: org.apache.solr.handler.admin.AdminHandlers
   [junit4]   2> 373559 T1225 oashl.XMLLoader.init xsltCacheLifetimeSeconds=60
   [junit4]   2> 373565 T1197 oasc.CoreContainer.registerCore registering core: nodes_used_collection_shard2_replica2
   [junit4]   2> 373571 T1197 oasc.ZkController.register Register replica - core:nodes_used_collection_shard2_replica2 address:http://127.0.0.1:53555/y/f collection:nodes_used_collection shard:shard2
   [junit4]   2> 373571 T1197 oascsi.HttpClientUtil.createClient Creating new http client, config:maxConnections=10000&maxConnectionsPerHost=20&connTimeout=15000&socketTimeout=30000&retry=false
   [junit4]   2> 373572 T1255 oass.ByteField.init WARN ByteField is deprecated and will be removed in 5.0. You should use TrieIntField instead.
   [junit4]   2> 373572 T1255 oass.ShortField.init WARN ShortField is deprecated and will be removed in 5.0. You should use TrieIntField instead.
   [junit4]   2> 373573 T1255 oass.OpenExchangeRatesOrgProvider.init Initialized with rates=open-exchange-rates.json, refreshInterval=1440.
   [junit4]   2> 373576 T1267 oasc.SolrCore.registerSearcher [nodes_used_collection_shard2_replica2] Registered new searcher Searcher@45d39891 main{StandardDirectoryReader(segments_1:1)}
   [junit4]   2> 373579 T1243 oasc.CoreContainer.registerCore registering core: nodes_used_collection_shard1_replica1
   [junit4]   2> 373579 T1243 oasc.ZkController.register Register replica - core:nodes_used_collection_shard1_replica1 address:http://127.0.0.1:53585/y/f collection:nodes_used_collection shard:shard1
   [junit4]   2> 373579 T1243 oascsi.HttpClientUtil.createClient Creating new http client, config:maxConnections=10000&maxConnectionsPerHost=20&connTimeout=15000&socketTimeout=30000&retry=false
   [junit4]   2> 373580 T1197 oascc.SolrZkClient.makePath makePath: /collections/nodes_used_collection/leader_elect/shard2/election
   [junit4]   2> 373579 T1268 oasc.SolrCore.registerSearcher [nodes_used_collection_shard1_replica1] Registered new searcher Searcher@65ca1676 main{StandardDirectoryReader(segments_1:1)}
   [junit4]   2> 373586 T1243 oascc.SolrZkClient.makePath makePath: /collections/nodes_used_collection/leader_elect/shard1/election
   [junit4]   2> 373588 T1225 oass.SolrIndexSearcher.<init> Opening Searcher@7c5eaa5b main
   [junit4]   2> 373590 T1225 oasu.CommitTracker.<init> Hard AutoCommit: disabled
   [junit4]   2> 373591 T1225 oasu.CommitTracker.<init> Soft AutoCommit: disabled
   [junit4]   2> 373591 T1255 oass.IndexSchema.readSchema default search field in schema is text
   [junit4]   2> 373596 T1255 oass.IndexSchema.readSchema unique key field: id
   [junit4]   2> 373596 T1225 oasc.CoreContainer.registerCore registering core: nodes_used_collection_shard1_replica2
   [junit4]   2> 373596 T1225 oasc.ZkController.register Register replica - core:nodes_used_collection_shard1_replica2 address:http://127.0.0.1:53576/y/f collection:nodes_used_collection shard:shard1
   [junit4]   2> 373597 T1225 oascsi.HttpClientUtil.createClient Creating new http client, config:maxConnections=10000&maxConnectionsPerHost=20&connTimeout=15000&socketTimeout=30000&retry=false
   [junit4]   2> 373600 T1269 oasc.SolrCore.registerSearcher [nodes_used_collection_shard1_replica2] Registered new searcher Searcher@7c5eaa5b main{StandardDirectoryReader(segments_1:1)}
   [junit4]   2> 373606 T1225 oascc.SolrZkClient.makePath makePath: /collections/nodes_used_collection/leader_elect/shard1/election
   [junit4]   2> 373615 T1197 oasc.ShardLeaderElectionContext.runLeaderProcess Running the leader process for shard shard2
   [junit4]   2> 373622 T1243 oasc.ShardLeaderElectionContext.runLeaderProcess Running the leader process for shard shard1
   [junit4]   2> 373623 T1197 oasc.ShardLead

[...truncated too long message...]

764 ccr.ThreadLeakControl.tryToInterruptAll Starting to interrupt leaked threads:
   [junit4]   2> 	   1) Thread[id=6781, name=searcherExecutor-3920-thread-1, state=WAITING, group=TGRP-TestLazyCores]
   [junit4]   2> 148000 T6764 ccr.ThreadLeakControl.tryToInterruptAll SEVERE There are still zombie threads that couldn't be terminated:
   [junit4]   2> 	   1) Thread[id=6781, name=searcherExecutor-3920-thread-1, state=WAITING, group=TGRP-TestLazyCores]
   [junit4]   2> 	        at sun.misc.Unsafe.park(Native Method)
   [junit4]   2> 	        at java.util.concurrent.locks.LockSupport.park(LockSupport.java:186)
   [junit4]   2> 	        at java.util.concurrent.locks.AbstractQueuedSynchronizer$ConditionObject.await(AbstractQueuedSynchronizer.java:2043)
   [junit4]   2> 	        at java.util.concurrent.LinkedBlockingQueue.take(LinkedBlockingQueue.java:442)
   [junit4]   2> 	        at java.util.concurrent.ThreadPoolExecutor.getTask(ThreadPoolExecutor.java:1068)
   [junit4]   2> 	        at java.util.concurrent.ThreadPoolExecutor.runWorker(ThreadPoolExecutor.java:1130)
   [junit4]   2> 	        at java.util.concurrent.ThreadPoolExecutor$Worker.run(ThreadPoolExecutor.java:615)
   [junit4]   2> 	        at java.lang.Thread.run(Thread.java:724)
   [junit4]   2> NOTE: test params are: codec=Lucene40, sim=DefaultSimilarity, locale=ru, timezone=America/Scoresbysund
   [junit4]   2> NOTE: Windows 7 6.1 amd64/Oracle Corporation 1.7.0_25 (64-bit)/cpus=2,threads=2,free=89250824,total=524288000
   [junit4]   2> NOTE: All tests run in this JVM: [AutoCommitTest, TestLuceneMatchVersion, SignatureUpdateProcessorFactoryTest, TestCSVResponseWriter, UniqFieldsUpdateProcessorFactoryTest, DocumentAnalysisRequestHandlerTest, EchoParamsTest, TestFiltering, SynonymTokenizerTest, FastVectorHighlighterTest, RecoveryZkTest, TestUniqueKeyFieldResource, SystemInfoHandlerTest, TestFastWriter, OverseerTest, PeerSyncTest, RegexBoostProcessorTest, HdfsSyncSliceTest, TestSolr4Spatial, HdfsRecoveryZkTest, TestManagedSchemaFieldResource, ChaosMonkeySafeLeaderTest, DeleteShardTest, TestLFUCache, TestFieldTypeResource, CollectionsAPIDistributedZkTest, ParsingFieldUpdateProcessorsTest, TestReversedWildcardFilterFactory, TestStressVersions, SampleTest, TermVectorComponentTest, CoreAdminCreateDiscoverTest, BlockCacheTest, TestLMDirichletSimilarityFactory, TestStressRecovery, TestRTGBase, ResourceLoaderTest, StressHdfsTest, IndexSchemaRuntimeFieldTest, StatsComponentTest, SimpleFacetsTest, JSONWriterTest, BadCopyFieldTest, TestIBSimilarityFactory, ZkNodePropsTest, TestPropInjectDefaults, TestDynamicFieldResource, SuggesterTSTTest, SortByFunctionTest, TestJmxIntegration, SolrTestCaseJ4Test, TermsComponentTest, TestRangeQuery, RequestHandlersTest, AssignTest, HardAutoCommitTest, PrimitiveFieldTypeTest, TestCharFilters, FieldAnalysisRequestHandlerTest, NumericFieldsTest, CoreAdminHandlerTest, TestDynamicFieldCollectionResource, SpellCheckCollatorTest, PathHierarchyTokenizerFactoryTest, TestXIncludeConfig, TestBM25SimilarityFactory, TestCopyFieldCollectionResource, OverseerCollectionProcessorTest, IndexSchemaTest, TestCloudManagedSchema, TestDistributedGrouping, RAMDirectoryFactoryTest, TestRandomMergePolicy, ConvertedLegacyTest, DisMaxRequestHandlerTest, SliceStateTest, ShardRoutingTest, TestPhraseSuggestions, TestReload, CachingDirectoryFactoryTest, TestSolrJ, TestRandomFaceting, BlockDirectoryTest, TestPerFieldSimilarity, TestCollationField, TestDocSet, AnalysisAfterCoreReloadTest, CoreMergeIndexesAdminHandlerTest, TestSolrQueryParserResource, TestSearchPerf, TestSolrXMLSerializer, SpellCheckComponentTest, DefaultValueUpdateProcessorTest, ExternalFileFieldSortTest, MultiTermTest, WordBreakSolrSpellCheckerTest, CopyFieldTest, SolrCoreCheckLockOnStartupTest, QueryEqualityTest, TestRecoveryHdfs, LeaderElectionTest, UpdateParamsTest, TestDefaultSimilarityFactory, TestSolrDeletionPolicy1, CSVRequestHandlerTest, QueryParsingTest, TestSolrXml, TestSurroundQueryParser, TestClassNameShortening, InfoHandlerTest, SolrPluginUtilsTest, TestFuzzyAnalyzedSuggestions, HdfsCollectionsAPIDistributedZkTest, SuggesterFSTTest, TestStressLucene, HdfsBasicDistributedZkTest, DirectUpdateHandlerOptimizeTest, DOMUtilTest, TestDefaultSearchFieldResource, HdfsBasicDistributedZk2Test, SchemaVersionSpecificBehaviorTest, LegacyHTMLStripCharFilterTest, ZkSolrClientTest, PreAnalyzedFieldTest, DocValuesTest, FullSolrCloudDistribCmdsTest, NotRequiredUniqueKeyTest, BasicDistributedZkTest, UUIDFieldTest, SimplePostToolTest, ReturnFieldsTest, SliceStateUpdateTest, HdfsChaosMonkeySafeLeaderTest, TestRandomDVFaceting, TestFaceting, TestHashPartitioner, HighlighterTest, ClusterStateTest, TestLRUCache, TestPHPSerializedResponseWriter, TestCoreDiscovery, TestPostingsSolrHighlighter, TestFieldTypeCollectionResource, TestBadConfig, SuggesterTest, TestDFRSimilarityFactory, TestUpdate, ClusterStateUpdateTest, TestArbitraryIndexDir, MinimalSchemaTest, MBeansHandlerTest, DirectSolrSpellCheckerTest, OpenCloseCoreStressTest, TestFunctionQuery, CacheHeaderTest, BasicDistributedZk2Test, UnloadDistributedZkTest, SyncSliceTest, LeaderElectionIntegrationTest, BasicZkTest, TestReplicationHandler, TestZkChroot, ZkCLITest, ShardRoutingCustomTest, TestDistributedSearch, TestRecovery, DistributedSpellCheckComponentTest, TermVectorComponentDistributedTest, ZkControllerTest, TestRealTimeGet, TestStressReorder, TestJoin, TestMultiCoreConfBootstrap, DistributedTermsComponentTest, TestCoreContainer, SolrCoreTest, TestGroupingSearch, SolrCmdDistributorTest, QueryElevationComponentTest, BadIndexSchemaTest, TestSort, BasicFunctionalityTest, TestLazyCores]
   [junit4]   2> NOTE: reproduce with: ant test  -Dtestcase=TestLazyCores -Dtests.seed=E9A8C75E789CABD9 -Dtests.slow=true -Dtests.locale=ru -Dtests.timezone=America/Scoresbysund -Dtests.file.encoding=ISO-8859-1
   [junit4] ERROR   0.00s | TestLazyCores (suite) <<<
   [junit4]    > Throwable #1: java.lang.AssertionError: ERROR: SolrIndexSearcher opens=36 closes=35
   [junit4]    > 	at __randomizedtesting.SeedInfo.seed([E9A8C75E789CABD9]:0)
   [junit4]    > 	at org.apache.solr.SolrTestCaseJ4.endTrackingSearchers(SolrTestCaseJ4.java:301)
   [junit4]    > 	at org.apache.solr.SolrTestCaseJ4.afterClass(SolrTestCaseJ4.java:129)
   [junit4]    > 	at java.lang.Thread.run(Thread.java:724)Throwable #2: com.carrotsearch.randomizedtesting.ThreadLeakError: 1 thread leaked from SUITE scope at org.apache.solr.core.TestLazyCores: 
   [junit4]    >    1) Thread[id=6781, name=searcherExecutor-3920-thread-1, state=WAITING, group=TGRP-TestLazyCores]
   [junit4]    >         at sun.misc.Unsafe.park(Native Method)
   [junit4]    >         at java.util.concurrent.locks.LockSupport.park(LockSupport.java:186)
   [junit4]    >         at java.util.concurrent.locks.AbstractQueuedSynchronizer$ConditionObject.await(AbstractQueuedSynchronizer.java:2043)
   [junit4]    >         at java.util.concurrent.LinkedBlockingQueue.take(LinkedBlockingQueue.java:442)
   [junit4]    >         at java.util.concurrent.ThreadPoolExecutor.getTask(ThreadPoolExecutor.java:1068)
   [junit4]    >         at java.util.concurrent.ThreadPoolExecutor.runWorker(ThreadPoolExecutor.java:1130)
   [junit4]    >         at java.util.concurrent.ThreadPoolExecutor$Worker.run(ThreadPoolExecutor.java:615)
   [junit4]    >         at java.lang.Thread.run(Thread.java:724)
   [junit4]    > 	at __randomizedtesting.SeedInfo.seed([E9A8C75E789CABD9]:0)Throwable #3: com.carrotsearch.randomizedtesting.ThreadLeakError: There are still zombie threads that couldn't be terminated:
   [junit4]    >    1) Thread[id=6781, name=searcherExecutor-3920-thread-1, state=WAITING, group=TGRP-TestLazyCores]
   [junit4]    >         at sun.misc.Unsafe.park(Native Method)
   [junit4]    >         at java.util.concurrent.locks.LockSupport.park(LockSupport.java:186)
   [junit4]    >         at java.util.concurrent.locks.AbstractQueuedSynchronizer$ConditionObject.await(AbstractQueuedSynchronizer.java:2043)
   [junit4]    >         at java.util.concurrent.LinkedBlockingQueue.take(LinkedBlockingQueue.java:442)
   [junit4]    >         at java.util.concurrent.ThreadPoolExecutor.getTask(ThreadPoolExecutor.java:1068)
   [junit4]    >         at java.util.concurrent.ThreadPoolExecutor.runWorker(ThreadPoolExecutor.java:1130)
   [junit4]    >         at java.util.concurrent.ThreadPoolExecutor$Worker.run(ThreadPoolExecutor.java:615)
   [junit4]    >         at java.lang.Thread.run(Thread.java:724)
   [junit4]    > 	at __randomizedtesting.SeedInfo.seed([E9A8C75E789CABD9]:0)
   [junit4] Completed in 148.10s, 6 tests, 1 failure, 2 errors <<< FAILURES!

[...truncated 406 lines...]
BUILD FAILED
C:\Users\JenkinsSlave\workspace\Lucene-Solr-4.x-Windows\build.xml:395: The following error occurred while executing this line:
C:\Users\JenkinsSlave\workspace\Lucene-Solr-4.x-Windows\build.xml:375: The following error occurred while executing this line:
C:\Users\JenkinsSlave\workspace\Lucene-Solr-4.x-Windows\build.xml:39: The following error occurred while executing this line:
C:\Users\JenkinsSlave\workspace\Lucene-Solr-4.x-Windows\solr\build.xml:181: The following error occurred while executing this line:
C:\Users\JenkinsSlave\workspace\Lucene-Solr-4.x-Windows\solr\common-build.xml:449: The following error occurred while executing this line:
C:\Users\JenkinsSlave\workspace\Lucene-Solr-4.x-Windows\lucene\common-build.xml:1233: The following error occurred while executing this line:
C:\Users\JenkinsSlave\workspace\Lucene-Solr-4.x-Windows\lucene\common-build.xml:876: There were test failures: 321 suites, 1352 tests, 3 suite-level errors, 1 error, 504 ignored (7 assumptions)

Total time: 77 minutes 47 seconds
Build step 'Invoke Ant' marked build as failure
Description set: Java: 64bit/jdk1.7.0_25 -XX:-UseCompressedOops -XX:+UseG1GC
Archiving artifacts
Recording test results
Email was triggered for: Failure
Sending email for trigger: Failure



Mime
View raw message