lucene-dev mailing list archives

Site index · List index
Message view « Date » · « Thread »
Top « Date » · « Thread »
From Robert Muir <rcm...@gmail.com>
Subject Re: [JENKINS] Lucene-Solr-SmokeRelease-4.4 - Build # 1 - Failure
Date Thu, 11 Jul 2013 13:37:57 GMT
And this is a serious problem because only like 2 people have access to
jenkins (and neither seems to know how to configure this correctly).

I don't want to see these tasks fail everytime someone makes a release
branch.


On Thu, Jul 11, 2013 at 9:34 AM, Uwe Schindler <uwe@thetaphi.de> wrote:

> What is wrong? I have no idea. The JDK-Paths seem to be correct, there is
> nothing else to configure?:****
>
> ** **
>
>     [mkdir] Created dir:
> /usr/home/hudson/hudson-slave/workspace/Lucene-Solr-SmokeRelease-4.4/lucene/build/fakeRelease
>      [copy] Copying 416 files to
> /usr/home/hudson/hudson-slave/workspace/Lucene-Solr-SmokeRelease-4.4/lucene/build/fakeRelease/lucene
>      [copy] Copying 194 files to
> /usr/home/hudson/hudson-slave/workspace/Lucene-Solr-SmokeRelease-4.4/lucene/build/fakeRelease/solr
>      [exec] JAVA6_HOME is /home/hudson/tools/java/latest1.6
>      [exec] JAVA7_HOME is /home/hudson/tools/java/latest1.7
>      [exec] NOTE: output encoding is US-ASCII
>
> ****
>
> Uwe****
>
> ** **
>
> -----****
>
> Uwe Schindler****
>
> H.-H.-Meier-Allee 63, D-28213 Bremen****
>
> http://www.thetaphi.de****
>
> eMail: uwe@thetaphi.de****
>
> ** **
>
> *From:* Robert Muir [mailto:rcmuir@gmail.com]
> *Sent:* Thursday, July 11, 2013 3:22 PM
> *To:* dev@lucene.apache.org; markrmiller@gmail.com
> *Subject:* Re: [JENKINS] Lucene-Solr-SmokeRelease-4.4 - Build # 1 -
> Failure****
>
> ** **
>
> Not exactly: this jenkins job is setup incorrectly, it does not have
> correct build properties.
>
> I have no access to jenkins, so i cannot fix it****
>
> On Wed, Jul 10, 2013 at 11:10 AM, Mark Miller <markrmiller@gmail.com>
> wrote:****
>
> Looks like this was some thread leaks out
> of org.apache.lucene.replicator.http.HttpReplicatorTest (suite)****
>
> ** **
>
> On Wed, Jul 10, 2013 at 11:05 AM, Apache Jenkins Server <
> jenkins@builds.apache.org> wrote:****
>
> Build: https://builds.apache.org/job/Lucene-Solr-SmokeRelease-4.4/1/
>
> No tests ran.
>
> Build Log:
> [...truncated 41628 lines...]
> prepare-release-no-sign:
>     [mkdir] Created dir:
> /usr/home/hudson/hudson-slave/workspace/Lucene-Solr-SmokeRelease-4.4/lucene/build/fakeRelease
>      [copy] Copying 416 files to
> /usr/home/hudson/hudson-slave/workspace/Lucene-Solr-SmokeRelease-4.4/lucene/build/fakeRelease/lucene
>      [copy] Copying 194 files to
> /usr/home/hudson/hudson-slave/workspace/Lucene-Solr-SmokeRelease-4.4/lucene/build/fakeRelease/solr
>      [exec] JAVA6_HOME is /home/hudson/tools/java/latest1.6
>      [exec] JAVA7_HOME is /home/hudson/tools/java/latest1.7
>      [exec] NOTE: output encoding is US-ASCII
>      [exec]
>      [exec] Load release URL
> "file:/usr/home/hudson/hudson-slave/workspace/Lucene-Solr-SmokeRelease-4.4/lucene/build/fakeRelease/"...
>      [exec]
>      [exec] Test Lucene...
>      [exec]   test basics...
>      [exec]   get KEYS
>      [exec]     0.1 MB in 0.01 sec (11.3 MB/sec)
>      [exec]   check changes HTML...
>      [exec]   download lucene-4.4.0-src.tgz...
>      [exec]     26.9 MB in 0.04 sec (662.2 MB/sec)
>      [exec]     verify md5/sha1 digests
>      [exec]   download lucene-4.4.0.tgz...
>      [exec]     50.5 MB in 0.13 sec (395.7 MB/sec)
>      [exec]     verify md5/sha1 digests
>      [exec]   download lucene-4.4.0.zip...
>      [exec]     60.5 MB in 0.10 sec (614.1 MB/sec)
>      [exec]     verify md5/sha1 digests
>      [exec]   unpack lucene-4.4.0.tgz...
>      [exec]     verify JAR/WAR metadata...
>      [exec]     test demo with 1.6...
>      [exec]       got 5646 hits for query "lucene"
>      [exec]     test demo with 1.7...
>      [exec]       got 5646 hits for query "lucene"
>      [exec]     check Lucene's javadoc JAR
>      [exec]   unpack lucene-4.4.0.zip...
>      [exec]     verify JAR/WAR metadata...
>      [exec]     test demo with 1.6...
>      [exec]       got 5646 hits for query "lucene"
>      [exec]     test demo with 1.7...
>      [exec]       got 5646 hits for query "lucene"
>      [exec]     check Lucene's javadoc JAR
>      [exec]   unpack lucene-4.4.0-src.tgz...
>      [exec]     make sure no JARs/WARs in src dist...
>      [exec]     run "ant validate"
>      [exec]     run tests w/ Java 6 and testArgs=''...
>      [exec]
>      [exec] command "export JAVA_HOME="/home/hudson/tools/java/latest1.6"
> PATH="/home/hudson/tools/java/latest1.6/bin:$PATH"
> JAVACMD="/home/hudson/tools/java/latest1.6/bin/java"; ant test " failed:
>      [exec] Buildfile:
> /usr/home/hudson/hudson-slave/workspace/Lucene-Solr-SmokeRelease-4.4/lucene/build/fakeReleaseTmp/unpack/lucene-4.4.0/build.xml
>      [exec]
>      [exec] -clover.load:
>      [exec]
>      [exec] test-core:
>      [exec]
>      [exec] -clover.disable:
>      [exec]
>      [exec] -clover.load:
>      [exec]
>      [exec] -clover.classpath:
>      [exec]
>      [exec] -clover.setup:
>      [exec]
>      [exec] clover:
>      [exec]
>      [exec] ivy-availability-check:
>      [exec]
>      [exec] ivy-fail:
>      [exec]
>      [exec] ivy-configure:
>      [exec] [ivy:configure] :: Apache Ivy 2.3.0 - 20130110142753 ::
> http://ant.apache.org/ivy/ ::
>      [exec] [ivy:configure] :: loading settings :: file =
> /usr/home/hudson/hudson-slave/workspace/Lucene-Solr-SmokeRelease-4.4/lucene/build/fakeReleaseTmp/unpack/lucene-4.4.0/ivy-settings.xml
>      [exec]
>      [exec] resolve:
>      [exec]
>      [exec] init:
>      [exec]
>      [exec] compile-core:
>      [exec]
>      [exec] compile-test-framework:
>      [exec]
>      [exec] ivy-availability-check:
>      [exec]
>      [exec] ivy-fail:
>      [exec]
>      [exec] ivy-configure:
>      [exec] [ivy:configure] :: loading settings :: file =
> /usr/home/hudson/hudson-slave/workspace/Lucene-Solr-SmokeRelease-4.4/lucene/build/fakeReleaseTmp/unpack/lucene-4.4.0/ivy-settings.xml
>      [exec]
>      [exec] resolve:
>      [exec]
>      [exec] init:
>      [exec]
>      [exec] compile-lucene-core:
>      [exec]
>      [exec] ivy-availability-check:
>      [exec]
>      [exec] ivy-fail:
>      [exec]
>      [exec] ivy-configure:
>      [exec] [ivy:configure] :: loading settings :: file =
> /usr/home/hudson/hudson-slave/workspace/Lucene-Solr-SmokeRelease-4.4/lucene/build/fakeReleaseTmp/unpack/lucene-4.4.0/ivy-settings.xml
>      [exec]
>      [exec] resolve:
>      [exec]
>      [exec] init:
>      [exec]
>      [exec] -clover.disable:
>      [exec]
>      [exec] -clover.load:
>      [exec]
>      [exec] -clover.classpath:
>      [exec]
>      [exec] -clover.setup:
>      [exec]
>      [exec] clover:
>      [exec]
>      [exec] compile-core:
>      [exec]
>      [exec] compile-codecs:
>      [exec]      [echo] Building codecs...
>      [exec]
>      [exec] ivy-availability-check:
>      [exec]      [echo] Building codecs...
>      [exec]
>      [exec] ivy-fail:
>      [exec]
>      [exec] ivy-configure:
>      [exec] [ivy:configure] :: loading settings :: file =
> /usr/home/hudson/hudson-slave/workspace/Lucene-Solr-SmokeRelease-4.4/lucene/build/fakeReleaseTmp/unpack/lucene-4.4.0/ivy-settings.xml
>      [exec]
>      [exec] resolve:
>      [exec]
>      [exec] common.init:
>      [exec]
>      [exec] compile-lucene-core:
>      [exec]
>      [exec] init:
>      [exec]
>      [exec] -clover.disable:
>      [exec]
>      [exec] -clover.load:
>      [exec]
>      [exec] -clover.classpath:
>      [exec]
>      [exec] -clover.setup:
>      [exec]
>      [exec] clover:
>      [exec]
>      [exec] compile-core:
>      [exec]
>      [exec] -clover.disable:
>      [exec]
>      [exec] -clover.load:
>      [exec]
>      [exec] -clover.classpath:
>      [exec]
>      [exec] -clover.setup:
>      [exec]
>      [exec] clover:
>      [exec]
>      [exec] common.compile-core:
>      [exec]
>      [exec] compile-core:
>      [exec]
>      [exec] compile-test:
>      [exec]
>      [exec] install-junit4-taskdef:
>      [exec]
>      [exec] validate:
>      [exec]
>      [exec] test:
>      [exec]     [mkdir] Created dir:
> /usr/home/hudson/hudson-slave/workspace/Lucene-Solr-SmokeRelease-4.4/lucene/build/fakeReleaseTmp/unpack/lucene-4.4.0/build/core/test
>      [exec]     [mkdir] Created dir:
> /usr/home/hudson/hudson-slave/workspace/Lucene-Solr-SmokeRelease-4.4/lucene/build/fakeReleaseTmp/unpack/lucene-4.4.0/build/core/test/temp
>      [exec]     [mkdir] Created dir:
> /usr/home/hudson/hudson-slave/workspace/Lucene-Solr-SmokeRelease-4.4/lucene/build/fakeReleaseTmp/unpack/.caches/test-stats/core
>      [exec]    [junit4] <JUnit4> says ??! Master seed: 70A76871EBAD21D
>      [exec]    [junit4] Your default console's encoding may not display
> certain unicode glyphs: ISO-8859-1
>      [exec]    [junit4] Executing 366 suites with 4 JVMs.
>      [exec]    [junit4]
>      [exec]    [junit4] Started J0 PID(6061@lucene.zones.apache.org).
>      [exec]    [junit4] Started J1 PID(6065@lucene.zones.apache.org).
>      [exec]    [junit4] Started J2 PID(6064@lucene.zones.apache.org).
>      [exec]    [junit4] Started J3 PID(6062@lucene.zones.apache.org).
>      [exec]    [junit4] Suite: org.apache.lucene.util.TestIntsRef
>      [exec]    [junit4] Completed on J1 in 1.59s, 2 tests
>      [exec]    [junit4]
>      [exec]    [junit4] Suite: org.apache.lucene.util.TestSmallFloat
>      [exec]    [junit4] Completed on J0 in 1.68s, 2 tests
>      [exec]    [junit4]
>      [exec]    [junit4] Suite:
> org.apache.lucene.util.TestRamUsageEstimatorOnWildAnimals
>      [exec]    [junit4] Completed on J1 in 0.55s, 1 test
>      [exec]    [junit4]
>      [exec]    [junit4] Suite:
> org.apache.lucene.util.automaton.TestBasicOperations
>      [exec]    [junit4] Completed on J0 in 0.71s, 8 tests
>      [exec]    [junit4]
>      [exec]    [junit4] Suite:
> org.apache.lucene.search.TestPhrasePrefixQuery
>      [exec]    [junit4] Completed on J2 in 3.79s, 1 test
>      [exec]    [junit4]
>      [exec]    [junit4] Suite: org.apache.lucene.search.TestPrefixFilter
>      [exec]    [junit4] Completed on J0 in 1.88s, 1 test
>      [exec]    [junit4]
>      [exec]    [junit4] Suite: org.apache.lucene.search.TestSortRandom
>      [exec]    [junit4] Completed on J3 in 4.07s, 1 test
>      [exec]    [junit4]
>      [exec]    [junit4] Suite:
> org.apache.lucene.search.TestPositionIncrement
>      [exec]    [junit4] Completed on J1 in 2.24s, 2 tests
>      [exec]    [junit4]
>      [exec]    [junit4] Suite: org.apache.lucene.index.TestParallelTermEnum
>      [exec]    [junit4] Completed on J3 in 0.22s, 1 test
>      [exec]    [junit4]
>      [exec]    [junit4] Suite: org.apache.lucene.index.TestNoDeletionPolicy
>      [exec]    [junit4] Completed on J2 in 0.75s, 4 tests
>      [exec]    [junit4]
>      [exec]    [junit4] Suite:
> org.apache.lucene.index.TestIndexWriterLockRelease
>      [exec]    [junit4] Completed on J3 in 0.18s, 1 test
>      [exec]    [junit4]
>      [exec]    [junit4] Suite: org.apache.lucene.util.TestRollingBuffer
>      [exec]    [junit4] Completed on J3 in 0.18s, 1 test
>      [exec]    [junit4]
>      [exec]    [junit4] Suite:
> org.apache.lucene.index.TestMultiLevelSkipList
>      [exec]    [junit4] Completed on J3 in 0.75s, 1 test
>      [exec]    [junit4]
>      [exec]    [junit4] Suite:
> org.apache.lucene.util.automaton.TestSpecialOperations
>      [exec]    [junit4] Completed on J3 in 0.57s, 2 tests
>      [exec]    [junit4]
>      [exec]    [junit4] Suite:
> org.apache.lucene.util.junitcompat.TestFailIfUnreferencedFiles
>      [exec]    [junit4] Completed on J3 in 0.16s, 1 test
>      [exec]    [junit4]
>      [exec]    [junit4] Suite: org.apache.lucene.search.TestTopDocsMerge
>      [exec]    [junit4] Completed on J0 in 5.29s, 1 test
>      [exec]    [junit4]
>      [exec]    [junit4] Suite:
> org.apache.lucene.search.TestSloppyPhraseQuery
>      [exec]    [junit4] Completed on J1 in 5.61s, 9 tests
>      [exec]    [junit4]
>      [exec]    [junit4] Suite: org.apache.lucene.search.MultiCollectorTest
>      [exec]    [junit4] Completed on J1 in 0.05s, 3 tests
>      [exec]    [junit4]
>      [exec]    [junit4] Suite: org.apache.lucene.index.TestDocValuesFormat
>      [exec]    [junit4] Completed on J2 in 5.67s, 57 tests
>      [exec]    [junit4]
>      [exec]    [junit4] Suite:
> org.apache.lucene.search.spans.TestSpanExplanationsOfNonMatches
>      [exec]    [junit4] Completed on J1 in 0.37s, 31 tests
>      [exec]    [junit4]
>      [exec]    [junit4] Suite:
> org.apache.lucene.search.TestSloppyPhraseQuery2
>      [exec]    [junit4] Completed on J1 in 1.66s, 9 tests
>      [exec]    [junit4]
>      [exec]    [junit4] Suite:
> org.apache.lucene.index.TestTermVectorsFormat
>      [exec]    [junit4] Completed on J3 in 5.98s, 7 tests
>      [exec]    [junit4]
>      [exec]    [junit4] Suite: org.apache.lucene.index.TestNewestSegment
>      [exec]    [junit4] Completed on J3 in 0.03s, 1 test
>      [exec]    [junit4]
>      [exec]    [junit4] Suite: org.apache.lucene.util.TestNumericUtils
>      [exec]    [junit4] Completed on J2 in 2.35s, 12 tests
>      [exec]    [junit4]
>      [exec]    [junit4] Suite:
> org.apache.lucene.codecs.compressing.TestFastCompressionMode
>      [exec]    [junit4] Completed on J1 in 0.72s, 8 tests
>      [exec]    [junit4]
>      [exec]    [junit4] Suite:
> org.apache.lucene.index.TestSnapshotDeletionPolicy
>      [exec]    [junit4] Completed on J3 in 2.20s, 7 tests
>      [exec]    [junit4]
>      [exec]    [junit4] Suite: org.apache.lucene.TestWorstCaseTestBehavior
>      [exec]    [junit4] Completed on J3 in 0.03s, 6 tests, 6 skipped
>      [exec]    [junit4]
>      [exec]    [junit4] Suite:
> org.apache.lucene.index.TestFilterAtomicReader
>      [exec]    [junit4] Completed on J3 in 0.19s, 2 tests
>      [exec]    [junit4]
>      [exec]    [junit4] Suite:
> org.apache.lucene.search.TestSimpleExplanationsOfNonMatches
>      [exec]    [junit4] Completed on J3 in 0.65s, 69 tests
>      [exec]    [junit4]
>      [exec]    [junit4] Suite:
> org.apache.lucene.index.TestIndexWriterUnicode
>      [exec]    [junit4] Completed on J2 in 3.13s, 5 tests
>      [exec]    [junit4]
>      [exec]    [junit4] Suite:
> org.apache.lucene.util.junitcompat.TestFailIfDirectoryNotClosed
>      [exec]    [junit4] Completed on J2 in 0.12s, 1 test
>      [exec]    [junit4]
>      [exec]    [junit4] Suite:
> org.apache.lucene.util.junitcompat.TestJUnitRuleOrder
>      [exec]    [junit4] Completed on J2 in 0.06s, 1 test
>      [exec]    [junit4]
>      [exec]    [junit4] Suite:
> org.apache.lucene.search.TestAutomatonQueryUnicode
>      [exec]    [junit4] Completed on J2 in 0.20s, 1 test
>      [exec]    [junit4]
>      [exec]    [junit4] Suite:
> org.apache.lucene.index.TestTermVectorsWriter
>      [exec]    [junit4] Completed on J3 in 0.54s, 13 tests
>      [exec]    [junit4]
>      [exec]    [junit4] Suite: org.apache.lucene.index.TestLazyProxSkipping
>      [exec]    [junit4] Completed on J2 in 1.12s, 2 tests
>      [exec]    [junit4]
>      [exec]    [junit4] Suite: org.apache.lucene.index.TestRollingUpdates
>      [exec]    [junit4] Completed on J1 in 4.59s, 2 tests
>      [exec]    [junit4]
>      [exec]    [junit4] Suite:
> org.apache.lucene.index.TestSameTokenSamePosition
>      [exec]    [junit4] Completed on J2 in 0.04s, 2 tests
>      [exec]    [junit4]
>      [exec]    [junit4] Suite:
> org.apache.lucene.analysis.TestNumericTokenStream
>      [exec]    [junit4] Completed on J2 in 0.07s, 4 tests
>      [exec]    [junit4]
>      [exec]    [junit4] Suite: org.apache.lucene.index.TestCheckIndex
>      [exec]    [junit4] Completed on J2 in 0.09s, 3 tests
>      [exec]    [junit4]
>      [exec]    [junit4] Suite: org.apache.lucene.index.TestPrefixCodedTerms
>      [exec]    [junit4] Completed on J1 in 0.53s, 6 tests
>      [exec]    [junit4]
>      [exec]    [junit4] Suite:
> org.apache.lucene.search.TestMultiThreadTermVectors
>      [exec]    [junit4] Completed on J2 in 0.46s, 1 test
>      [exec]    [junit4]
>      [exec]    [junit4] Suite: org.apache.lucene.index.TestTermsEnum
>      [exec]    [junit4] Completed on J0 in 8.81s, 7 tests
>      [exec]    [junit4]
>      [exec]    [junit4] Suite: org.apache.lucene.util.Test2BPagedBytes
>      [exec]    [junit4] Completed on J0 in 0.01s, 0 tests
>      [exec]    [junit4]
>      [exec]    [junit4] Suite:
> org.apache.lucene.search.TestTopScoreDocCollector
>      [exec]    [junit4] Completed on J0 in 0.05s, 1 test
>      [exec]    [junit4]
>      [exec]    [junit4] Suite:
> org.apache.lucene.index.TestTieredMergePolicy
>      [exec]    [junit4] Completed on J3 in 3.25s, 4 tests
>      [exec]    [junit4]
>      [exec]    [junit4] Suite: org.apache.lucene.index.TestMultiDocValues
>      [exec]    [junit4] Completed on J1 in 1.87s, 6 tests
>      [exec]    [junit4]
>      [exec]    [junit4] Suite: org.apache.lucene.analysis.TestMockAnalyzer
>      [exec]    [junit4] Completed on J0 in 2.16s, 9 tests
>      [exec]    [junit4]
>      [exec]    [junit4] Suite: org.apache.lucene.index.TestPostingsOffsets
>      [exec]    [junit4] Completed on J0 in 1.57s, 11 tests
>      [exec]    [junit4]
>      [exec]    [junit4] Suite:
> org.apache.lucene.index.TestPayloadsOnVectors
>      [exec]    [junit4] Completed on J0 in 0.07s, 3 tests
>      [exec]    [junit4]
>      [exec]    [junit4] Suite:
> org.apache.lucene.index.TestStoredFieldsFormat
>      [exec]    [junit4] IGNOR/A 0.10s J3 |
> TestStoredFieldsFormat.testBigDocuments
>      [exec]    [junit4]    > Assumption #1: 'nightly' test group is
> disabled (@Nightly)
>      [exec]    [junit4] Completed on J3 in 4.56s, 10 tests, 1 skipped
>      [exec]    [junit4]
>      [exec]    [junit4] Suite: org.apache.lucene.index.TestIndexInput
>      [exec]    [junit4] Completed on J3 in 0.95s, 3 tests
>      [exec]    [junit4]
>      [exec]    [junit4] Suite: org.apache.lucene.index.TestUniqueTermCount
>      [exec]    [junit4] Completed on J3 in 0.17s, 1 test
>      [exec]    [junit4]
>      [exec]    [junit4] Suite:
> org.apache.lucene.codecs.lucene40.TestLucene40TermVectorsFormat
>      [exec]    [junit4] Completed on J1 in 6.01s, 7 tests
>      [exec]    [junit4]
>      [exec]    [junit4] Suite: org.apache.lucene.index.TestCrash
>      [exec]    [junit4] Completed on J1 in 0.89s, 5 tests
>      [exec]    [junit4]
>      [exec]    [junit4] Suite: org.apache.lucene.util.TestWeakIdentityMap
>      [exec]    [junit4] Completed on J1 in 1.08s, 2 tests
>      [exec]    [junit4]
>      [exec]    [junit4] Suite:
> org.apache.lucene.search.TestQueryWrapperFilter
>      [exec]    [junit4] Completed on J1 in 0.56s, 3 tests
>      [exec]    [junit4]
>      [exec]    [junit4] Suite:
> org.apache.lucene.index.TestIndexWriterWithThreads
>      [exec]    [junit4] Completed on J0 in 6.55s, 12 tests
>      [exec]    [junit4]
>      [exec]    [junit4] Suite: org.apache.lucene.search.TestBoolean2
>      [exec]    [junit4] Completed on J2 in 10.99s, 11 tests
>      [exec]    [junit4]
>      [exec]    [junit4] Suite:
> org.apache.lucene.search.TestBooleanQueryVisitSubscorers
>      [exec]    [junit4] Completed on J2 in 0.07s, 3 tests
>      [exec]    [junit4]
>      [exec]    [junit4] Suite: org.apache.lucene.store.TestHugeRamFile
>      [exec]    [junit4] Completed on J1 in 1.08s, 1 test
>      [exec]    [junit4]
>      [exec]    [junit4] Suite:
> org.apache.lucene.codecs.lucene3x.TestTermInfosReaderIndex
>      [exec]    [junit4] Completed on J0 in 0.69s, 3 tests
>      [exec]    [junit4]
>      [exec]    [junit4] Suite: org.apache.lucene.index.TestSegmentReader
>      [exec]    [junit4] Completed on J2 in 0.98s, 7 tests
>      [exec]    [junit4]
>      [exec]    [junit4] Suite: org.apache.lucene.index.Test2BDocs
>      [exec]    [junit4] Completed on J0 in 1.66s, 2 tests
>      [exec]    [junit4]
>      [exec]    [junit4] Suite:
> org.apache.lucene.util.automaton.TestLevenshteinAutomata
>      [exec]    [junit4] Completed on J0 in 1.37s, 4 tests
>      [exec]    [junit4]
>      [exec]    [junit4] Suite:
> org.apache.lucene.index.TestDirectoryReaderReopen
>      [exec]    [junit4] Completed on J2 in 2.44s, 6 tests
>      [exec]    [junit4]
>      [exec]    [junit4] Suite:
> org.apache.lucene.search.TestScoreCachingWrappingScorer
>      [exec]    [junit4] Completed on J0 in 0.02s, 1 test
>      [exec]    [junit4]
>      [exec]    [junit4] Suite:
> org.apache.lucene.search.TestNumericRangeQuery32
>      [exec]    [junit4] Completed on J3 in 7.51s, 27 tests
>      [exec]    [junit4]
>      [exec]    [junit4] Suite: org.apache.lucene.search.TestDateFilter
>      [exec]    [junit4] Completed on J2 in 0.07s, 2 tests
>      [exec]    [junit4]
>      [exec]    [junit4] Suite:
> org.apache.lucene.codecs.lucene42.TestLucene42DocValuesFormat
>      [exec]    [junit4] Completed on J1 in 3.39s, 60 tests
>      [exec]    [junit4]
>      [exec]    [junit4] Suite:
> org.apache.lucene.search.spans.TestNearSpansOrdered
>      [exec]    [junit4] Completed on J3 in 0.27s, 10 tests
>      [exec]    [junit4]
>      [exec]    [junit4] Suite:
> org.apache.lucene.search.TestFieldValueFilter
>      [exec]    [junit4] Completed on J3 in 0.15s, 2 tests
>      [exec]    [junit4]
>      [exec]    [junit4] Suite: org.apache.lucene.search.TestLiveFieldValues
>      [exec]    [junit4] Completed on J2 in 0.64s, 1 test
>      [exec]    [junit4]
>      [exec]    [junit4] Suite: org.apache.lucene.index.TestTerm
>      [exec]    [junit4] Completed on J3 in 0.01s, 1 test
>      [exec]    [junit4]
>      [exec]    [junit4] Suite:
> org.apache.lucene.search.spans.TestSpansAdvanced
>      [exec]    [junit4] Completed on J3 in 0.14s, 1 test
>      [exec]    [junit4]
>      [exec]    [junit4] Suite: org.apache.lucene.search.TestPrefixRandom
>      [exec]    [junit4] Completed on J1 in 0.52s, 1 test
>      [exec]    [junit4]
>      [exec]    [junit4] Suite: org.apache.lucene.util.TestMaxFailuresRule
>      [exec]    [junit4] Completed on J0 in 1.15s, 1 test
>      [exec]    [junit4]
>      [exec]    [junit4] Suite: org.apache.lucene.search.TestSubScorerFreqs
>      [exec]    [junit4] Completed on J2 in 0.07s, 3 tests
>      [exec]    [junit4]
>      [exec]    [junit4] Suite: org.apache.lucene.index.TestSumDocFreq
>      [exec]    [junit4] Completed on J3 in 0.24s, 1 test
>      [exec]    [junit4]
>      [exec]    [junit4] Suite:
> org.apache.lucene.search.TestElevationComparator
>      [exec]    [junit4] Completed on J3 in 0.12s, 1 test
>      [exec]    [junit4]
>      [exec]    [junit4] Suite: org.apache.lucene.util.TestCharsRef
>      [exec]    [junit4] Completed on J3 in 0.05s, 8 tests
>      [exec]    [junit4]
>      [exec]    [junit4] Suite:
> org.apache.lucene.search.TestNGramPhraseQuery
>      [exec]    [junit4] Completed on J3 in 0.02s, 1 test
>      [exec]    [junit4]
>      [exec]    [junit4] Suite:
> org.apache.lucene.search.payloads.TestPayloadNearQuery
>      [exec]    [junit4] Completed on J1 in 0.69s, 7 tests
>      [exec]    [junit4]
>      [exec]    [junit4] Suite:
> org.apache.lucene.codecs.lucene41.TestForUtil
>      [exec]    [junit4] Completed on J0 in 0.28s, 1 test
>      [exec]    [junit4]
>      [exec]    [junit4] Suite: org.apache.lucene.search.TestFuzzyQuery
>      [exec]    [junit4] Completed on J2 in 0.82s, 6 tests
>      [exec]    [junit4]
>      [exec]    [junit4] Suite:
> org.apache.lucene.index.TestForTooMuchCloning
>      [exec]    [junit4] Completed on J3 in 0.54s, 1 test
>      [exec]    [junit4]
>      [exec]    [junit4] Suite: org.apache.lucene.index.TestOmitPositions
>      [exec]    [junit4] Completed on J1 in 0.83s, 4 tests
>      [exec]    [junit4]
>      [exec]    [junit4] Suite:
> org.apache.lucene.search.TestSameScoresWithThreads
>      [exec]    [junit4] Completed on J0 in 1.15s, 1 test
>      [exec]    [junit4]
>      [exec]    [junit4] Suite: org.apache.lucene.search.TestAutomatonQuery
>      [exec]    [junit4] Completed on J1 in 0.65s, 6 tests
>      [exec]    [junit4]
>      [exec]    [junit4] Suite:
> org.apache.lucene.search.spans.TestSpansAdvanced2
>      [exec]    [junit4] Completed on J0 in 0.93s, 4 tests
>      [exec]    [junit4]
>      [exec]    [junit4] Suite: org.apache.lucene.index.TestNoMergeScheduler
>      [exec]    [junit4] Completed on J0 in 0.04s, 3 tests
>      [exec]    [junit4]
>      [exec]    [junit4] Suite: org.apache.lucene.search.TestBooleanOr
>      [exec]    [junit4] Completed on J3 in 2.02s, 6 tests
>      [exec]    [junit4]
>      [exec]    [junit4] Suite:
> org.apache.lucene.search.TestTopDocsCollector
>      [exec]    [junit4] Completed on J3 in 0.21s, 8 tests
>      [exec]    [junit4]
>      [exec]    [junit4] Suite: org.apache.lucene.index.TestTermsEnum2
>      [exec]    [junit4] Completed on J0 in 0.90s, 4 tests
>      [exec]    [junit4]
>      [exec]    [junit4] Suite: org.apache.lucene.analysis.TestCharFilter
>      [exec]    [junit4] Completed on J0 in 0.08s, 4 tests
>      [exec]    [junit4]
>      [exec]    [junit4] Suite: org.apache.lucene.index.TestStressNRT
>      [exec]    [junit4] Completed on J2 in 3.25s, 1 test
>      [exec]    [junit4]
>      [exec]    [junit4] Suite: org.apache.lucene.search.TestTermRangeFilter
>      [exec]    [junit4] Completed on J2 in 0.50s, 3 tests
>      [exec]    [junit4]
>      [exec]    [junit4] Suite:
> org.apache.lucene.search.spans.TestFieldMaskingSpanQuery
>      [exec]    [junit4] IGNOR/A 0.01s J3 |
> TestFieldMaskingSpanQuery.testSpans2
>      [exec]    [junit4]    > Assumption #1: Broken scoring: LUCENE-3723
>      [exec]    [junit4] IGNOR/A 0.01s J3 |
> TestFieldMaskingSpanQuery.testSimple2
>      [exec]    [junit4]    > Assumption #1: Broken scoring: LUCENE-3723
>      [exec]    [junit4] Completed on J3 in 1.32s, 11 tests, 2 skipped
>      [exec]    [junit4]
>      [exec]    [junit4] Suite: org.apache.lucene.index.TestStressAdvance
>      [exec]    [junit4] Completed on J2 in 1.61s, 1 test
>      [exec]    [junit4]
>      [exec]    [junit4] Suite: org.apache.lucene.search.TestExplanations
>      [exec]    [junit4] Completed on J2 in 0.02s, 1 test
>      [exec]    [junit4]
>      [exec]    [junit4] Suite:
> org.apache.lucene.analysis.TestLookaheadTokenFilter
>      [exec]    [junit4] Completed on J1 in 6.25s, 2 tests
>      [exec]    [junit4]
>      [exec]    [junit4] Suite: org.apache.lucene.util.TestArrayUtil
>      [exec]    [junit4] Completed on J2 in 3.38s, 11 tests
>      [exec]    [junit4]
>      [exec]    [junit4] Suite: org.apache.lucene.search.TestIndexSearcher
>      [exec]    [junit4] Completed on J2 in 0.21s, 1 test
>      [exec]    [junit4]
>      [exec]    [junit4] Suite: org.apache.lucene.index.TestLongPostings
>      [exec]    [junit4] Completed on J1 in 2.08s, 2 tests
>      [exec]    [junit4]
>      [exec]    [junit4] Suite: org.apache.lucene.search.TestRegexpQuery
>      [exec]    [junit4] Completed on J1 in 0.12s, 7 tests
>      [exec]    [junit4]
>      [exec]    [junit4] Suite: org.apache.lucene.util.TestVersion
>      [exec]    [junit4] Completed on J1 in 0.02s, 3 tests
>      [exec]    [junit4]
>      [exec]    [junit4] Suite:
> org.apache.lucene.index.TestConsistentFieldNumbers
>      [exec]    [junit4] Completed on J2 in 1.24s, 4 tests
>      [exec]    [junit4]
>      [exec]    [junit4] Suite: org.apache.lucene.search.TestDocIdSet
>      [exec]    [junit4] Completed on J2 in 0.07s, 3 tests
>      [exec]    [junit4]
>      [exec]    [junit4] Suite: org.apache.lucene.search.TestPrefixQuery
>      [exec]    [junit4] Completed on J2 in 0.08s, 1 test
>      [exec]    [junit4]
>      [exec]    [junit4] Suite: org.apache.lucene.store.TestMultiMMap
>      [exec]    [junit4] Completed on J3 in 6.82s, 11 tests
>      [exec]    [junit4]
>      [exec]    [junit4] Suite:
> org.apache.lucene.search.TestSimilarityProvider
>      [exec]    [junit4] Completed on J2 in 0.04s, 1 test
>      [exec]    [junit4]
>      [exec]    [junit4] Suite: org.apache.lucene.TestAssertions
>      [exec]    [junit4] Completed on J3 in 0.02s, 1 test
>      [exec]    [junit4]
>      [exec]    [junit4] Suite:
> org.apache.lucene.codecs.lucene3x.TestLucene3xPostingsFormat
>      [exec]    [junit4] Completed on J1 in 0.63s, 7 tests
>      [exec]    [junit4]
>      [exec]    [junit4] Suite: org.apache.lucene.index.TestDocTermOrds
>      [exec]    [junit4] Completed on J1 in 0.33s, 5 tests
>      [exec]    [junit4]
>      [exec]    [junit4] Suite: org.apache.lucene.util.TestPriorityQueue
>      [exec]    [junit4] Completed on J1 in 0.07s, 4 tests
>      [exec]    [junit4]
>      [exec]    [junit4] Suite:
> org.apache.lucene.index.TestDocumentsWriterStallControl
>      [exec]    [junit4] Completed on J1 in 0.14s, 3 tests
>      [exec]    [junit4]
>      [exec]    [junit4] Suite:
> org.apache.lucene.search.similarities.TestSimilarityBase
>      [exec]    [junit4] Completed on J2 in 0.77s, 29 tests
>      [exec]    [junit4]
>      [exec]    [junit4] Suite: org.apache.lucene.index.TestMixedCodecs
>      [exec]    [junit4] Completed on J3 in 0.66s, 1 test
>      [exec]    [junit4]
>      [exec]    [junit4] Suite: org.apache.lucene.TestDemo
>      [exec]    [junit4] Completed on J2 in 0.02s, 1 test
>      [exec]    [junit4]
>      [exec]    [junit4] Suite:
> org.apache.lucene.index.TestParallelCompositeReader
>      [exec]    [junit4] Completed on J1 in 0.88s, 13 tests
>      [exec]    [junit4]
>      [exec]    [junit4] Suite:
> org.apache.lucene.util.junitcompat.TestLeaveFilesIfTestFails
>      [exec]    [junit4] Completed on J1 in 0.13s, 1 test
>      [exec]    [junit4]
>      [exec]    [junit4] Suite:
> org.apache.lucene.search.TestConstantScoreQuery
>      [exec]    [junit4] Completed on J1 in 0.03s, 3 tests
>      [exec]    [junit4]
>      [exec]    [junit4] Suite:
> org.apache.lucene.index.TestIndexWriterOnDiskFull
>      [exec]    [junit4] Completed on J2 in 1.25s, 4 tests
>      [exec]    [junit4]
>      [exec]    [junit4] Suite:
> org.apache.lucene.index.Test2BNumericDocValues
>      [exec]    [junit4] Completed on J2 in 0.01s, 0 tests
>      [exec]    [junit4]
>      [exec]    [junit4] Suite:
> org.apache.lucene.store.TestMockDirectoryWrapper
>      [exec]    [junit4] Completed on J2 in 0.02s, 3 tests
>      [exec]    [junit4]
>      [exec]    [junit4] Suite: org.apache.lucene.index.TestOmitNorms
>      [exec]    [junit4] Completed on J1 in 0.76s, 5 tests
>      [exec]    [junit4]
>      [exec]    [junit4] Suite: org.apache.lucene.index.TestTryDelete
>      [exec]    [junit4] Completed on J1 in 0.05s, 3 tests
>      [exec]    [junit4]
>      [exec]    [junit4] Suite:
> org.apache.lucene.search.TestTotalHitCountCollector
>      [exec]    [junit4] Completed on J1 in 0.02s, 1 test
>      [exec]    [junit4]
>      [exec]    [junit4] Suite: org.apache.lucene.TestSearch
>      [exec]    [junit4] Completed on J1 in 0.19s, 2 tests
>      [exec]    [junit4]
>      [exec]    [junit4] Suite:
> org.apache.lucene.search.TestMultiPhraseQuery
>      [exec]    [junit4] Completed on J1 in 0.39s, 16 tests, 1 skipped
>      [exec]    [junit4]
>      [exec]    [junit4] Suite: org.apache.lucene.index.TestCompoundFile
>      [exec]    [junit4] Completed on J3 in 2.49s, 18 tests
>      [exec]    [junit4]
>      [exec]    [junit4] Suite: org.apache.lucene.util.TestAttributeSource
>      [exec]    [junit4] Completed on J3 in 0.07s, 5 tests
>      [exec]    [junit4]
>      [exec]    [junit4] Suite: org.apache.lucene.util.TestMathUtil
>      [exec]    [junit4] Completed on J3 in 0.03s, 2 tests
>      [exec]    [junit4]
>      [exec]    [junit4] Suite: org.apache.lucene.util.TestFixedBitSet
>      [exec]    [junit4] Completed on J2 in 2.36s, 6 tests
>      [exec]    [junit4]
>      [exec]    [junit4] Suite:
> org.apache.lucene.index.TestFlushByRamOrCountsPolicy
>      [exec]    [junit4] Completed on J1 in 1.61s, 5 tests
>      [exec]    [junit4]
>      [exec]    [junit4] Suite:
> org.apache.lucene.index.TestIndexWriterOutOfFileDescriptors
>      [exec]    [junit4] Completed on J0 in 13.10s, 1 test
>      [exec]    [junit4]
>      [exec]    [junit4] Suite: org.apache.lucene.index.TestAtomicUpdate
>      [exec]    [junit4] Completed on J3 in 3.72s, 1 test
>      [exec]    [junit4]
>      [exec]    [junit4] Suite:
> org.apache.lucene.search.TestSearchWithThreads
>      [exec]    [junit4] Completed on J0 in 1.82s, 1 test
>      [exec]    [junit4]
>      [exec]    [junit4] Suite:
> org.apache.lucene.util.automaton.TestCompiledAutomaton
>      [exec]    [junit4] Completed on J0 in 0.08s, 2 tests
>      [exec]    [junit4]
>      [exec]    [junit4] Suite:
> org.apache.lucene.analysis.TestMockCharFilter
>      [exec]    [junit4] Completed on J0 in 0.03s, 1 test
>      [exec]    [junit4]
>      [exec]    [junit4] Suite: org.apache.lucene.index.TestPayloads
>      [exec]    [junit4] Completed on J3 in 0.17s, 7 tests
>      [exec]    [junit4]
>      [exec]    [junit4] Suite: org.apache.lucene.document.TestField
>      [exec]    [junit4] Completed on J3 in 0.10s, 18 tests
>      [exec]    [junit4]
>      [exec]    [junit4] Suite: org.apache.lucene.search.TestMinShouldMatch2
>      [exec]    [junit4] Completed on J1 in 2.64s, 6 tests
>      [exec]    [junit4]
>      [exec]    [junit4] Suite: org.apache.lucene.util.fst.Test2BFST
>      [exec]    [junit4] Completed on J1 in 0.00s, 0 tests
>      [exec]    [junit4]
>      [exec]    [junit4] Suite:
> org.apache.lucene.codecs.lucene41.TestBlockPostingsFormat2
>      [exec]    [junit4] Completed on J2 in 3.75s, 4 tests
>      [exec]    [junit4]
>      [exec]    [junit4] Suite: org.apache.lucene.search.TestFilteredQuery
>      [exec]    [junit4] Completed on J1 in 0.76s, 12 tests
>      [exec]    [junit4]
>      [exec]    [junit4] Suite: org.apache.lucene.index.TestNoMergePolicy
>      [exec]    [junit4] Completed on J2 in 0.04s, 4 tests
>      [exec]    [junit4]
>      [exec]    [junit4] Suite:
> org.apache.lucene.search.TestBooleanMinShouldMatch
>      [exec]    [junit4] Completed on J3 in 1.81s, 17 tests
>      [exec]    [junit4]
>      [exec]    [junit4] Suite: org.apache.lucene.index.TestCodecs
>      [exec]    [junit4] Completed on J0 in 1.99s, 4 tests
>      [exec]    [junit4]
>      [exec]    [junit4] Suite: org.apache.lucene.util.TestUnicodeUtil
>      [exec]    [junit4] Completed on J0 in 0.25s, 4 tests
>      [exec]    [junit4]
>      [exec]    [junit4] Suite:
> org.apache.lucene.codecs.compressing.TestHighCompressionMode
>      [exec]    [junit4] Completed on J2 in 1.46s, 5 tests
>      [exec]    [junit4]
>      [exec]    [junit4] Suite: org.apache.lucene.search.TestDocBoost
>      [exec]    [junit4] Completed on J2 in 0.02s, 1 test
>      [exec]    [junit4]
>      [exec]    [junit4] Suite:
> org.apache.lucene.codecs.lucene3x.TestSurrogates
>      [exec]    [junit4] Completed on J3 in 0.36s, 1 test
>      [exec]    [junit4]
>      [exec]    [junit4] Suite: org.apache.lucene.analysis.TestToken
>      [exec]    [junit4] Completed on J2 in 1.00s, 10 tests
>      [exec]    [junit4]
>      [exec]    [junit4] Suite:
> org.apache.lucene.index.TestIndexWriterDelete
>      [exec]    [junit4] IGNOR/A 0.14s J2 |
> TestIndexWriterDelete.testApplyDeletesOnFlush
>      [exec]    [junit4]    > Assumption #1: 'nightly' test group is
> disabled (@Nightly)
>      [exec]    [junit4] IGNOR/A 0.01s J2 |
> TestIndexWriterDelete.testIndexingThenDeleting
>      [exec]    [junit4]    > Assumption #1: This test cannot run with
> SimpleText codec
>      [exec]    [junit4] Completed on J2 in 2.51s, 22 tests, 2 skipped
>      [exec]    [junit4]
>      [exec]    [junit4] Suite: org.apache.lucene.index.TestDeletionPolicy
>      [exec]    [junit4] Completed on J0 in 4.53s, 6 tests
>      [exec]    [junit4]
>      [exec]    [junit4] Suite: org.apache.lucene.index.TestNorms
>      [exec]    [junit4] Completed on J0 in 0.91s, 2 tests
>      [exec]    [junit4]
>      [exec]    [junit4] Suite:
> org.apache.lucene.util.junitcompat.TestSeedFromUncaught
>      [exec]    [junit4] Completed on J0 in 0.05s, 1 test
>      [exec]    [junit4]
>      [exec]    [junit4] Suite:
> org.apache.lucene.index.TestIndexWriterReader
>      [exec]    [junit4] Completed on J3 in 5.88s, 21 tests
>      [exec]    [junit4]
>      [exec]    [junit4] Suite: org.apache.lucene.TestSearchForDuplicates
>      [exec]    [junit4] Completed on J3 in 0.18s, 1 test
>      [exec]    [junit4]
>      [exec]    [junit4] Suite:
> org.apache.lucene.search.TestDisjunctionMaxQuery
>      [exec]    [junit4] Completed on J0 in 0.71s, 11 tests
>      [exec]    [junit4]
>      [exec]    [junit4] Suite: org.apache.lucene.util.fst.TestBytesStore
>      [exec]    [junit4] Completed on J1 in 7.80s, 1 test
>      [exec]    [junit4]
>      [exec]    [junit4] Suite: org.apache.lucene.index.TestMultiFields
>      [exec]    [junit4] Completed on J0 in 0.61s, 3 tests
>      [exec]    [junit4]
>      [exec]    [junit4] Suite:
> org.apache.lucene.search.spans.TestPayloadSpans
>      [exec]    [junit4] Completed on J1 in 1.35s, 10 tests
>      [exec]    [junit4]
>      [exec]    [junit4] Suite:
> org.apache.lucene.index.Test2BSortedDocValues
>      [exec]    [junit4] Completed on J1 in 0.00s, 0 tests
>      [exec]    [junit4]
>      [exec]    [junit4] Suite: org.apache.lucene.index.TestDoc
>      [exec]    [junit4] Completed on J1 in 0.62s, 1 test
>      [exec]    [junit4]
>      [exec]    [junit4] Suite: org.apache.lucene.index.TestStressIndexing
>      [exec]    [junit4] Completed on J0 in 1.88s, 1 test
>      [exec]    [junit4]
>      [exec]    [junit4] Suite:
> org.apache.lucene.analysis.TestGraphTokenizers
>      [exec]    [junit4] Completed on J2 in 6.08s, 21 tests
>      [exec]    [junit4]
>      [exec]    [junit4] Suite:
> org.apache.lucene.util.junitcompat.TestFailOnFieldCacheInsanity
>      [exec]    [junit4] Completed on J2 in 0.05s, 1 test
>      [exec]    [junit4]
>      [exec]    [junit4] Suite:
> org.apache.lucene.search.TestMatchAllDocsQuery
>      [exec]    [junit4] Completed on J2 in 0.03s, 2 tests
>      [exec]    [junit4]
>      [exec]    [junit4] Suite:
> org.apache.lucene.search.spans.TestSpanExplanations
>      [exec]    [junit4] Completed on J0 in 1.27s, 31 tests
>      [exec]    [junit4]
>      [exec]    [junit4] Suite: org.apache.lucene.TestExternalCodecs
>      [exec]    [junit4] Completed on J0 in 0.11s, 1 test
>      [exec]    [junit4]
>      [exec]    [junit4] Suite:
> org.apache.lucene.search.TestFieldCacheTermsFilter
>      [exec]    [junit4] Completed on J0 in 0.11s, 1 test
>      [exec]    [junit4]
>      [exec]    [junit4] Suite:
> org.apache.lucene.codecs.lucene40.TestLucene40PostingsReader
>      [exec]    [junit4] Completed on J1 in 3.02s, 1 test
>      [exec]    [junit4]
>      [exec]    [junit4] Suite:
> org.apache.lucene.codecs.perfield.TestPerFieldDocValuesFormat
>      [exec]    [junit4] Completed on J1 in 4.81s, 58 tests
>      [exec]    [junit4]
>      [exec]    [junit4] Suite: org.apache.lucene.util.fst.TestFSTs
>      [exec]    [junit4] IGNOR/A 0.01s J3 | TestFSTs.testBigSet
>      [exec]    [junit4]    > Assumption #1: 'nightly' test group is
> disabled (@Nightly)
>      [exec]    [junit4] Completed on J3 in 14.62s, 18 tests, 1 skipped
>      [exec]    [junit4]
>      [exec]    [junit4] Suite:
> org.apache.lucene.codecs.compressing.TestCompressingTermVectorsFormat
>      [exec]    [junit4] Completed on J1 in 4.70s, 7 tests
>      [exec]    [junit4]
>      [exec]    [junit4] Suite: org.apache.lucene.search.TestScorerPerf
>      [exec]    [junit4] Completed on J3 in 2.36s, 1 test
>      [exec]    [junit4]
>      [exec]    [junit4] Suite: org.apache.lucene.index.TestIndexWriter
>      [exec]    [junit4] Completed on J2 in 17.84s, 55 tests
>      [exec]    [junit4]
>      [exec]    [junit4] Suite:
> org.apache.lucene.search.TestNumericRangeQuery64
>      [exec]    [junit4] Completed on J3 in 5.62s, 34 tests
>      [exec]    [junit4]
>      [exec]    [junit4] Suite: org.apache.lucene.index.TestDuelingCodecs
>      [exec]    [junit4] Completed on J0 in 19.41s, 1 test
>      [exec]    [junit4]
>      [exec]    [junit4] Suite:
> org.apache.lucene.search.TestFieldCacheRewriteMethod
>      [exec]    [junit4] Completed on J0 in 0.68s, 2 tests
>      [exec]    [junit4]
>      [exec]    [junit4] Suite:
> org.apache.lucene.util.junitcompat.TestBeforeAfterOverrides
>      [exec]    [junit4] Completed on J0 in 0.04s, 2 tests
>      [exec]    [junit4]
>      [exec]    [junit4] Suite:
> org.apache.lucene.search.TestDocValuesScoring
>      [exec]    [junit4] Completed on J0 in 0.05s, 1 test
>      [exec]    [junit4]
>      [exec]    [junit4] Suite:
> org.apache.lucene.util.junitcompat.TestExceptionInBeforeClassHooks
>      [exec]    [junit4] Completed on J0 in 0.12s, 3 tests
>      [exec]    [junit4]
>      [exec]    [junit4] Suite: org.apache.lucene.store.TestWindowsMMap
>      [exec]    [junit4] Completed on J0 in 0.11s, 1 test
>      [exec]    [junit4]
>      [exec]    [junit4] Suite:
> org.apache.lucene.index.Test2BBinaryDocValues
>      [exec]    [junit4] Completed on J0 in 0.00s, 0 tests
>      [exec]    [junit4]
>      [exec]    [junit4] Suite: org.apache.lucene.index.TestBinaryTerms
>      [exec]    [junit4] Completed on J0 in 0.09s, 2 tests
>      [exec]    [junit4]
>      [exec]    [junit4] Suite:
> org.apache.lucene.codecs.compressing.TestCompressingStoredFieldsFormat
>      [exec]    [junit4] IGNOR/A 0.10s J0 |
> TestCompressingStoredFieldsFormat.testBigDocuments
>      [exec]    [junit4]    > Assumption #1: 'nightly' test group is
> disabled (@Nightly)
>      [exec]    [junit4] Completed on J0 in 2.13s, 11 tests, 1 skipped
>      [exec]    [junit4]
>      [exec]    [junit4] Suite:
> org.apache.lucene.index.TestIndexWriterMerging
>      [exec]    [junit4] Completed on J1 in 14.78s, 6 tests
>      [exec]    [junit4]
>      [exec]    [junit4] Suite:
> org.apache.lucene.index.TestBackwardsCompatibility
>      [exec]    [junit4] Completed on J3 in 7.45s, 14 tests
>      [exec]    [junit4]
>      [exec]    [junit4] Suite: org.apache.lucene.index.TestAddIndexes
>      [exec]    [junit4] Completed on J0 in 3.81s, 20 tests
>      [exec]    [junit4]
>      [exec]    [junit4] Suite: org.apache.lucene.util.packed.TestPackedInts
>      [exec]    [junit4] IGNOR/A 0.00s J2 |
> TestPackedInts.testBlockReaderOverflow
>      [exec]    [junit4]    > Assumption #1: 'nightly' test group is
> disabled (@Nightly)
>      [exec]    [junit4] Completed on J2 in 10.19s, 26 tests, 3 skipped
>      [exec]    [junit4]
>      [exec]    [junit4] Suite: org.apache.lucene.search.TestSearcherManager
>      [exec]    [junit4] Completed on J2 in 2.84s, 7 tests
>      [exec]    [junit4]
>      [exec]    [junit4] Suite: org.apache.lucene.search.TestShardSearching
>      [exec]    [junit4] Completed on J1 in 5.05s, 1 test
>      [exec]    [junit4]
>      [exec]    [junit4] Suite:
> org.apache.lucene.codecs.lucene40.TestLucene40DocValuesFormat
>      [exec]    [junit4] IGNOR/A 0.09s J1 |
> TestLucene40DocValuesFormat.testSortedSetTwoValuesUnordered
>      [exec]    [junit4]    > Assumption #1: Codec does not support
> SORTED_SET
>      [exec]    [junit4] IGNOR/A 0.01s J1 |
> TestLucene40DocValuesFormat.testSortedSetTwoDocumentsLastMissingMerge
>      [exec]    [junit4]    > Assumption #1: Codec does not support
> SORTED_SET
>      [exec]    [junit4] IGNOR/A 0.01s J1 |
> TestLucene40DocValuesFormat.testSortedSetTwoDocumentsFirstMissing
>      [exec]    [junit4]    > Assumption #1: Codec does not support
> SORTED_SET
>      [exec]    [junit4] IGNOR/A 0.01s J1 |
> TestLucene40DocValuesFormat.testSortedSetThreeValuesTwoDocs
>      [exec]    [junit4]    > Assumption #1: Codec does not support
> SORTED_SET
>      [exec]    [junit4] IGNOR/A 0.00s J1 |
> TestLucene40DocValuesFormat.testSortedSetTwoDocumentsLastMissing
>      [exec]    [junit4]    > Assumption #1: Codec does not support
> SORTED_SET
>      [exec]    [junit4] IGNOR/A 0.01s J1 |
> TestLucene40DocValuesFormat.testSortedSetFixedLengthVsStoredFields
>      [exec]    [junit4]    > Assumption #1: Codec does not support
> SORTED_SET
>      [exec]    [junit4] IGNOR/A 0.01s J1 |
> TestLucene40DocValuesFormat.testSortedSetTwoFields
>      [exec]    [junit4]    > Assumption #1: Codec does not support
> SORTED_SET
>      [exec]    [junit4] IGNOR/A 0.01s J1 |
> TestLucene40DocValuesFormat.testSortedSetTermsEnum
>      [exec]    [junit4]    > Assumption #1: Codec does not support
> SORTED_SET
>      [exec]    [junit4] IGNOR/A 0.01s J1 |
> TestLucene40DocValuesFormat.testSortedSetMergeAwayAllValues
>      [exec]    [junit4]    > Assumption #1: Codec does not support
> SORTED_SET
>      [exec]    [junit4] IGNOR/A 0.01s J1 |
> TestLucene40DocValuesFormat.testSortedSetTwoValues
>      [exec]    [junit4]    > Assumption #1: Codec does not support
> SORTED_SET
>      [exec]    [junit4] IGNOR/A 0.01s J1 |
> TestLucene40DocValuesFormat.testSortedSetTwoDocumentsMerged
>      [exec]    [junit4]    > Assumption #1: Codec does not support
> SORTED_SET
>      [exec]    [junit4] IGNOR/A 0.01s J1 |
> TestLucene40DocValuesFormat.testSortedSetTwoDocumentsFirstMissingMerge
>      [exec]    [junit4]    > Assumption #1: Codec does not support
> SORTED_SET
>      [exec]    [junit4] IGNOR/A 0.01s J1 |
> TestLucene40DocValuesFormat.testSortedSetOneValue
>      [exec]    [junit4]    > Assumption #1: Codec does not support
> SORTED_SET
>      [exec]    [junit4] IGNOR/A 0.01s J1 |
> TestLucene40DocValuesFormat.testSortedSetFixedLengthVsUninvertedField
>      [exec]    [junit4]    > Assumption #1: Codec does not support
> SORTED_SET
>      [exec]    [junit4] IGNOR/A 0.01s J1 |
> TestLucene40DocValuesFormat.testSortedSetVariableLengthVsUninvertedField
>      [exec]    [junit4]    > Assumption #1: Codec does not support
> SORTED_SET
>      [exec]    [junit4] IGNOR/A 0.01s J1 |
> TestLucene40DocValuesFormat.testSortedSetVariableLengthVsStoredFields
>      [exec]    [junit4]    > Assumption #1: Codec does not support
> SORTED_SET
>      [exec]    [junit4] Completed on J1 in 1.55s, 57 tests, 16 skipped
>      [exec]    [junit4]
>      [exec]    [junit4] Suite:
> org.apache.lucene.index.TestIndexWriterExceptions
>      [exec]    [junit4] Completed on J3 in 7.46s, 26 tests
>      [exec]    [junit4]
>      [exec]    [junit4] Suite: org.apache.lucene.search.spans.TestBasics
>      [exec]    [junit4] Completed on J2 in 4.65s, 24 tests
>      [exec]    [junit4]
>      [exec]    [junit4] Suite:
> org.apache.lucene.codecs.lucene41.TestBlockPostingsFormat3
>      [exec]    [junit4] Completed on J0 in 9.00s, 1 test
>      [exec]    [junit4]
>      [exec]    [junit4] Suite: org.apache.lucene.index.TestNRTThreads
>      [exec]    [junit4] Completed on J3 in 3.61s, 1 test
>      [exec]    [junit4]
>      [exec]    [junit4] Suite:
> org.apache.lucene.index.TestPersistentSnapshotDeletionPolicy
>      [exec]    [junit4] Completed on J2 in 1.76s, 13 tests
>      [exec]    [junit4]
>      [exec]    [junit4] Suite:
> org.apache.lucene.index.TestIndexWriterMergePolicy
>      [exec]    [junit4] Completed on J1 in 4.94s, 7 tests
>      [exec]    [junit4]
>      [exec]    [junit4] Suite:
> org.apache.lucene.index.TestIndexWriterCommit
>      [exec]    [junit4] Completed on J0 in 2.01s, 12 tests
>      [exec]    [junit4]
>      [exec]    [junit4] Suite:
> org.apache.lucene.index.TestConcurrentMergeScheduler
>      [exec]    [junit4] Completed on J1 in 2.19s, 6 tests
>      [exec]    [junit4]
>      [exec]    [junit4] Suite:
> org.apache.lucene.search.TestTimeLimitingCollector
>      [exec]    [junit4] Completed on J3 in 3.95s, 6 tests
>      [exec]    [junit4]
>      [exec]    [junit4] Suite: org.apache.lucene.search.TestSearchAfter
>      [exec]    [junit4] Completed on J2 in 3.56s, 1 test
>      [exec]    [junit4]
>      [exec]    [junit4] Suite: org.apache.lucene.index.TestNeverDelete
>      [exec]    [junit4] Completed on J1 in 1.22s, 1 test
>      [exec]    [junit4]
>      [exec]    [junit4] Suite: org.apache.lucene.util.TestOpenBitSet
>      [exec]    [junit4] Completed on J0 in 3.75s, 4 tests
>      [exec]    [junit4]
>      [exec]    [junit4] Suite:
> org.apache.lucene.index.TestNRTReaderWithThreads
>      [exec]    [junit4] Completed on J1 in 1.15s, 1 test
>      [exec]    [junit4]
>      [exec]    [junit4] Suite:
> org.apache.lucene.index.TestIndexWriterForceMerge
>      [exec]    [junit4] Completed on J0 in 1.68s, 4 tests
>      [exec]    [junit4]
>      [exec]    [junit4] Suite:
> org.apache.lucene.codecs.perfield.TestPerFieldPostingsFormat
>      [exec]    [junit4] Completed on J1 in 1.07s, 7 tests
>      [exec]    [junit4]
>      [exec]    [junit4] Suite:
> org.apache.lucene.util.automaton.TestMinimize
>      [exec]    [junit4] Completed on J3 in 2.60s, 3 tests
>      [exec]    [junit4]
>      [exec]    [junit4] Suite: org.apache.lucene.index.TestByteSlices
>      [exec]    [junit4] Completed on J0 in 2.37s, 1 test
>      [exec]    [junit4]
>      [exec]    [junit4] Suite:
> org.apache.lucene.search.TestSimpleExplanations
>      [exec]    [junit4] Completed on J3 in 1.80s, 69 tests
>      [exec]    [junit4]
>      [exec]    [junit4] Suite:
> org.apache.lucene.search.TestDocTermOrdsRangeFilter
>      [exec]    [junit4] Completed on J3 in 0.37s, 1 test
>      [exec]    [junit4]
>      [exec]    [junit4] Suite:
> org.apache.lucene.search.TestDocTermOrdsRewriteMethod
>      [exec]    [junit4] Completed on J2 in 5.45s, 2 tests
>      [exec]    [junit4]
>      [exec]    [junit4] Suite:
> org.apache.lucene.store.TestBufferedIndexInput
>      [exec]    [junit4] Completed on J1 in 2.97s, 4 tests
>      [exec]    [junit4]
>      [exec]    [junit4] Suite: org.apache.lucene.index.TestDirectoryReader
>      [exec]    [junit4] Completed on J0 in 1.01s, 27 tests
>      [exec]    [junit4]
>      [exec]    [junit4] Suite: org.apache.lucene.index.TestSegmentMerger
>      [exec]    [junit4] Completed on J2 in 0.68s, 3 tests
>      [exec]    [junit4]
>      [exec]    [junit4] Suite: org.apache.lucene.store.TestLockFactory
>      [exec]    [junit4] IGNOR/A 0.00s J3 |
> TestLockFactory.testStressLocksNativeFSLockFactory
>      [exec]    [junit4]    > Assumption #1: 'nightly' test group is
> disabled (@Nightly)
>      [exec]    [junit4] IGNOR/A 0.00s J3 | TestLockFactory.testStressLocks
>      [exec]    [junit4]    > Assumption #1: 'nightly' test group is
> disabled (@Nightly)
>      [exec]    [junit4] Completed on J3 in 1.07s, 11 tests, 2 skipped
>      [exec]    [junit4]
>      [exec]    [junit4] Suite: org.apache.lucene.index.TestBagOfPositions
>      [exec]    [junit4] Completed on J2 in 0.52s, 1 test
>      [exec]    [junit4]
>      [exec]    [junit4] Suite: org.apache.lucene.search.TestPhraseQuery
>      [exec]    [junit4] Completed on J1 in 1.51s, 17 tests
>      [exec]    [junit4]
>      [exec]    [junit4] Suite:
> org.apache.lucene.util.TestDoubleBarrelLRUCache
>      [exec]    [junit4] Completed on J3 in 1.05s, 2 tests
>      [exec]    [junit4]
>      [exec]    [junit4] Suite:
> org.apache.lucene.search.TestComplexExplanations
>      [exec]    [junit4] Completed on J2 in 1.04s, 22 tests
>      [exec]    [junit4]
>      [exec]    [junit4] Suite:
> org.apache.lucene.codecs.compressing.TestFastDecompressionMode
>      [exec]    [junit4] Completed on J2 in 0.94s, 8 tests
>      [exec]    [junit4]
>      [exec]    [junit4] Suite:
> org.apache.lucene.store.TestNRTCachingDirectory
>      [exec]    [junit4] Completed on J3 in 1.64s, 5 tests
>      [exec]    [junit4]
>      [exec]    [junit4] Suite:
> org.apache.lucene.index.TestIndexWriterNRTIsCurrent
>      [exec]    [junit4] Completed on J2 in 0.72s, 1 test
>      [exec]    [junit4]
>      [exec]    [junit4] Suite: org.apache.lucene.util.TestCollectionUtil
>      [exec]    [junit4] Completed on J0 in 4.06s, 4 tests
>      [exec]    [junit4]
>      [exec]    [junit4] Suite: org.apache.lucene.search.TestRegexpRandom2
>      [exec]    [junit4] Completed on J1 in 2.58s, 1 test
>      [exec]    [junit4]
>      [exec]    [junit4] Suite: org.apache.lucene.index.TestSegmentTermDocs
>      [exec]    [junit4] Completed on J0 in 0.58s, 5 tests
>      [exec]    [junit4]
>      [exec]    [junit4] Suite: org.apache.lucene.index.TestTransactions
>      [exec]    [junit4] Completed on J2 in 0.79s, 1 test
>      [exec]    [junit4]
>      [exec]    [junit4] Suite:
> org.apache.lucene.codecs.perfield.TestPerFieldPostingsFormat2
>      [exec]    [junit4] Completed on J1 in 0.84s, 5 tests
>      [exec]    [junit4]
>      [exec]    [junit4] Suite:
> org.apache.lucene.codecs.lucene41.TestBlockPostingsFormat
>      [exec]    [junit4] Completed on J0 in 0.43s, 7 tests
>      [exec]    [junit4]
>      [exec]    [junit4] Suite:
> org.apache.lucene.codecs.lucene40.TestReuseDocsEnum
>      [exec]    [junit4] Completed on J0 in 0.45s, 3 tests
>      [exec]    [junit4]
>      [exec]    [junit4] Suite:
> org.apache.lucene.codecs.lucene40.TestBitVector
>      [exec]    [junit4] Completed on J1 in 0.94s, 9 tests
>      [exec]    [junit4]
>      [exec]    [junit4] Suite: org.apache.lucene.search.TestSort
>      [exec]    [junit4] Completed on J2 in 1.05s, 49 tests
>      [exec]    [junit4]
>      [exec]    [junit4] Suite:
> org.apache.lucene.util.TestFieldCacheSanityChecker
>      [exec]    [junit4] Completed on J0 in 0.36s, 3 tests
>      [exec]    [junit4]
>      [exec]    [junit4] Suite:
> org.apache.lucene.search.TestSimpleSearchEquivalence
>      [exec]    [junit4] Completed on J2 in 0.36s, 12 tests
>      [exec]    [junit4]
>      [exec]    [junit4] Suite: org.apache.lucene.index.TestFieldsReader
>      [exec]    [junit4] Completed on J1 in 0.51s, 2 tests
>      [exec]    [junit4]
>      [exec]    [junit4] Suite:
> org.apache.lucene.search.TestCustomSearcherSort
>      [exec]    [junit4] Completed on J0 in 0.58s, 2 tests
>      [exec]    [junit4]
>      [exec]    [junit4] Suite:
> org.apache.lucene.index.TestDocValuesIndexing
>      [exec]    [junit4] Completed on J2 in 0.53s, 30 tests
>      [exec]    [junit4]
>      [exec]    [junit4] Suite: org.apache.lucene.index.TestPostingsFormat
>      [exec]    [junit4] Completed on J1 in 0.72s, 7 tests
>      [exec]    [junit4]
>      [exec]    [junit4] Suite:
> org.apache.lucene.search.payloads.TestPayloadTermQuery
>      [exec]    [junit4] Completed on J0 in 0.51s, 6 tests
>      [exec]    [junit4]
>      [exec]    [junit4] Suite:
> org.apache.lucene.util.automaton.TestDeterminizeLexicon
>      [exec]    [junit4] Completed on J2 in 0.58s, 1 test
>      [exec]    [junit4]
>      [exec]    [junit4] Suite: org.apache.lucene.search.spans.TestSpans
>      [exec]    [junit4] Completed on J0 in 0.64s, 25 tests
>      [exec]    [junit4]
>      [exec]    [junit4] Suite: org.apache.lucene.search.TestFieldCache
>      [exec]    [junit4] Completed on J1 in 0.76s, 10 tests
>      [exec]    [junit4]
>      [exec]    [junit4] Suite:
> org.apache.lucene.codecs.lucene40.TestLucene40PostingsFormat
>      [exec]    [junit4] Completed on J1 in 0.34s, 7 tests
>      [exec]    [junit4]
>      [exec]    [junit4] Suite:
> org.apache.lucene.index.TestTransactionRollback
>      [exec]    [junit4] Completed on J0 in 0.66s, 2 tests
>      [exec]    [junit4]
>      [exec]    [junit4] Suite: org.apache.lucene.index.TestFlex
>      [exec]    [junit4] Completed on J1 in 0.06s, 2 tests
>      [exec]    [junit4]
>      [exec]    [junit4] Suite: org.apache.lucene.search.TestSortDocValues
>      [exec]    [junit4] Completed on J1 in 0.27s, 19 tests
>      [exec]    [junit4]
>      [exec]    [junit4] Suite:
> org.apache.lucene.util.automaton.TestUTF32ToUTF8
>      [exec]    [junit4] Completed on J0 in 0.56s, 5 tests
>      [exec]    [junit4]
>      [exec]    [junit4] Suite: org.apache.lucene.index.TestStressIndexing2
>      [exec]    [junit4] Completed on J1 in 0.45s, 3 tests
>      [exec]    [junit4]
>      [exec]    [junit4] Suite: org.apache.lucene.store.TestRAMDirectory
>      [exec]    [junit4] Completed on J0 in 0.39s, 4 tests
>      [exec]    [junit4]
>      [exec]    [junit4] Suite: org.apache.lucene.index.TestDocsAndPositions
>      [exec]    [junit4] Completed on J0 in 0.15s, 6 tests
>      [exec]    [junit4]
>      [exec]    [junit4] Suite:
> org.apache.lucene.util.automaton.TestDeterminism
>      [exec]    [junit4] Completed on J1 in 0.49s, 2 tests
>      [exec]    [junit4]
>      [exec]    [junit4] Suite:
> org.apache.lucene.search.TestFieldCacheRangeFilter
>      [exec]    [junit4] Completed on J1 in 0.38s, 9 tests
>      [exec]    [junit4]
>      [exec]    [junit4] Suite: org.apache.lucene.TestMergeSchedulerExternal
>      [exec]    [junit4] Completed on J0 in 0.50s, 2 tests
>      [exec]    [junit4]
>      [exec]    [junit4] Suite: org.apache.lucene.util.TestPagedBytes
>      [exec]    [junit4] Completed on J3 in 8.39s, 2 tests, 1 skipped
>      [exec]    [junit4]
>      [exec]    [junit4] Suite: org.apache.lucene.index.TestBagOfPostings
>      [exec]    [junit4] Completed on J1 in 0.60s, 1 test
>      [exec]    [junit4]
>      [exec]    [junit4] Suite:
> org.apache.lucene.analysis.tokenattributes.TestCharTermAttributeImpl
>      [exec]    [junit4] Completed on J0 in 0.51s, 12 tests
>      [exec]    [junit4]
>      [exec]    [junit4] Suite:
> org.apache.lucene.search.payloads.TestPayloadExplanations
>      [exec]    [junit4] Completed on J3 in 0.29s, 5 tests
>      [exec]    [junit4]
>      [exec]    [junit4] Suite:
> org.apache.lucene.index.TestParallelAtomicReader
>      [exec]    [junit4] Completed on J1 in 0.24s, 7 tests
>      [exec]    [junit4]
>      [exec]    [junit4] Suite: org.apache.lucene.util.TestBytesRefHash
>      [exec]    [junit4] Completed on J0 in 0.46s, 8 tests
>      [exec]    [junit4]
>      [exec]    [junit4] Suite: org.apache.lucene.store.TestCopyBytes
>      [exec]    [junit4] Completed on J1 in 0.25s, 2 tests
>      [exec]    [junit4]
>      [exec]    [junit4] Suite: org.apache.lucene.index.TestCustomNorms
>      [exec]    [junit4] Completed on J2 in 4.69s, 1 test
>      [exec]    [junit4]
>      [exec]    [junit4] Suite:
> org.apache.lucene.index.TestThreadedForceMerge
>      [exec]    [junit4] Completed on J3 in 0.71s, 1 test
>      [exec]    [junit4]
>      [exec]    [junit4] Suite:
> org.apache.lucene.index.TestForceMergeForever
>      [exec]    [junit4] Completed on J0 in 0.35s, 1 test
>      [exec]    [junit4]
>      [exec]    [junit4] Suite: org.apache.lucene.index.TestOmitTf
>      [exec]    [junit4] Completed on J1 in 0.27s, 6 tests
>      [exec]    [junit4]
>      [exec]    [junit4] Suite: org.apache.lucene.search.TestTermRangeQuery
>      [exec]    [junit4] Completed on J2 in 0.29s, 7 tests
>      [exec]    [junit4]
>      [exec]    [junit4] Suite:
> org.apache.lucene.index.TestDocumentsWriterDeleteQueue
>      [exec]    [junit4] Completed on J3 in 0.32s, 5 tests
>      [exec]    [junit4]
>      [exec]    [junit4] Suite:
> org.apache.lucene.index.TestCrashCausesCorruptIndex
>      [exec]    [junit4] Completed on J1 in 0.20s, 1 test
>      [exec]    [junit4]
>      [exec]    [junit4] Suite: org.apache.lucene.index.TestDocumentWriter
>      [exec]    [junit4] Completed on J0 in 0.25s, 7 tests
>      [exec]    [junit4]
>      [exec]    [junit4] Suite:
> org.apache.lucene.search.TestMultiTermConstantScore
>      [exec]    [junit4] Completed on J2 in 0.14s, 7 tests
>      [exec]    [junit4]
>      [exec]    [junit4] Suite:
> org.apache.lucene.search.spans.TestSpanSearchEquivalence
>      [exec]    [junit4] Completed on J1 in 0.18s, 8 tests
>      [exec]    [junit4]
>      [exec]    [junit4] Suite: org.apache.lucene.search.TestWildcard
>      [exec]    [junit4] Completed on J0 in 0.21s, 8 tests
>      [exec]    [junit4]
>      [exec]    [junit4] Suite:
> org.apache.lucene.search.similarities.TestSimilarity2
>      [exec]    [junit4] Completed on J2 in 0.18s, 7 tests
>      [exec]    [junit4]
>      [exec]    [junit4] Suite:
> org.apache.lucene.index.TestTermVectorsReader
>      [exec]    [junit4] Completed on J0 in 0.17s, 5 tests
>      [exec]    [junit4]
>      [exec]    [junit4] Suite:
> org.apache.lucene.index.TestPerSegmentDeletes
>      [exec]    [junit4] Completed on J2 in 0.05s, 1 test
>      [exec]    [junit4]
>      [exec]    [junit4] Suite:
> org.apache.lucene.util.junitcompat.TestReproduceMessage
>      [exec]    [junit4] Completed on J3 in 0.59s, 21 tests
>      [exec]    [junit4]
>      [exec]    [junit4] Suite: org.apache.lucene.search.TestTermVectors
>      [exec]    [junit4] Completed on J1 in 0.22s, 4 tests
>      [exec]    [junit4]
>      [exec]    [junit4] Suite: org.apache.lucene.index.TestSegmentTermEnum
>      [exec]    [junit4] Completed on J1 in 0.08s, 2 tests
>      [exec]    [junit4]
>      [exec]    [junit4] Suite:
> org.apache.lucene.search.TestMultiValuedNumericRangeQuery
>      [exec]    [junit4] Completed on J0 in 0.29s, 1 test
>      [exec]    [junit4]
>      [exec]    [junit4] Suite: org.apache.lucene.index.TestIntBlockPool
>      [exec]    [junit4] Completed on J2 in 0.26s, 2 tests
>      [exec]    [junit4]
>      [exec]    [junit4] Suite:
> org.apache.lucene.search.TestPrefixInBooleanQuery
>      [exec]    [junit4] Completed on J3 in 0.29s, 4 tests
>      [exec]    [junit4]
>      [exec]    [junit4] Suite: org.apache.lucene.search.TestBooleanQuery
>      [exec]    [junit4] Completed on J1 in 0.23s, 6 tests
>      [exec]    [junit4]
>      [exec]    [junit4] Suite:
> org.apache.lucene.search.TestComplexExplanationsOfNonMatches
>      [exec]    [junit4] Completed on J0 in 0.11s, 22 tests
>      [exec]    [junit4]
>      [exec]    [junit4] Suite:
> org.apache.lucene.index.TestAllFilesHaveCodecHeader
>      [exec]    [junit4] Completed on J2 in 0.21s, 1 test
>      [exec]    [junit4]
>      [exec]    [junit4] Suite:
> org.apache.lucene.index.TestParallelReaderEmptyIndex
>      [exec]    [junit4] Completed on J3 in 0.11s, 2 tests
>      [exec]    [junit4]
>      [exec]    [junit4] Suite: org.apache.lucene.document.TestDocument
>      [exec]    [junit4] Completed on J1 in 0.18s, 10 tests
>      [exec]    [junit4]
>      [exec]    [junit4] Suite: org.apache.lucene.search.TestTermScorer
>      [exec]    [junit4] Completed on J2 in 0.04s, 3 tests
>      [exec]    [junit4]
>      [exec]    [junit4] Suite:
> org.apache.lucene.search.TestTopFieldCollector
>      [exec]    [junit4] Completed on J3 in 0.15s, 8 tests
>      [exec]    [junit4]
>      [exec]    [junit4] Suite:
> org.apache.lucene.store.TestFileSwitchDirectory
>      [exec]    [junit4] Completed on J1 in 0.06s, 4 tests
>      [exec]    [junit4]
>      [exec]    [junit4] Suite: org.apache.lucene.index.TestIndexableField
>      [exec]    [junit4] Completed on J2 in 0.10s, 1 test
>      [exec]    [junit4]
>      [exec]    [junit4] Suite: org.apache.lucene.util.TestSentinelIntSet
>      [exec]    [junit4] Completed on J3 in 0.19s, 2 tests
>      [exec]    [junit4]
>      [exec]    [junit4] Suite: org.apache.lucene.search.TestWildcardRandom
>      [exec]    [junit4] Completed on J1 in 0.06s, 1 test
>      [exec]    [junit4]
>      [exec]    [junit4] Suite: org.apache.lucene.store.TestDirectory
>      [exec]    [junit4] IGNOR/A 0.00s J2 | TestDirectory.testThreadSafety
>      [exec]    [junit4]    > Assumption #1: 'nightly' test group is
> disabled (@Nightly)
>      [exec]    [junit4] Completed on J2 in 0.05s, 8 tests, 1 skipped
>      [exec]    [junit4]
>      [exec]    [junit4] Suite:
> org.apache.lucene.search.TestCachingWrapperFilter
>      [exec]    [junit4] Completed on J1 in 0.06s, 5 tests
>      [exec]    [junit4]
>      [exec]    [junit4] Suite: org.apache.lucene.index.TestMaxTermFrequency
>      [exec]    [junit4] Completed on J0 in 0.96s, 1 test
>      [exec]    [junit4]
>      [exec]    [junit4] Suite: org.apache.lucene.search.TestRegexpRandom
>      [exec]    [junit4] Completed on J3 in 0.33s, 1 test
>      [exec]    [junit4]
>      [exec]    [junit4] Suite:
> org.apache.lucene.search.spans.TestSpanMultiTermQueryWrapper
>      [exec]    [junit4] Completed on J2 in 0.11s, 4 tests
>      [exec]    [junit4]
>      [exec]    [junit4] Suite:
> org.apache.lucene.util.junitcompat.TestSystemPropertiesInvariantRule
>      [exec]    [junit4] Completed on J1 in 0.12s, 5 tests
>      [exec]    [junit4]
>      [exec]    [junit4] Suite:
> org.apache.lucene.index.TestSizeBoundedForceMerge
>      [exec]    [junit4] Completed on J0 in 0.08s, 11 tests
>      [exec]    [junit4]
>      [exec]    [junit4] Suite: org.apache.lucene.index.TestIndexFileDeleter
>      [exec]    [junit4] Completed on J3 in 0.05s, 1 test
>      [exec]    [junit4]
>      [exec]    [junit4] Suite:
> org.apache.lucene.index.TestDocValuesWithThreads
>      [exec]    [junit4] Completed on J2 in 0.06s, 2 tests
>      [exec]    [junit4]
>      [exec]    [junit4] Suite: org.apache.lucene.search.TestFilteredSearch
>      [exec]    [junit4] Completed on J1 in 0.04s, 1 test
>      [exec]    [junit4]
>      [exec]    [junit4] Suite:
> org.apache.lucene.util.TestRecyclingIntBlockAllocator
>      [exec]    [junit4] Completed on J0 in 0.21s, 3 tests
>      [exec]    [junit4]
>      [exec]    [junit4] Suite:
> org.apache.lucene.index.TestIndexWriterConfig
>      [exec]    [junit4] Completed on J3 in 0.07s, 9 tests
>      [exec]    [junit4]
>      [exec]    [junit4] Suite: org.apache.lucene.search.TestConjunctions
>      [exec]    [junit4] Completed on J2 in 0.03s, 1 test
>      [exec]    [junit4]
>      [exec]    [junit4] Suite:
> org.apache.lucene.search.TestMultiTermQueryRewrites
>      [exec]    [junit4] Completed on J1 in 0.10s, 3 tests
>      [exec]    [junit4]
>      [exec]    [junit4] Suite:
> org.apache.lucene.util.junitcompat.TestSameRandomnessLocalePassedOrNot
>      [exec]    [junit4] Completed on J0 in 0.05s, 1 test
>      [exec]    [junit4]
>      [exec]    [junit4] Suite: org.apache.lucene.search.TestDateSort
>      [exec]    [junit4] Completed on J3 in 0.10s, 1 test
>      [exec]    [junit4]
>      [exec]    [junit4] Suite: org.apache.lucene.search.TestSimilarity
>      [exec]    [junit4] Completed on J2 in 0.02s, 1 test
>      [exec]    [junit4]
>      [exec]    [junit4] Suite: org.apache.lucene.util.TestIdentityHashSet
>      [exec]    [junit4] Completed on J1 in 0.14s, 1 test
>      [exec]    [junit4]
>      [exec]    [junit4] Suite: org.apache.lucene.util.TestVirtualMethod
>      [exec]    [junit4] Completed on J0 in 0.04s, 2 tests
>      [exec]    [junit4]
>      [exec]    [junit4] Suite:
> org.apache.lucene.analysis.TestCachingTokenFilter
>      [exec]    [junit4] Completed on J2 in 0.07s, 1 test
>      [exec]    [junit4]
>      [exec]    [junit4] Suite: org.apache.lucene.util.TestSetOnce
>      [exec]    [junit4] Completed on J3 in 0.03s, 4 tests
>      [exec]    [junit4]
>      [exec]    [junit4] Suite: org.apache.lucene.util.TestFilterIterator
>      [exec]    [junit4] Completed on J1 in 0.05s, 8 tests
>      [exec]    [junit4]
>      [exec]    [junit4] Suite: org.apache.lucene.document.TestDateTools
>      [exec]    [junit4] Completed on J0 in 0.03s, 5 tests
>      [exec]    [junit4]
>      [exec]    [junit4] Suite: org.apache.lucene.index.Test2BPostings
>      [exec]    [junit4] IGNOR/A 0.00s J2 | Test2BPostings.test
>      [exec]    [junit4]    > Assumption #1: 'nightly' test group is
> disabled (@Nightly)
>      [exec]    [junit4] Completed on J2 in 0.02s, 1 test, 1 skipped
>      [exec]    [junit4]
>      [exec]    [junit4] Suite: org.apache.lucene.index.TestDocCount
>      [exec]    [junit4] Completed on J3 in 0.05s, 1 test
>      [exec]    [junit4]
>      [exec]    [junit4] Suite:
> org.apache.lucene.search.TestCachingCollector
>      [exec]    [junit4] Completed on J1 in 0.04s, 5 tests
>      [exec]    [junit4]
>      [exec]    [junit4] Suite:
> org.apache.lucene.document.TestBinaryDocument
>      [exec]    [junit4] Completed on J0 in 0.03s, 2 tests
>      [exec]    [junit4]
>      [exec]    [junit4] Suite:
> org.apache.lucene.util.junitcompat.TestSetupTeardownChaining
>      [exec]    [junit4] Completed on J2 in 0.06s, 2 tests
>      [exec]    [junit4]
>      [exec]    [junit4] Suite:
> org.apache.lucene.util.TestRecyclingByteBlockAllocator
>      [exec]    [junit4] Completed on J3 in 0.08s, 3 tests
>      [exec]    [junit4]
>      [exec]    [junit4] Suite: org.apache.lucene.search.TestBooleanScorer
>      [exec]    [junit4] Completed on J1 in 0.04s, 3 tests
>      [exec]    [junit4]
>      [exec]    [junit4] Suite: org.apache.lucene.store.TestLock
>      [exec]    [junit4] Completed on J0 in 0.03s, 1 test
>      [exec]    [junit4]
>      [exec]    [junit4] Suite: org.apache.lucene.util.TestRamUsageEstimator
>      [exec]    [junit4] Completed on J2 in 0.04s, 3 tests
>      [exec]    [junit4]
>      [exec]    [junit4] Suite:
> org.apache.lucene.search.spans.TestSpanFirstQuery
>      [exec]    [junit4] Completed on J3 in 0.04s, 1 test
>      [exec]    [junit4]
>      [exec]    [junit4] Suite: org.apache.lucene.index.TestIsCurrent
>      [exec]    [junit4] Completed on J1 in 0.03s, 2 tests
>      [exec]    [junit4]
>      [exec]    [junit4] Suite: org.apache.lucene.util.TestNamedSPILoader
>      [exec]    [junit4] Completed on J0 in 0.02s, 3 tests
>      [exec]    [junit4]
>      [exec]    [junit4] Suite: org.apache.lucene.util.TestByteBlockPool
>      [exec]    [junit4] Completed on J2 in 0.02s, 1 test
>      [exec]    [junit4]
>      [exec]    [junit4] Suite: org.apache.lucene.util.TestBytesRef
>      [exec]    [junit4] Completed on J3 in 0.03s, 5 tests
>      [exec]    [junit4]
>      [exec]    [junit4] Suite: org.apache.lucene.index.TestRollback
>      [exec]    [junit4] Completed on J1 in 0.07s, 1 test
>      [exec]    [junit4]
>      [exec]    [junit4] Suite: org.apache.lucene.index.TestFieldInfos
>      [exec]    [junit4] Completed on J0 in 0.02s, 2 tests
>      [exec]    [junit4]
>      [exec]    [junit4] Suite:
> org.apache.lucene.index.TestTwoPhaseCommitTool
>      [exec]    [junit4] Completed on J2 in 0.03s, 3 tests
>      [exec]    [junit4]
>      [exec]    [junit4] Suite: org.apache.lucene.search.TestNot
>      [exec]    [junit4] Completed on J3 in 0.02s, 1 test
>      [exec]    [junit4]
>      [exec]    [junit4] Suite:
> org.apache.lucene.util.TestCloseableThreadLocal
>      [exec]    [junit4] Completed on J1 in 0.02s, 3 tests
>      [exec]    [junit4]
>      [exec]    [junit4] Suite: org.apache.lucene.util.TestVersionComparator
>      [exec]    [junit4] Completed on J0 in 0.02s, 1 test
>      [exec]    [junit4]
>      [exec]    [junit4] Suite:
> org.apache.lucene.index.TestIndexWriterOnJRECrash
>      [exec]    [junit4] IGNOR/A 0.00s J2 |
> TestIndexWriterOnJRECrash.testNRTThreads
>      [exec]    [junit4]    > Assumption #1: 'nightly' test group is
> disabled (@Nightly)
>      [exec]    [junit4] Completed on J2 in 0.01s, 1 test, 1 skipped
>      [exec]    [junit4]
>      [exec]    [junit4] Suite:
> org.apache.lucene.util.junitcompat.TestCodecReported
>      [exec]    [junit4] Completed on J3 in 0.03s, 1 test
>      [exec]    [junit4]
>      [exec]    [junit4] Suite: org.apache.lucene.index.Test4GBStoredFields
>      [exec]    [junit4] IGNOR/A 0.01s J1 | Test4GBStoredFields.test
>      [exec]    [junit4]    > Assumption #1: 'nightly' test group is
> disabled (@Nightly)
>      [exec]    [junit4] Completed on J1 in 0.02s, 1 test, 1 skipped
>      [exec]    [junit4]
>      [exec]    [junit4] Suite:
> org.apache.lucene.index.TestCodecHoldsOpenFiles
>      [exec]    [junit4] Completed on J0 in 0.01s, 1 test
>      [exec]    [junit4]
>      [exec]    [junit4] Suite: org.apache.lucene.index.TestReaderClosed
>      [exec]    [junit4] Completed on J2 in 0.02s, 2 tests
>      [exec]    [junit4]
>      [exec]    [junit4] Suite:
> org.apache.lucene.analysis.tokenattributes.TestSimpleAttributeImpl
>      [exec]    [junit4] Completed on J3 in 0.02s, 1 test
>      [exec]    [junit4]
>      [exec]    [junit4] Suite: org.apache.lucene.index.TestTermdocPerf
>      [exec]    [junit4] Completed on J1 in 0.01s, 1 test
>      [exec]    [junit4]
>      [exec]    [junit4] Suite: org.apache.lucene.index.Test2BPositions
>      [exec]    [junit4] Completed on J0 in 0.01s, 1 test, 1 skipped
>      [exec]    [junit4]
>      [exec]    [junit4] Suite: org.apache.lucene.index.TestIndexCommit
>      [exec]    [junit4] Completed on J2 in 0.01s, 1 test
>      [exec]    [junit4]
>      [exec]    [junit4] Suite: org.apache.lucene.index.Test2BPostingsBytes
>      [exec]    [junit4] Completed on J3 in 0.01s, 1 test, 1 skipped
>      [exec]    [junit4]
>      [exec]    [junit4] Suite:
> org.apache.lucene.search.TestPositiveScoresOnlyCollector
>      [exec]    [junit4] Completed on J1 in 0.01s, 1 test
>      [exec]    [junit4]
>      [exec]    [junit4] Suite: org.apache.lucene.util.TestIOUtils
>      [exec]    [junit4] Completed on J0 in 0.01s, 1 test
>      [exec]    [junit4]
>      [exec]    [junit4] Suite: org.apache.lucene.index.Test2BTerms
>      [exec]    [junit4] Completed on J2 in 0.01s, 1 test, 1 skipped
>      [exec]    [junit4]
>      [exec]    [junit4] Suite:
> org.apache.lucene.store.TestByteArrayDataInput
>      [exec]    [junit4] Completed on J3 in 0.01s, 1 test
>      [exec]    [junit4]
>      [exec]    [junit4] Suite:
> org.apache.lucene.analysis.TestReusableStringReader
>      [exec]    [junit4] Completed on J1 in 0.01s, 1 test
>      [exec]    [junit4]
>      [exec]    [junit4] Suite:
> org.apache.lucene.codecs.lucene3x.TestImpersonation
>      [exec]    [junit4] Completed on J0 in 0.03s, 1 test
>      [exec]    [junit4]
>      [exec]    [junit4] Suite:
> org.apache.lucene.codecs.lucene41.TestLucene41StoredFieldsFormat
>      [exec]    [junit4] IGNOR/A 0.01s J0 |
> TestLucene41StoredFieldsFormat.testBigDocuments
>      [exec]    [junit4]    > Assumption #1: 'nightly' test group is
> disabled (@Nightly)
>      [exec]    [junit4] Completed on J0 in 1.90s, 10 tests, 1 skipped
>      [exec]    [junit4]
>      [exec]    [junit4] Suite:
> org.apache.lucene.codecs.lucene40.TestLucene40StoredFieldsFormat
>      [exec]    [junit4] IGNOR/A 0.00s J1 |
> TestLucene40StoredFieldsFormat.testBigDocuments
>      [exec]    [junit4]    > Assumption #1: 'nightly' test group is
> disabled (@Nightly)
>      [exec]    [junit4] Completed on J1 in 2.07s, 10 tests, 1 skipped
>      [exec]    [junit4]
>      [exec]    [junit4] Suite:
> org.apache.lucene.codecs.lucene3x.TestLucene3xTermVectorsFormat
>      [exec]    [junit4] Completed on J3 in 3.00s, 7 tests
>      [exec]    [junit4]
>      [exec]    [junit4] Suite:
> org.apache.lucene.search.TestEarlyTermination
>      [exec]    [junit4] Completed on J3 in 0.03s, 1 test
>      [exec]    [junit4]
>      [exec]    [junit4] Suite: org.apache.lucene.store.TestRateLimiter
>      [exec]    [junit4] Completed on J3 in 1.22s, 1 test
>      [exec]    [junit4]
>      [exec]    [junit4] Suite:
> org.apache.lucene.search.TestControlledRealTimeReopenThread
>      [exec]    [junit4] Completed on J1 in 2.02s, 4 tests
>      [exec]    [junit4]
>      [exec]    [junit4] Suite:
> org.apache.lucene.util.TestInPlaceMergeSorter
>      [exec]    [junit4] Completed on J3 in 0.38s, 9 tests
>      [exec]    [junit4]
>      [exec]    [junit4] Suite:
> org.apache.lucene.util.TestIndexableBinaryStringTools
>      [exec]    [junit4] Completed on J1 in 0.31s, 5 tests
>      [exec]    [junit4]
>      [exec]    [junit4] Suite: org.apache.lucene.util.TestIntroSorter
>      [exec]    [junit4] Completed on J3 in 0.09s, 9 tests
>      [exec]    [junit4]
>      [exec]    [junit4] Suite: org.apache.lucene.util.TestTimSorter
>      [exec]    [junit4] Completed on J1 in 0.21s, 9 tests
>      [exec]    [junit4]
>      [exec]    [junit4] Suite:
> org.apache.lucene.util.junitcompat.TestReproduceMessageWithRepeated
>      [exec]    [junit4] Completed on J3 in 0.04s, 1 test
>      [exec]    [junit4]
>      [exec]    [junit4] Suite:
> org.apache.lucene.codecs.lucene3x.TestLucene3xStoredFieldsFormat
>      [exec]    [junit4] IGNOR/A 0.01s J2 |
> TestLucene3xStoredFieldsFormat.testWriteReadMerge
>      [exec]    [junit4]    > Assumption #1: impersonation isnt good enough
>      [exec]    [junit4] IGNOR/A 0.00s J2 |
> TestLucene3xStoredFieldsFormat.testBigDocuments
>      [exec]    [junit4]    > Assumption #1: 'nightly' test group is
> disabled (@Nightly)
>      [exec]    [junit4] Completed on J2 in 7.70s, 10 tests, 2 skipped
>      [exec]    [junit4]
>      [exec]    [junit4] Suite:
> org.apache.lucene.index.TestBackwardsCompatibility3x
>      [exec]    [junit4] Completed on J0 in 7.83s, 16 tests
>      [exec]    [junit4]
>      [exec]    [junit4] JVM J0:     3.45 ..   147.69 =   144.24s
>      [exec]    [junit4] JVM J1:     3.45 ..   142.75 =   139.30s
>      [exec]    [junit4] JVM J2:     3.45 ..   145.16 =   141.71s
>      [exec]    [junit4] JVM J3:     4.18 ..   142.96 =   138.78s
>      [exec]    [junit4] Execution time total: 2 minutes 27 seconds
>      [exec]    [junit4] Tests summary: 366 suites, 2316 tests, 47 ignored
> (34 assumptions)
>      [exec]      [echo] 5 slowest tests:
>      [exec] [junit4:tophints]  19.41s |
> org.apache.lucene.index.TestDuelingCodecs
>      [exec] [junit4:tophints]  17.84s |
> org.apache.lucene.index.TestIndexWriter
>      [exec] [junit4:tophints]  14.78s |
> org.apache.lucene.index.TestIndexWriterMerging
>      [exec] [junit4:tophints]  14.62s | org.apache.lucene.util.fst.TestFSTs
>      [exec] [junit4:tophints]  13.10s |
> org.apache.lucene.index.TestIndexWriterOutOfFileDescriptors
>      [exec]
>      [exec] compile-test:
>      [exec]
>      [exec] ivy-availability-check:
>      [exec]
>      [exec] ivy-fail:
>      [exec]
>      [exec] ivy-configure:
>      [exec] [ivy:configure] :: loading settings :: file =
> /usr/home/hudson/hudson-slave/workspace/Lucene-Solr-SmokeRelease-4.4/lucene/build/fakeReleaseTmp/unpack/lucene-4.4.0/ivy-settings.xml
>      [exec]
>      [exec] resolve:
>      [exec]
>      [exec] init:
>      [exec]
>      [exec] -clover.disable:
>      [exec]
>      [exec] -clover.load:
>      [exec]
>      [exec] -clover.classpath:
>      [exec]
>      [exec] -clover.setup:
>      [exec]
>      [exec] clover:
>      [exec]
>      [exec] compile-core:
>      [exec]
>      [exec] compile-test-framework:
>      [exec]
>      [exec] ivy-availability-check:
>      [exec]
>      [exec] ivy-fail:
>      [exec]
>      [exec] ivy-configure:
>      [exec] [ivy:configure] :: loading settings :: file =
> /usr/home/hudson/hudson-slave/workspace/Lucene-Solr-SmokeRelease-4.4/lucene/build/fakeReleaseTmp/unpack/lucene-4.4.0/ivy-settings.xml
>      [exec]
>      [exec] resolve:
>      [exec]
>      [exec] init:
>      [exec]
>      [exec] compile-lucene-core:
>      [exec]
>      [exec] ivy-availability-check:
>      [exec]
>      [exec] ivy-fail:
>      [exec]
>      [exec] ivy-configure:
>      [exec] [ivy:configure] :: loading settings :: file =
> /usr/home/hudson/hudson-slave/workspace/Lucene-Solr-SmokeRelease-4.4/lucene/build/fakeReleaseTmp/unpack/lucene-4.4.0/ivy-settings.xml
>      [exec]
>      [exec] resolve:
>      [exec]
>      [exec] init:
>      [exec]
>      [exec] -clover.disable:
>      [exec]
>      [exec] -clover.load:
>      [exec]
>      [exec] -clover.classpath:
>      [exec]
>      [exec] -clover.setup:
>      [exec]
>      [exec] clover:
>      [exec]
>      [exec] compile-core:
>      [exec]
>      [exec] compile-codecs:
>      [exec]      [echo] Building codecs...
>      [exec]
>      [exec] ivy-availability-check:
>      [exec]      [echo] Building codecs...
>      [exec]
>      [exec] ivy-fail:
>      [exec]
>      [exec] ivy-configure:
>      [exec] [ivy:configure] :: loading settings :: file =
> /usr/home/hudson/hudson-slave/workspace/Lucene-Solr-SmokeRelease-4.4/lucene/build/fakeReleaseTmp/unpack/lucene-4.4.0/ivy-settings.xml
>      [exec]
>      [exec] resolve:
>      [exec]
>      [exec] common.init:
>      [exec]
>      [exec] compile-lucene-core:
>      [exec]
>      [exec] init:
>      [exec]
>      [exec] -clover.disable:
>      [exec]
>      [exec] -clover.load:
>      [exec]
>      [exec] -clover.classpath:
>      [exec]
>      [exec] -clover.setup:
>      [exec]
>      [exec] clover:
>      [exec]
>      [exec] compile-core:
>      [exec]
>      [exec] -clover.disable:
>      [exec]
>      [exec] -clover.load:
>      [exec]
>      [exec] -clover.classpath:
>      [exec]
>      [exec] -clover.setup:
>      [exec]
>      [exec] clover:
>      [exec]
>      [exec] common.compile-core:
>      [exec]
>      [exec] compile-core:
>      [exec]
>      [exec] compile-test:
>      [exec]
>      [exec] compile-test:
>      [exec]      [echo] Building analyzers-common...
>      [exec]
>      [exec] ivy-availability-check:
>      [exec]      [echo] Building analyzers-common...
>      [exec]
>      [exec] ivy-fail:
>      [exec]
>      [exec] ivy-configure:
>      [exec] [ivy:configure] :: loading settings :: file =
> /usr/home/hudson/hudson-slave/workspace/Lucene-Solr-SmokeRelease-4.4/lucene/build/fakeReleaseTmp/unpack/lucene-4.4.0/ivy-settings.xml
>      [exec]
>      [exec] resolve:
>      [exec]
>      [exec] common.init:
>      [exec]
>      [exec] compile-lucene-core:
>      [exec]
>      [exec] ivy-availability-check:
>      [exec]
>      [exec] ivy-fail:
>      [exec]
>      [exec] ivy-configure:
>      [exec] [ivy:configure] :: loading settings :: file =
> /usr/home/hudson/hudson-slave/workspace/Lucene-Solr-SmokeRelease-4.4/lucene/build/fakeReleaseTmp/unpack/lucene-4.4.0/ivy-settings.xml
>      [exec]
>      [exec] resolve:
>      [exec]
>      [exec] init:
>      [exec]
>      [exec] -clover.disable:
>      [exec]
>      [exec] -clover.load:
>      [exec]
>      [exec] -clover.classpath:
>      [exec]
>      [exec] -clover.setup:
>      [exec]
>      [exec] clover:
>      [exec]
>      [exec] compile-core:
>      [exec]
>      [exec] init:
>      [exec]
>      [exec] compile-test:
>      [exec]      [echo] Building analyzers-common...
>      [exec]
>      [exec] jflex-uptodate-check:
>      [exec]
>      [exec] jflex-notice:
>      [exec]      [echo]
>      [exec]      [echo]       One or more of the JFlex .jflex files is
> newer than its corresponding
>      [exec]      [echo]       .java file.  Run the "jflex" target to
> regenerate the artifacts.
>      [exec]      [echo]
>      [exec]
>      [exec] ivy-availability-check:
>      [exec]
>      [exec] ivy-configure:
>      [exec] [ivy:configure] :: loading settings :: file =
> /usr/home/hudson/hudson-slave/workspace/Lucene-Solr-SmokeRelease-4.4/lucene/build/fakeReleaseTmp/unpack/lucene-4.4.0/ivy-settings.xml
>      [exec]
>      [exec] resolve:
>      [exec]
>      [exec] common.init:
>      [exec]
>      [exec] compile-lucene-core:
>      [exec]
>      [exec] init:
>      [exec]
>      [exec] -clover.disable:
>      [exec]
>      [exec] -clover.load:
>      [exec]
>      [exec] -clover.classpath:
>      [exec]
>      [exec] -clover.setup:
>      [exec]
>      [exec] clover:
>      [exec]
>      [exec] common.compile-core:
>      [exec]
>      [exec] compile-core:
>      [exec]
>      [exec] compile-test-framework:
>      [exec]
>      [exec] ivy-availability-check:
>      [exec]
>      [exec] ivy-fail:
>      [exec]
>      [exec] ivy-configure:
>      [exec] [ivy:configure] :: loading settings :: file =
> /usr/home/hudson/hudson-slave/workspace/Lucene-Solr-SmokeRelease-4.4/lucene/build/fakeReleaseTmp/unpack/lucene-4.4.0/ivy-settings.xml
>      [exec]
>      [exec] resolve:
>      [exec]
>      [exec] init:
>      [exec]
>      [exec] compile-lucene-core:
>      [exec]
>      [exec] compile-codecs:
>      [exec]      [echo] Building codecs...
>      [exec]
>      [exec] ivy-availability-check:
>      [exec]      [echo] Building codecs...
>      [exec]
>      [exec] ivy-fail:
>      [exec]
>      [exec] ivy-configure:
>      [exec] [ivy:configure] :: loading settings :: file =
> /usr/home/hudson/hudson-slave/workspace/Lucene-Solr-SmokeRelease-4.4/lucene/build/fakeReleaseTmp/unpack/lucene-4.4.0/ivy-settings.xml
>      [exec]
>      [exec] resolve:
>      [exec]
>      [exec] common.init:
>      [exec]
>      [exec] compile-lucene-core:
>      [exec]
>      [exec] init:
>      [exec]
>      [exec] -clover.disable:
>      [exec]
>      [exec] -clover.load:
>      [exec]
>      [exec] -clover.classpath:
>      [exec]
>      [exec] -clover.setup:
>      [exec]
>      [exec] clover:
>      [exec]
>      [exec] compile-core:
>      [exec]
>      [exec] -clover.disable:
>      [exec]
>      [exec] -clover.load:
>      [exec]
>      [exec] -clover.classpath:
>      [exec]
>      [exec] -clover.setup:
>      [exec]
>      [exec] clover:
>      [exec]
>      [exec] common.compile-core:
>      [exec]
>      [exec] compile-core:
>      [exec]
>      [exec] common.compile-test:
>      [exec]      [echo] Building analyzers-icu...
>      [exec]
>      [exec] ivy-availability-check:
>      [exec]      [echo] Building analyzers-icu...
>      [exec]
>      [exec] ivy-fail:
>      [exec]
>      [exec] ivy-configure:
>      [exec] [ivy:configure] :: loading settings :: file =
> /usr/home/hudson/hudson-slave/workspace/Lucene-Solr-SmokeRelease-4.4/lucene/build/fakeReleaseTmp/unpack/lucene-4.4.0/ivy-settings.xml
>      [exec]
>      [exec] resolve:
>      [exec]
>      [exec] common.init:
>      [exec]
>      [exec] compile-lucene-core:
>      [exec]
>      [exec] ivy-availability-check:
>      [exec]
>      [exec] ivy-fail:
>      [exec]
>      [exec] ivy-configure:
>      [exec] [ivy:configure] :: loading settings :: file =
> /usr/home/hudson/hudson-slave/workspace/Lucene-Solr-SmokeRelease-4.4/lucene/build/fakeReleaseTmp/unpack/lucene-4.4.0/ivy-settings.xml
>      [exec]
>      [exec] resolve:
>      [exec]
>      [exec] init:
>      [exec]
>      [exec] -clover.disable:
>      [exec]
>      [exec] -clover.load:
>      [exec]
>      [exec] -clover.classpath:
>      [exec]
>      [exec] -clover.setup:
>      [exec]
>      [exec] clover:
>      [exec]
>      [exec] compile-core:
>      [exec]
>      [exec] init:
>      [exec]
>      [exec] compile-test:
>      [exec]      [echo] Building analyzers-icu...
>      [exec]
>      [exec] check-analyzers-common-uptodate:
>      [exec]
>      [exec] jar-analyzers-common:
>      [exec]
>      [exec] ivy-availability-check:
>      [exec]
>      [exec] ivy-configure:
>      [exec] [ivy:configure] :: loading settings :: file =
> /usr/home/hudson/hudson-slave/workspace/Lucene-Solr-SmokeRelease-4.4/lucene/build/fakeReleaseTmp/unpack/lucene-4.4.0/ivy-settings.xml
>      [exec]
>      [exec] resolve:
>      [exec]
>      [exec] common.init:
>      [exec]
>      [exec] compile-lucene-core:
>      [exec]
>      [exec] init:
>      [exec]
>      [exec] -clover.disable:
>      [exec]
>      [exec] -clover.load:
>      [exec]
>      [exec] -clover.classpath:
>      [exec]
>      [exec] -clover.setup:
>      [exec]
>      [exec] clover:
>      [exec]
>      [exec] common.compile-core:
>      [exec]
>      [exec] compile-core:
>      [exec]
>      [exec] compile-test-framework:
>      [exec]
>      [exec] ivy-availability-check:
>      [exec]
>      [exec] ivy-fail:
>      [exec]
>      [exec] ivy-configure:
>      [exec] [ivy:configure] :: loading settings :: file =
> /usr/home/hudson/hudson-slave/workspace/Lucene-Solr-SmokeRelease-4.4/lucene/build/fakeReleaseTmp/unpack/lucene-4.4.0/ivy-settings.xml
>      [exec]
>      [exec] resolve:
>      [exec]
>      [exec] init:
>      [exec]
>      [exec] compile-lucene-core:
>      [exec]
>      [exec] compile-codecs:
>      [exec]      [echo] Building codecs...
>      [exec]
>      [exec] ivy-availability-check:
>      [exec]      [echo] Building codecs...
>      [exec]
>      [exec] ivy-fail:
>      [exec]
>      [exec] ivy-configure:
>      [exec] [ivy:configure] :: loading settings :: file =
> /usr/home/hudson/hudson-slave/workspace/Lucene-Solr-SmokeRelease-4.4/lucene/build/fakeReleaseTmp/unpack/lucene-4.4.0/ivy-settings.xml
>      [exec]
>      [exec] resolve:
>      [exec]
>      [exec] common.init:
>      [exec]
>      [exec] compile-lucene-core:
>      [exec]
>      [exec] init:
>      [exec]
>      [exec] -clover.disable:
>      [exec]
>      [exec] -clover.load:
>      [exec]
>      [exec] -clover.classpath:
>      [exec]
>      [exec] -clover.setup:
>      [exec]
>      [exec] clover:
>      [exec]
>      [exec] compile-core:
>      [exec]
>      [exec] -clover.disable:
>      [exec]
>      [exec] -clover.load:
>      [exec]
>      [exec] -clover.classpath:
>      [exec]
>      [exec] -clover.setup:
>      [exec]
>      [exec] clover:
>      [exec]
>      [exec] common.compile-core:
>      [exec]
>      [exec] compile-core:
>      [exec]
>      [exec] common.compile-test:
>      [exec]      [echo] Building analyzers-kuromoji...
>      [exec]
>      [exec] ivy-availability-check:
>      [exec]      [echo] Building analyzers-kuromoji...
>      [exec]
>      [exec] ivy-fail:
>      [exec]
>      [exec] ivy-configure:
>      [exec] [ivy:configure] :: loading settings :: file =
> /usr/home/hudson/hudson-slave/workspace/Lucene-Solr-SmokeRelease-4.4/lucene/build/fakeReleaseTmp/unpack/lucene-4.4.0/ivy-settings.xml
>      [exec]
>      [exec] resolve:
>      [exec]
>      [exec] common.init:
>      [exec]
>      [exec] compile-lucene-core:
>      [exec]
>      [exec] ivy-availability-check:
>      [exec]
>      [exec] ivy-fail:
>      [exec]
>      [exec] ivy-configure:
>      [exec] [ivy:configure] :: loading settings :: file =
> /usr/home/hudson/hudson-slave/workspace/Lucene-Solr-SmokeRelease-4.4/lucene/build/fakeReleaseTmp/unpack/lucene-4.4.0/ivy-settings.xml
>      [exec]
>      [exec] resolve:
>      [exec]
>      [exec] init:
>      [exec]
>      [exec] -clover.disable:
>      [exec]
>      [exec] -clover.load:
>      [exec]
>      [exec] -clover.classpath:
>      [exec]
>      [exec] -clover.setup:
>      [exec]
>      [exec] clover:
>      [exec]
>      [exec] compile-core:
>      [exec]
>      [exec] init:
>      [exec]
>      [exec] module-build.compile-test:
>      [exec]      [echo] Building analyzers-kuromoji...
>      [exec]
>      [exec] check-analyzers-common-uptodate:
>      [exec]
>      [exec] jar-analyzers-common:
>      [exec]
>      [exec] ivy-availability-check:
>      [exec]
>      [exec] ivy-configure:
>      [exec] [ivy:configure] :: loading settings :: file =
> /usr/home/hudson/hudson-slave/workspace/Lucene-Solr-SmokeRelease-4.4/lucene/build/fakeReleaseTmp/unpack/lucene-4.4.0/ivy-settings.xml
>      [exec]
>      [exec] resolve:
>      [exec]
>      [exec] common.init:
>      [exec]
>      [exec] compile-lucene-core:
>      [exec]
>      [exec] init:
>      [exec]
>      [exec] -clover.disable:
>      [exec]
>      [exec] -clover.load:
>      [exec]
>      [exec] -clover.classpath:
>      [exec]
>      [exec] -clover.setup:
>      [exec]
>      [exec] clover:
>      [exec]
>      [exec] common.compile-core:
>      [exec]
>      [exec] compile-core:
>      [exec]
>      [exec] compile-test-framework:
>      [exec]
>      [exec] ivy-availability-check:
>      [exec]
>      [exec] ivy-fail:
>      [exec]
>      [exec] ivy-configure:
>      [exec] [ivy:configure] :: loading settings :: file =
> /usr/home/hudson/hudson-slave/workspace/Lucene-Solr-SmokeRelease-4.4/lucene/build/fakeReleaseTmp/unpack/lucene-4.4.0/ivy-settings.xml
>      [exec]
>      [exec] resolve:
>      [exec]
>      [exec] init:
>      [exec]
>      [exec] compile-lucene-core:
>      [exec]
>      [exec] compile-codecs:
>      [exec]      [echo] Building codecs...
>      [exec]
>      [exec] ivy-availability-check:
>      [exec]      [echo] Building codecs...
>      [exec]
>      [exec] ivy-fail:
>      [exec]
>      [exec] ivy-configure:
>      [exec] [ivy:configure] :: loading settings :: file =
> /usr/home/hudson/hudson-slave/workspace/Lucene-Solr-SmokeRelease-4.4/lucene/build/fakeReleaseTmp/unpack/lucene-4.4.0/ivy-settings.xml
>      [exec]
>      [exec] resolve:
>      [exec]
>      [exec] common.init:
>      [exec]
>      [exec] compile-lucene-core:
>      [exec]
>      [exec] init:
>      [exec]
>      [exec] -clover.disable:
>      [exec]
>      [exec] -clover.load:
>      [exec]
>      [exec] -clover.classpath:
>      [exec]
>      [exec] -clover.setup:
>      [exec]
>      [exec] clover:
>      [exec]
>      [exec] compile-core:
>      [exec]
>      [exec] -clover.disable:
>      [exec]
>      [exec] -clover.load:
>      [exec]
>      [exec] -clover.classpath:
>      [exec]
>      [exec] -clover.setup:
>      [exec]
>      [exec] clover:
>      [exec]
>      [exec] common.compile-core:
>      [exec]
>      [exec] compile-core:
>      [exec]
>      [exec] common.compile-test:
>      [exec]
>      [exec] resolve-icu:
>      [exec]      [echo] Building analyzers-icu...
>      [exec]
>      [exec] ivy-availability-check:
>      [exec]      [echo] Building analyzers-icu...
>      [exec]
>      [exec] ivy-fail:
>      [exec]
>      [exec] ivy-configure:
>      [exec] [ivy:configure] :: loading settings :: file =
> /usr/home/hudson/hudson-slave/workspace/Lucene-Solr-SmokeRelease-4.4/lucene/build/fakeReleaseTmp/unpack/lucene-4.4.0/ivy-settings.xml
>      [exec]
>      [exec] resolve:
>      [exec]
>      [exec] check-analyzers-common-uptodate:
>      [exec]
>      [exec] jar-analyzers-common:
>      [exec]
>      [exec] -clover.disable:
>      [exec]
>      [exec] -clover.load:
>      [exec]
>      [exec] -clover.classpath:
>      [exec]
>      [exec] -clover.setup:
>      [exec]
>      [exec] clover:
>      [exec]
>      [exec] common.compile-core:
>      [exec]
>      [exec] compile-core:
>      [exec]
>      [exec] common.compile-tools:
>      [exec]
>      [exec] ivy-availability-check:
>      [exec]
>      [exec] ivy-fail:
>      [exec]
>      [exec] ivy-configure:
>      [exec] [ivy:configure] :: loading settings :: file =
> /usr/home/hudson/hudson-slave/workspace/Lucene-Solr-SmokeRelease-4.4/lucene/build/fakeReleaseTmp/unpack/lucene-4.4.0/ivy-settings.xml
>      [exec]
>      [exec] resolve:
>      [exec]
>      [exec] init:
>      [exec]
>      [exec] compile-core:
>      [exec]
>      [exec] compile-tools:
>      [exec]
>      [exec] compile-tools-tests:
>      [exec]
>      [exec] compile-test:
>      [exec]      [echo] Building analyzers-morfologik...
>      [exec]
>      [exec] ivy-availability-check:
>      [exec]      [echo] Building analyzers-morfologik...
>      [exec]
>      [exec] ivy-fail:
>      [exec]
>      [exec] ivy-configure:
>      [exec] [ivy:configure] :: loading settings :: file =
> /usr/home/hudson/hudson-slave/workspace/Lucene-Solr-SmokeRelease-4.4/lucene/build/fakeReleaseTmp/unpack/lucene-4.4.0/ivy-settings.xml
>      [exec]
>      [exec] resolve:
>      [exec]
>      [exec] common.init:
>      [exec]
>      [exec] compile-lucene-core:
>      [exec]
>      [exec] ivy-availability-check:
>      [exec]
>      [exec] ivy-fail:
>      [exec]
>      [exec] ivy-configure:
>      [exec] [ivy:configure] :: loading settings :: file =
> /usr/home/hudson/hudson-slave/workspace/Lucene-Solr-SmokeRelease-4.4/lucene/build/fakeReleaseTmp/unpack/lucene-4.4.0/ivy-settings.xml
>      [exec]
>      [exec] resolve:
>      [exec]
>      [exec] init:
>      [exec]
>      [exec] -clover.disable:
>      [exec]
>      [exec] -clover.load:
>      [exec]
>      [exec] -clover.classpath:
>      [exec]
>      [exec] -clover.setup:
>      [exec]
>      [exec] clover:
>      [exec]
>      [exec] compile-core:
>      [exec]
>      [exec] init:
>      [exec]
>      [exec] compile-test:
>      [exec]      [echo] Building analyzers-morfologik...
>      [exec]
>      [exec] check-analyzers-common-uptodate:
>      [exec]
>      [exec] jar-analyzers-common:
>      [exec]
>      [exec] ivy-availability-check:
>      [exec]
>      [exec] ivy-configure:
>      [exec
>
> [...truncated too long message...]
>
> etty.server.AbstractConnector$Acceptor.run(AbstractConnector.java:938)
>      [exec]    [junit4]    >         at
> org.eclipse.jetty.util.thread.QueuedThreadPool.runJob(QueuedThreadPool.java:608)
>      [exec]    [junit4]    >         at
> org.eclipse.jetty.util.thread.QueuedThreadPool$3.run(QueuedThreadPool.java:543)
>      [exec]    [junit4]    >         at
> java.lang.Thread.run(Thread.java:679)
>      [exec]    [junit4]    >    3) Thread[id=22, name=qtp1774239462-22
> Acceptor3 SelectChannelConnector@127.0.0.1:33617, state=BLOCKED,
> group=TGRP-HttpReplicatorTest]
>      [exec]    [junit4]    >         at
> sun.nio.ch.ServerSocketChannelImpl.accept(ServerSocketChannelImpl.java:147)
>      [exec]    [junit4]    >         at
> org.eclipse.jetty.server.nio.SelectChannelConnector.accept(SelectChannelConnector.java:109)
>      [exec]    [junit4]    >         at
> org.eclipse.jetty.server.AbstractConnector$Acceptor.run(AbstractConnector.java:938)
>      [exec]    [junit4]    >         at
> org.eclipse.jetty.util.thread.QueuedThreadPool.runJob(QueuedThreadPool.java:608)
>      [exec]    [junit4]    >         at
> org.eclipse.jetty.util.thread.QueuedThreadPool$3.run(QueuedThreadPool.java:543)
>      [exec]    [junit4]    >         at
> java.lang.Thread.run(Thread.java:679)
>      [exec]    [junit4]    >    4) Thread[id=19, name=qtp1774239462-19
> Acceptor0 SelectChannelConnector@127.0.0.1:33617, state=RUNNABLE,
> group=TGRP-HttpReplicatorTest]
>      [exec]    [junit4]    >         at
> sun.nio.ch.ServerSocketChannelImpl.accept0(Native Method)
>      [exec]    [junit4]    >         at
> sun.nio.ch.ServerSocketChannelImpl.accept(ServerSocketChannelImpl.java:163)
>      [exec]    [junit4]    >         at
> org.eclipse.jetty.server.nio.SelectChannelConnector.accept(SelectChannelConnector.java:109)
>      [exec]    [junit4]    >         at
> org.eclipse.jetty.server.AbstractConnector$Acceptor.run(AbstractConnector.java:938)
>      [exec]    [junit4]    >         at
> org.eclipse.jetty.util.thread.QueuedThreadPool.runJob(QueuedThreadPool.java:608)
>      [exec]    [junit4]    >         at
> org.eclipse.jetty.util.thread.QueuedThreadPool$3.run(QueuedThreadPool.java:543)
>      [exec]    [junit4]    >         at
> java.lang.Thread.run(Thread.java:679)
>      [exec]    [junit4]    >    at
> __randomizedtesting.SeedInfo.seed([9D0ACECD10E8ABB3]:0)Throwable #2:
> com.carrotsearch.randomizedtesting.ThreadLeakError: There are still zombie
> threads that couldn't be terminated:
>      [exec]    [junit4]    >    1) Thread[id=17, name=qtp1774239462-17
> Acceptor1 SelectChannelConnector@127.0.0.1:33617, state=BLOCKED,
> group=TGRP-HttpReplicatorTest]
>      [exec]    [junit4]    >         at
> sun.nio.ch.ServerSocketChannelImpl.accept(ServerSocketChannelImpl.java:147)
>      [exec]    [junit4]    >         at
> org.eclipse.jetty.server.nio.SelectChannelConnector.accept(SelectChannelConnector.java:109)
>      [exec]    [junit4]    >         at
> org.eclipse.jetty.server.AbstractConnector$Acceptor.run(AbstractConnector.java:938)
>      [exec]    [junit4]    >         at
> org.eclipse.jetty.util.thread.QueuedThreadPool.runJob(QueuedThreadPool.java:608)
>      [exec]    [junit4]    >         at
> org.eclipse.jetty.util.thread.QueuedThreadPool$3.run(QueuedThreadPool.java:543)
>      [exec]    [junit4]    >         at
> java.lang.Thread.run(Thread.java:679)
>      [exec]    [junit4]    >    2) Thread[id=23, name=qtp1774239462-23
> Acceptor2 SelectChannelConnector@127.0.0.1:33617, state=BLOCKED,
> group=TGRP-HttpReplicatorTest]
>      [exec]    [junit4]    >         at
> sun.nio.ch.ServerSocketChannelImpl.accept(ServerSocketChannelImpl.java:147)
>      [exec]    [junit4]    >         at
> org.eclipse.jetty.server.nio.SelectChannelConnector.accept(SelectChannelConnector.java:109)
>      [exec]    [junit4]    >         at
> org.eclipse.jetty.server.AbstractConnector$Acceptor.run(AbstractConnector.java:938)
>      [exec]    [junit4]    >         at
> org.eclipse.jetty.util.thread.QueuedThreadPool.runJob(QueuedThreadPool.java:608)
>      [exec]    [junit4]    >         at
> org.eclipse.jetty.util.thread.QueuedThreadPool$3.run(QueuedThreadPool.java:543)
>      [exec]    [junit4]    >         at
> java.lang.Thread.run(Thread.java:679)
>      [exec]    [junit4]    >    3) Thread[id=22, name=qtp1774239462-22
> Acceptor3 SelectChannelConnector@127.0.0.1:33617, state=BLOCKED,
> group=TGRP-HttpReplicatorTest]
>      [exec]    [junit4]    >         at
> sun.nio.ch.ServerSocketChannelImpl.accept(ServerSocketChannelImpl.java:147)
>      [exec]    [junit4]    >         at
> org.eclipse.jetty.server.nio.SelectChannelConnector.accept(SelectChannelConnector.java:109)
>      [exec]    [junit4]    >         at
> org.eclipse.jetty.server.AbstractConnector$Acceptor.run(AbstractConnector.java:938)
>      [exec]    [junit4]    >         at
> org.eclipse.jetty.util.thread.QueuedThreadPool.runJob(QueuedThreadPool.java:608)
>      [exec]    [junit4]    >         at
> org.eclipse.jetty.util.thread.QueuedThreadPool$3.run(QueuedThreadPool.java:543)
>      [exec]    [junit4]    >         at
> java.lang.Thread.run(Thread.java:679)
>      [exec]    [junit4]    >    4) Thread[id=19, name=qtp1774239462-19
> Acceptor0 SelectChannelConnector@127.0.0.1:33617, state=RUNNABLE,
> group=TGRP-HttpReplicatorTest]
>      [exec]    [junit4]    >         at
> sun.nio.ch.ServerSocketChannelImpl.accept0(Native Method)
>      [exec]    [junit4]    >         at
> sun.nio.ch.ServerSocketChannelImpl.accept(ServerSocketChannelImpl.java:163)
>      [exec]    [junit4]    >         at
> org.eclipse.jetty.server.nio.SelectChannelConnector.accept(SelectChannelConnector.java:109)
>      [exec]    [junit4]    >         at
> org.eclipse.jetty.server.AbstractConnector$Acceptor.run(AbstractConnector.java:938)
>      [exec]    [junit4]    >         at
> org.eclipse.jetty.util.thread.QueuedThreadPool.runJob(QueuedThreadPool.java:608)
>      [exec]    [junit4]    >         at
> org.eclipse.jetty.util.thread.QueuedThreadPool$3.run(QueuedThreadPool.java:543)
>      [exec]    [junit4]    >         at
> java.lang.Thread.run(Thread.java:679)
>      [exec]    [junit4]    >    at
> __randomizedtesting.SeedInfo.seed([9D0ACECD10E8ABB3]:0)
>      [exec]    [junit4] Completed on J3 in 26.33s, 1 test, 2 errors <<<
> FAILURES!
>      [exec]    [junit4]
>      [exec]    [junit4]
>      [exec]    [junit4] Tests with failures:
>      [exec]    [junit4]   -
> org.apache.lucene.replicator.http.HttpReplicatorTest (suite)
>      [exec]    [junit4]
>      [exec]    [junit4]
>      [exec]    [junit4] JVM J0:     5.45 ..    12.26 =     6.81s
>      [exec]    [junit4] JVM J1:     4.97 ..    17.30 =    12.33s
>      [exec]    [junit4] JVM J2:     4.97 ..    14.57 =     9.60s
>      [exec]    [junit4] JVM J3:     4.97 ..    38.91 =    33.94s
>      [exec]    [junit4] Execution time total: 39 seconds
>      [exec]    [junit4] Tests summary: 7 suites, 30 tests, 2 suite-level
> errors
>      [exec]
>      [exec] BUILD FAILED
>      [exec]
> /usr/home/hudson/hudson-slave/workspace/Lucene-Solr-SmokeRelease-4.4/lucene/build/fakeReleaseTmp/unpack/lucene-4.4.0/build.xml:557:
> The following error occurred while executing this line:
>      [exec]
> /usr/home/hudson/hudson-slave/workspace/Lucene-Solr-SmokeRelease-4.4/lucene/build/fakeReleaseTmp/unpack/lucene-4.4.0/common-build.xml:1904:
> The following error occurred while executing this line:
>      [exec]
> /usr/home/hudson/hudson-slave/workspace/Lucene-Solr-SmokeRelease-4.4/lucene/build/fakeReleaseTmp/unpack/lucene-4.4.0/module-build.xml:61:
> The following error occurred while executing this line:
>      [exec]
> /usr/home/hudson/hudson-slave/workspace/Lucene-Solr-SmokeRelease-4.4/lucene/build/fakeReleaseTmp/unpack/lucene-4.4.0/common-build.xml:1250:
> The following error occurred while executing this line:
>      [exec]
> /usr/home/hudson/hudson-slave/workspace/Lucene-Solr-SmokeRelease-4.4/lucene/build/fakeReleaseTmp/unpack/lucene-4.4.0/common-build.xml:893:
> There were test failures: 7 suites, 30 tests, 2 suite-level errors
>      [exec]
>      [exec] Total time: 10 minutes 38 seconds
>      [exec]
>      [exec]
>      [exec] Traceback (most recent call last):
>      [exec]   File
> "/usr/home/hudson/hudson-slave/workspace/Lucene-Solr-SmokeRelease-4.4/dev-tools/scripts/smokeTestRelease.py",
> line 1450, in <module>
>      [exec]     main()
>      [exec]   File
> "/usr/home/hudson/hudson-slave/workspace/Lucene-Solr-SmokeRelease-4.4/dev-tools/scripts/smokeTestRelease.py",
> line 1394, in main
>      [exec]     smokeTest(baseURL, svnRevision, version, tmpDir, isSigned,
> testArgs)
>      [exec]   File
> "/usr/home/hudson/hudson-slave/workspace/Lucene-Solr-SmokeRelease-4.4/dev-tools/scripts/smokeTestRelease.py",
> line 1432, in smokeTest
>      [exec]     unpackAndVerify('lucene', tmpDir, 'lucene-%s-src.tgz' %
> version, svnRevision, version, testArgs)
>      [exec]   File
> "/usr/home/hudson/hudson-slave/workspace/Lucene-Solr-SmokeRelease-4.4/dev-tools/scripts/smokeTestRelease.py",
> line 607, in unpackAndVerify
>      [exec]     verifyUnpacked(project, artifact, unpackPath, svnRevision,
> version, testArgs)
>      [exec]   File
> "/usr/home/hudson/hudson-slave/workspace/Lucene-Solr-SmokeRelease-4.4/dev-tools/scripts/smokeTestRelease.py",
> line 702, in verifyUnpacked
>      [exec]     run('%s; ant test %s' % (javaExe('1.6'), testArgs),
> '%s/test.log' % unpackPath)
>      [exec]   File
> "/usr/home/hudson/hudson-slave/workspace/Lucene-Solr-SmokeRelease-4.4/dev-tools/scripts/smokeTestRelease.py",
> line 532, in run
>      [exec]     raise RuntimeError('command "%s" failed; see log file %s'
> % (command, logPath))
>      [exec] RuntimeError: command "export
> JAVA_HOME="/home/hudson/tools/java/latest1.6"
> PATH="/home/hudson/tools/java/latest1.6/bin:$PATH"
> JAVACMD="/home/hudson/tools/java/latest1.6/bin/java"; ant test " failed;
> see log file
> /usr/home/hudson/hudson-slave/workspace/Lucene-Solr-SmokeRelease-4.4/lucene/build/fakeReleaseTmp/unpack/lucene-4.4.0/test.log
>
> BUILD FAILED
> /usr/home/hudson/hudson-slave/workspace/Lucene-Solr-SmokeRelease-4.4/build.xml:314:
> exec returned: 1
>
> Total time: 31 minutes 7 seconds
> Build step 'Invoke Ant' marked build as failure
> Email was triggered for: Failure
> Sending email for trigger: Failure
>
>
>
>
> ---------------------------------------------------------------------
> To unsubscribe, e-mail: dev-unsubscribe@lucene.apache.org
> For additional commands, e-mail: dev-help@lucene.apache.org****
>
>
>
> ****
>
> ** **
>
> --
> - Mark ****
>
> ** **
>

Mime
View raw message