lucene-dev mailing list archives

Site index · List index
Message view « Date » · « Thread »
Top « Date » · « Thread »
From Policeman Jenkins Server <jenk...@thetaphi.de>
Subject [JENKINS] Lucene-Solr-4.x-Linux (32bit/ibm-j9-jdk6) - Build # 6636 - Failure!
Date Wed, 24 Jul 2013 18:12:00 GMT
Build: http://jenkins.thetaphi.de/job/Lucene-Solr-4.x-Linux/6636/
Java: 32bit/ibm-j9-jdk6 -Xjit:exclude={org/apache/lucene/util/fst/FST.pack(IIF)Lorg/apache/lucene/util/fst/FST;}

2 tests failed.
REGRESSION:  org.apache.solr.core.TestJmxIntegration.testJmxRegistration

Error Message:
No SolrDynamicMBeans found

Stack Trace:
java.lang.AssertionError: No SolrDynamicMBeans found
	at __randomizedtesting.SeedInfo.seed([EAD7FFEA55D6F80E:64069BD03897A06B]:0)
	at org.junit.Assert.fail(Assert.java:93)
	at org.junit.Assert.assertTrue(Assert.java:43)
	at org.apache.solr.core.TestJmxIntegration.testJmxRegistration(TestJmxIntegration.java:94)
	at sun.reflect.NativeMethodAccessorImpl.invoke0(Native Method)
	at sun.reflect.NativeMethodAccessorImpl.invoke(NativeMethodAccessorImpl.java:60)
	at sun.reflect.DelegatingMethodAccessorImpl.invoke(DelegatingMethodAccessorImpl.java:37)
	at java.lang.reflect.Method.invoke(Method.java:611)
	at com.carrotsearch.randomizedtesting.RandomizedRunner.invoke(RandomizedRunner.java:1559)
	at com.carrotsearch.randomizedtesting.RandomizedRunner.access$600(RandomizedRunner.java:79)
	at com.carrotsearch.randomizedtesting.RandomizedRunner$6.evaluate(RandomizedRunner.java:737)
	at com.carrotsearch.randomizedtesting.RandomizedRunner$7.evaluate(RandomizedRunner.java:773)
	at com.carrotsearch.randomizedtesting.RandomizedRunner$8.evaluate(RandomizedRunner.java:787)
	at com.carrotsearch.randomizedtesting.rules.SystemPropertiesRestoreRule$1.evaluate(SystemPropertiesRestoreRule.java:53)
	at org.apache.lucene.util.TestRuleSetupTeardownChained$1.evaluate(TestRuleSetupTeardownChained.java:50)
	at org.apache.lucene.util.TestRuleFieldCacheSanity$1.evaluate(TestRuleFieldCacheSanity.java:51)
	at org.apache.lucene.util.AbstractBeforeAfterRule$1.evaluate(AbstractBeforeAfterRule.java:46)
	at com.carrotsearch.randomizedtesting.rules.SystemPropertiesInvariantRule$1.evaluate(SystemPropertiesInvariantRule.java:55)
	at org.apache.lucene.util.TestRuleThreadAndTestName$1.evaluate(TestRuleThreadAndTestName.java:49)
	at org.apache.lucene.util.TestRuleIgnoreAfterMaxFailures$1.evaluate(TestRuleIgnoreAfterMaxFailures.java:70)
	at org.apache.lucene.util.TestRuleMarkFailure$1.evaluate(TestRuleMarkFailure.java:48)
	at com.carrotsearch.randomizedtesting.rules.StatementAdapter.evaluate(StatementAdapter.java:36)
	at com.carrotsearch.randomizedtesting.ThreadLeakControl$StatementRunner.run(ThreadLeakControl.java:358)
	at com.carrotsearch.randomizedtesting.ThreadLeakControl.forkTimeoutingTask(ThreadLeakControl.java:782)
	at com.carrotsearch.randomizedtesting.ThreadLeakControl$3.evaluate(ThreadLeakControl.java:442)
	at com.carrotsearch.randomizedtesting.RandomizedRunner.runSingleTest(RandomizedRunner.java:746)
	at com.carrotsearch.randomizedtesting.RandomizedRunner$3.evaluate(RandomizedRunner.java:648)
	at com.carrotsearch.randomizedtesting.RandomizedRunner$4.evaluate(RandomizedRunner.java:682)
	at com.carrotsearch.randomizedtesting.RandomizedRunner$5.evaluate(RandomizedRunner.java:693)
	at com.carrotsearch.randomizedtesting.rules.StatementAdapter.evaluate(StatementAdapter.java:36)
	at com.carrotsearch.randomizedtesting.rules.SystemPropertiesRestoreRule$1.evaluate(SystemPropertiesRestoreRule.java:53)
	at org.apache.lucene.util.AbstractBeforeAfterRule$1.evaluate(AbstractBeforeAfterRule.java:46)
	at org.apache.lucene.util.TestRuleStoreClassName$1.evaluate(TestRuleStoreClassName.java:42)
	at com.carrotsearch.randomizedtesting.rules.SystemPropertiesInvariantRule$1.evaluate(SystemPropertiesInvariantRule.java:55)
	at com.carrotsearch.randomizedtesting.rules.NoShadowingOrOverridesOnMethodsRule$1.evaluate(NoShadowingOrOverridesOnMethodsRule.java:39)
	at com.carrotsearch.randomizedtesting.rules.NoShadowingOrOverridesOnMethodsRule$1.evaluate(NoShadowingOrOverridesOnMethodsRule.java:39)
	at com.carrotsearch.randomizedtesting.rules.StatementAdapter.evaluate(StatementAdapter.java:36)
	at org.apache.lucene.util.TestRuleAssertionsRequired$1.evaluate(TestRuleAssertionsRequired.java:43)
	at org.apache.lucene.util.TestRuleMarkFailure$1.evaluate(TestRuleMarkFailure.java:48)
	at org.apache.lucene.util.TestRuleIgnoreAfterMaxFailures$1.evaluate(TestRuleIgnoreAfterMaxFailures.java:70)
	at org.apache.lucene.util.TestRuleIgnoreTestSuites$1.evaluate(TestRuleIgnoreTestSuites.java:55)
	at com.carrotsearch.randomizedtesting.rules.StatementAdapter.evaluate(StatementAdapter.java:36)
	at com.carrotsearch.randomizedtesting.ThreadLeakControl$StatementRunner.run(ThreadLeakControl.java:358)
	at java.lang.Thread.run(Thread.java:738)


FAILED:  org.apache.solr.cloud.BasicDistributedZk2Test.testDistribSearch

Error Message:
Server at http://127.0.0.1:58849/onenodecollectioncore returned non ok status:404, message:Can not find: /onenodecollectioncore/update

Stack Trace:
org.apache.solr.client.solrj.impl.HttpSolrServer$RemoteSolrException: Server at http://127.0.0.1:58849/onenodecollectioncore returned non ok status:404, message:Can not find: /onenodecollectioncore/update
	at __randomizedtesting.SeedInfo.seed([EAD7FFEA55D6F80E:6B3171F222899832]:0)
	at org.apache.solr.client.solrj.impl.HttpSolrServer.request(HttpSolrServer.java:385)
	at org.apache.solr.client.solrj.impl.HttpSolrServer.request(HttpSolrServer.java:180)
	at org.apache.solr.client.solrj.request.AbstractUpdateRequest.process(AbstractUpdateRequest.java:117)
	at org.apache.solr.client.solrj.SolrServer.add(SolrServer.java:116)
	at org.apache.solr.client.solrj.SolrServer.add(SolrServer.java:102)
	at org.apache.solr.cloud.BasicDistributedZk2Test.testNodeWithoutCollectionForwarding(BasicDistributedZk2Test.java:196)
	at org.apache.solr.cloud.BasicDistributedZk2Test.doTest(BasicDistributedZk2Test.java:88)
	at org.apache.solr.BaseDistributedSearchTestCase.testDistribSearch(BaseDistributedSearchTestCase.java:835)
	at sun.reflect.NativeMethodAccessorImpl.invoke0(Native Method)
	at sun.reflect.NativeMethodAccessorImpl.invoke(NativeMethodAccessorImpl.java:60)
	at sun.reflect.DelegatingMethodAccessorImpl.invoke(DelegatingMethodAccessorImpl.java:37)
	at java.lang.reflect.Method.invoke(Method.java:611)
	at com.carrotsearch.randomizedtesting.RandomizedRunner.invoke(RandomizedRunner.java:1559)
	at com.carrotsearch.randomizedtesting.RandomizedRunner.access$600(RandomizedRunner.java:79)
	at com.carrotsearch.randomizedtesting.RandomizedRunner$6.evaluate(RandomizedRunner.java:737)
	at com.carrotsearch.randomizedtesting.RandomizedRunner$7.evaluate(RandomizedRunner.java:773)
	at com.carrotsearch.randomizedtesting.RandomizedRunner$8.evaluate(RandomizedRunner.java:787)
	at com.carrotsearch.randomizedtesting.rules.SystemPropertiesRestoreRule$1.evaluate(SystemPropertiesRestoreRule.java:53)
	at org.apache.lucene.util.TestRuleSetupTeardownChained$1.evaluate(TestRuleSetupTeardownChained.java:50)
	at org.apache.lucene.util.TestRuleFieldCacheSanity$1.evaluate(TestRuleFieldCacheSanity.java:51)
	at org.apache.lucene.util.AbstractBeforeAfterRule$1.evaluate(AbstractBeforeAfterRule.java:46)
	at com.carrotsearch.randomizedtesting.rules.SystemPropertiesInvariantRule$1.evaluate(SystemPropertiesInvariantRule.java:55)
	at org.apache.lucene.util.TestRuleThreadAndTestName$1.evaluate(TestRuleThreadAndTestName.java:49)
	at org.apache.lucene.util.TestRuleIgnoreAfterMaxFailures$1.evaluate(TestRuleIgnoreAfterMaxFailures.java:70)
	at org.apache.lucene.util.TestRuleMarkFailure$1.evaluate(TestRuleMarkFailure.java:48)
	at com.carrotsearch.randomizedtesting.rules.StatementAdapter.evaluate(StatementAdapter.java:36)
	at com.carrotsearch.randomizedtesting.ThreadLeakControl$StatementRunner.run(ThreadLeakControl.java:358)
	at com.carrotsearch.randomizedtesting.ThreadLeakControl.forkTimeoutingTask(ThreadLeakControl.java:782)
	at com.carrotsearch.randomizedtesting.ThreadLeakControl$3.evaluate(ThreadLeakControl.java:442)
	at com.carrotsearch.randomizedtesting.RandomizedRunner.runSingleTest(RandomizedRunner.java:746)
	at com.carrotsearch.randomizedtesting.RandomizedRunner$3.evaluate(RandomizedRunner.java:648)
	at com.carrotsearch.randomizedtesting.RandomizedRunner$4.evaluate(RandomizedRunner.java:682)
	at com.carrotsearch.randomizedtesting.RandomizedRunner$5.evaluate(RandomizedRunner.java:693)
	at com.carrotsearch.randomizedtesting.rules.StatementAdapter.evaluate(StatementAdapter.java:36)
	at com.carrotsearch.randomizedtesting.rules.SystemPropertiesRestoreRule$1.evaluate(SystemPropertiesRestoreRule.java:53)
	at org.apache.lucene.util.AbstractBeforeAfterRule$1.evaluate(AbstractBeforeAfterRule.java:46)
	at org.apache.lucene.util.TestRuleStoreClassName$1.evaluate(TestRuleStoreClassName.java:42)
	at com.carrotsearch.randomizedtesting.rules.SystemPropertiesInvariantRule$1.evaluate(SystemPropertiesInvariantRule.java:55)
	at com.carrotsearch.randomizedtesting.rules.NoShadowingOrOverridesOnMethodsRule$1.evaluate(NoShadowingOrOverridesOnMethodsRule.java:39)
	at com.carrotsearch.randomizedtesting.rules.NoShadowingOrOverridesOnMethodsRule$1.evaluate(NoShadowingOrOverridesOnMethodsRule.java:39)
	at com.carrotsearch.randomizedtesting.rules.StatementAdapter.evaluate(StatementAdapter.java:36)
	at org.apache.lucene.util.TestRuleAssertionsRequired$1.evaluate(TestRuleAssertionsRequired.java:43)
	at org.apache.lucene.util.TestRuleMarkFailure$1.evaluate(TestRuleMarkFailure.java:48)
	at org.apache.lucene.util.TestRuleIgnoreAfterMaxFailures$1.evaluate(TestRuleIgnoreAfterMaxFailures.java:70)
	at org.apache.lucene.util.TestRuleIgnoreTestSuites$1.evaluate(TestRuleIgnoreTestSuites.java:55)
	at com.carrotsearch.randomizedtesting.rules.StatementAdapter.evaluate(StatementAdapter.java:36)
	at com.carrotsearch.randomizedtesting.ThreadLeakControl$StatementRunner.run(ThreadLeakControl.java:358)
	at java.lang.Thread.run(Thread.java:738)




Build Log:
[...truncated 8874 lines...]
   [junit4] Suite: org.apache.solr.core.TestJmxIntegration
   [junit4]   2> 114483 T363 oas.SolrTestCaseJ4.initCore ####initCore
   [junit4]   2> Creating dataDir: /mnt/ssd/jenkins/workspace/Lucene-Solr-4.x-Linux/solr/build/solr-core/test/J1/./solrtest-TestJmxIntegration-1374687844713
   [junit4]   2> 114485 T363 oasc.SolrResourceLoader.<init> new SolrResourceLoader for directory: '/mnt/ssd/jenkins/workspace/Lucene-Solr-4.x-Linux/solr/build/solr-core/test-files/solr/collection1/'
   [junit4]   2> 114487 T363 oasc.SolrResourceLoader.replaceClassLoader Adding 'file:/mnt/ssd/jenkins/workspace/Lucene-Solr-4.x-Linux/solr/build/solr-core/test-files/solr/collection1/lib/README' to classloader
   [junit4]   2> 114487 T363 oasc.SolrResourceLoader.replaceClassLoader Adding 'file:/mnt/ssd/jenkins/workspace/Lucene-Solr-4.x-Linux/solr/build/solr-core/test-files/solr/collection1/lib/classes/' to classloader
   [junit4]   2> 114590 T363 oasc.SolrConfig.<init> Using Lucene MatchVersion: LUCENE_45
   [junit4]   2> 114651 T363 oasc.SolrConfig.<init> Loaded SolrConfig: solrconfig.xml
   [junit4]   2> 114652 T363 oass.IndexSchema.readSchema Reading Solr Schema from schema.xml
   [junit4]   2> 114664 T363 oass.IndexSchema.readSchema [null] Schema name=test
   [junit4]   2> 115264 T363 oass.ByteField.init WARN ByteField is deprecated and will be removed in 5.0. You should use TrieIntField instead.
   [junit4]   2> 115265 T363 oass.ShortField.init WARN ShortField is deprecated and will be removed in 5.0. You should use TrieIntField instead.
   [junit4]   2> 115266 T363 oass.OpenExchangeRatesOrgProvider.init Initialized with rates=open-exchange-rates.json, refreshInterval=1440.
   [junit4]   2> 115273 T363 oass.IndexSchema.readSchema default search field in schema is text
   [junit4]   2> 115276 T363 oass.IndexSchema.readSchema unique key field: id
   [junit4]   2> 115284 T363 oass.FileExchangeRateProvider.reload Reloading exchange rates from file currency.xml
   [junit4]   2> 115289 T363 oass.FileExchangeRateProvider.reload Reloading exchange rates from file currency.xml
   [junit4]   2> 115293 T363 oass.OpenExchangeRatesOrgProvider.reload Reloading exchange rates from open-exchange-rates.json
   [junit4]   2> 115294 T363 oass.OpenExchangeRatesOrgProvider$OpenExchangeRates.<init> WARN Unknown key IMPORTANT NOTE
   [junit4]   2> 115294 T363 oass.OpenExchangeRatesOrgProvider$OpenExchangeRates.<init> WARN Expected key, got STRING
   [junit4]   2> 115295 T363 oass.OpenExchangeRatesOrgProvider.reload Reloading exchange rates from open-exchange-rates.json
   [junit4]   2> 115296 T363 oass.OpenExchangeRatesOrgProvider$OpenExchangeRates.<init> WARN Unknown key IMPORTANT NOTE
   [junit4]   2> 115296 T363 oass.OpenExchangeRatesOrgProvider$OpenExchangeRates.<init> WARN Expected key, got STRING
   [junit4]   2> 115297 T363 oasc.SolrResourceLoader.locateSolrHome JNDI not configured for solr (NoInitialContextEx)
   [junit4]   2> 115298 T363 oasc.SolrResourceLoader.locateSolrHome using system property solr.solr.home: /mnt/ssd/jenkins/workspace/Lucene-Solr-4.x-Linux/solr/build/solr-core/test-files/solr
   [junit4]   2> 115298 T363 oasc.SolrResourceLoader.<init> new SolrResourceLoader for directory: '/mnt/ssd/jenkins/workspace/Lucene-Solr-4.x-Linux/solr/build/solr-core/test-files/solr/'
   [junit4]   2> 115309 T363 oasc.SolrResourceLoader.locateSolrHome JNDI not configured for solr (NoInitialContextEx)
   [junit4]   2> 115309 T363 oasc.SolrResourceLoader.locateSolrHome using system property solr.solr.home: /mnt/ssd/jenkins/workspace/Lucene-Solr-4.x-Linux/solr/build/solr-core/test-files/solr
   [junit4]   2> 115310 T363 oasc.SolrResourceLoader.<init> new SolrResourceLoader for deduced Solr Home: '/mnt/ssd/jenkins/workspace/Lucene-Solr-4.x-Linux/solr/build/solr-core/test-files/solr/'
   [junit4]   2> 115366 T363 oasc.CoreContainer.<init> New CoreContainer 1701078372
   [junit4]   2> 115366 T363 oasc.CoreContainer.load Loading cores into CoreContainer [instanceDir=/mnt/ssd/jenkins/workspace/Lucene-Solr-4.x-Linux/solr/build/solr-core/test-files/solr/]
   [junit4]   2> 115368 T363 oashc.HttpShardHandlerFactory.getParameter Setting socketTimeout to: 0
   [junit4]   2> 115368 T363 oashc.HttpShardHandlerFactory.getParameter Setting urlScheme to: http://
   [junit4]   2> 115369 T363 oashc.HttpShardHandlerFactory.getParameter Setting connTimeout to: 0
   [junit4]   2> 115369 T363 oashc.HttpShardHandlerFactory.getParameter Setting maxConnectionsPerHost to: 20
   [junit4]   2> 115370 T363 oashc.HttpShardHandlerFactory.getParameter Setting corePoolSize to: 0
   [junit4]   2> 115371 T363 oashc.HttpShardHandlerFactory.getParameter Setting maximumPoolSize to: 2147483647
   [junit4]   2> 115371 T363 oashc.HttpShardHandlerFactory.getParameter Setting maxThreadIdleTime to: 5
   [junit4]   2> 115372 T363 oashc.HttpShardHandlerFactory.getParameter Setting sizeOfQueue to: -1
   [junit4]   2> 115372 T363 oashc.HttpShardHandlerFactory.getParameter Setting fairnessPolicy to: false
   [junit4]   2> 115373 T363 oascsi.HttpClientUtil.createClient Creating new http client, config:maxConnectionsPerHost=20&maxConnections=10000&socketTimeout=0&connTimeout=0&retry=false
   [junit4]   2> 115380 T363 oasl.LogWatcher.newRegisteredLogWatcher Registering Log Listener [Log4j (org.slf4j.impl.Log4jLoggerFactory)]
   [junit4]   2> 115393 T364 oasc.CoreContainer.create Creating SolrCore 'collection1' using instanceDir: /mnt/ssd/jenkins/workspace/Lucene-Solr-4.x-Linux/solr/build/solr-core/test-files/solr/collection1
   [junit4]   2> 115393 T364 oasc.SolrResourceLoader.<init> new SolrResourceLoader for directory: '/mnt/ssd/jenkins/workspace/Lucene-Solr-4.x-Linux/solr/build/solr-core/test-files/solr/collection1/'
   [junit4]   2> 115395 T364 oasc.SolrResourceLoader.replaceClassLoader Adding 'file:/mnt/ssd/jenkins/workspace/Lucene-Solr-4.x-Linux/solr/build/solr-core/test-files/solr/collection1/lib/README' to classloader
   [junit4]   2> 115395 T364 oasc.SolrResourceLoader.replaceClassLoader Adding 'file:/mnt/ssd/jenkins/workspace/Lucene-Solr-4.x-Linux/solr/build/solr-core/test-files/solr/collection1/lib/classes/' to classloader
   [junit4]   2> 115482 T364 oasc.SolrConfig.<init> Using Lucene MatchVersion: LUCENE_45
   [junit4]   2> 115533 T364 oasc.SolrConfig.<init> Loaded SolrConfig: solrconfig.xml
   [junit4]   2> 115534 T364 oass.IndexSchema.readSchema Reading Solr Schema from schema.xml
   [junit4]   2> 115542 T364 oass.IndexSchema.readSchema [collection1] Schema name=test
   [junit4]   2> 115999 T364 oass.ByteField.init WARN ByteField is deprecated and will be removed in 5.0. You should use TrieIntField instead.
   [junit4]   2> 116000 T364 oass.ShortField.init WARN ShortField is deprecated and will be removed in 5.0. You should use TrieIntField instead.
   [junit4]   2> 116001 T364 oass.OpenExchangeRatesOrgProvider.init Initialized with rates=open-exchange-rates.json, refreshInterval=1440.
   [junit4]   2> 116007 T364 oass.IndexSchema.readSchema default search field in schema is text
   [junit4]   2> 116012 T364 oass.IndexSchema.readSchema unique key field: id
   [junit4]   2> 116021 T364 oass.FileExchangeRateProvider.reload Reloading exchange rates from file currency.xml
   [junit4]   2> 116025 T364 oass.FileExchangeRateProvider.reload Reloading exchange rates from file currency.xml
   [junit4]   2> 116029 T364 oass.OpenExchangeRatesOrgProvider.reload Reloading exchange rates from open-exchange-rates.json
   [junit4]   2> 116030 T364 oass.OpenExchangeRatesOrgProvider$OpenExchangeRates.<init> WARN Unknown key IMPORTANT NOTE
   [junit4]   2> 116030 T364 oass.OpenExchangeRatesOrgProvider$OpenExchangeRates.<init> WARN Expected key, got STRING
   [junit4]   2> 116031 T364 oass.OpenExchangeRatesOrgProvider.reload Reloading exchange rates from open-exchange-rates.json
   [junit4]   2> 116032 T364 oass.OpenExchangeRatesOrgProvider$OpenExchangeRates.<init> WARN Unknown key IMPORTANT NOTE
   [junit4]   2> 116032 T364 oass.OpenExchangeRatesOrgProvider$OpenExchangeRates.<init> WARN Expected key, got STRING
   [junit4]   2> 116033 T364 oasc.SolrCore.initDirectoryFactory org.apache.solr.core.MockDirectoryFactory
   [junit4]   2> 116033 T364 oasc.SolrCore.<init> [collection1] Opening new SolrCore at /mnt/ssd/jenkins/workspace/Lucene-Solr-4.x-Linux/solr/build/solr-core/test-files/solr/collection1/, dataDir=/mnt/ssd/jenkins/workspace/Lucene-Solr-4.x-Linux/solr/build/solr-core/test/J1/./solrtest-TestJmxIntegration-1374687844713/
   [junit4]   2> 116034 T364 oasc.JmxMonitoredMap.<init> No JMX servers found, not exposing Solr information with JMX.
   [junit4]   2> 116035 T364 oasc.CachingDirectoryFactory.get return new directory for /mnt/ssd/jenkins/workspace/Lucene-Solr-4.x-Linux/solr/build/solr-core/test/J1/./solrtest-TestJmxIntegration-1374687844713
   [junit4]   2> 116035 T364 oasc.SolrCore.getNewIndexDir New index directory detected: old=null new=/mnt/ssd/jenkins/workspace/Lucene-Solr-4.x-Linux/solr/build/solr-core/test/J1/./solrtest-TestJmxIntegration-1374687844713/index/
   [junit4]   2> 116036 T364 oasc.SolrCore.initIndex WARN [collection1] Solr index directory '/mnt/ssd/jenkins/workspace/Lucene-Solr-4.x-Linux/solr/build/solr-core/test/J1/./solrtest-TestJmxIntegration-1374687844713/index' doesn't exist. Creating new index...
   [junit4]   2> 116037 T364 oasc.CachingDirectoryFactory.get return new directory for /mnt/ssd/jenkins/workspace/Lucene-Solr-4.x-Linux/solr/build/solr-core/test/J1/./solrtest-TestJmxIntegration-1374687844713/index
   [junit4]   2> 116039 T364 oasc.SolrDeletionPolicy.onCommit SolrDeletionPolicy.onCommit: commits: num=1
   [junit4]   2> 		commit{dir=RateLimitedDirectoryWrapper(MockDirWrapper(org.apache.lucene.store.RAMDirectory@6d186d18 lockFactory=org.apache.lucene.store.NativeFSLockFactory@7d867d86)),segFN=segments_1,generation=1}
   [junit4]   2> 116039 T364 oasc.SolrDeletionPolicy.updateCommits newest commit generation = 1
   [junit4]   2> 116040 T364 oasc.SolrCore.initWriters created xml: solr.XMLResponseWriter
   [junit4]   2> 116041 T364 oasup.UpdateRequestProcessorChain.init inserting DistributedUpdateProcessorFactory into updateRequestProcessorChain "dedupe"
   [junit4]   2> 116042 T364 oasup.UpdateRequestProcessorChain.init inserting DistributedUpdateProcessorFactory into updateRequestProcessorChain "dedupe-allfields"
   [junit4]   2> 116042 T364 oasup.UpdateRequestProcessorChain.init inserting DistributedUpdateProcessorFactory into updateRequestProcessorChain "stored_sig"
   [junit4]   2> 116043 T364 oasup.UpdateRequestProcessorChain.init inserting DistributedUpdateProcessorFactory into updateRequestProcessorChain "uniq-fields"
   [junit4]   2> 116044 T364 oasup.UpdateRequestProcessorChain.init inserting DistributedUpdateProcessorFactory into updateRequestProcessorChain "distrib-dup-test-chain-implicit"
   [junit4]   2> 116044 T364 oasc.RequestHandlers.initHandlersFromConfig adding lazy requestHandler: solr.ReplicationHandler
   [junit4]   2> 116045 T364 oasc.RequestHandlers.initHandlersFromConfig created /replication: solr.ReplicationHandler
   [junit4]   2> 116045 T364 oasc.RequestHandlers.initHandlersFromConfig created standard: solr.StandardRequestHandler
   [junit4]   2> 116046 T364 oasc.RequestHandlers.initHandlersFromConfig created /get: solr.RealTimeGetHandler
   [junit4]   2> 116046 T364 oasc.RequestHandlers.initHandlersFromConfig created dismax: solr.SearchHandler
   [junit4]   2> 116047 T364 oasc.RequestHandlers.initHandlersFromConfig created mock: org.apache.solr.core.MockQuerySenderListenerReqHandler
   [junit4]   2> 116047 T364 oasc.RequestHandlers.initHandlersFromConfig created /admin/: org.apache.solr.handler.admin.AdminHandlers
   [junit4]   2> 116048 T364 oasc.RequestHandlers.initHandlersFromConfig created defaults: solr.StandardRequestHandler
   [junit4]   2> 116048 T364 oasc.RequestHandlers.initHandlersFromConfig adding lazy requestHandler: solr.StandardRequestHandler
   [junit4]   2> 116049 T364 oasc.RequestHandlers.initHandlersFromConfig created lazy: solr.StandardRequestHandler
   [junit4]   2> 116049 T364 oasc.RequestHandlers.initHandlersFromConfig created /update: solr.UpdateRequestHandler
   [junit4]   2> 116050 T364 oasc.RequestHandlers.initHandlersFromConfig created /terms: org.apache.solr.handler.component.SearchHandler
   [junit4]   2> 116050 T364 oasc.RequestHandlers.initHandlersFromConfig created spellCheckCompRH: org.apache.solr.handler.component.SearchHandler
   [junit4]   2> 116051 T364 oasc.RequestHandlers.initHandlersFromConfig created spellCheckCompRH_Direct: org.apache.solr.handler.component.SearchHandler
   [junit4]   2> 116051 T364 oasc.RequestHandlers.initHandlersFromConfig created spellCheckWithWordbreak: org.apache.solr.handler.component.SearchHandler
   [junit4]   2> 116052 T364 oasc.RequestHandlers.initHandlersFromConfig created spellCheckWithWordbreak_Direct: org.apache.solr.handler.component.SearchHandler
   [junit4]   2> 116052 T364 oasc.RequestHandlers.initHandlersFromConfig created spellCheckCompRH1: org.apache.solr.handler.component.SearchHandler
   [junit4]   2> 116053 T364 oasc.RequestHandlers.initHandlersFromConfig created mltrh: org.apache.solr.handler.component.SearchHandler
   [junit4]   2> 116053 T364 oasc.RequestHandlers.initHandlersFromConfig created tvrh: org.apache.solr.handler.component.SearchHandler
   [junit4]   2> 116054 T364 oasc.RequestHandlers.initHandlersFromConfig created /mlt: solr.MoreLikeThisHandler
   [junit4]   2> 116054 T364 oasc.RequestHandlers.initHandlersFromConfig created /debug/dump: solr.DumpRequestHandler
   [junit4]   2> 116056 T364 oashl.XMLLoader.init xsltCacheLifetimeSeconds=60
   [junit4]   2> 116057 T364 oasc.SolrCore.initDeprecatedSupport WARN solrconfig.xml uses deprecated <admin/gettableFiles>, Please update your config to use the ShowFileRequestHandler.
   [junit4]   2> 116059 T364 oasc.SolrCore.initDeprecatedSupport WARN adding ShowFileRequestHandler with hidden files: [SCHEMA-REQUIRED-FIELDS.XML, SOLRCONFIG-PROPINJECT.XML, SCHEMA11.XML, SCHEMA15.XML, SCHEMA-SIM.XML, SOLRCONFIG-NATIVELOCK.XML, BAD-SOLRCONFIG-UNEXPECTED-SCHEMA-ATTRIBUTE.XML, CONDITIONAL.UPDATEPROCESSOR.JS, SCHEMA-ID-AND-VERSION-FIELDS-ONLY.XML, BAD-SCHEMA-DOCVALUES-NOT-REQUIRED-NO-DEFAULT.XML, SOLRCONFIG-SPELLCHECKER.XML, SCHEMA-CHARFILTERS.XML, SCHEMA-EFF.XML, SOLRCONFIG_CODEC.XML, SOLRCONFIG-MUTABLE-MANAGED-SCHEMA.XML, HYPHENATION.DTD, BAD-SCHEMA-EXTERNAL-FILEFIELD.XML, SOLRCONFIG-MERGEPOLICY.XML, TRIVIAL.UPDATEPROCESSOR1.JS, SOLRCONFIG-SLAVE1.XML, SCHEMA-LMJELINEKMERCER.XML, SOLRCONFIG-BASIC.XML, BAD-SCHEMA-DUP-FIELD.XML, SCHEMA-ONE-FIELD-NO-DYNAMIC-FIELD-UNIQUE-KEY.XML, SOLRCONFIG-PARSING-UPDATE-PROCESSOR-CHAINS.XML, SOLRCONFIG-HIGHLIGHT.XML, SCHEMA-TFIDF.XML, SOLRCONFIG-ELEVATE.XML, STOPWITHBOM.TXT, SOLRCONFIG-QUERYSENDER.XML, WDFTYPES.TXT, SOLRCONFIG-COMPONENTS-NAME.XML, BAD-SCHEMA-CURRENCY-FT-OER-NORATES.XML, SOLRCONFIG-DELPOLICY1.XML, BAD-SCHEMA-UNSUPPORTED-DOCVALUES.XML, KEEP-2.TXT, SCHEMA-STOP-KEEP.XML, SCHEMA-ONE-FIELD-NO-DYNAMIC-FIELD.XML, STOP-SNOWBALL.TXT, BAD-SCHEMA-MULTIPLE-ASTERISK-COPYFIELD-DEST-SHOULD-FAIL-TEST.XML, SOLRCONFIG-INDEXCONFIG.XML, SCHEMA-DOCVALUESMULTI.XML, SCHEMA-CLASS-NAME-SHORTENING-ON-SERIALIZATION.XML, STOPWORDSWRONGENCODING.TXT, SOLRCONFIG-SPELLCHECKCOMPONENT.XML, SOLRCONFIG.SNIPPET.RANDOMINDEXCONFIG.XML, SOLRCONFIG-MINIMAL.XML, SOLRCONFIG-TLOG.XML, SCHEMA-DOCVALUESFACETING.XML, SOLRCONFIG-TERMINDEX.XML, BAD-SOLRCONFIG-INVALID-SCRIPTFILE.XML, OPEN-EXCHANGE-RATES.JSON, BAD-SCHEMA-DUP-FIELDTYPE.XML, PHRASESUGGEST.TXT, SOLRCONFIG-INFOSTREAM-LOGGING.XML, OLD_SYNONYMS.TXT, SCHEMA-NOT-REQUIRED-UNIQUE-KEY.XML, SCHEMA-REVERSED.XML, SCHEMA-FOLDING.XML, SCHEMA-BM25.XML, BAD-SCHEMA-SWEETSPOT-BOTH-TF.XML, SOLRCONFIG-ENABLEPLUGIN.XML, MISSING.FUNCTIONS.UPDATEPROCESSOR.JS, SOLRCONFIG-TRANSFORMERS.XML, SCHEMA-COPYFIELD-TEST.XML, BAD-SCHEMA-DUP-DYNAMICFIELD.XML, BAD-SCHEMA-SWEETSPOT-PARTIAL-BASELINE.XML, CURRENCY.XML, FUZZYSUGGEST.TXT, SCHEMA-POSTINGSHIGHLIGHT.XML, SOLRCONFIG-SOLR-749.XML, SOLRCONFIG_PERF.XML, SCHEMA-SWEETSPOT.XML, SOLRCONFIG-SIMPLELOCK.XML, SCHEMA-TINY.XML, SOLRCONFIG-LAZYWRITER.XML, SOLRCONFIG-RESPONSE-LOG-COMPONENT.XML, SCHEMA-REPLICATION2.XML, SCHEMA-SNIPPET-TYPE.XML, SOLRCONFIG-XINCLUDE.XML, SCHEMA-SPELLCHECKER.XML, SOLRCONFIG-WARMER.XML, KEEP-1.TXT, SCHEMA-TRIE.XML, BAD-SCHEMA-CURRENCY-FT-BOGUS-CODE-IN-XML.XML, BAD-SCHEMA-OMIT-TF-BUT-NOT-POS.XML, STOPTYPES-2.TXT, SCHEMA_CODEC.XML, SCHEMA-SYNONYM-TOKENIZER.XML, SOLRCONFIG-DEFAULTS.XML, SCHEMA-XINCLUDE.XML, SOLRCONFIG-REQHANDLER.INCL, SCHEMA-SNIPPET-FIELD.XML, SCHEMA-PHRASESUGGEST.XML, SCHEMA-DFR.XML, SOLRCONFIG-UPDATE-PROCESSOR-CHAINS.XML, SOLRCONFIG-MASTER3.XML, BAD-SCHEMA-MULTIPLE-ASTERISK-COPYFIELD-SOURCE-SHOULD-FAIL-TEST.XML, BAD-SCHEMA-CURRENCY-FT-BOGUS-DEFAULT-CODE.XML, BAD-SCHEMA-NOT-INDEXED-BUT-TF.XML, SOLRCONFIG-MANAGED-SCHEMA.XML, BAD-SOLRCONFIG-MANAGED-SCHEMA-NAMED-SCHEMA.XML.XML, SOLRCONFIG-MASTER1-KEEPONEBACKUP.XML, BAD-SCHEMA-NONTEXT-ANALYZER.XML, SOLRCONFIG-MERGEPOLICY-DEFAULTS.XML, SCHEMA-BEHAVIOR.XML, SOLRCONFIG-PROPINJECT-INDEXDEFAULT.XML, STOP-2.TXT, BAD-SCHEMA-UNIQUEKEY-USES-DEFAULT.XML, SCHEMA-DOCVALUES.XML, BAD-SOLRCONFIG-MISSING-SCRIPTFILE.XML, SOLRCONFIG-SCRIPT-UPDATEPROCESSOR.XML, SOLRCONFIG-REPEATER.XML, SOLRCONFIG-NOCACHE.XML, SOLRCONFIG-SOLCOREPROPERTIES.XML, SOLRCONFIG-PHRASESUGGEST.XML, JASUGGEST.TXT, BAD-MP-SOLRCONFIG.XML, BAD-SCHEMA-UNIQUEKEY-MULTIVALUED.XML, SOLRCONFIG-MASTER.XML, SYNONYMS.TXT, SCHEMA-REPLICATION1.XML, SCHEMA-SNIPPET-TYPES.INCL, SOLRCONFIG-SNIPPET-PROCESSOR.XML, BAD_SOLRCONFIG.XML, HUNSPELL-TEST.DIC, SCHEMA-LUCENEMATCHVERSION.XML, SCHEMA-NUMERIC.XML, SCHEMA-IB.XML, SOLRCONFIG-SLAVE.XML, SCHEMA-ADD-SCHEMA-FIELDS-UPDATE-PROCESSOR.XML, BAD-SCHEMA-NOT-INDEXED-BUT-NORMS.XML, THROW.ERROR.ON.ADD.UPDATEPROCESSOR.JS, BAD-SCHEMA-MISPLACED-ASTERISK-COPYFIELD-SOURCE-SHOULD-FAIL-TEST.XML, STOPTYPES-1.TXT, REGEX-BOOST-PROCESSOR-TEST.TXT, SOLRCONFIG-POSTINGSHIGHLIGHT.XML, COMPOUNDDICTIONARY.TXT, DA_COMPOUNDDICTIONARY.TXT, BAD-SCHEMA-NON-GLOB-COPYFIELD-SOURCE-MATCHING-NOTHING-SHOULD-FAIL-TEST.XML, SCHEMASURROUND.XML, BAD-SCHEMA-CURRENCY-FT-MULTIVALUED.XML, SOLRCONFIG-MASTER2.XML, BAD-SCHEMA-UNIQUEKEY-IS-COPYFIELD-DEST.XML, BAD-SCHEMA-CODEC-GLOBAL-VS-FT-MISMATCH.XML, SCHEMA-LMDIRICHLET.XML, BAD-SCHEMA-NOT-INDEXED-BUT-POS.XML, SOLRCONFIG-ADD-SCHEMA-FIELDS-UPDATE-PROCESSOR-CHAINS.XML, BAD-SCHEMA-CURRENCY-MULTIVALUED.XML, MAPPING-ISOLATIN1ACCENT.TXT, SOLRCONFIG-CACHING.XML, ADDFIELDS.UPDATEPROCESSOR.JS, BAD-CURRENCY.XML, STOP-1.TXT, SCHEMA-REST.XML, SCHEMA12.XML, SOLRCONFIG-BASIC-LUCENEVERSION31.XML, DA_UTF8.XML, MISSLEADING.EXTENSION.UPDATEPROCESSOR.JS.TXT, STOPWORDS.TXT, HUNSPELL-TEST.AFF, BAD-SCHEMA-BOGUS-ANALYSIS-PARAMETERS.XML, SOLRCONFIG-TLOG-MANAGED-SCHEMA.XML, BAD-SCHEMA-SWEETSPOT-PARTIAL-NORMS.XML, BAD-SCHEMA-MISPLACED-ASTERISK-COPYFIELD-DEST-SHOULD-FAIL-TEST.XML, FRENCHARTICLES.TXT, BAD-SCHEMA-SWEETSPOT-PARTIAL-HYPERBOLIC.XML, SCHEMA-SPATIAL.XML, XSLT, SOLRCONFIG-DELPOLICY2.XML, TRIVIAL.UPDATEPROCESSOR0.JS, BAD-SCHEMA-CURRENCY-DYNAMIC-MULTIVALUED.XML, SOLRCONFIG-TLOG-MUTABLE-MANAGED-SCHEMA.XML, SCHEMA-BINARYFIELD.XML, SCHEMA-COLLATEFILTER.XML, SCHEMA-REST-LUCENE-MATCH-VERSION.XML, SCHEMA-MINIMAL.XML, STEMDICT.TXT, SCHEMA-COLLATE.XML, ELEVATE.XML, PROTWORDS.TXT, BAD-SCHEMA-ANALYZER-CLASS-AND-NESTED.XML, SOLRCONFIG-MASTER1.XML, BAD-SOLRCONFIG-SCHEMA-MUTABLE-BUT-NOT-MANAGED.XML, SOLRCONFIG-FUNCTIONQUERY.XML, BAD-SCHEMA-SIM-GLOBAL-VS-FT-MISMATCH.XML, SOLRCONFIG-ALTDIRECTORY.XML, SOLRCONFIG-QUERYSENDER-NOQUERY.XML, SOLRCONFIG-MERGEPOLICY-LEGACY.XML, BAD-SOLRCONFIG-BOGUS-SCRIPTENGINE-NAME.XML, BAD-SCHEMA-BOGUS-FIELD-PARAMETERS.XML]
   [junit4]   2> 116061 T364 oass.SolrIndexSearcher.<init> Opening Searcher@266f266f main
   [junit4]   2> 116063 T364 oasu.CommitTracker.<init> Hard AutoCommit: disabled
   [junit4]   2> 116063 T364 oasu.CommitTracker.<init> Soft AutoCommit: disabled
   [junit4]   2> 116064 T364 oashc.SpellCheckComponent.inform Initializing spell checkers
   [junit4]   2> 116147 T364 oass.DirectSolrSpellChecker.init init: {name=direct,classname=DirectSolrSpellChecker,field=lowerfilt,minQueryLength=3}
   [junit4]   2> 116203 T365 oasc.SolrCore.registerSearcher [collection1] Registered new searcher Searcher@266f266f main{StandardDirectoryReader(segments_1:1)}
   [junit4]   2> 116203 T364 oasc.CoreContainer.registerCore registering core: collection1
   [junit4]   2> 116205 T363 oas.SolrTestCaseJ4.initCore ####initCore end
   [junit4]   2> 116289 T363 oas.SolrTestCaseJ4.setUp ###Starting testJmxUpdate
   [junit4]   2> 116293 T363 oas.SolrTestCaseJ4.tearDown ###Ending testJmxUpdate
   [junit4] IGNOR/A 0.13s J1 | TestJmxIntegration.testJmxUpdate
   [junit4]    > Assumption #1: got: <false>, expected: is <true>
   [junit4]   2> 116339 T363 oas.SolrTestCaseJ4.setUp ###Starting testJmxRegistration
   [junit4]   2> 116340 T363 oasc.TestJmxIntegration.testJmxRegistration Servers in testJmxRegistration: [com.sun.jmx.mbeanserver.JmxMBeanServer@53665366]
   [junit4]   2> 116347 T363 oas.SolrTestCaseJ4.tearDown ###Ending testJmxRegistration
   [junit4]   2> NOTE: reproduce with: ant test  -Dtestcase=TestJmxIntegration -Dtests.method=testJmxRegistration -Dtests.seed=EAD7FFEA55D6F80E -Dtests.multiplier=3 -Dtests.slow=true -Dtests.locale=en_GB_EURO -Dtests.timezone=US/Mountain -Dtests.file.encoding=UTF-8
   [junit4] FAILURE 0.02s J1 | TestJmxIntegration.testJmxRegistration <<<
   [junit4]    > Throwable #1: java.lang.AssertionError: No SolrDynamicMBeans found
   [junit4]    > 	at __randomizedtesting.SeedInfo.seed([EAD7FFEA55D6F80E:64069BD03897A06B]:0)
   [junit4]    > 	at org.apache.solr.core.TestJmxIntegration.testJmxRegistration(TestJmxIntegration.java:94)
   [junit4]    > 	at java.lang.Thread.run(Thread.java:738)
   [junit4]   2> 116361 T363 oas.SolrTestCaseJ4.deleteCore ###deleteCore
   [junit4]   2> 116361 T363 oasc.CoreContainer.shutdown Shutting down CoreContainer instance=1701078372
   [junit4]   2> 116362 T363 oasc.SolrCore.close [collection1]  CLOSING SolrCore org.apache.solr.core.SolrCore@52645264
   [junit4]   2> 116362 T363 oasu.DirectUpdateHandler2.close closing DirectUpdateHandler2{commits=0,autocommits=0,soft autocommits=0,optimizes=0,rollbacks=0,expungeDeletes=0,docsPending=0,adds=0,deletesById=0,deletesByQuery=0,errors=0,cumulative_adds=0,cumulative_deletesById=0,cumulative_deletesByQuery=0,cumulative_errors=0}
   [junit4]   2> 116363 T363 oasu.SolrCoreState.decrefSolrCoreState Closing SolrCoreState
   [junit4]   2> 116364 T363 oasu.DefaultSolrCoreState.closeIndexWriter SolrCoreState ref count has reached 0 - closing IndexWriter
   [junit4]   2> 116364 T363 oasu.DefaultSolrCoreState.closeIndexWriter closing IndexWriter with IndexWriterCloser
   [junit4]   2> 116365 T363 oasc.SolrCore.closeSearcher [collection1] Closing main searcher on request.
   [junit4]   2> 116365 T363 oasc.CachingDirectoryFactory.close Closing MockDirectoryFactory - 2 directories currently being tracked
   [junit4]   2> 116366 T363 oasc.CachingDirectoryFactory.closeCacheValue looking to close /mnt/ssd/jenkins/workspace/Lucene-Solr-4.x-Linux/solr/build/solr-core/test/J1/./solrtest-TestJmxIntegration-1374687844713 [CachedDir<<refCount=0;path=/mnt/ssd/jenkins/workspace/Lucene-Solr-4.x-Linux/solr/build/solr-core/test/J1/./solrtest-TestJmxIntegration-1374687844713;done=false>>]
   [junit4]   2> 116366 T363 oasc.CachingDirectoryFactory.close Closing directory: /mnt/ssd/jenkins/workspace/Lucene-Solr-4.x-Linux/solr/build/solr-core/test/J1/./solrtest-TestJmxIntegration-1374687844713
   [junit4]   2> 116367 T363 oasc.CachingDirectoryFactory.closeCacheValue looking to close /mnt/ssd/jenkins/workspace/Lucene-Solr-4.x-Linux/solr/build/solr-core/test/J1/./solrtest-TestJmxIntegration-1374687844713/index [CachedDir<<refCount=0;path=/mnt/ssd/jenkins/workspace/Lucene-Solr-4.x-Linux/solr/build/solr-core/test/J1/./solrtest-TestJmxIntegration-1374687844713/index;done=false>>]
   [junit4]   2> 116367 T363 oasc.CachingDirectoryFactory.close Closing directory: /mnt/ssd/jenkins/workspace/Lucene-Solr-4.x-Linux/solr/build/solr-core/test/J1/./solrtest-TestJmxIntegration-1374687844713/index
   [junit4]   2> NOTE: test params are: codec=Lucene42: {}, docValues:{}, sim=RandomSimilarityProvider(queryNorm=true,coord=crazy): {}, locale=en_GB_EURO, timezone=US/Mountain
   [junit4]   2> NOTE: Linux 3.2.0-49-generic x86/IBM Corporation 1.6.0 (32-bit)/cpus=8,threads=2,free=20636336,total=35773952
   [junit4]   2> NOTE: All tests run in this JVM: [TestFieldTypeResource, SolrCmdDistributorTest, TestPartialUpdateDeduplication, URLClassifyProcessorTest, TestLuceneMatchVersion, DocValuesMultiTest, TestDynamicFieldCollectionResource, TestBinaryResponseWriter, FileUtilsTest, TestPropInject, BlockCacheTest, JSONWriterTest, TestAddFieldRealTimeGet, TestFastOutputStream, OutputWriterTest, HighlighterTest, SpellCheckCollatorTest, TestMergePolicyConfig, TestSolrJ, TestLazyCores, TestFiltering, TestJmxIntegration]
   [junit4] Completed on J1 in 1.94s, 3 tests, 1 failure, 2 skipped <<< FAILURES!

[...truncated 256 lines...]
   [junit4] Suite: org.apache.solr.cloud.BasicDistributedZk2Test
   [junit4]   2> 582056 T1831 oas.BaseDistributedSearchTestCase.initHostContext Setting hostContext system property: /
   [junit4]   2> 582061 T1831 oas.SolrTestCaseJ4.setUp ###Starting testDistribSearch
   [junit4]   2> Creating dataDir: /mnt/ssd/jenkins/workspace/Lucene-Solr-4.x-Linux/solr/build/solr-core/test/J1/./solrtest-BasicDistributedZk2Test-1374688312292
   [junit4]   2> 582063 T1831 oasc.ZkTestServer.run STARTING ZK TEST SERVER
   [junit4]   2> 582064 T1832 oasc.ZkTestServer$ZKServerMain.runFromConfig Starting server
   [junit4]   2> 582164 T1831 oasc.ZkTestServer.run start zk server on port:48730
   [junit4]   2> 582166 T1831 oascc.ConnectionManager.waitForConnected Waiting for client to connect to ZooKeeper
   [junit4]   2> 582231 T1838 oascc.ConnectionManager.process Watcher org.apache.solr.common.cloud.ConnectionManager@1d8e1d8e name:ZooKeeperConnection Watcher:127.0.0.1:48730 got event WatchedEvent state:SyncConnected type:None path:null path:null type:None
   [junit4]   2> 582231 T1831 oascc.ConnectionManager.waitForConnected Client is connected to ZooKeeper
   [junit4]   2> 582232 T1831 oascc.SolrZkClient.makePath makePath: /solr
   [junit4]   2> 582240 T1831 oascc.ConnectionManager.waitForConnected Waiting for client to connect to ZooKeeper
   [junit4]   2> 582242 T1840 oascc.ConnectionManager.process Watcher org.apache.solr.common.cloud.ConnectionManager@1a941a94 name:ZooKeeperConnection Watcher:127.0.0.1:48730/solr got event WatchedEvent state:SyncConnected type:None path:null path:null type:None
   [junit4]   2> 582243 T1831 oascc.ConnectionManager.waitForConnected Client is connected to ZooKeeper
   [junit4]   2> 582243 T1831 oascc.SolrZkClient.makePath makePath: /collections/collection1
   [junit4]   2> 582251 T1831 oascc.SolrZkClient.makePath makePath: /collections/collection1/shards
   [junit4]   2> 582259 T1831 oascc.SolrZkClient.makePath makePath: /collections/control_collection
   [junit4]   2> 582274 T1831 oascc.SolrZkClient.makePath makePath: /collections/control_collection/shards
   [junit4]   2> 582282 T1831 oasc.AbstractZkTestCase.putConfig put /mnt/ssd/jenkins/workspace/Lucene-Solr-4.x-Linux/solr/build/solr-core/test-files/solr/collection1/conf/solrconfig-tlog.xml to /configs/conf1/solrconfig.xml
   [junit4]   2> 582283 T1831 oascc.SolrZkClient.makePath makePath: /configs/conf1/solrconfig.xml
   [junit4]   2> 582294 T1831 oasc.AbstractZkTestCase.putConfig put /mnt/ssd/jenkins/workspace/Lucene-Solr-4.x-Linux/solr/build/solr-core/test-files/solr/collection1/conf/schema.xml to /configs/conf1/schema.xml
   [junit4]   2> 582295 T1831 oascc.SolrZkClient.makePath makePath: /configs/conf1/schema.xml
   [junit4]   2> 582305 T1831 oasc.AbstractZkTestCase.putConfig put /mnt/ssd/jenkins/workspace/Lucene-Solr-4.x-Linux/solr/build/solr-core/test-files/solr/collection1/conf/stopwords.txt to /configs/conf1/stopwords.txt
   [junit4]   2> 582306 T1831 oascc.SolrZkClient.makePath makePath: /configs/conf1/stopwords.txt
   [junit4]   2> 582313 T1831 oasc.AbstractZkTestCase.putConfig put /mnt/ssd/jenkins/workspace/Lucene-Solr-4.x-Linux/solr/build/solr-core/test-files/solr/collection1/conf/protwords.txt to /configs/conf1/protwords.txt
   [junit4]   2> 582314 T1831 oascc.SolrZkClient.makePath makePath: /configs/conf1/protwords.txt
   [junit4]   2> 582322 T1831 oasc.AbstractZkTestCase.putConfig put /mnt/ssd/jenkins/workspace/Lucene-Solr-4.x-Linux/solr/build/solr-core/test-files/solr/collection1/conf/currency.xml to /configs/conf1/currency.xml
   [junit4]   2> 582323 T1831 oascc.SolrZkClient.makePath makePath: /configs/conf1/currency.xml
   [junit4]   2> 582330 T1831 oasc.AbstractZkTestCase.putConfig put /mnt/ssd/jenkins/workspace/Lucene-Solr-4.x-Linux/solr/build/solr-core/test-files/solr/collection1/conf/open-exchange-rates.json to /configs/conf1/open-exchange-rates.json
   [junit4]   2> 582331 T1831 oascc.SolrZkClient.makePath makePath: /configs/conf1/open-exchange-rates.json
   [junit4]   2> 582339 T1831 oasc.AbstractZkTestCase.putConfig put /mnt/ssd/jenkins/workspace/Lucene-Solr-4.x-Linux/solr/build/solr-core/test-files/solr/collection1/conf/mapping-ISOLatin1Accent.txt to /configs/conf1/mapping-ISOLatin1Accent.txt
   [junit4]   2> 582340 T1831 oascc.SolrZkClient.makePath makePath: /configs/conf1/mapping-ISOLatin1Accent.txt
   [junit4]   2> 582348 T1831 oasc.AbstractZkTestCase.putConfig put /mnt/ssd/jenkins/workspace/Lucene-Solr-4.x-Linux/solr/build/solr-core/test-files/solr/collection1/conf/old_synonyms.txt to /configs/conf1/old_synonyms.txt
   [junit4]   2> 582349 T1831 oascc.SolrZkClient.makePath makePath: /configs/conf1/old_synonyms.txt
   [junit4]   2> 582357 T1831 oasc.AbstractZkTestCase.putConfig put /mnt/ssd/jenkins/workspace/Lucene-Solr-4.x-Linux/solr/build/solr-core/test-files/solr/collection1/conf/synonyms.txt to /configs/conf1/synonyms.txt
   [junit4]   2> 582358 T1831 oascc.SolrZkClient.makePath makePath: /configs/conf1/synonyms.txt
   [junit4]   2> 582545 T1831 oejs.Server.doStart jetty-8.1.10.v20130312
   [junit4]   2> 582548 T1831 oejs.AbstractConnector.doStart Started SelectChannelConnector@127.0.0.1:51063
   [junit4]   2> 582549 T1831 oass.SolrDispatchFilter.init SolrDispatchFilter.init()
   [junit4]   2> 582550 T1831 oasc.SolrResourceLoader.locateSolrHome JNDI not configured for solr (NoInitialContextEx)
   [junit4]   2> 582551 T1831 oasc.SolrResourceLoader.locateSolrHome using system property solr.solr.home: /mnt/ssd/jenkins/workspace/Lucene-Solr-4.x-Linux/solr/build/solr-core/test/J1/./org.apache.solr.cloud.BasicDistributedZk2Test-controljetty-1374688312604
   [junit4]   2> 582552 T1831 oasc.SolrResourceLoader.<init> new SolrResourceLoader for directory: '/mnt/ssd/jenkins/workspace/Lucene-Solr-4.x-Linux/solr/build/solr-core/test/J1/./org.apache.solr.cloud.BasicDistributedZk2Test-controljetty-1374688312604/'
   [junit4]   2> 582572 T1831 oasc.ConfigSolr.fromFile Loading container configuration from /mnt/ssd/jenkins/workspace/Lucene-Solr-4.x-Linux/solr/build/solr-core/test/J1/./org.apache.solr.cloud.BasicDistributedZk2Test-controljetty-1374688312604/solr.xml
   [junit4]   2> 582609 T1831 oasc.CoreContainer.<init> New CoreContainer 1392792324
   [junit4]   2> 582610 T1831 oasc.CoreContainer.load Loading cores into CoreContainer [instanceDir=/mnt/ssd/jenkins/workspace/Lucene-Solr-4.x-Linux/solr/build/solr-core/test/J1/./org.apache.solr.cloud.BasicDistributedZk2Test-controljetty-1374688312604/]
   [junit4]   2> 582612 T1831 oashc.HttpShardHandlerFactory.getParameter Setting socketTimeout to: 120000
   [junit4]   2> 582612 T1831 oashc.HttpShardHandlerFactory.getParameter Setting urlScheme to: http://
   [junit4]   2> 582613 T1831 oashc.HttpShardHandlerFactory.getParameter Setting connTimeout to: 15000
   [junit4]   2> 582614 T1831 oashc.HttpShardHandlerFactory.getParameter Setting maxConnectionsPerHost to: 20
   [junit4]   2> 582615 T1831 oashc.HttpShardHandlerFactory.getParameter Setting corePoolSize to: 0
   [junit4]   2> 582615 T1831 oashc.HttpShardHandlerFactory.getParameter Setting maximumPoolSize to: 2147483647
   [junit4]   2> 582616 T1831 oashc.HttpShardHandlerFactory.getParameter Setting maxThreadIdleTime to: 5
   [junit4]   2> 582617 T1831 oashc.HttpShardHandlerFactory.getParameter Setting sizeOfQueue to: -1
   [junit4]   2> 582618 T1831 oashc.HttpShardHandlerFactory.getParameter Setting fairnessPolicy to: false
   [junit4]   2> 582619 T1831 oascsi.HttpClientUtil.createClient Creating new http client, config:maxConnectionsPerHost=20&maxConnections=10000&socketTimeout=120000&connTimeout=15000&retry=false
   [junit4]   2> 582626 T1831 oasc.ZkContainer.initZooKeeper Zookeeper client=127.0.0.1:48730/solr
   [junit4]   2> 582627 T1831 oasc.ZkController.checkChrootPath zkHost includes chroot
   [junit4]   2> 582628 T1831 oascc.ConnectionManager.waitForConnected Waiting for client to connect to ZooKeeper
   [junit4]   2> 582631 T1851 oascc.ConnectionManager.process Watcher org.apache.solr.common.cloud.ConnectionManager@20eb20eb name:ZooKeeperConnection Watcher:127.0.0.1:48730 got event WatchedEvent state:SyncConnected type:None path:null path:null type:None
   [junit4]   2> 582631 T1831 oascc.ConnectionManager.waitForConnected Client is connected to ZooKeeper
   [junit4]   2> 582636 T1831 oascsi.HttpClientUtil.createClient Creating new http client, config:maxConnections=500&maxConnectionsPerHost=16&socketTimeout=120000&connTimeout=15000
   [junit4]   2> 582643 T1831 oascc.ConnectionManager.waitForConnected Waiting for client to connect to ZooKeeper
   [junit4]   2> 582645 T1853 oascc.ConnectionManager.process Watcher org.apache.solr.common.cloud.ConnectionManager@60b160b1 name:ZooKeeperConnection Watcher:127.0.0.1:48730/solr got event WatchedEvent state:SyncConnected type:None path:null path:null type:None
   [junit4]   2> 582646 T1831 oascc.ConnectionManager.waitForConnected Client is connected to ZooKeeper
   [junit4]   2> 582650 T1831 oascc.SolrZkClient.makePath makePath: /overseer/queue
   [junit4]   2> 582672 T1831 oascc.SolrZkClient.makePath makePath: /overseer/collection-queue-work
   [junit4]   2> 582683 T1831 oascc.SolrZkClient.makePath makePath: /live_nodes
   [junit4]   2> 582689 T1831 oasc.ZkController.createEphemeralLiveNode Register node as live in ZooKeeper:/live_nodes/127.0.0.1:51063_
   [junit4]   2> 582691 T1831 oascc.SolrZkClient.makePath makePath: /live_nodes/127.0.0.1:51063_
   [junit4]   2> 582704 T1831 oascc.SolrZkClient.makePath makePath: /overseer_elect/election
   [junit4]   2> 582718 T1831 oascc.SolrZkClient.makePath makePath: /overseer_elect/leader
   [junit4]   2> 582726 T1831 oasc.Overseer.start Overseer (id=90091573234630659-127.0.0.1:51063_-n_0000000000) starting
   [junit4]   2> 582736 T1831 oascc.SolrZkClient.makePath makePath: /overseer/queue-work
   [junit4]   2> 582759 T1855 oasc.OverseerCollectionProcessor.run Process current queue of collection creations
   [junit4]   2> 582763 T1831 oascc.SolrZkClient.makePath makePath: /clusterstate.json
   [junit4]   2> 582771 T1831 oascc.SolrZkClient.makePath makePath: /aliases.json
   [junit4]   2> 582778 T1831 oascc.ZkStateReader.createClusterStateWatchersAndUpdate Updating cluster state from ZooKeeper... 
   [junit4]   2> 582789 T1854 oasc.Overseer$ClusterStateUpdater.run Starting to work on the main queue
   [junit4]   2> 582800 T1856 oasc.ZkController.publish publishing core=collection1 state=down
   [junit4]   2> 582800 T1856 oasc.ZkController.publish numShards not found on descriptor - reading it from system property
   [junit4]   2> 582803 T1856 oasc.ZkController.waitForCoreNodeName look for our core node name
   [junit4]   2> 584303 T1854 oascc.ZkStateReader.updateClusterState Updating cloud state from ZooKeeper... 
   [junit4]   2> 584307 T1854 oasc.Overseer$ClusterStateUpdater.updateState Update state numShards=1 message={
   [junit4]   2> 	  "shard_state":"active",
   [junit4]   2> 	  "base_url":"http://127.0.0.1:51063",
   [junit4]   2> 	  "state":"down",
   [junit4]   2> 	  "operation":"state",
   [junit4]   2> 	  "core_node_name":"core_node1",
   [junit4]   2> 	  "node_name":"127.0.0.1:51063_",
   [junit4]   2> 	  "numShards":"1",
   [junit4]   2> 	  "shard_range":null,
   [junit4]   2> 	  "roles":null,
   [junit4]   2> 	  "collection":"control_collection",
   [junit4]   2> 	  "shard":null,
   [junit4]   2> 	  "core":"collection1"}
   [junit4]   2> 584308 T1854 oasc.Overseer$ClusterStateUpdater.createCollection Create collection control_collection with numShards 1
   [junit4]   2> 584308 T1854 oasc.Overseer$ClusterStateUpdater.updateState Assigning new node to shard shard=shard1
   [junit4]   2> 584319 T1853 oascc.ZkStateReader$2.process A cluster state change: WatchedEvent state:SyncConnected type:NodeDataChanged path:/clusterstate.json, has occurred - updating... (live nodes size: 1)
   [junit4]   2> 584804 T1856 oasc.ZkController.waitForShardId waiting to find shard id in clusterstate for collection1
   [junit4]   2> 584804 T1856 oasc.CoreContainer.create Creating SolrCore 'collection1' using instanceDir: /mnt/ssd/jenkins/workspace/Lucene-Solr-4.x-Linux/solr/build/solr-core/test/J1/./org.apache.solr.cloud.BasicDistributedZk2Test-controljetty-1374688312604/collection1
   [junit4]   2> 584805 T1856 oasc.ZkController.createCollectionZkNode Check for collection zkNode:control_collection
   [junit4]   2> 584807 T1856 oasc.ZkController.createCollectionZkNode Collection zkNode exists
   [junit4]   2> 584808 T1856 oasc.ZkController.readConfigName Load collection config from:/collections/control_collection
   [junit4]   2> 584811 T1856 oasc.SolrResourceLoader.<init> new SolrResourceLoader for directory: '/mnt/ssd/jenkins/workspace/Lucene-Solr-4.x-Linux/solr/build/solr-core/test/J1/./org.apache.solr.cloud.BasicDistributedZk2Test-controljetty-1374688312604/collection1/'
   [junit4]   2> 584812 T1856 oasc.SolrResourceLoader.replaceClassLoader Adding 'file:/mnt/ssd/jenkins/workspace/Lucene-Solr-4.x-Linux/solr/build/solr-core/test/J1/org.apache.solr.cloud.BasicDistributedZk2Test-controljetty-1374688312604/collection1/lib/README' to classloader
   [junit4]   2> 584813 T1856 oasc.SolrResourceLoader.replaceClassLoader Adding 'file:/mnt/ssd/jenkins/workspace/Lucene-Solr-4.x-Linux/solr/build/solr-core/test/J1/org.apache.solr.cloud.BasicDistributedZk2Test-controljetty-1374688312604/collection1/lib/classes/' to classloader
   [junit4]   2> 584847 T1856 oasc.SolrConfig.<init> Using Lucene MatchVersion: LUCENE_45
   [junit4]   2> 584902 T1856 oasc.SolrConfig.<init> Loaded SolrConfig: solrconfig.xml
   [junit4]   2> 584906 T1856 oass.IndexSchema.readSchema Reading Solr Schema from schema.xml
   [junit4]   2> 584917 T1856 oass.IndexSchema.readSchema [collection1] Schema name=test
   [junit4]   2> 585339 T1856 oass.ByteField.init WARN ByteField is deprecated and will be removed in 5.0. You should use TrieIntField instead.
   [junit4]   2> 585340 T1856 oass.ShortField.init WARN ShortField is deprecated and will be removed in 5.0. You should use TrieIntField instead.
   [junit4]   2> 585341 T1856 oass.OpenExchangeRatesOrgProvider.init Initialized with rates=open-exchange-rates.json, refreshInterval=1440.
   [junit4]   2> 585347 T1856 oass.IndexSchema.readSchema default search field in schema is text
   [junit4]   2> 585350 T1856 oass.IndexSchema.readSchema unique key field: id
   [junit4]   2> 585388 T1856 oass.FileExchangeRateProvider.reload Reloading exchange rates from file currency.xml
   [junit4]   2> 585395 T1856 oass.FileExchangeRateProvider.reload Reloading exchange rates from file currency.xml
   [junit4]   2> 585402 T1856 oass.OpenExchangeRatesOrgProvider.reload Reloading exchange rates from open-exchange-rates.json
   [junit4]   2> 585406 T1856 oass.OpenExchangeRatesOrgProvider$OpenExchangeRates.<init> WARN Unknown key IMPORTANT NOTE
   [junit4]   2> 585406 T1856 oass.OpenExchangeRatesOrgProvider$OpenExchangeRates.<init> WARN Expected key, got STRING
   [junit4]   2> 585407 T1856 oass.OpenExchangeRatesOrgProvider.reload Reloading exchange rates from open-exchange-rates.json
   [junit4]   2> 585422 T1856 oass.OpenExchangeRatesOrgProvider$OpenExchangeRates.<init> WARN Unknown key IMPORTANT NOTE
   [junit4]   2> 585422 T1856 oass.OpenExchangeRatesOrgProvider$OpenExchangeRates.<init> WARN Expected key, got STRING
   [junit4]   2> 585423 T1856 oasc.SolrCore.initDirectoryFactory org.apache.solr.core.MockDirectoryFactory
   [junit4]   2> 585423 T1856 oasc.SolrCore.<init> [collection1] Opening new SolrCore at /mnt/ssd/jenkins/workspace/Lucene-Solr-4.x-Linux/solr/build/solr-core/test/J1/./org.apache.solr.cloud.BasicDistributedZk2Test-controljetty-1374688312604/collection1/, dataDir=./org.apache.solr.cloud.BasicDistributedZk2Test-1374688312291/control/data/
   [junit4]   2> 585424 T1856 oasc.JmxMonitoredMap.<init> JMX monitoring is enabled. Adding Solr mbeans to JMX Server: com.sun.jmx.mbeanserver.JmxMBeanServer@53665366
   [junit4]   2> 585425 T1856 oasc.CachingDirectoryFactory.get return new directory for ./org.apache.solr.cloud.BasicDistributedZk2Test-1374688312291/control/data
   [junit4]   2> 585426 T1856 oasc.SolrCore.getNewIndexDir New index directory detected: old=null new=./org.apache.solr.cloud.BasicDistributedZk2Test-1374688312291/control/data/index/
   [junit4]   2> 585426 T1856 oasc.SolrCore.initIndex WARN [collection1] Solr index directory './org.apache.solr.cloud.BasicDistributedZk2Test-1374688312291/control/data/index' doesn't exist. Creating new index...
   [junit4]   2> 585427 T1856 oasc.CachingDirectoryFactory.get return new directory for ./org.apache.solr.cloud.BasicDistributedZk2Test-1374688312291/control/data/index
   [junit4]   2> 585429 T1856 oasc.SolrDeletionPolicy.onCommit SolrDeletionPolicy.onCommit: commits: num=1
   [junit4]   2> 		commit{dir=MockDirWrapper(org.apache.lucene.store.RAMDirectory@5cde5cde lockFactory=org.apache.lucene.store.NativeFSLockFactory@75037503),segFN=segments_1,generation=1}
   [junit4]   2> 585430 T1856 oasc.SolrDeletionPolicy.updateCommits newest commit generation = 1
   [junit4]   2> 585436 T1856 oasup.UpdateRequestProcessorChain.init inserting DistributedUpdateProcessorFactory into updateRequestProcessorChain "dedupe"
   [junit4]   2> 585436 T1856 oasup.UpdateRequestProcessorChain.init inserting DistributedUpdateProcessorFactory into updateRequestProcessorChain "stored_sig"
   [junit4]   2> 585437 T1856 oasup.UpdateRequestProcessorChain.init inserting DistributedUpdateProcessorFactory into updateRequestProcessorChain "distrib-dup-test-chain-implicit"
   [junit4]   2> 585438 T1856 oasc.RequestHandlers.initHandlersFromConfig created standard: solr.StandardRequestHandler
   [junit4]   2> 585439 T1856 oasc.RequestHandlers.initHandlersFromConfig created /get: solr.RealTimeGetHandler
   [junit4]   2> 585439 T1856 oasc.RequestHandlers.initHandlersFromConfig adding lazy requestHandler: solr.ReplicationHandler
   [junit4]   2> 585440 T1856 oasc.RequestHandlers.initHandlersFromConfig created /replication: solr.ReplicationHandler
   [junit4]   2> 585441 T1856 oasc.RequestHandlers.initHandlersFromConfig created /update: solr.UpdateRequestHandler
   [junit4]   2> 585442 T1856 oasc.RequestHandlers.initHandlersFromConfig created /admin/: org.apache.solr.handler.admin.AdminHandlers
   [junit4]   2> 585443 T1856 oashl.XMLLoader.init xsltCacheLifetimeSeconds=60
   [junit4]   2> 585445 T1856 oass.SolrIndexSearcher.<init> Opening Searcher@4a344a34 main
   [junit4]   2> 585446 T1856 oasu.CommitTracker.<init> Hard AutoCommit: disabled
   [junit4]   2> 585447 T1856 oasu.CommitTracker.<init> Soft AutoCommit: disabled
   [junit4]   2> 585457 T1857 oasc.SolrCore.registerSearcher [collection1] Registered new searcher Searcher@4a344a34 main{StandardDirectoryReader(segments_1:1)}
   [junit4]   2> 585461 T1856 oasc.CoreContainer.registerCore registering core: collection1
   [junit4]   2> 585462 T1856 oasc.ZkController.register Register replica - core:collection1 address:http://127.0.0.1:51063 collection:control_collection shard:shard1
   [junit4]   2> 585463 T1856 oascsi.HttpClientUtil.createClient Creating new http client, config:maxConnections=10000&maxConnectionsPerHost=20&connTimeout=30000&socketTimeout=30000&retry=false
   [junit4]   2> 585472 T1856 oascc.SolrZkClient.makePath makePath: /collections/control_collection/leader_elect/shard1/election
   [junit4]   2> 585501 T1856 oasc.ShardLeaderElectionContext.runLeaderProcess Running the leader process for shard shard1
   [junit4]   2> 585520 T1856 oasc.ShardLeaderElectionContext.waitForReplicasToComeUp Enough replicas found to continue.
   [junit4]   2> 585521 T1856 oasc.ShardLeaderElectionContext.runLeaderProcess I may be the new leader - try and sync
   [junit4]   2> 585521 T1856 oasc.SyncStrategy.sync Sync replicas to http://127.0.0.1:51063/collection1/
   [junit4]   2> 585522 T1856 oasc.SyncStrategy.syncReplicas Sync Success - now sync replicas to me
   [junit4]   2> 585523 T1856 oasc.SyncStrategy.syncToMe http://127.0.0.1:51063/collection1/ has no replicas
   [junit4]   2> 585523 T1856 oasc.ShardLeaderElectionContext.runLeaderProcess I am the new leader: http://127.0.0.1:51063/collection1/ shard1
   [junit4]   2> 585524 T1856 oascc.SolrZkClient.makePath makePath: /collections/control_collection/leaders/shard1
   [junit4]   2> 585884 T1854 oascc.ZkStateReader.updateClusterState Updating cloud state from ZooKeeper... 
   [junit4]   2> 585907 T1853 oascc.ZkStateReader$2.process A cluster state change: WatchedEvent state:SyncConnected type:NodeDataChanged path:/clusterstate.json, has occurred - updating... (live nodes size: 1)
   [junit4]   2> 586001 T1856 oasc.ZkController.register We are http://127.0.0.1:51063/collection1/ and leader is http://127.0.0.1:51063/collection1/
   [junit4]   2> 586002 T1856 oasc.ZkController.register No LogReplay needed for core=collection1 baseURL=http://127.0.0.1:51063
   [junit4]   2> 586002 T1856 oasc.ZkController.checkRecovery I am the leader, no recovery necessary
   [junit4]   2> 586003 T1856 oasc.ZkController.publish publishing core=collection1 state=active
   [junit4]   2> 586003 T1856 oasc.ZkController.publish numShards not found on descriptor - reading it from system property
   [junit4]   2> 586008 T1856 oascc.ZkStateReader.updateClusterState Updating cloud state from ZooKeeper... 
   [junit4]   2> 586010 T1831 oass.SolrDispatchFilter.init user.dir=/mnt/ssd/jenkins/workspace/Lucene-Solr-4.x-Linux/solr/build/solr-core/test/J1
   [junit4]   2> 586011 T1831 oass.SolrDispatchFilter.init SolrDispatchFilter.init() done
   [junit4]   2> 586012 T1831 oascsi.HttpClientUtil.createClient Creating new http client, config:maxConnections=128&maxConnectionsPerHost=32&followRedirects=false
   [junit4]   2> 586018 T1831 oascsi.HttpClientUtil.createClient Creating new http client, config:
   [junit4]   2> 586019 T1831 oascc.ConnectionManager.waitForConnected Waiting for client to connect to ZooKeeper
   [junit4]   2> 586021 T1860 oascc.ConnectionManager.process Watcher org.apache.solr.common.cloud.ConnectionManager@2e542e54 name:ZooKeeperConnection Watcher:127.0.0.1:48730/solr got event WatchedEvent state:SyncConnected type:None path:null path:null type:None
   [junit4]   2> 586022 T1831 oascc.ConnectionManager.waitForConnected Client is connected to ZooKeeper
   [junit4]   2> 586025 T1831 oascc.ZkStateReader.createClusterStateWatchersAndUpdate Updating cluster state from ZooKeeper... 
   [junit4]   2> 586033 T1831 oasc.ChaosMonkey.monkeyLog monkey: init - expire sessions:true cause connection loss:true
   [junit4]   2> 586215 T1831 oejs.Server.doStart jetty-8.1.10.v20130312
   [junit4]   2> 586217 T1831 oejs.AbstractConnector.doStart Started SelectChannelConnector@127.0.0.1:46223
   [junit4]   2> 586218 T1831 oass.SolrDispatchFilter.init SolrDispatchFilter.init()
   [junit4]   2> 586219 T1831 oasc.SolrResourceLoader.locateSolrHome JNDI not configured for solr (NoInitialContextEx)
   [junit4]   2> 586220 T1831 oasc.SolrResourceLoader.locateSolrHome using system property solr.solr.home: /mnt/ssd/jenkins/workspace/Lucene-Solr-4.x-Linux/solr/build/solr-core/test/J1/./org.apache.solr.cloud.BasicDistributedZk2Test-jetty1-1374688316263
   [junit4]   2> 586220 T1831 oasc.SolrResourceLoader.<init> new SolrResourceLoader for directory: '/mnt/ssd/jenkins/workspace/Lucene-Solr-4.x-Linux/solr/build/solr-core/test/J1/./org.apache.solr.cloud.BasicDistributedZk2Test-jetty1-1374688316263/'
   [junit4]   2> 586242 T1831 oasc.ConfigSolr.fromFile Loading container configuration from /mnt/ssd/jenkins/workspace/Lucene-Solr-4.x-Linux/solr/build/solr-core/test/J1/./org.apache.solr.cloud.BasicDistributedZk2Test-jetty1-1374688316263/solr.xml
   [junit4]   2> 586280 T1831 oasc.CoreContainer.<init> New CoreContainer 1782671937
   [junit4]   2> 586281 T1831 oasc.CoreContainer.load Loading cores into CoreContainer [instanceDir=/mnt/ssd/jenkins/workspace/Lucene-Solr-4.x-Linux/solr/build/solr-core/test/J1/./org.apache.solr.cloud.BasicDistributedZk2Test-jetty1-1374688316263/]
   [junit4]   2> 586283 T1831 oashc.HttpShardHandlerFactory.getParameter Setting socketTimeout to: 120000
   [junit4]   2> 586284 T1831 oashc.HttpShardHandlerFactory.getParameter Setting urlScheme to: http://
   [junit4]   2> 586284 T1831 oashc.HttpShardHandlerFactory.getParameter Setting connTimeout to: 15000
   [junit4]   2> 586285 T1831 oashc.HttpShardHandlerFactory.getParameter Setting maxConnectionsPerHost to: 20
   [junit4]   2> 586286 T1831 oashc.HttpShardHandlerFactory.getParameter Setting corePoolSize to: 0
   [junit4]   2> 586287 T1831 oashc.HttpShardHandlerFactory.getParameter Setting maximumPoolSize to: 2147483647
   [junit4]   2> 586287 T1831 oashc.HttpShardHandlerFactory.getParameter Setting maxThreadIdleTime to: 5
   [junit4]   2> 586288 T1831 oashc.HttpShardHandlerFactory.getParameter Setting sizeOfQueue to: -1
   [junit4]   2> 586289 T1831 oashc.HttpShardHandlerFactory.getParameter Setting fairnessPolicy to: false
   [junit4]   2> 586290 T1831 oascsi.HttpClientUtil.createClient Creating new http client, config:maxConnectionsPerHost=20&maxConnections=10000&socketTimeout=120000&connTimeout=15000&retry=false
   [junit4]   2> 586297 T1831 oasc.ZkContainer.initZooKeeper Zookeeper client=127.0.0.1:48730/solr
   [junit4]   2> 586298 T1831 oasc.ZkController.checkChrootPath zkHost includes chroot
   [junit4]   2> 586299 T1831 oascc.ConnectionManager.waitForConnected Waiting for client to connect to ZooKeeper
   [junit4]   2> 586301 T1871 oascc.ConnectionManager.process Watcher org.apache.solr.common.cloud.ConnectionManager@7bce7bce name:ZooKeeperConnection Watcher:127.0.0.1:48730 got event WatchedEvent state:SyncConnected type:None path:null path:null type:None
   [junit4]   2> 586302 T1831 oascc.ConnectionManager.waitForConnected Client is connected to ZooKeeper
   [junit4]   2> 586306 T1831 oascsi.HttpClientUtil.createClient Creating new http client, config:maxConnections=500&maxConnectionsPerHost=16&socketTimeout=120000&connTimeout=15000
   [junit4]   2> 586321 T1831 oascc.ConnectionManager.waitForConnected Waiting for client to connect to ZooKeeper
   [junit4]   2> 586324 T1873 oascc.ConnectionManager.process Watcher org.apache.solr.common.cloud.ConnectionManager@17761776 name:ZooKeeperConnection Watcher:127.0.0.1:48730/solr got event WatchedEvent state:SyncConnected type:None path:null path:null type:None
   [junit4]   2> 586324 T1831 oascc.ConnectionManager.waitForConnected Client is connected to ZooKeeper
   [junit4]   2> 586336 T1831 oascc.ZkStateReader.createClusterStateWatchersAndUpdate Updating cluster state from ZooKeeper... 
   [junit4]   2> 587347 T1831 oasc.ZkController.createEphemeralLiveNode Register node as live in ZooKeeper:/live_nodes/127.0.0.1:46223_
   [junit4]   2> 587350 T1831 oascc.SolrZkClient.makePath makePath: /live_nodes/127.0.0.1:46223_
   [junit4]   2> 587358 T1860 oascc.ZkStateReader$3.process Updating live nodes... (2)
   [junit4]   2> 587359 T1873 oascc.ZkStateReader$3.process Updating live nodes... (2)
   [junit4]   2> 587360 T1853 oascc.ZkStateReader$3.process Updating live nodes... (2)
   [junit4]   2> 587361 T1853 oascc.ZkStateReader$2.process A cluster state change: WatchedEvent state:SyncConnected type:NodeChildrenChanged path:/live_nodes, has occurred - updating... (live nodes size: 2)
   [junit4]   2> 587436 T1874 oasc.ZkController.publish publishing core=collection1 state=down
   [junit4]   2> 587437 T1874 oasc.ZkController.publish numShards not found on descriptor - reading it from system property
   [junit4]   2> 587439 T1874 oasc.ZkController.waitForCoreNodeName look for our core node name
   [junit4]   2> 587459 T1854 oascc.ZkStateReader.updateClusterState Updating cloud state from ZooKeeper... 
   [junit4]   2> 587463 T1854 oasc.Overseer$ClusterStateUpdater.updateState Update state numShards=1 message={
   [junit4]   2> 	  "shard_state":"active",
   [junit4]   2> 	  "base_url":"http://127.0.0.1:51063",
   [junit4]   2> 	  "state":"active",
   [junit4]   2> 	  "operation":"state",
   [junit4]   2> 	  "core_node_name":"core_node1",
   [junit4]   2> 	  "node_name":"127.0.0.1:51063_",
   [junit4]   2> 	  "numShards":"1",
   [junit4]   2> 	  "shard_range":null,
   [junit4]   2> 	  "roles":null,
   [junit4]   2> 	  "collection":"control_collection",
   [junit4]   2> 	  "shard":"shard1",
   [junit4]   2> 	  "core":"collection1"}
   [junit4]   2> 587476 T1854 oasc.Overseer$ClusterStateUpdater.updateState Update state numShards=2 message={
   [junit4]   2> 	  "shard_state":"active",
   [junit4]   2> 	  "base_url":"http://127.0.0.1:46223",
   [junit4]   2> 	  "state":"down",
   [junit4]   2> 	  "operation":"state",
   [junit4]   2> 	  "core_node_name":"core_node1",
   [junit4]   2> 	  "node_name":"127.0.0.1:46223_",
   [junit4]   2> 	  "numShards":"2",
   [junit4]   2> 	  "shard_range":null,
   [junit4]   2> 	  "roles":null,
   [junit4]   2> 	  "collection":"collection1",
   [junit4]   2> 	  "shard":null,
   [junit4]   2> 	  "core":"collection1"}
   [junit4]   2> 587476 T1854 oasc.Overseer$ClusterStateUpdater.createCollection Create collection collection1 with numShards 2
   [junit4]   2> 587477 T1854 oasc.Overseer$ClusterStateUpdater.updateState Assigning new node to shard shard=shard1
   [junit4]   2> 587488 T1860 oascc.ZkStateReader$2.process A cluster state change: WatchedEvent state:SyncConnected type:NodeDataChanged path:/clusterstate.json, has occurred - updating... (live nodes size: 2)
   [junit4]   2> 587489 T1853 oascc.ZkStateReader$2.process A cluster state change: WatchedEvent state:SyncConnected type:NodeDataChanged path:/clusterstate.json, has occurred - updating... (live nodes size: 2)
   [junit4]   2> 587489 T1873 oascc.ZkStateReader$2.process A cluster state change: WatchedEvent state:SyncConnected type:NodeDataChanged path:/clusterstate.json, has occurred - updating... (live nodes size: 2)
   [junit4]   2> 588440 T1874 oasc.ZkController.waitForShardId waiting to find shard id in clusterstate for collection1
   [junit4]   2> 588441 T1874 oasc.CoreContainer.create Creating SolrCore 'collection1' using instanceDir: /mnt/ssd/jenkins/workspace/Lucene-Solr-4.x-Linux/solr/build/solr-core/test/J1/./org.apache.solr.cloud.BasicDistributedZk2Test-jetty1-1374688316263/collection1
   [junit4]   2> 588441 T1874 oasc.ZkController.createCollectionZkNode Check for collection zkNode:collection1
   [junit4]   2> 588444 T1874 oasc.ZkController.createCollectionZkNode Collection zkNode exists
   [junit4]   2> 588444 T1874 oasc.ZkController.readConfigName Load collection config from:/collections/collection1
   [junit4]   2> 588448 T1874 oasc.SolrResourceLoader.<init> new SolrResourceLoader for directory: '/mnt/ssd/jenkins/workspace/Lucene-Solr-4.x-Linux/solr/build/solr-core/test/J1/./org.apache.solr.cloud.BasicDistributedZk2Test-jetty1-1374688316263/collection1/'
   [junit4]   2> 588450 T1874 oasc.SolrResourceLoader.replaceClassLoader Adding 'file:/mnt/ssd/jenkins/workspace/Lucene-Solr-4.x-Linux/solr/build/solr-core/test/J1/org.apache.solr.cloud.BasicDistributedZk2Test-jetty1-1374688316263/collection1/lib/README' to classloader
   [junit4]   2> 588451 T1874 oasc.SolrResourceLoader.replaceClassLoader Adding 'file:/mnt/ssd/jenkins/workspace/Lucene-Solr-4.x-Linux/solr/build/solr-core/test/J1/org.apache.solr.cloud.BasicDistributedZk2Test-jetty1-1374688316263/collection1/lib/classes/' to classloader
   [junit4]   2> 588492 T1874 oasc.SolrConfig.<init> Using Lucene MatchVersion: LUCENE_45
   [junit4]   2> 588539 T1874 oasc.SolrConfig.<init> Loaded SolrConfig: solrconfig.xml
   [junit4]   2> 588545 T1874 oass.IndexSchema.readSchema Reading Solr Schema from schema.xml
   [junit4]   2> 588552 T1874 oass.IndexSchema.readSchema [collection1] Schema name=test
   [junit4]   2> 589040 T1874 oass.ByteField.init WARN ByteField is deprecated and will be removed in 5.0. You should use TrieIntField instead.
   [junit4]   2> 589041 T1874 oass.ShortField.init WARN ShortField is deprecated and will be removed in 5.0. You should use TrieIntField instead.
   [junit4]   2> 589041 T1874 oass.OpenExchangeRatesOrgProvider.init Initialized with rates=open-exchange-rates.json, refreshInterval=1440.
   [junit4]   2> 589047 T1874 oass.IndexSchema.readSchema default search field in schema is text
   [junit4]   2> 589050 T1874 oass.IndexSchema.readSchema unique key field: id
   [junit4]   2> 589101 T1874 oass.FileExchangeRateProvider.reload Reloading exchange rates from file currency.xml
   [junit4]   2> 589109 T1874 oass.FileExchangeRateProvider.reload Reloading exchange rates from file currency.xml
   [junit4]   2> 589128 T1874 oass.OpenExchangeRatesOrgProvider.reload Reloading exchange rates from open-exchange-rates.json
   [junit4]   2> 589133 T1874 oass.OpenExchangeRatesOrgProvider$OpenExchangeRates.<init> WARN Unknown key IMPORTANT NOTE
   [junit4]   2> 589134 T1874 oass.OpenExchangeRatesOrgProvider$OpenExchangeRates.<init> WARN Expected key, got STRING
   [junit4]   2> 589135 T1874 oass.OpenExchangeRatesOrgProvider.reload Reloading exchange rates from open-exchange-rates.json
   [junit4]   2> 589140 T1874 oass.OpenExchangeRatesOrgProvider$OpenExchangeRates.<init> WARN Unknown key IMPORTANT NOTE
   [junit4]   2> 589141 T1874 oass.OpenExchangeRatesOrgProvider$OpenExchangeRates.<init> WARN Expected key, got STRING
   [junit4]   2> 589142 T1874 oasc.SolrCore.initDirectoryFactory org.apache.solr.core.MockDirectoryFactory
   [junit4]   2> 589143 T1874 oasc.SolrCore.<init> [collection1] Opening new SolrCore at /mnt/ssd/jenkins/workspace/Lucene-Solr-4.x-Linux/solr/build/solr-core/test/J1/./org.apache.solr.cloud.BasicDistributedZk2Test-jetty1-1374688316263/collection1/, dataDir=./org.apache.solr.cloud.BasicDistributedZk2Test-1374688312291/jetty1/
   [junit4]   2> 589144 T1874 oasc.JmxMonitoredMap.<init> JMX monitoring is enabled. Adding Solr mbeans to JMX Server: com.sun.jmx.mbeanserver.JmxMBeanServer@53665366
   [junit4]   2> 589146 T1874 oasc.CachingDirectoryFactory.get return new directory for ./org.apache.solr.cloud.BasicDistributedZk2Test-1374688312291/jetty1
   [junit4]   2> 589146 T1874 oasc.SolrCore.getNewIndexDir New index directory detected: old=null new=./org.apache.solr.cloud.BasicDistributedZk2Test-1374688312291/jetty1/index/
   [junit4]   2> 589147 T1874 oasc.SolrCore.initIndex WARN [collection1] Solr index directory './org.apache.solr.cloud.BasicDistributedZk2Test-1374688312291/jetty1/index' doesn't exist. Creating new index...
   [junit4]   2> 589148 T1874 oasc.CachingDirectoryFactory.get return new directory for ./org.apache.solr.cloud.BasicDistributedZk2Test-1374688312291/jetty1/index
   [junit4]   2> 589150 T1874 oasc.SolrDeletionPolicy.onCommit SolrDeletionPolicy.onCommit: commits: num=1
   [junit4]   2> 		commit{dir=MockDirWrapper(org.apache.lucene.store.RAMDirectory@57c057c lockFactory=org.apache.lucene.store.NativeFSLockFactory@9510951),segFN=segments_1,generation=1}
   [junit4]   2> 589150 T1874 oasc.SolrDeletionPolicy.updateCommits newest commit generation = 1
   [junit4]   2> 589158 T1874 oasup.UpdateRequestProcessorChain.init inserting DistributedUpdateProcessorFactory into updateRequestProcessorChain "dedupe"
   [junit4]   2> 589158 T1874 oasup.UpdateRequestProcessorChain.init inserting DistributedUpdateProcessorFactory into updateRequestProcessorChain "stored_sig"
   [junit4]   2> 589159 T1874 oasup.UpdateRequestProcessorChain.init inserting DistributedUpdateProcessorFactory into updateRequestProcessorChain "distrib-dup-test-chain-implicit"
   [junit4]   2> 589160 T1874 oasc.RequestHandlers.initHandlersFromConfig created standard: solr.StandardRequestHandler
   [junit4]   2> 589161 T1874 oasc.RequestHandlers.initHandlersFromConfig created /get: solr.RealTimeGetHandler
   [junit4]   2> 589162 T1874 oasc.RequestHandlers.initHandlersFromConfig adding lazy requestHandler: solr.ReplicationHandler
   [junit4]   2> 589162 T1874 oasc.RequestHandlers.initHandlersFromConfig created /replication: solr.ReplicationHandler
   [junit4]   2> 589163 T1874 oasc.RequestHandlers.initHandlersFromConfig created /update: solr.UpdateRequestHandler
   [junit4]   2> 589164 T1874 oasc.RequestHandlers.initHandlersFromConfig created /admin/: org.apache.solr.handler.admin.AdminHandlers
   [junit4]   2> 589166 T1874 oashl.XMLLoader.init xsltCacheLifetimeSeconds=60
   [junit4]   2> 589168 T1874 oass.SolrIndexSearcher.<init> Opening Searcher@6d1b6d1b main
   [junit4]   2> 589169 T1874 oasu.CommitTracker.<init> Hard AutoCommit: disabled
   [junit4]   2> 589170 T1874 oasu.CommitTracker.<init> Soft AutoCommit: disabled
   [junit4]   2> 589180 T1875 oasc.SolrCore.registerSearcher [collection1] Registered new searcher Searcher@6d1b6d1b main{StandardDirectoryReader(segments_1:1)}
   [junit4]   2> 589184 T1874 oasc.CoreContainer.registerCore registering core: collection1
   [junit4]   2> 589184 T1874 oasc.ZkController.register Register replica - core:collection1 address:http://127.0.0.1:46223 collection:collection1 shard:shard1
   [junit4]   2> 589185 T1874 oascsi.HttpClientUtil.createClient Creating new http client, config:maxConnections=10000&maxConnectionsPerHost=20&connTimeout=30000&socketTimeout=30000&retry=false
   [junit4]   2> 589193 T1874 oascc.SolrZkClient.makePath makePath: /collections/collection1/leader_elect/shard1/election
   [junit4]   2> 589234 T1874 oasc.ShardLeaderElectionContext.runLeaderProcess Running the leader process for shard shard1
   [junit4]   2> 589242 T1874 oasc.ShardLeaderElectionContext.waitForReplicasToComeUp Enough replicas found to continue.
   [junit4]   2> 589242 T1874 oasc.ShardLeaderElectionContext.runLeaderProcess I may be the new leader - try and sync
   [junit4]   2> 589243 T1874 oasc.SyncStrategy.sync Sync replicas to http://127.0.0.1:46223/collection1/
   [junit4]   2> 589243 T1874 oasc.SyncStrategy.syncReplicas Sync Success - now sync replicas to me
   [junit4]   2> 589244 T1874 oasc.SyncStrategy.syncToMe http://127.0.0.1:46223/collection1/ has no replicas
   [junit4]   2> 589244 T1874 oasc.ShardLeaderElectionContext.runLeaderProcess I am the new leader: http://127.0.0.1:46223/collection1/ shard1
   [junit4]   2> 589245 T1874 oascc.SolrZkClient.makePath makePath: /collections/collection1/leaders/shard1
   [junit4]   2> 590549 T1854 oascc.ZkStateReader.updateClusterState Updating cloud state from ZooKeeper... 
   [junit4]   2> 590611 T1860 oascc.ZkStateReader$2.process A cluster state change: WatchedEvent state:SyncConnected type:NodeDataChanged path:/clusterstate.json, has occurred - updating... (live nodes size: 2)
   [junit4]   2> 590611 T1873 oascc.ZkStateReader$2.process A cluster state change: WatchedEvent state:SyncConnected type:NodeDataChanged path:/clusterstate.json, has occurred - updating... (live nodes size: 2)
   [junit4]   2> 590612 T1853 oascc.ZkStateReader$2.process A cluster state change: WatchedEvent state:SyncConnected type:NodeDataChanged path:/clusterstate.json, has occurred - updating... (live nodes size: 2)
   [junit4]   2> 590669 T1874 oasc.ZkController.register We are http://127.0.0.1:46223/collection1/ and leader is http://127.0.0.1:46223/collection1/
   [junit4]   2> 590669 T1874 oasc.ZkController.register No LogReplay needed for core=collection1 baseURL=http://127.0.0.1:46223
   [junit4]   2> 590670 T1874 oasc.ZkController.checkRecovery I am the leader, no recovery necessary
   [junit4]   2> 590670 T1874 oasc.ZkController.publish publishing core=collection1 state=active
   [junit4]   2> 590671 T1874 oasc.ZkController.publish numShards not found on descriptor - reading it from system property
   [junit4]   2> 590677 T1874 oascc.ZkStateReader.updateClusterState Updating cloud state from ZooKeeper... 
   [junit4]   2> 590681 T1831 oass.SolrDispatchFilter.init user.dir=/mnt/ssd/jenkins/workspace/Lucene-Solr-4.x-Linux/solr/build/solr-core/test/J1
   [junit4]   2> 590681 T1831 oass.SolrDispatchFilter.init SolrDispatchFilter.init() done
   [junit4]   2> 590683 T1831 oascsi.HttpClientUtil.createClient Creating new http client, config:maxConnections=128&maxConnectionsPerHost=32&followRedirects=false
   [junit4]   2> 590882 T1831 oejs.Server.doStart jetty-8.1.10.v20130312
   [junit4]   2> 590884 T1831 oejs.AbstractConnector.doStart Started SelectChannelConnector@127.0.0.1:58849
   [junit4]   2> 590885 T1831 oass.SolrDispatchFilter.init SolrDispatchFilter.init()
   [junit4]   2> 590886 T1831 oasc.SolrResourceLoader.locateSolrHome JNDI not configured for solr (NoInitialContextEx)
   [junit4]   2> 590887 T1831 oasc.SolrResourceLoader.locateSolrHome using system property solr.solr.home: /mnt/ssd/jenkins/workspace/Lucene-Solr-4.x-Linux/solr/build/solr-core/test/J1/./org.apache.solr.cloud.BasicDistributedZk2Test-jetty2-1374688320917
   [junit4]   2> 590888 T1831 oasc.SolrResourceLoader.<init> new SolrResourceLoader for directory: '/mnt/ssd/jenkins/workspace/Lucene-Solr-4.x-Linux/solr/build/solr-core/test/J1/./org.apache.solr.cloud.BasicDistributedZk2Test-jetty2-1374688320917/'
   [junit4]   2> 590906 T1831 oasc.ConfigSolr.fromFile Loading container configuration from /mnt/ssd/jenkins/workspace/Lucene-Solr-4.x-Linux/solr/build/solr-core/test/J1/./org.apache.solr.cloud.BasicDistributedZk2Test-jetty2-1374688320917/solr.xml
   [junit4]   2> 590955 T1831 oasc.CoreContainer.<init> New CoreContainer 1401836430
   [junit4]   2> 590957 T1831 oasc.CoreContainer.load Loading cores into CoreContainer [instanceDir=/mnt/ssd/jenkins/workspace/Lucene-Solr-4.x-Linux/solr/build/solr-core/test/J1/./org.apache.solr.cloud.BasicDistributedZk2Test-jetty2-1374688320917/]
   [junit4]   2> 590959 T1831 oashc.HttpShardHandlerFactory.getParameter Setting socketTimeout to: 120000
   [junit4]   2> 590960 T1831 oashc.HttpShardHandlerFactory.getParameter Setting urlScheme to: http://
   [junit4]   2> 590961 T1831 oashc.HttpShardHandlerFactory.getParameter Setting connTimeout to: 15000
   [junit4]   2> 590963 T1831 oashc.HttpShardHandlerFactory.getParameter Setting maxConnectionsPerHost to: 20
   [junit4]   2> 590963 T1831 oashc.HttpShardHandlerFactory.getParameter Setting corePoolSize to: 0
   [junit4]   2> 590964 T1831 oashc.HttpShardHandlerFactory.getParameter Setting maximumPoolSize to: 2147483647
   [junit4]   2> 590965 T1831 oashc.HttpShardHandlerFactory.getParameter Setting maxThreadIdleTime to: 5
   [junit4]   2> 590966 T1831 oashc.HttpShardHandlerFactory.getParameter Setting sizeOfQueue to: -1
   [junit4]   2> 590966 T1831 oashc.HttpShardHandlerFactory.getParameter Setting fairnessPolicy to: false
   [junit4]   2> 590967 T1831 oascsi.HttpClientUtil.createClient Creating new http client, config:maxConnectionsPerHost=20&maxConnections=10000&socketTimeout=120000&connTimeout=15000&retry=false
   [junit4]   2> 590974 T1831 oasc.ZkContainer.initZooKeeper Zookeeper client=127.0.0.1:48730/solr
   [junit4]   2> 590975 T1831 oasc.ZkController.checkChrootPath zkHost includes chroot
   [junit4]   2> 590977 T1831 oascc.ConnectionManager.waitForConnected Waiting for client to connect to ZooKeeper
   [junit4]   2> 590980 T1887 oascc.ConnectionManager.process Watcher org.apache.solr.common.cloud.ConnectionManager@72167216 name:ZooKeeperConnection Watcher:127.0.0.1:48730 got event WatchedEvent state:SyncConnected type:None path:null path:null type:None
   [junit4]   2> 590980 T1831 oascc.ConnectionManager.waitForConnected Client is connected to ZooKeeper
   [junit4]   2> 590985 T1831 oascsi.HttpClientUtil.createClient Creating new http client, config:maxConnections=500&maxConnectionsPerHost=16&socketTimeout=120000&connTimeout=15000
   [junit4]   2> 590991 T1831 oascc.ConnectionManager.waitForConnected Waiting for client to connect to ZooKeeper
   [junit4]   2> 590993 T1889 oascc.ConnectionManager.process Watcher org.apache.solr.common.cloud.ConnectionManager@191f191f name:ZooKeeperConnection Watcher:127.0.0.1:48730/solr got event WatchedEvent state:SyncConnected type:None path:null path:null type:None
   [junit4]   2> 590994 T1831 oascc.ConnectionManager.waitForConnected Client is connected to ZooKeeper
   [junit4]   2> 591007 T1831 oascc.ZkStateReader.createClusterStateWatchersAndUpdate Updating cluster state from ZooKeeper... 
   [junit4]   2> 592018 T1831 oasc.ZkController.createEphemeralLiveNode Register node as live in ZooKeeper:/live_nodes/127.0.0.1:58849_
   [junit4]   2> 592022 T1831 oascc.SolrZkClient.makePath makePath: /live_nodes/127.0.0.1:58849_
   [junit4]   2> 592072 T1860 oascc.ZkStateReader$3.process Updating live nodes... (3)
   [junit4]   2> 592072 T1860 oascc.ZkStateReader$2.process A cluster state change: WatchedEvent state:SyncConnected type:NodeChildrenChanged path:/live_nodes, has occurred - updating... (live nodes size: 3)
   [junit4]   2> 592073 T1889 oascc.ZkStateReader$3.process Updating live nodes... (3)
   [junit4]   2> 592075 T1873 oascc.ZkStateReader$3.process Updating live nodes... (3)
   [junit4]   2> 592075 T1873 oascc.ZkStateReader$2.process A cluster state change: WatchedEvent state:SyncConnected type:NodeChildrenChanged path:/live_nodes, has occurred - updating... (live nodes size: 3)
   [junit4]   2> 592076 T1853 oascc.ZkStateReader$3.process Updating live nodes... (3)
   [junit4]   2> 592076 T1853 oascc.ZkStateReader$2.process A cluster state change: WatchedEvent state:SyncConnected type:NodeChildrenChanged path:/live_nodes, has occurred - updating... (live nodes size: 3)
   [junit4]   2> 592099 T1890 oasc.ZkController.publish publishing core=collection1 state=down
   [junit4]   2> 592099 T1890 oasc.ZkController.publish numShards not found on descriptor - reading it from system property
   [junit4]   2> 592102 T1890 oasc.ZkController.waitForCoreNodeName look for our core node name
   [junit4]   2> 592136 T1854 oascc.ZkStateReader.updateClusterState Updating cloud state from ZooKeeper... 
   [junit4]   2> 592140 T1854 oasc.Overseer$ClusterStateUpdater.updateState Update state numShards=2 message={
   [junit4]   2> 	  "shard_state":"active",
   [junit4]   2> 	  "base_url":"http://127.0.0.1:46223",
   [junit4]   2> 	  "state":"active",
   [junit4]   2> 	  "operation":"state",
   [junit4]   2> 	  "core_node_name":"core_node1",
   [junit4]   2> 	  "node_name":"127.0.0.1:46223_",
   [junit4]   2> 	  "numShards":"2",
   [junit4]   2> 	  "shard_range":null,
   [junit4]   2> 	  "roles":null,
   [junit4]   2> 	  "collection":"collection1",
   [junit4]   2> 	  "shard":"shard1",
   [junit4]   2> 	  "core":"collection1"}
   [junit4]   2> 592163 T1854 oasc.Overseer$ClusterStateUpdater.updateState Update state numShards=2 message={
   [junit4]   2> 	  "shard_state":"active",
   [junit4]   2> 	  "base_url":"http://127.0.0.1:58849",
   [junit4]   2> 	  "state":"down",
   [junit4]   2> 	  "operation":"state",
   [junit4]   2> 	  "core_node_name":"core_node2",
   [junit4]   2> 	  "node_name":"127.0.0.1:58849_",
   [junit4]   2> 	  "numShards":"2",
   [junit4]   2> 	  "shard_range":null,
   [junit4]   2> 	  "roles":null,
   [junit4]   2> 	  "collection":"collection1",
   [junit4]   2> 	  "shard":null,
   [junit4]   2> 	  "core":"collection1"}
   [junit4]   2> 592163 T1854 oasc.Overseer$ClusterStateUpdater.updateState Collection already exists with numShards=2
   [junit4]   2> 592164 T1854 oasc.Overseer$ClusterStateUpdater.updateState Assigning new node to shard shard=shard2
   [junit4]   2> 592174 T1873 oascc.ZkStateReader$2.process A cluster state change: WatchedEvent state:SyncConnected type:NodeDataChanged path:/clusterstate.json, has occurred - updating... (live nodes size: 3)
   [junit4]   2> 592174 T1889 oascc.ZkStateReader$2.process A cluster state change: WatchedEvent state:SyncConnected type:NodeDataChanged path:/clusterstate.json, has occurred - updating... (live nodes size: 3)
   [junit4]   2> 592174 T1860 oascc.ZkStateReader$2.process A cluster state change: WatchedEvent state:SyncConnected type:NodeDataChanged path:/clusterstate.json, has occurred - updating... (live nodes size: 3)
   [junit4]   2> 592175 T1853 oascc.ZkStateReader$2.process A cluster state change: WatchedEvent state:SyncConnected type:NodeDataChanged path:/clusterstate.json, has occurred - updating... (live nodes size: 3)
   [junit4]   2> 593102 T1890 oasc.ZkController.waitForShardId waiting to find shard id in clusterstate for collection1
   [junit4]   2> 593103 T1890 oasc.CoreContainer.create Creating SolrCore 'collection1' using instanceDir: /mnt/ssd/jenkins/workspace/Lucene-Solr-4.x-Linux/solr/build/solr-core/test/J1/./org.apache.solr.cloud.BasicDistributedZk2Test-jetty2-1374688320917/collection1
   [junit4]   2> 593104 T1890 oasc.ZkController.createCollectionZkNode Check for collection zkNode:collection1
   [junit4]   2> 593106 T1890 oasc.ZkController.createCollectionZkNode Collection zkNode exists
   [junit4]   2> 593106 T1890 oasc.ZkController.readConfigName Load collection config from:/collections/collection1
   [junit4]   2> 593110 T1890 oasc.SolrResourceLoader.<init> new SolrResourceLoader for directory: '/mnt/ssd/jenkins/workspace/Lucene-Solr-4.x-Linux/solr/build/solr-core/test/J1/./org.apache.solr.cloud.BasicDistributedZk2Test-jetty2-1374688320917/collection1/'
   [junit4]   2> 593111 T1890 oasc.SolrResourceLoader.replaceClassLoader Adding 'file:/mnt/ssd/jenkins/workspace/Lucene-Solr-4.x-Linux/solr/build/solr-core/test/J1/org.apache.solr.cloud.BasicDistributedZk2Test-jetty2-1374688320917/collection1/lib/README' to classloader
   [junit4]   2> 593112 T1890 oasc.SolrResourceLoader.replaceClassLoader Adding 'file:/mnt/ssd/jenkins/workspace/Lucene-Solr-4.x-Linux/solr/build/solr-core/test/J1/org.apache.solr.cloud.BasicDistributedZk2Test-jetty2-1374688320917/collection1/lib/classes/' to classloader
   [junit4]   2> 593148 T1890 oasc.SolrConfig.<init> Using Lucene MatchVersion: LUCENE_45
   [junit4]   2> 593209 T1890 oasc.SolrConfig.<init> Loaded SolrConfig: solrconfig.xml
   [junit4]   2> 593213 T1890 oass.IndexSchema.readSchema Reading Solr Schema from schema.xml
   [junit4]   2> 593224 T1890 oass.IndexSchema.readSchema [collection1] Schema name=test
   [junit4]   2> 593729 T1890 oass.ByteField.init WARN ByteField is deprecated and will be removed in 5.0. You should use TrieIntField instead.
   [junit4]   2> 593730 T1890 oass.ShortField.init WARN ShortField is deprecated and will be removed in 5.0. You should use TrieIntField instead.
   [junit4]   2> 593731 T1890 oass.OpenExchangeRatesOrgProvider.init Initialized with rates=open-exchange-rates.json, refreshInterval=1440.
   [junit4]   2> 593737 T1890 oass.IndexSchema.readSchema default search field in schema is text
   [junit4]   2> 593740 T1890 oass.IndexSchema.readSchema unique key field: id
   [junit4]   2> 593777 T1890 oass.FileExchangeRateProvider.reload Reloading exchange rates from file currency.xml
   [junit4]   2> 593792 T1890 oass.FileExchangeRateProvider.reload Reloading exchange rates from file currency.xml
   [junit4]   2> 593799 T1890 oass.OpenExchangeRatesOrgProvider.reload Reloading exchange rates from open-exchange-rates.json
   [junit4]   2> 593803 T1890 oass.OpenExchangeRatesOrgProvider$OpenExchangeRates.<init> WARN Unknown key IMPORTANT NOTE
   [junit4]   2> 593804 T1890 oass.OpenExchangeRatesOrgProvider$OpenExchangeRates.<init> WARN Expected key, got STRING
   [junit4]   2> 593804 T1890 oass.OpenExchangeRatesOrgProvider.reload Reloading exchange rates from open-exchange-rates.json
   [junit4]   2> 593808 T1890 oass.OpenExchangeRatesOrgProvider$OpenExchangeRates.<init> WARN Unknown key IMPORTANT NOTE
   [junit4]   2> 593809 T1890 oass.OpenExchangeRatesOrgProvider$OpenExchangeRates.<init> WARN Expected key, got STRING
   [junit4]   2> 593809 T1890 oasc.SolrCore.initDirectoryFactory org.apache.solr.core.MockDirectoryFactory
   [junit4]   2> 593810 T1890 oasc.SolrCore.<init> [collection1] Opening new SolrCore at /mnt/ssd/jenkins/workspace/Lucene-Solr-4.x-Linux/solr/build/solr-core/test/J1/./org.apache.solr.cloud.BasicDistributedZk2Test-jetty2-1374688320917/collection1/, dataDir=./org.apache.solr.cloud.BasicDistributedZk2Test-1374688312291/jetty2/
   [junit4]   2> 593811 T1890 oasc.JmxMonitoredMap.<init> JMX monitoring is enabled. Adding Solr mbeans to JMX Server: com.sun.jmx.mbeanserver.JmxMBeanServer@53665366
   [junit4]   2> 593812 T1890 oasc.CachingDirectoryFactory.get return new directory for ./org.apache.solr.cloud.BasicDistributedZk2Test-1374688312291/jetty2
   [junit4]   2> 593812 T1890 oasc.SolrCore.getNewIndexDir New index directory detected: old=null new=./org.apache.solr.cloud.BasicDistributedZk2Test-1374688312291/jetty2/index/
   [junit4]   2> 593813 T1890 oasc.SolrCore.initIndex WARN [collection1] Solr index directory './org.apache.solr.cloud.BasicDistributedZk2Test-1374688312291/jetty2/index' doesn't exist. Creating new index...
   [junit4]   2> 593814 T1890 oasc.CachingDirectoryFactory.get return new directory for ./org.apache.solr.cloud.BasicDistributedZk2Test-1374688312291/jetty2/index
   [junit4]   2> 593816 T1890 oasc.SolrDeletionPolicy.onCommit SolrDeletionPolicy.onCommit: commits: num=1
   [junit4]   2> 		commit{dir=MockDirWrapper(org.apache.lucene.store.RAMDirectory@4efc4efc lockFactory=org.apache.lucene.store.NativeFSLockFactory@6e226e22),segFN=segments_1,generation=1}
   [junit4]   2> 593816 T1890 oasc.SolrDeletionPolicy.updateCommits newest commit generation = 1
   [junit4]   2> 593825 T1890 oasup.UpdateRequestProcessorChain.init inserting DistributedUpdateProcessorFactory into updateRequestProcessorChain "dedupe"
   [junit4]   2> 593825 T1890 oasup.UpdateRequestProcessorChain.init inserting DistributedUpdateProcessorFactory into updateRequestProcessorChain "stored_sig"
   [junit4]   2> 593826 T1890 oasup.UpdateRequestProcessorChain.init inserting DistributedUpdateProcessorFactory into updateRequestProcessorChain "distrib-dup-test-chain-implicit"
   [junit4]   2> 593827 T1890 oasc.RequestHandlers.initHandlersFromConfig created standard: solr.StandardRequestHandler
   [junit4]   2> 593828 T1890 oasc.RequestHandlers.initHandlersFromConfig created /get: solr.RealTimeGetHandler
   [junit4]   2> 593829 T1890 oasc.RequestHandlers.initHandlersFromConfig adding lazy requestHandler: solr.ReplicationHandler
   [junit4]   2> 593829 T1890 oasc.RequestHandlers.initHandlersFromConfig created /replication: solr.ReplicationHandler
   [junit4]   2> 593830 T1890 oasc.RequestHandlers.initHandlersFromConfig created /update: solr.UpdateRequestHandler
   [junit4]   2> 593831 T1890 oasc.RequestHandlers.initHandlersFromConfig created /admin/: org.apache.solr.handler.admin.AdminHandlers
   [junit4]   2> 593833 T1890 oashl.XMLLoader.init xsltCacheLifetimeSeconds=60
   [junit4]   2> 593835 T1890 oass.SolrIndexSearcher.<init> Opening Searcher@4f3d4f3d main
   [junit4]   2> 593836 T1890 oasu.CommitTracker.<init> Hard AutoCommit: disabled
   [junit4]   2> 593837 T1890 oasu.CommitTracker.<init> Soft AutoCommit: disabled
   [junit4]   2> 593861 T1891 oasc.SolrCore.registerSearcher [collection1] Registered new searcher Searcher@4f3d4f3d main{StandardDirectoryReader(segments_1:1)}
   [junit4]   2> 593865 T1890 oasc.CoreContainer.registerCore registering core: collection1
   [junit4]   2> 593866 T1890 oasc.Z

[...truncated too long message...]

0)
   [junit4]   1>      DATA:
   [junit4]   1>          {
   [junit4]   1>            "base_url":"http://127.0.0.1:46223",
   [junit4]   1>            "node_name":"127.0.0.1:46223_",
   [junit4]   1>            "core":"onenodecollectioncore"}
   [junit4]   1>   /solr/aliases.json (0)
   [junit4]   1>   /solr/live_nodes (5)
   [junit4]   1>    /solr/live_nodes/127.0.0.1:52320_ (0)
   [junit4]   1>    /solr/live_nodes/127.0.0.1:58849_ (0)
   [junit4]   1>    /solr/live_nodes/127.0.0.1:43165_ (0)
   [junit4]   1>    /solr/live_nodes/127.0.0.1:46223_ (0)
   [junit4]   1>    /solr/live_nodes/127.0.0.1:51063_ (0)
   [junit4]   1>   /solr/clusterstate.json (0)
   [junit4]   1>   DATA:
   [junit4]   1>       {
   [junit4]   1>         "control_collection":{
   [junit4]   1>           "shards":{"shard1":{
   [junit4]   1>               "range":"80000000-7fffffff",
   [junit4]   1>               "state":"active",
   [junit4]   1>               "replicas":{"core_node1":{
   [junit4]   1>                   "base_url":"http://127.0.0.1:51063",
   [junit4]   1>                   "state":"active",
   [junit4]   1>                   "node_name":"127.0.0.1:51063_",
   [junit4]   1>                   "core":"collection1",
   [junit4]   1>                   "leader":"true"}}}},
   [junit4]   1>           "router":"compositeId"},
   [junit4]   1>         "onenodecollection":{
   [junit4]   1>           "shards":{"shard1":{
   [junit4]   1>               "range":"80000000-7fffffff",
   [junit4]   1>               "state":"active",
   [junit4]   1>               "replicas":{"core_node1":{
   [junit4]   1>                   "base_url":"http://127.0.0.1:46223",
   [junit4]   1>                   "state":"active",
   [junit4]   1>                   "node_name":"127.0.0.1:46223_",
   [junit4]   1>                   "roles":"none",
   [junit4]   1>                   "core":"onenodecollectioncore",
   [junit4]   1>                   "leader":"true"}}}},
   [junit4]   1>           "router":"compositeId"},
   [junit4]   1>         "collection1":{
   [junit4]   1>           "shards":{
   [junit4]   1>             "shard1":{
   [junit4]   1>               "range":"80000000-ffffffff",
   [junit4]   1>               "state":"active",
   [junit4]   1>               "replicas":{
   [junit4]   1>                 "core_node1":{
   [junit4]   1>                   "base_url":"http://127.0.0.1:46223",
   [junit4]   1>                   "state":"active",
   [junit4]   1>                   "node_name":"127.0.0.1:46223_",
   [junit4]   1>                   "core":"collection1",
   [junit4]   1>                   "leader":"true"},
   [junit4]   1>                 "core_node3":{
   [junit4]   1>                   "base_url":"http://127.0.0.1:43165",
   [junit4]   1>                   "state":"active",
   [junit4]   1>                   "node_name":"127.0.0.1:43165_",
   [junit4]   1>                   "core":"collection1"}}},
   [junit4]   1>             "shard2":{
   [junit4]   1>               "range":"0-7fffffff",
   [junit4]   1>               "state":"active",
   [junit4]   1>               "replicas":{
   [junit4]   1>                 "core_node2":{
   [junit4]   1>                   "base_url":"http://127.0.0.1:58849",
   [junit4]   1>                   "state":"active",
   [junit4]   1>                   "node_name":"127.0.0.1:58849_",
   [junit4]   1>                   "core":"collection1",
   [junit4]   1>                   "leader":"true"},
   [junit4]   1>                 "core_node4":{
   [junit4]   1>                   "base_url":"http://127.0.0.1:52320",
   [junit4]   1>                   "state":"active",
   [junit4]   1>                   "node_name":"127.0.0.1:52320_",
   [junit4]   1>                   "core":"collection1"}}}},
   [junit4]   1>           "router":"compositeId"}}
   [junit4]   1>  /zookeeper (1)
   [junit4]   1>  DATA:
   [junit4]   1>      
   [junit4]   1> 
   [junit4]   2> NOTE: reproduce with: ant test  -Dtestcase=BasicDistributedZk2Test -Dtests.method=testDistribSearch -Dtests.seed=EAD7FFEA55D6F80E -Dtests.multiplier=3 -Dtests.slow=true -Dtests.locale=no_NO_NY -Dtests.timezone=Asia/Damascus -Dtests.file.encoding=UTF-8
   [junit4] ERROR   32.6s J1 | BasicDistributedZk2Test.testDistribSearch <<<
   [junit4]    > Throwable #1: org.apache.solr.client.solrj.impl.HttpSolrServer$RemoteSolrException: Server at http://127.0.0.1:58849/onenodecollectioncore returned non ok status:404, message:Can not find: /onenodecollectioncore/update
   [junit4]    > 	at __randomizedtesting.SeedInfo.seed([EAD7FFEA55D6F80E:6B3171F222899832]:0)
   [junit4]    > 	at org.apache.solr.client.solrj.impl.HttpSolrServer.request(HttpSolrServer.java:385)
   [junit4]    > 	at org.apache.solr.client.solrj.impl.HttpSolrServer.request(HttpSolrServer.java:180)
   [junit4]    > 	at org.apache.solr.client.solrj.request.AbstractUpdateRequest.process(AbstractUpdateRequest.java:117)
   [junit4]    > 	at org.apache.solr.client.solrj.SolrServer.add(SolrServer.java:116)
   [junit4]    > 	at org.apache.solr.client.solrj.SolrServer.add(SolrServer.java:102)
   [junit4]    > 	at org.apache.solr.cloud.BasicDistributedZk2Test.testNodeWithoutCollectionForwarding(BasicDistributedZk2Test.java:196)
   [junit4]    > 	at org.apache.solr.cloud.BasicDistributedZk2Test.doTest(BasicDistributedZk2Test.java:88)
   [junit4]    > 	at org.apache.solr.BaseDistributedSearchTestCase.testDistribSearch(BaseDistributedSearchTestCase.java:835)
   [junit4]    > 	at java.lang.Thread.run(Thread.java:738)
   [junit4]   2> 614643 T1831 oas.SolrTestCaseJ4.deleteCore ###deleteCore
   [junit4]   2> 32602 T1830 ccr.ThreadLeakControl.checkThreadLeaks WARNING Will linger awaiting termination of 3 leaked thread(s).
   [junit4]   2> 614669 T1905 oascc.ZkStateReader$3.process WARN ZooKeeper watch triggered, but Solr cannot talk to ZK
   [junit4]   2> 614669 T1905 oascc.ZkStateReader$2.process A cluster state change: WatchedEvent state:SyncConnected type:NodeChildrenChanged path:/live_nodes, has occurred - updating... (live nodes size: 2)
   [junit4]   2> 614670 T1905 oascc.ZkStateReader$2.process WARN ZooKeeper watch triggered, but Solr cannot talk to ZK
   [junit4]   2> 615843 T1922 oascc.ZkStateReader$3.process WARN ZooKeeper watch triggered, but Solr cannot talk to ZK
   [junit4]   2> 615844 T1922 oascc.ZkStateReader$2.process A cluster state change: WatchedEvent state:SyncConnected type:NodeChildrenChanged path:/live_nodes, has occurred - updating... (live nodes size: 1)
   [junit4]   2> 615844 T1922 oascc.ZkStateReader$2.process WARN ZooKeeper watch triggered, but Solr cannot talk to ZK
   [junit4]   2> NOTE: test params are: codec=Lucene42: {}, docValues:{}, sim=DefaultSimilarity, locale=no_NO_NY, timezone=Asia/Damascus
   [junit4]   2> NOTE: Linux 3.2.0-49-generic x86/IBM Corporation 1.6.0 (32-bit)/cpus=8,threads=2,free=8691224,total=42394624
   [junit4]   2> NOTE: All tests run in this JVM: [TestFieldTypeResource, SolrCmdDistributorTest, TestPartialUpdateDeduplication, URLClassifyProcessorTest, TestLuceneMatchVersion, DocValuesMultiTest, TestDynamicFieldCollectionResource, TestBinaryResponseWriter, FileUtilsTest, TestPropInject, BlockCacheTest, JSONWriterTest, TestAddFieldRealTimeGet, TestFastOutputStream, OutputWriterTest, HighlighterTest, SpellCheckCollatorTest, TestMergePolicyConfig, TestSolrJ, TestLazyCores, TestFiltering, TestJmxIntegration, DirectUpdateHandlerTest, IndexSchemaRuntimeFieldTest, TestUtils, TestAtomicUpdateErrorCases, ChaosMonkeySafeLeaderTest, SampleTest, DistanceFunctionTest, CachingDirectoryFactoryTest, OpenExchangeRatesOrgProviderTest, TestSolr4Spatial, XsltUpdateRequestHandlerTest, TestSolrXml, TestUpdate, SuggesterTSTTest, NumericFieldsTest, TestRandomFaceting, ZkNodePropsTest, TestCloudManagedSchema, HardAutoCommitTest, TestFieldCollectionResource, TestSerializedLuceneMatchVersion, ZkSolrClientTest, TestNumberUtils, CoreContainerCoreInitFailuresTest, ShardRoutingCustomTest, EchoParamsTest, TestCodecSupport, CopyFieldTest, RequiredFieldsTest, TestCloudManagedSchemaAddField, MultiTermTest, PathHierarchyTokenizerFactoryTest, DirectSolrSpellCheckerTest, SolrIndexConfigTest, TestManagedSchemaFieldResource, SimplePostToolTest, UniqFieldsUpdateProcessorFactoryTest, TestIndexSearcher, TestFoldingMultitermQuery, TestSolrQueryParserResource, SolrTestCaseJ4Test, FullSolrCloudDistribCmdsTest, DOMUtilTest, TestSuggestSpellingConverter, TestLMJelinekMercerSimilarityFactory, TestCopyFieldCollectionResource, TestSolrXMLSerializer, TestCSVLoader, TestDefaultSimilarityFactory, TestDefaultSearchFieldResource, SuggesterWFSTTest, BasicDistributedZk2Test]
   [junit4] Completed on J1 in 33.88s, 1 test, 1 error <<< FAILURES!

[...truncated 663 lines...]
BUILD FAILED
/mnt/ssd/jenkins/workspace/Lucene-Solr-4.x-Linux/build.xml:395: The following error occurred while executing this line:
/mnt/ssd/jenkins/workspace/Lucene-Solr-4.x-Linux/build.xml:388: The following error occurred while executing this line:
/mnt/ssd/jenkins/workspace/Lucene-Solr-4.x-Linux/build.xml:39: The following error occurred while executing this line:
/mnt/ssd/jenkins/workspace/Lucene-Solr-4.x-Linux/solr/build.xml:181: The following error occurred while executing this line:
/mnt/ssd/jenkins/workspace/Lucene-Solr-4.x-Linux/solr/common-build.xml:449: The following error occurred while executing this line:
/mnt/ssd/jenkins/workspace/Lucene-Solr-4.x-Linux/lucene/common-build.xml:1233: The following error occurred while executing this line:
/mnt/ssd/jenkins/workspace/Lucene-Solr-4.x-Linux/lucene/common-build.xml:876: There were test failures: 319 suites, 1345 tests, 1 error, 1 failure, 35 ignored (7 assumptions)

Total time: 56 minutes 30 seconds
Build step 'Invoke Ant' marked build as failure
Description set: Java: 32bit/ibm-j9-jdk6 -Xjit:exclude={org/apache/lucene/util/fst/FST.pack(IIF)Lorg/apache/lucene/util/fst/FST;}
Archiving artifacts
Recording test results
Email was triggered for: Failure
Sending email for trigger: Failure



Mime
View raw message