lucene-dev mailing list archives

Site index · List index
Message view « Date » · « Thread »
Top « Date » · « Thread »
From Policeman Jenkins Server <jenk...@thetaphi.de>
Subject [JENKINS] Lucene-Solr-trunk-MacOSX (64bit/jdk1.7.0) - Build # 667 - Failure!
Date Mon, 22 Jul 2013 23:27:28 GMT
Build: http://jenkins.thetaphi.de/job/Lucene-Solr-trunk-MacOSX/667/
Java: 64bit/jdk1.7.0 -XX:+UseCompressedOops -XX:+UseConcMarkSweepGC

1 tests failed.
REGRESSION:  org.apache.solr.client.solrj.TestBatchUpdate.testWithXml

Error Message:
IOException occured when talking to server at: https://127.0.0.1:51913/solr/collection1

Stack Trace:
org.apache.solr.client.solrj.SolrServerException: IOException occured when talking to server
at: https://127.0.0.1:51913/solr/collection1
	at __randomizedtesting.SeedInfo.seed([C25C53179091FCC5:69BEEAE11297E5A8]:0)
	at org.apache.solr.client.solrj.impl.HttpSolrServer.request(HttpSolrServer.java:435)
	at org.apache.solr.client.solrj.impl.HttpSolrServer.request(HttpSolrServer.java:180)
	at org.apache.solr.client.solrj.request.AbstractUpdateRequest.process(AbstractUpdateRequest.java:117)
	at org.apache.solr.client.solrj.SolrServer.commit(SolrServer.java:168)
	at org.apache.solr.client.solrj.SolrServer.commit(SolrServer.java:146)
	at org.apache.solr.client.solrj.TestBatchUpdate.doIt(TestBatchUpdate.java:130)
	at org.apache.solr.client.solrj.TestBatchUpdate.testWithXml(TestBatchUpdate.java:54)
	at sun.reflect.NativeMethodAccessorImpl.invoke0(Native Method)
	at sun.reflect.NativeMethodAccessorImpl.invoke(NativeMethodAccessorImpl.java:57)
	at sun.reflect.DelegatingMethodAccessorImpl.invoke(DelegatingMethodAccessorImpl.java:43)
	at java.lang.reflect.Method.invoke(Method.java:606)
	at com.carrotsearch.randomizedtesting.RandomizedRunner.invoke(RandomizedRunner.java:1559)
	at com.carrotsearch.randomizedtesting.RandomizedRunner.access$600(RandomizedRunner.java:79)
	at com.carrotsearch.randomizedtesting.RandomizedRunner$6.evaluate(RandomizedRunner.java:737)
	at com.carrotsearch.randomizedtesting.RandomizedRunner$7.evaluate(RandomizedRunner.java:773)
	at com.carrotsearch.randomizedtesting.RandomizedRunner$8.evaluate(RandomizedRunner.java:787)
	at com.carrotsearch.randomizedtesting.rules.SystemPropertiesRestoreRule$1.evaluate(SystemPropertiesRestoreRule.java:53)
	at org.apache.lucene.util.TestRuleSetupTeardownChained$1.evaluate(TestRuleSetupTeardownChained.java:50)
	at org.apache.lucene.util.TestRuleFieldCacheSanity$1.evaluate(TestRuleFieldCacheSanity.java:51)
	at org.apache.lucene.util.AbstractBeforeAfterRule$1.evaluate(AbstractBeforeAfterRule.java:46)
	at com.carrotsearch.randomizedtesting.rules.SystemPropertiesInvariantRule$1.evaluate(SystemPropertiesInvariantRule.java:55)
	at org.apache.lucene.util.TestRuleThreadAndTestName$1.evaluate(TestRuleThreadAndTestName.java:49)
	at org.apache.lucene.util.TestRuleIgnoreAfterMaxFailures$1.evaluate(TestRuleIgnoreAfterMaxFailures.java:70)
	at org.apache.lucene.util.TestRuleMarkFailure$1.evaluate(TestRuleMarkFailure.java:48)
	at com.carrotsearch.randomizedtesting.rules.StatementAdapter.evaluate(StatementAdapter.java:36)
	at com.carrotsearch.randomizedtesting.ThreadLeakControl$StatementRunner.run(ThreadLeakControl.java:358)
	at com.carrotsearch.randomizedtesting.ThreadLeakControl.forkTimeoutingTask(ThreadLeakControl.java:782)
	at com.carrotsearch.randomizedtesting.ThreadLeakControl$3.evaluate(ThreadLeakControl.java:442)
	at com.carrotsearch.randomizedtesting.RandomizedRunner.runSingleTest(RandomizedRunner.java:746)
	at com.carrotsearch.randomizedtesting.RandomizedRunner$3.evaluate(RandomizedRunner.java:648)
	at com.carrotsearch.randomizedtesting.RandomizedRunner$4.evaluate(RandomizedRunner.java:682)
	at com.carrotsearch.randomizedtesting.RandomizedRunner$5.evaluate(RandomizedRunner.java:693)
	at com.carrotsearch.randomizedtesting.rules.StatementAdapter.evaluate(StatementAdapter.java:36)
	at com.carrotsearch.randomizedtesting.rules.SystemPropertiesRestoreRule$1.evaluate(SystemPropertiesRestoreRule.java:53)
	at org.apache.lucene.util.AbstractBeforeAfterRule$1.evaluate(AbstractBeforeAfterRule.java:46)
	at org.apache.lucene.util.TestRuleStoreClassName$1.evaluate(TestRuleStoreClassName.java:42)
	at com.carrotsearch.randomizedtesting.rules.SystemPropertiesInvariantRule$1.evaluate(SystemPropertiesInvariantRule.java:55)
	at com.carrotsearch.randomizedtesting.rules.NoShadowingOrOverridesOnMethodsRule$1.evaluate(NoShadowingOrOverridesOnMethodsRule.java:39)
	at com.carrotsearch.randomizedtesting.rules.NoShadowingOrOverridesOnMethodsRule$1.evaluate(NoShadowingOrOverridesOnMethodsRule.java:39)
	at com.carrotsearch.randomizedtesting.rules.StatementAdapter.evaluate(StatementAdapter.java:36)
	at org.apache.lucene.util.TestRuleAssertionsRequired$1.evaluate(TestRuleAssertionsRequired.java:43)
	at org.apache.lucene.util.TestRuleMarkFailure$1.evaluate(TestRuleMarkFailure.java:48)
	at org.apache.lucene.util.TestRuleIgnoreAfterMaxFailures$1.evaluate(TestRuleIgnoreAfterMaxFailures.java:70)
	at org.apache.lucene.util.TestRuleIgnoreTestSuites$1.evaluate(TestRuleIgnoreTestSuites.java:55)
	at com.carrotsearch.randomizedtesting.rules.StatementAdapter.evaluate(StatementAdapter.java:36)
	at com.carrotsearch.randomizedtesting.ThreadLeakControl$StatementRunner.run(ThreadLeakControl.java:358)
	at java.lang.Thread.run(Thread.java:724)
Caused by: org.apache.http.NoHttpResponseException: The target server failed to respond
	at org.apache.http.impl.conn.DefaultHttpResponseParser.parseHead(DefaultHttpResponseParser.java:95)
	at org.apache.http.impl.conn.DefaultHttpResponseParser.parseHead(DefaultHttpResponseParser.java:62)
	at org.apache.http.impl.io.AbstractMessageParser.parse(AbstractMessageParser.java:254)
	at org.apache.http.impl.AbstractHttpClientConnection.receiveResponseHeader(AbstractHttpClientConnection.java:289)
	at org.apache.http.impl.conn.DefaultClientConnection.receiveResponseHeader(DefaultClientConnection.java:252)
	at org.apache.http.impl.conn.ManagedClientConnectionImpl.receiveResponseHeader(ManagedClientConnectionImpl.java:191)
	at org.apache.http.protocol.HttpRequestExecutor.doReceiveResponse(HttpRequestExecutor.java:300)
	at org.apache.http.protocol.HttpRequestExecutor.execute(HttpRequestExecutor.java:127)
	at org.apache.http.impl.client.DefaultRequestDirector.tryExecute(DefaultRequestDirector.java:717)
	at org.apache.http.impl.client.DefaultRequestDirector.execute(DefaultRequestDirector.java:522)
	at org.apache.http.impl.client.AbstractHttpClient.execute(AbstractHttpClient.java:906)
	at org.apache.http.impl.client.AbstractHttpClient.execute(AbstractHttpClient.java:805)
	at org.apache.http.impl.client.AbstractHttpClient.execute(AbstractHttpClient.java:784)
	at org.apache.solr.client.solrj.impl.HttpSolrServer.request(HttpSolrServer.java:365)
	... 46 more




Build Log:
[...truncated 10671 lines...]
   [junit4] Suite: org.apache.solr.client.solrj.TestBatchUpdate
   [junit4]   1> 447292 [SUITE-TestBatchUpdate-seed#[C25C53179091FCC5]-worker] INFO  org.apache.solr.SolrJettyTestBase
 ? Randomized ssl (true) and clientAuth (false)
   [junit4]   1> 447293 [SUITE-TestBatchUpdate-seed#[C25C53179091FCC5]-worker] INFO  org.apache.solr.SolrTestCaseJ4
 ? ####initCore
   [junit4]   1> 447294 [SUITE-TestBatchUpdate-seed#[C25C53179091FCC5]-worker] INFO  org.apache.solr.SolrTestCaseJ4
 ? ####initCore end
   [junit4]   1> 447295 [SUITE-TestBatchUpdate-seed#[C25C53179091FCC5]-worker] INFO  org.eclipse.jetty.server.Server
 ? jetty-8.1.10.v20130312
   [junit4]   1> 447304 [SUITE-TestBatchUpdate-seed#[C25C53179091FCC5]-worker] INFO  org.eclipse.jetty.util.ssl.SslContextFactory
 ? Enabled Protocols [SSLv2Hello, SSLv3, TLSv1, TLSv1.1, TLSv1.2] of [SSLv2Hello, SSLv3, TLSv1,
TLSv1.1, TLSv1.2]
   [junit4]   1> 447306 [SUITE-TestBatchUpdate-seed#[C25C53179091FCC5]-worker] INFO  org.eclipse.jetty.server.AbstractConnector
 ? Started SslSelectChannelConnector@127.0.0.1:51913
   [junit4]   1> 447307 [SUITE-TestBatchUpdate-seed#[C25C53179091FCC5]-worker] INFO  org.apache.solr.servlet.SolrDispatchFilter
 ? SolrDispatchFilter.init()
   [junit4]   1> 447307 [SUITE-TestBatchUpdate-seed#[C25C53179091FCC5]-worker] INFO  org.apache.solr.core.SolrResourceLoader
 ? JNDI not configured for solr (NoInitialContextEx)
   [junit4]   1> 447308 [SUITE-TestBatchUpdate-seed#[C25C53179091FCC5]-worker] INFO  org.apache.solr.core.SolrResourceLoader
 ? using system property solr.solr.home: /Users/jenkins/jenkins-slave/workspace/Lucene-Solr-trunk-MacOSX/solr/example/solr
   [junit4]   1> 447308 [SUITE-TestBatchUpdate-seed#[C25C53179091FCC5]-worker] INFO  org.apache.solr.core.SolrResourceLoader
 ? new SolrResourceLoader for directory: '/Users/jenkins/jenkins-slave/workspace/Lucene-Solr-trunk-MacOSX/solr/example/solr/'
   [junit4]   1> 447350 [SUITE-TestBatchUpdate-seed#[C25C53179091FCC5]-worker] INFO  org.apache.solr.core.ConfigSolr
 ? Loading container configuration from /Users/jenkins/jenkins-slave/workspace/Lucene-Solr-trunk-MacOSX/solr/example/solr/solr.xml
   [junit4]   1> 447450 [SUITE-TestBatchUpdate-seed#[C25C53179091FCC5]-worker] INFO  org.apache.solr.core.ConfigSolrXml
 ? Config-defined core root directory: 
   [junit4]   1> 447451 [SUITE-TestBatchUpdate-seed#[C25C53179091FCC5]-worker] INFO  org.apache.solr.core.CoreContainer
 ? New CoreContainer 1619525211
   [junit4]   1> 447452 [SUITE-TestBatchUpdate-seed#[C25C53179091FCC5]-worker] INFO  org.apache.solr.core.CoreContainer
 ? Loading cores into CoreContainer [instanceDir=/Users/jenkins/jenkins-slave/workspace/Lucene-Solr-trunk-MacOSX/solr/example/solr/]
   [junit4]   1> 447454 [SUITE-TestBatchUpdate-seed#[C25C53179091FCC5]-worker] INFO  org.apache.solr.handler.component.HttpShardHandlerFactory
 ? Setting socketTimeout to: 0
   [junit4]   1> 447454 [SUITE-TestBatchUpdate-seed#[C25C53179091FCC5]-worker] INFO  org.apache.solr.handler.component.HttpShardHandlerFactory
 ? Setting urlScheme to: http://
   [junit4]   1> 447455 [SUITE-TestBatchUpdate-seed#[C25C53179091FCC5]-worker] INFO  org.apache.solr.handler.component.HttpShardHandlerFactory
 ? Setting connTimeout to: 0
   [junit4]   1> 447461 [SUITE-TestBatchUpdate-seed#[C25C53179091FCC5]-worker] INFO  org.apache.solr.handler.component.HttpShardHandlerFactory
 ? Setting maxConnectionsPerHost to: 20
   [junit4]   1> 447461 [SUITE-TestBatchUpdate-seed#[C25C53179091FCC5]-worker] INFO  org.apache.solr.handler.component.HttpShardHandlerFactory
 ? Setting corePoolSize to: 0
   [junit4]   1> 447462 [SUITE-TestBatchUpdate-seed#[C25C53179091FCC5]-worker] INFO  org.apache.solr.handler.component.HttpShardHandlerFactory
 ? Setting maximumPoolSize to: 2147483647
   [junit4]   1> 447462 [SUITE-TestBatchUpdate-seed#[C25C53179091FCC5]-worker] INFO  org.apache.solr.handler.component.HttpShardHandlerFactory
 ? Setting maxThreadIdleTime to: 5
   [junit4]   1> 447463 [SUITE-TestBatchUpdate-seed#[C25C53179091FCC5]-worker] INFO  org.apache.solr.handler.component.HttpShardHandlerFactory
 ? Setting sizeOfQueue to: -1
   [junit4]   1> 447463 [SUITE-TestBatchUpdate-seed#[C25C53179091FCC5]-worker] INFO  org.apache.solr.handler.component.HttpShardHandlerFactory
 ? Setting fairnessPolicy to: false
   [junit4]   1> 447464 [SUITE-TestBatchUpdate-seed#[C25C53179091FCC5]-worker] INFO  org.apache.solr.client.solrj.impl.HttpClientUtil
 ? Creating new http client, config:maxConnectionsPerHost=20&maxConnections=10000&socketTimeout=0&connTimeout=0&retry=false
   [junit4]   1> 447471 [SUITE-TestBatchUpdate-seed#[C25C53179091FCC5]-worker] INFO  org.apache.solr.logging.LogWatcher
 ? Registering Log Listener [Log4j (org.slf4j.impl.Log4jLoggerFactory)]
   [junit4]   1> 447476 [SUITE-TestBatchUpdate-seed#[C25C53179091FCC5]-worker] INFO  org.apache.solr.core.CoresLocator
 ? Looking for core definitions underneath /Users/jenkins/jenkins-slave/workspace/Lucene-Solr-trunk-MacOSX/solr/example/solr
   [junit4]   1> 447488 [SUITE-TestBatchUpdate-seed#[C25C53179091FCC5]-worker] INFO  org.apache.solr.core.CoresLocator
 ? Found core collection1 in /Users/jenkins/jenkins-slave/workspace/Lucene-Solr-trunk-MacOSX/solr/example/solr/collection1/
   [junit4]   1> 447489 [SUITE-TestBatchUpdate-seed#[C25C53179091FCC5]-worker] INFO  org.apache.solr.core.CoresLocator
 ? Found 1 core definitions
   [junit4]   1> 447491 [coreLoadExecutor-324-thread-1] INFO  org.apache.solr.core.CoreContainer
 ? Creating SolrCore 'collection1' using instanceDir: /Users/jenkins/jenkins-slave/workspace/Lucene-Solr-trunk-MacOSX/solr/example/solr/collection1
   [junit4]   1> 447492 [coreLoadExecutor-324-thread-1] INFO  org.apache.solr.core.SolrResourceLoader
 ? new SolrResourceLoader for directory: '/Users/jenkins/jenkins-slave/workspace/Lucene-Solr-trunk-MacOSX/solr/example/solr/collection1/'
   [junit4]   1> 447530 [coreLoadExecutor-324-thread-1] INFO  org.apache.solr.core.SolrConfig
 ? Adding specified lib dirs to ClassLoader
   [junit4]   1> 447531 [coreLoadExecutor-324-thread-1] WARN  org.apache.solr.core.SolrResourceLoader
 ? No files added to classloader from lib: ../../../contrib/extraction/lib (resolved as: /Users/jenkins/jenkins-slave/workspace/Lucene-Solr-trunk-MacOSX/solr/example/solr/collection1/../../../contrib/extraction/lib).
   [junit4]   1> 447533 [coreLoadExecutor-324-thread-1] WARN  org.apache.solr.core.SolrResourceLoader
 ? Can't find (or read) directory to add to classloader: ../../../dist/ (resolved as: /Users/jenkins/jenkins-slave/workspace/Lucene-Solr-trunk-MacOSX/solr/example/solr/collection1/../../../dist).
   [junit4]   1> 447533 [coreLoadExecutor-324-thread-1] WARN  org.apache.solr.core.SolrResourceLoader
 ? No files added to classloader from lib: ../../../contrib/clustering/lib/ (resolved as:
/Users/jenkins/jenkins-slave/workspace/Lucene-Solr-trunk-MacOSX/solr/example/solr/collection1/../../../contrib/clustering/lib).
   [junit4]   1> 447534 [coreLoadExecutor-324-thread-1] WARN  org.apache.solr.core.SolrResourceLoader
 ? Can't find (or read) directory to add to classloader: ../../../dist/ (resolved as: /Users/jenkins/jenkins-slave/workspace/Lucene-Solr-trunk-MacOSX/solr/example/solr/collection1/../../../dist).
   [junit4]   1> 447535 [coreLoadExecutor-324-thread-1] WARN  org.apache.solr.core.SolrResourceLoader
 ? No files added to classloader from lib: ../../../contrib/langid/lib/ (resolved as: /Users/jenkins/jenkins-slave/workspace/Lucene-Solr-trunk-MacOSX/solr/example/solr/collection1/../../../contrib/langid/lib).
   [junit4]   1> 447535 [coreLoadExecutor-324-thread-1] WARN  org.apache.solr.core.SolrResourceLoader
 ? Can't find (or read) directory to add to classloader: ../../../dist/ (resolved as: /Users/jenkins/jenkins-slave/workspace/Lucene-Solr-trunk-MacOSX/solr/example/solr/collection1/../../../dist).
   [junit4]   1> 447536 [coreLoadExecutor-324-thread-1] WARN  org.apache.solr.core.SolrResourceLoader
 ? No files added to classloader from lib: ../../../contrib/velocity/lib (resolved as: /Users/jenkins/jenkins-slave/workspace/Lucene-Solr-trunk-MacOSX/solr/example/solr/collection1/../../../contrib/velocity/lib).
   [junit4]   1> 447537 [coreLoadExecutor-324-thread-1] WARN  org.apache.solr.core.SolrResourceLoader
 ? Can't find (or read) directory to add to classloader: ../../../dist/ (resolved as: /Users/jenkins/jenkins-slave/workspace/Lucene-Solr-trunk-MacOSX/solr/example/solr/collection1/../../../dist).
   [junit4]   1> 447593 [coreLoadExecutor-324-thread-1] INFO  org.apache.solr.update.SolrIndexConfig
 ? IndexWriter infoStream solr logging is enabled
   [junit4]   1> 447596 [coreLoadExecutor-324-thread-1] INFO  org.apache.solr.core.SolrConfig
 ? Using Lucene MatchVersion: LUCENE_50
   [junit4]   1> 447709 [coreLoadExecutor-324-thread-1] INFO  org.apache.solr.core.Config
 ? Loaded SolrConfig: solrconfig.xml
   [junit4]   1> 447711 [coreLoadExecutor-324-thread-1] INFO  org.apache.solr.schema.IndexSchema
 ? Reading Solr Schema from schema.xml
   [junit4]   1> 447730 [coreLoadExecutor-324-thread-1] INFO  org.apache.solr.schema.IndexSchema
 ? [collection1] Schema name=example
   [junit4]   1> 448755 [coreLoadExecutor-324-thread-1] INFO  org.apache.solr.schema.IndexSchema
 ? unique key field: id
   [junit4]   1> 448779 [coreLoadExecutor-324-thread-1] INFO  org.apache.solr.schema.FileExchangeRateProvider
 ? Reloading exchange rates from file currency.xml
   [junit4]   1> 448787 [coreLoadExecutor-324-thread-1] INFO  org.apache.solr.schema.FileExchangeRateProvider
 ? Reloading exchange rates from file currency.xml
   [junit4]   1> 448829 [coreLoadExecutor-324-thread-1] INFO  org.apache.solr.core.SolrCore
 ? org.apache.solr.core.MockDirectoryFactory
   [junit4]   1> 448830 [coreLoadExecutor-324-thread-1] INFO  org.apache.solr.core.SolrCore
 ? [collection1] Opening new SolrCore at /Users/jenkins/jenkins-slave/workspace/Lucene-Solr-trunk-MacOSX/solr/example/solr/collection1/,
dataDir=/Users/jenkins/jenkins-slave/workspace/Lucene-Solr-trunk-MacOSX/solr/build/solr-solrj/test/J0/solrtest-TestBatchUpdate-1374535377987/
   [junit4]   1> 448830 [coreLoadExecutor-324-thread-1] INFO  org.apache.solr.core.JmxMonitoredMap
 ? JMX monitoring is enabled. Adding Solr mbeans to JMX Server: com.sun.jmx.mbeanserver.JmxMBeanServer@6cf26de4
   [junit4]   1> 448831 [coreLoadExecutor-324-thread-1] INFO  org.apache.solr.core.SolrCore
 ? [collection1] Added SolrEventListener for newSearcher: org.apache.solr.core.QuerySenderListener{queries=[]}
   [junit4]   1> 448831 [coreLoadExecutor-324-thread-1] INFO  org.apache.solr.core.SolrCore
 ? [collection1] Added SolrEventListener for firstSearcher: org.apache.solr.core.QuerySenderListener{queries=[{q=static
firstSearcher warming in solrconfig.xml}]}
   [junit4]   1> 448832 [coreLoadExecutor-324-thread-1] INFO  org.apache.solr.core.CachingDirectoryFactory
 ? return new directory for /Users/jenkins/jenkins-slave/workspace/Lucene-Solr-trunk-MacOSX/solr/build/solr-solrj/test/J0/solrtest-TestBatchUpdate-1374535377987
   [junit4]   1> 448833 [coreLoadExecutor-324-thread-1] INFO  org.apache.solr.core.SolrCore
 ? New index directory detected: old=null new=/Users/jenkins/jenkins-slave/workspace/Lucene-Solr-trunk-MacOSX/solr/build/solr-solrj/test/J0/solrtest-TestBatchUpdate-1374535377987/index/
   [junit4]   1> 448833 [coreLoadExecutor-324-thread-1] WARN  org.apache.solr.core.SolrCore
 ? [collection1] Solr index directory '/Users/jenkins/jenkins-slave/workspace/Lucene-Solr-trunk-MacOSX/solr/build/solr-solrj/test/J0/solrtest-TestBatchUpdate-1374535377987/index'
doesn't exist. Creating new index...
   [junit4]   1> 448834 [coreLoadExecutor-324-thread-1] INFO  org.apache.solr.core.CachingDirectoryFactory
 ? return new directory for /Users/jenkins/jenkins-slave/workspace/Lucene-Solr-trunk-MacOSX/solr/build/solr-solrj/test/J0/solrtest-TestBatchUpdate-1374535377987/index
   [junit4]   1> 448838 [coreLoadExecutor-324-thread-1] INFO  org.apache.solr.core.SolrCore
 ? SolrDeletionPolicy.onCommit: commits: num=1
   [junit4]   1> 	commit{dir=MockDirWrapper(org.apache.lucene.store.RAMDirectory@10bc5ebf
lockFactory=org.apache.lucene.store.NativeFSLockFactory@2682eedf),segFN=segments_1,generation=1}
   [junit4]   1> 448839 [coreLoadExecutor-324-thread-1] INFO  org.apache.solr.core.SolrCore
 ? newest commit generation = 1
   [junit4]   1> 448840 [coreLoadExecutor-324-thread-1] INFO  org.apache.solr.core.SolrCore
 ? created json: solr.JSONResponseWriter
   [junit4]   1> 448840 [coreLoadExecutor-324-thread-1] INFO  org.apache.solr.core.SolrCore
 ? adding lazy queryResponseWriter: solr.VelocityResponseWriter
   [junit4]   1> 448841 [coreLoadExecutor-324-thread-1] INFO  org.apache.solr.core.SolrCore
 ? created velocity: solr.VelocityResponseWriter
   [junit4]   1> 448842 [coreLoadExecutor-324-thread-1] INFO  org.apache.solr.core.SolrCore
 ? created xslt: solr.XSLTResponseWriter
   [junit4]   1> 448842 [coreLoadExecutor-324-thread-1] INFO  org.apache.solr.response.XSLTResponseWriter
 ? xsltCacheLifetimeSeconds=5
   [junit4]   1> 448856 [coreLoadExecutor-324-thread-1] INFO  org.apache.solr.core.RequestHandlers
 ? created /select: solr.SearchHandler
   [junit4]   1> 448856 [coreLoadExecutor-324-thread-1] INFO  org.apache.solr.core.RequestHandlers
 ? created /query: solr.SearchHandler
   [junit4]   1> 448858 [coreLoadExecutor-324-thread-1] INFO  org.apache.solr.core.RequestHandlers
 ? created /get: solr.RealTimeGetHandler
   [junit4]   1> 448861 [coreLoadExecutor-324-thread-1] INFO  org.apache.solr.core.RequestHandlers
 ? created /browse: solr.SearchHandler
   [junit4]   1> 448863 [coreLoadExecutor-324-thread-1] INFO  org.apache.solr.core.RequestHandlers
 ? created /update: solr.UpdateRequestHandler
   [junit4]   1> 448866 [coreLoadExecutor-324-thread-1] INFO  org.apache.solr.core.RequestHandlers
 ? created /update/json: solr.JsonUpdateRequestHandler
   [junit4]   1> 448868 [coreLoadExecutor-324-thread-1] INFO  org.apache.solr.core.RequestHandlers
 ? created /update/csv: solr.CSVRequestHandler
   [junit4]   1> 448869 [coreLoadExecutor-324-thread-1] INFO  org.apache.solr.core.RequestHandlers
 ? adding lazy requestHandler: solr.extraction.ExtractingRequestHandler
   [junit4]   1> 448870 [coreLoadExecutor-324-thread-1] INFO  org.apache.solr.core.RequestHandlers
 ? created /update/extract: solr.extraction.ExtractingRequestHandler
   [junit4]   1> 448871 [coreLoadExecutor-324-thread-1] INFO  org.apache.solr.core.RequestHandlers
 ? adding lazy requestHandler: solr.FieldAnalysisRequestHandler
   [junit4]   1> 448872 [coreLoadExecutor-324-thread-1] INFO  org.apache.solr.core.RequestHandlers
 ? created /analysis/field: solr.FieldAnalysisRequestHandler
   [junit4]   1> 448872 [coreLoadExecutor-324-thread-1] INFO  org.apache.solr.core.RequestHandlers
 ? adding lazy requestHandler: solr.DocumentAnalysisRequestHandler
   [junit4]   1> 448873 [coreLoadExecutor-324-thread-1] INFO  org.apache.solr.core.RequestHandlers
 ? created /analysis/document: solr.DocumentAnalysisRequestHandler
   [junit4]   1> 448874 [coreLoadExecutor-324-thread-1] INFO  org.apache.solr.core.RequestHandlers
 ? created /admin/: solr.admin.AdminHandlers
   [junit4]   1> 448875 [coreLoadExecutor-324-thread-1] INFO  org.apache.solr.core.RequestHandlers
 ? created /admin/ping: solr.PingRequestHandler
   [junit4]   1> 448875 [coreLoadExecutor-324-thread-1] INFO  org.apache.solr.core.RequestHandlers
 ? created /debug/dump: solr.DumpRequestHandler
   [junit4]   1> 448876 [coreLoadExecutor-324-thread-1] INFO  org.apache.solr.core.RequestHandlers
 ? created /replication: solr.ReplicationHandler
   [junit4]   1> 448877 [coreLoadExecutor-324-thread-1] INFO  org.apache.solr.core.RequestHandlers
 ? adding lazy requestHandler: solr.SearchHandler
   [junit4]   1> 448877 [coreLoadExecutor-324-thread-1] INFO  org.apache.solr.core.RequestHandlers
 ? created /spell: solr.SearchHandler
   [junit4]   1> 448878 [coreLoadExecutor-324-thread-1] INFO  org.apache.solr.core.RequestHandlers
 ? adding lazy requestHandler: solr.SearchHandler
   [junit4]   1> 448878 [coreLoadExecutor-324-thread-1] INFO  org.apache.solr.core.RequestHandlers
 ? created /tvrh: solr.SearchHandler
   [junit4]   1> 448879 [coreLoadExecutor-324-thread-1] INFO  org.apache.solr.core.RequestHandlers
 ? adding lazy requestHandler: solr.SearchHandler
   [junit4]   1> 448879 [coreLoadExecutor-324-thread-1] INFO  org.apache.solr.core.RequestHandlers
 ? created /terms: solr.SearchHandler
   [junit4]   1> 448879 [coreLoadExecutor-324-thread-1] INFO  org.apache.solr.core.RequestHandlers
 ? adding lazy requestHandler: solr.SearchHandler
   [junit4]   1> 448880 [coreLoadExecutor-324-thread-1] INFO  org.apache.solr.core.RequestHandlers
 ? created /elevate: solr.SearchHandler
   [junit4]   1> 448894 [coreLoadExecutor-324-thread-1] INFO  org.apache.solr.handler.loader.XMLLoader
 ? xsltCacheLifetimeSeconds=60
   [junit4]   1> 448897 [coreLoadExecutor-324-thread-1] INFO  org.apache.solr.handler.loader.XMLLoader
 ? xsltCacheLifetimeSeconds=60
   [junit4]   1> 448899 [coreLoadExecutor-324-thread-1] INFO  org.apache.solr.handler.loader.XMLLoader
 ? xsltCacheLifetimeSeconds=60
   [junit4]   1> 448909 [coreLoadExecutor-324-thread-1] INFO  org.apache.solr.search.SolrIndexSearcher
 ? Opening Searcher@3f93da94 main
   [junit4]   1> 448910 [coreLoadExecutor-324-thread-1] INFO  org.apache.solr.core.SolrCore
 ? Hard AutoCommit: if uncommited for 15000ms; 
   [junit4]   1> 448910 [coreLoadExecutor-324-thread-1] INFO  org.apache.solr.core.SolrCore
 ? Soft AutoCommit: disabled
   [junit4]   1> 448911 [coreLoadExecutor-324-thread-1] INFO  org.apache.solr.handler.component.SpellCheckComponent
 ? Initializing spell checkers
   [junit4]   1> 448912 [coreLoadExecutor-324-thread-1] INFO  org.apache.solr.spelling.DirectSolrSpellChecker
 ? init: {name=default,field=text,classname=solr.DirectSolrSpellChecker,distanceMeasure=internal,accuracy=0.5,maxEdits=2,minPrefix=1,maxInspections=5,minQueryLength=4,maxQueryFrequency=0.01}
   [junit4]   1> 448912 [coreLoadExecutor-324-thread-1] INFO  org.apache.solr.handler.component.SpellCheckComponent
 ? No queryConverter defined, using default converter
   [junit4]   1> 448913 [coreLoadExecutor-324-thread-1] INFO  org.apache.solr.handler.component.QueryElevationComponent
 ? Loading QueryElevation from: /Users/jenkins/jenkins-slave/workspace/Lucene-Solr-trunk-MacOSX/solr/example/solr/collection1/conf/elevate.xml
   [junit4]   1> 448956 [coreLoadExecutor-324-thread-1] INFO  org.apache.solr.handler.ReplicationHandler
 ? Commits will be reserved for  10000
   [junit4]   1> 448956 [searcherExecutor-325-thread-1] INFO  org.apache.solr.core.SolrCore
 ? QuerySenderListener sending requests to Searcher@3f93da94 main{StandardDirectoryReader(segments_1:1)}
   [junit4]   1> 448958 [searcherExecutor-325-thread-1] INFO  org.apache.solr.core.SolrCore
 ? [collection1] webapp=null path=null params={event=firstSearcher&q=static+firstSearcher+warming+in+solrconfig.xml&distrib=false}
hits=0 status=0 QTime=1 
   [junit4]   1> 448958 [searcherExecutor-325-thread-1] INFO  org.apache.solr.core.SolrCore
 ? QuerySenderListener done.
   [junit4]   1> 448959 [searcherExecutor-325-thread-1] INFO  org.apache.solr.handler.component.SpellCheckComponent
 ? Loading spell index for spellchecker: default
   [junit4]   1> 448959 [searcherExecutor-325-thread-1] INFO  org.apache.solr.handler.component.SpellCheckComponent
 ? Loading spell index for spellchecker: wordbreak
   [junit4]   1> 448961 [searcherExecutor-325-thread-1] INFO  org.apache.solr.core.SolrCore
 ? [collection1] Registered new searcher Searcher@3f93da94 main{StandardDirectoryReader(segments_1:1)}
   [junit4]   1> 448964 [coreLoadExecutor-324-thread-1] INFO  org.apache.solr.core.CoreContainer
 ? registering core: collection1
   [junit4]   1> 448965 [SUITE-TestBatchUpdate-seed#[C25C53179091FCC5]-worker] INFO  org.apache.solr.servlet.SolrDispatchFilter
 ? user.dir=/Users/jenkins/jenkins-slave/workspace/Lucene-Solr-trunk-MacOSX/solr/build/solr-solrj/test/J0
   [junit4]   1> 448966 [SUITE-TestBatchUpdate-seed#[C25C53179091FCC5]-worker] INFO  org.apache.solr.servlet.SolrDispatchFilter
 ? SolrDispatchFilter.init() done
   [junit4]   1> 448967 [SUITE-TestBatchUpdate-seed#[C25C53179091FCC5]-worker] INFO  org.apache.solr.SolrJettyTestBase
 ? Jetty Assigned Port#51913
   [junit4]   2> Creating dataDir: /Users/jenkins/jenkins-slave/workspace/Lucene-Solr-trunk-MacOSX/solr/build/solr-solrj/test/J0/./solrtest-TestBatchUpdate-1374535377987
   [junit4]   1> 448980 [TEST-TestBatchUpdate.testWithBinaryBean-seed#[C25C53179091FCC5]]
INFO  org.apache.solr.SolrTestCaseJ4  ? ###Starting testWithBinaryBean
   [junit4]   1> 448982 [TEST-TestBatchUpdate.testWithBinaryBean-seed#[C25C53179091FCC5]]
INFO  org.apache.solr.client.solrj.impl.HttpClientUtil  ? Creating new http client, config:maxConnections=128&maxConnectionsPerHost=32&followRedirects=false
   [junit4]   1> 449048 [qtp1113097340-614] INFO  org.apache.solr.core.SolrCore  ? SolrDeletionPolicy.onInit:
commits: num=1
   [junit4]   1> 	commit{dir=MockDirWrapper(org.apache.lucene.store.RAMDirectory@10bc5ebf
lockFactory=org.apache.lucene.store.NativeFSLockFactory@2682eedf),segFN=segments_1,generation=1}
   [junit4]   1> 449050 [qtp1113097340-614] INFO  org.apache.solr.core.SolrCore  ? newest
commit generation = 1
   [junit4]   1> 449054 [qtp1113097340-614] INFO  org.apache.solr.search.SolrIndexSearcher
 ? Opening Searcher@5a16d652 realtime
   [junit4]   1> 449054 [qtp1113097340-614] INFO  org.apache.solr.update.processor.LogUpdateProcessor
 ? [collection1] webapp=/solr path=/update params={wt=javabin&version=2} {deleteByQuery=*:*
(-1441304810342055936)} 0 11
   [junit4]   1> 449566 [qtp1113097340-615] INFO  org.apache.solr.update.processor.LogUpdateProcessor
 ? [collection1] webapp=/solr path=/update params={wt=javabin&version=2} {add=[1 (1441304810416504832),
2 (1441304810418601984), 3 (1441304810418601985), 4 (1441304810418601986), 5 (1441304810419650560),
6 (1441304810419650561), 7 (1441304810420699136), 8 (1441304810420699137), 9 (1441304810421747712),
10 (1441304810421747713), ... (1000 adds)]} 0 452
   [junit4]   1> 449574 [qtp1113097340-617] INFO  org.apache.solr.update.UpdateHandler
 ? start commit{,optimize=false,openSearcher=true,waitSearcher=true,expungeDeletes=false,softCommit=false,prepareCommit=false}
   [junit4]   1> 449666 [qtp1113097340-617] INFO  org.apache.solr.core.SolrCore  ? SolrDeletionPolicy.onCommit:
commits: num=2
   [junit4]   1> 	commit{dir=MockDirWrapper(org.apache.lucene.store.RAMDirectory@10bc5ebf
lockFactory=org.apache.lucene.store.NativeFSLockFactory@2682eedf),segFN=segments_1,generation=1}
   [junit4]   1> 	commit{dir=MockDirWrapper(org.apache.lucene.store.RAMDirectory@10bc5ebf
lockFactory=org.apache.lucene.store.NativeFSLockFactory@2682eedf),segFN=segments_2,generation=2}
   [junit4]   1> 449667 [qtp1113097340-617] INFO  org.apache.solr.core.SolrCore  ? newest
commit generation = 2
   [junit4]   1> 449669 [qtp1113097340-617] INFO  org.apache.solr.search.SolrIndexSearcher
 ? Opening Searcher@136245d3 main
   [junit4]   1> 449670 [searcherExecutor-325-thread-1] INFO  org.apache.solr.core.SolrCore
 ? QuerySenderListener sending requests to Searcher@136245d3 main{StandardDirectoryReader(segments_2:3:nrt
_0(5.0):C1000)}
   [junit4]   1> 449671 [searcherExecutor-325-thread-1] INFO  org.apache.solr.core.SolrCore
 ? QuerySenderListener done.
   [junit4]   1> 449679 [searcherExecutor-325-thread-1] INFO  org.apache.solr.core.SolrCore
 ? [collection1] Registered new searcher Searcher@136245d3 main{StandardDirectoryReader(segments_2:3:nrt
_0(5.0):C1000)}
   [junit4]   1> 449680 [qtp1113097340-617] INFO  org.apache.solr.update.UpdateHandler
 ? end_commit_flush
   [junit4]   1> 449680 [qtp1113097340-617] INFO  org.apache.solr.update.processor.LogUpdateProcessor
 ? [collection1] webapp=/solr path=/update params={waitSearcher=true&commit=true&wt=javabin&version=2&softCommit=false}
{commit=} 0 106
   [junit4]   1> 449686 [qtp1113097340-618] INFO  org.apache.solr.core.SolrCore  ? [collection1]
webapp=/solr path=/select params={q=*:*&wt=javabin&version=2} hits=1000 status=0 QTime=1

   [junit4]   1> 449693 [TEST-TestBatchUpdate.testWithBinaryBean-seed#[C25C53179091FCC5]]
INFO  org.apache.solr.SolrTestCaseJ4  ? ###Ending testWithBinaryBean
   [junit4]   1> 449705 [TEST-TestBatchUpdate.testWithXml-seed#[C25C53179091FCC5]] INFO
 org.apache.solr.SolrTestCaseJ4  ? ###Starting testWithXml
   [junit4]   1> 449744 [qtp1113097340-613] INFO  org.apache.solr.search.SolrIndexSearcher
 ? Opening Searcher@791b6956 realtime
   [junit4]   1> 449745 [qtp1113097340-613] INFO  org.apache.solr.update.processor.LogUpdateProcessor
 ? [collection1] webapp=/solr path=/update params={wt=javabin&version=2} {deleteByQuery=*:*
(-1441304811040407552)} 0 37
   [junit4]   1> 450488 [qtp1113097340-614] INFO  org.apache.solr.update.processor.LogUpdateProcessor
 ? [collection1] webapp=/solr path=/update params={wt=javabin&version=2} {add=[1 (1441304811115905024),
2 (1441304811122196480), 3 (1441304811122196481), 4 (1441304811123245056), 5 (1441304811123245057),
6 (1441304811124293632), 7 (1441304811124293633), 8 (1441304811124293634), 9 (1441304811125342208),
10 (1441304811125342209), ... (1000 adds)]} 0 708
   [junit4]   1> 464747 [commitScheduler-327-thread-1] INFO  org.apache.solr.update.UpdateHandler
 ? start commit{,optimize=false,openSearcher=false,waitSearcher=true,expungeDeletes=false,softCommit=false,prepareCommit=false}
   [junit4]   1> 464778 [commitScheduler-327-thread-1] INFO  org.apache.solr.core.SolrCore
 ? SolrDeletionPolicy.onCommit: commits: num=2
   [junit4]   1> 	commit{dir=MockDirWrapper(org.apache.lucene.store.RAMDirectory@10bc5ebf
lockFactory=org.apache.lucene.store.NativeFSLockFactory@2682eedf),segFN=segments_2,generation=2}
   [junit4]   1> 	commit{dir=MockDirWrapper(org.apache.lucene.store.RAMDirectory@10bc5ebf
lockFactory=org.apache.lucene.store.NativeFSLockFactory@2682eedf),segFN=segments_3,generation=3}
   [junit4]   1> 464778 [commitScheduler-327-thread-1] INFO  org.apache.solr.core.SolrCore
 ? newest commit generation = 3
   [junit4]   1> 464780 [commitScheduler-327-thread-1] INFO  org.apache.solr.search.SolrIndexSearcher
 ? Opening Searcher@670b539a realtime
   [junit4]   1> 464783 [commitScheduler-327-thread-1] INFO  org.apache.solr.update.UpdateHandler
 ? end_commit_flush
   [junit4]   1> 650545 [TEST-TestBatchUpdate.testWithXml-seed#[C25C53179091FCC5]] INFO
 org.apache.solr.SolrTestCaseJ4  ? ###Ending testWithXml
   [junit4]   1> 650546 [qtp1113097340-616] INFO  org.apache.solr.update.UpdateHandler
 ? start commit{,optimize=false,openSearcher=true,waitSearcher=true,expungeDeletes=false,softCommit=false,prepareCommit=false}
   [junit4]   1> 650551 [qtp1113097340-616] INFO  org.apache.solr.update.UpdateHandler
 ? No uncommitted changes. Skipping IW.commit.
   [junit4]   1> 650555 [qtp1113097340-616] INFO  org.apache.solr.search.SolrIndexSearcher
 ? Opening Searcher@697d8906 main
   [junit4]   1> 650559 [qtp1113097340-616] INFO  org.apache.solr.update.UpdateHandler
 ? end_commit_flush
   [junit4]   1> 650561 [searcherExecutor-325-thread-1] INFO  org.apache.solr.core.SolrCore
 ? QuerySenderListener sending requests to Searcher@697d8906 main{StandardDirectoryReader(segments_3:7:nrt
_1(5.0):C1000)}
   [junit4]   1> 650562 [searcherExecutor-325-thread-1] INFO  org.apache.solr.core.SolrCore
 ? QuerySenderListener done.
   [junit4]   1> 650572 [searcherExecutor-325-thread-1] INFO  org.apache.solr.core.SolrCore
 ? [collection1] Registered new searcher Searcher@697d8906 main{StandardDirectoryReader(segments_3:7:nrt
_1(5.0):C1000)}
   [junit4]   1> 650573 [qtp1113097340-616] INFO  org.apache.solr.update.processor.LogUpdateProcessor
 ? [collection1] webapp=/solr path=/update params={waitSearcher=true&commit=true&wt=javabin&version=2&softCommit=false}
{commit=} 0 27
   [junit4]   2> NOTE: reproduce with: ant test  -Dtestcase=TestBatchUpdate -Dtests.method=testWithXml
-Dtests.seed=C25C53179091FCC5 -Dtests.slow=true -Dtests.locale=en_NZ -Dtests.timezone=Africa/Bamako
-Dtests.file.encoding=UTF-8
   [junit4] ERROR    201s | TestBatchUpdate.testWithXml <<<
   [junit4]    > Throwable #1: org.apache.solr.client.solrj.SolrServerException: IOException
occured when talking to server at: https://127.0.0.1:51913/solr/collection1
   [junit4]    > 	at __randomizedtesting.SeedInfo.seed([C25C53179091FCC5:69BEEAE11297E5A8]:0)
   [junit4]    > 	at org.apache.solr.client.solrj.impl.HttpSolrServer.request(HttpSolrServer.java:435)
   [junit4]    > 	at org.apache.solr.client.solrj.impl.HttpSolrServer.request(HttpSolrServer.java:180)
   [junit4]    > 	at org.apache.solr.client.solrj.request.AbstractUpdateRequest.process(AbstractUpdateRequest.java:117)
   [junit4]    > 	at org.apache.solr.client.solrj.SolrServer.commit(SolrServer.java:168)
   [junit4]    > 	at org.apache.solr.client.solrj.SolrServer.commit(SolrServer.java:146)
   [junit4]    > 	at org.apache.solr.client.solrj.TestBatchUpdate.doIt(TestBatchUpdate.java:130)
   [junit4]    > 	at org.apache.solr.client.solrj.TestBatchUpdate.testWithXml(TestBatchUpdate.java:54)
   [junit4]    > 	at java.lang.Thread.run(Thread.java:724)
   [junit4]    > Caused by: org.apache.http.NoHttpResponseException: The target server
failed to respond
   [junit4]    > 	at org.apache.http.impl.conn.DefaultHttpResponseParser.parseHead(DefaultHttpResponseParser.java:95)
   [junit4]    > 	at org.apache.http.impl.conn.DefaultHttpResponseParser.parseHead(DefaultHttpResponseParser.java:62)
   [junit4]    > 	at org.apache.http.impl.io.AbstractMessageParser.parse(AbstractMessageParser.java:254)
   [junit4]    > 	at org.apache.http.impl.AbstractHttpClientConnection.receiveResponseHeader(AbstractHttpClientConnection.java:289)
   [junit4]    > 	at org.apache.http.impl.conn.DefaultClientConnection.receiveResponseHeader(DefaultClientConnection.java:252)
   [junit4]    > 	at org.apache.http.impl.conn.ManagedClientConnectionImpl.receiveResponseHeader(ManagedClientConnectionImpl.java:191)
   [junit4]    > 	at org.apache.http.protocol.HttpRequestExecutor.doReceiveResponse(HttpRequestExecutor.java:300)
   [junit4]    > 	at org.apache.http.protocol.HttpRequestExecutor.execute(HttpRequestExecutor.java:127)
   [junit4]    > 	at org.apache.http.impl.client.DefaultRequestDirector.tryExecute(DefaultRequestDirector.java:717)
   [junit4]    > 	at org.apache.http.impl.client.DefaultRequestDirector.execute(DefaultRequestDirector.java:522)
   [junit4]    > 	at org.apache.http.impl.client.AbstractHttpClient.execute(AbstractHttpClient.java:906)
   [junit4]    > 	at org.apache.http.impl.client.AbstractHttpClient.execute(AbstractHttpClient.java:805)
   [junit4]    > 	at org.apache.http.impl.client.AbstractHttpClient.execute(AbstractHttpClient.java:784)
   [junit4]    > 	at org.apache.solr.client.solrj.impl.HttpSolrServer.request(HttpSolrServer.java:365)
   [junit4]    > 	... 46 more
   [junit4]   1> 650748 [TEST-TestBatchUpdate.testWithBinary-seed#[C25C53179091FCC5]] INFO
 org.apache.solr.SolrTestCaseJ4  ? ###Starting testWithBinary
   [junit4]   1> 650771 [qtp1113097340-618] INFO  org.apache.solr.search.SolrIndexSearcher
 ? Opening Searcher@7d54d68b realtime
   [junit4]   1> 650772 [qtp1113097340-618] INFO  org.apache.solr.update.processor.LogUpdateProcessor
 ? [collection1] webapp=/solr path=/update params={wt=javabin&version=2} {deleteByQuery=*:*
(-1441305021855563776)} 0 15
   [junit4]   1> 651236 [qtp1113097340-613] INFO  org.apache.solr.update.processor.LogUpdateProcessor
 ? [collection1] webapp=/solr path=/update params={wt=javabin&version=2} {add=[1 (1441305021885972480),
2 (1441305021887021056), 3 (1441305021888069632), 4 (1441305021888069633), 5 (1441305021888069634),
6 (1441305021889118208), 7 (1441305021889118209), 8 (1441305021889118210), 9 (1441305021890166784),
10 (1441305021890166785), ... (1000 adds)]} 0 449
   [junit4]   1> 651244 [qtp1113097340-615] INFO  org.apache.solr.update.UpdateHandler
 ? start commit{,optimize=false,openSearcher=true,waitSearcher=true,expungeDeletes=false,softCommit=false,prepareCommit=false}
   [junit4]   1> 651285 [qtp1113097340-615] INFO  org.apache.solr.core.SolrCore  ? SolrDeletionPolicy.onCommit:
commits: num=2
   [junit4]   1> 	commit{dir=MockDirWrapper(org.apache.lucene.store.RAMDirectory@10bc5ebf
lockFactory=org.apache.lucene.store.NativeFSLockFactory@2682eedf),segFN=segments_3,generation=3}
   [junit4]   1> 	commit{dir=MockDirWrapper(org.apache.lucene.store.RAMDirectory@10bc5ebf
lockFactory=org.apache.lucene.store.NativeFSLockFactory@2682eedf),segFN=segments_4,generation=4}
   [junit4]   1> 651286 [qtp1113097340-615] INFO  org.apache.solr.core.SolrCore  ? newest
commit generation = 4
   [junit4]   1> 651289 [qtp1113097340-615] INFO  org.apache.solr.search.SolrIndexSearcher
 ? Opening Searcher@3681772 main
   [junit4]   1> 651291 [qtp1113097340-615] INFO  org.apache.solr.update.UpdateHandler
 ? end_commit_flush
   [junit4]   1> 651291 [searcherExecutor-325-thread-1] INFO  org.apache.solr.core.SolrCore
 ? QuerySenderListener sending requests to Searcher@3681772 main{StandardDirectoryReader(segments_4:11:nrt
_2(5.0):C1000)}
   [junit4]   1> 651292 [searcherExecutor-325-thread-1] INFO  org.apache.solr.core.SolrCore
 ? QuerySenderListener done.
   [junit4]   1> 651295 [searcherExecutor-325-thread-1] INFO  org.apache.solr.core.SolrCore
 ? [collection1] Registered new searcher Searcher@3681772 main{StandardDirectoryReader(segments_4:11:nrt
_2(5.0):C1000)}
   [junit4]   1> 651296 [qtp1113097340-615] INFO  org.apache.solr.update.processor.LogUpdateProcessor
 ? [collection1] webapp=/solr path=/update params={waitSearcher=true&commit=true&wt=javabin&version=2&softCommit=false}
{commit=} 0 52
   [junit4]   1> 651303 [qtp1113097340-616] INFO  org.apache.solr.core.SolrCore  ? [collection1]
webapp=/solr path=/select params={q=*:*&wt=javabin&version=2} hits=1000 status=0 QTime=1

   [junit4]   1> 651306 [TEST-TestBatchUpdate.testWithBinary-seed#[C25C53179091FCC5]] INFO
 org.apache.solr.SolrTestCaseJ4  ? ###Ending testWithBinary
   [junit4]   1> 651322 [SUITE-TestBatchUpdate-seed#[C25C53179091FCC5]-worker] INFO  org.apache.solr.core.CoreContainer
 ? Shutting down CoreContainer instance=1619525211
   [junit4]   1> 651331 [SUITE-TestBatchUpdate-seed#[C25C53179091FCC5]-worker] INFO  org.apache.solr.core.SolrCore
 ? [collection1]  CLOSING SolrCore org.apache.solr.core.SolrCore@58d87cf5
   [junit4]   1> 651373 [SUITE-TestBatchUpdate-seed#[C25C53179091FCC5]-worker] INFO  org.apache.solr.update.UpdateHandler
 ? closing DirectUpdateHandler2{commits=4,autocommit maxTime=15000ms,autocommits=1,soft autocommits=0,optimizes=0,rollbacks=0,expungeDeletes=0,docsPending=0,adds=0,deletesById=0,deletesByQuery=0,errors=0,cumulative_adds=3000,cumulative_deletesById=0,cumulative_deletesByQuery=3,cumulative_errors=0}
   [junit4]   1> 651375 [SUITE-TestBatchUpdate-seed#[C25C53179091FCC5]-worker] INFO  org.apache.solr.update.SolrCoreState
 ? Closing SolrCoreState
   [junit4]   1> 651375 [SUITE-TestBatchUpdate-seed#[C25C53179091FCC5]-worker] INFO  org.apache.solr.update.DefaultSolrCoreState
 ? SolrCoreState ref count has reached 0 - closing IndexWriter
   [junit4]   1> 651376 [SUITE-TestBatchUpdate-seed#[C25C53179091FCC5]-worker] INFO  org.apache.solr.update.DefaultSolrCoreState
 ? closing IndexWriter with IndexWriterCloser
   [junit4]   1> 651381 [SUITE-TestBatchUpdate-seed#[C25C53179091FCC5]-worker] INFO  org.apache.solr.core.SolrCore
 ? [collection1] Closing main searcher on request.
   [junit4]   1> 651382 [SUITE-TestBatchUpdate-seed#[C25C53179091FCC5]-worker] INFO  org.apache.solr.core.CachingDirectoryFactory
 ? Closing MockDirectoryFactory - 2 directories currently being tracked
   [junit4]   1> 651383 [SUITE-TestBatchUpdate-seed#[C25C53179091FCC5]-worker] INFO  org.apache.solr.core.CachingDirectoryFactory
 ? looking to close /Users/jenkins/jenkins-slave/workspace/Lucene-Solr-trunk-MacOSX/solr/build/solr-solrj/test/J0/solrtest-TestBatchUpdate-1374535377987
[CachedDir<<refCount=0;path=/Users/jenkins/jenkins-slave/workspace/Lucene-Solr-trunk-MacOSX/solr/build/solr-solrj/test/J0/solrtest-TestBatchUpdate-1374535377987;done=false>>]
   [junit4]   1> 651384 [SUITE-TestBatchUpdate-seed#[C25C53179091FCC5]-worker] INFO  org.apache.solr.core.CachingDirectoryFactory
 ? Closing directory: /Users/jenkins/jenkins-slave/workspace/Lucene-Solr-trunk-MacOSX/solr/build/solr-solrj/test/J0/solrtest-TestBatchUpdate-1374535377987
   [junit4]   1> 651384 [SUITE-TestBatchUpdate-seed#[C25C53179091FCC5]-worker] INFO  org.apache.solr.core.CachingDirectoryFactory
 ? looking to close /Users/jenkins/jenkins-slave/workspace/Lucene-Solr-trunk-MacOSX/solr/build/solr-solrj/test/J0/solrtest-TestBatchUpdate-1374535377987/index
[CachedDir<<refCount=0;path=/Users/jenkins/jenkins-slave/workspace/Lucene-Solr-trunk-MacOSX/solr/build/solr-solrj/test/J0/solrtest-TestBatchUpdate-1374535377987/index;done=false>>]
   [junit4]   1> 651385 [SUITE-TestBatchUpdate-seed#[C25C53179091FCC5]-worker] INFO  org.apache.solr.core.CachingDirectoryFactory
 ? Closing directory: /Users/jenkins/jenkins-slave/workspace/Lucene-Solr-trunk-MacOSX/solr/build/solr-solrj/test/J0/solrtest-TestBatchUpdate-1374535377987/index
   [junit4]   1> 651386 [SUITE-TestBatchUpdate-seed#[C25C53179091FCC5]-worker] INFO  org.eclipse.jetty.server.handler.ContextHandler
 ? stopped o.e.j.s.ServletContextHandler{/solr,null}
   [junit4]   1> 651441 [SUITE-TestBatchUpdate-seed#[C25C53179091FCC5]-worker] INFO  org.apache.solr.SolrTestCaseJ4
 ? ###deleteCore
   [junit4]   2> NOTE: test params are: codec=Lucene42: {}, docValues:{}, sim=DefaultSimilarity,
locale=en_NZ, timezone=Africa/Bamako
   [junit4]   2> NOTE: Mac OS X 10.8.4 x86_64/Oracle Corporation 1.7.0_25 (64-bit)/cpus=2,threads=1,free=27151144,total=104726528
   [junit4]   2> NOTE: All tests run in this JVM: [LargeVolumeJettyTest, FacetFieldTest,
ModifiableSolrParamsTest, TestLBHttpSolrServer, DocumentAnalysisResponseTest, TestFastInputStream,
LargeVolumeEmbeddedTest, SolrExampleBinaryTest, JettyWebappTest, FieldAnalysisResponseTest,
SolrQueryTest, TestCoreAdmin, SolrExampleStreamingTest, TestNamedListCodec, TestDocumentObjectBinder,
SolrExceptionTest, NamedListTest, TestUpdateRequestCodec, TestEmbeddedSolrServer, MultiCoreExampleJettyTest,
TermsResponseTest, CloudSolrServerTest, SolrExampleStreamingBinaryTest, SolrExampleXMLTest,
SolrExampleJettyTest, SolrExampleEmbeddedTest, BasicHttpSolrServerTest, LargeVolumeBinaryJettyTest,
TestBatchUpdate]
   [junit4] Completed in 204.23s, 3 tests, 1 error <<< FAILURES!

[...truncated 54 lines...]
BUILD FAILED
/Users/jenkins/jenkins-slave/workspace/Lucene-Solr-trunk-MacOSX/build.xml:389: The following
error occurred while executing this line:
/Users/jenkins/jenkins-slave/workspace/Lucene-Solr-trunk-MacOSX/build.xml:369: The following
error occurred while executing this line:
/Users/jenkins/jenkins-slave/workspace/Lucene-Solr-trunk-MacOSX/build.xml:39: The following
error occurred while executing this line:
/Users/jenkins/jenkins-slave/workspace/Lucene-Solr-trunk-MacOSX/solr/build.xml:194: The following
error occurred while executing this line:
/Users/jenkins/jenkins-slave/workspace/Lucene-Solr-trunk-MacOSX/solr/common-build.xml:449:
The following error occurred while executing this line:
/Users/jenkins/jenkins-slave/workspace/Lucene-Solr-trunk-MacOSX/lucene/common-build.xml:1247:
The following error occurred while executing this line:
/Users/jenkins/jenkins-slave/workspace/Lucene-Solr-trunk-MacOSX/lucene/common-build.xml:890:
There were test failures: 46 suites, 272 tests, 1 error

Total time: 115 minutes 53 seconds
Build step 'Invoke Ant' marked build as failure
Description set: Java: 64bit/jdk1.7.0 -XX:+UseCompressedOops -XX:+UseConcMarkSweepGC
Archiving artifacts
Recording test results
Email was triggered for: Failure
Sending email for trigger: Failure



Mime
View raw message