lucene-dev mailing list archives

Site index · List index
Message view « Date » · « Thread »
Top « Date » · « Thread »
From "Uwe Schindler" <...@thetaphi.de>
Subject RE: [JENKINS] Lucene-Solr-trunk-Windows (64bit/jdk1.7.0_25) - Build # 3019 - Failure!
Date Wed, 10 Jul 2013 09:44:24 GMT
This looks like a real error in the new BlockDirectory!

-----
Uwe Schindler
H.-H.-Meier-Allee 63, D-28213 Bremen
http://www.thetaphi.de
eMail: uwe@thetaphi.de


> -----Original Message-----
> From: Policeman Jenkins Server [mailto:jenkins@thetaphi.de]
> Sent: Wednesday, July 10, 2013 11:37 AM
> To: dev@lucene.apache.org; koji@apache.org
> Subject: [JENKINS] Lucene-Solr-trunk-Windows (64bit/jdk1.7.0_25) - Build #
> 3019 - Failure!
> 
> Build: http://jenkins.thetaphi.de/job/Lucene-Solr-trunk-Windows/3019/
> Java: 64bit/jdk1.7.0_25 -XX:+UseCompressedOops -
> XX:+UseConcMarkSweepGC
> 
> 1 tests failed.
> REGRESSION:
> org.apache.solr.store.blockcache.BlockDirectoryTest.testRandomAccessWrit
> es
> 
> Error Message:
> Test failed on pass [8]
> 
> Stack Trace:
> java.lang.AssertionError: Test failed on pass [8]
> 	at
> __randomizedtesting.SeedInfo.seed([B5A6D867604C87FD:4507EE6E6781C3B
> 1]:0)
> 	at org.junit.Assert.fail(Assert.java:93)
> 	at
> org.apache.solr.store.blockcache.BlockDirectoryTest.testRandomAccessWrit
> es(BlockDirectoryTest.java:163)
> 	at sun.reflect.NativeMethodAccessorImpl.invoke0(Native Method)
> 	at
> sun.reflect.NativeMethodAccessorImpl.invoke(NativeMethodAccessorImpl.j
> ava:57)
> 	at
> sun.reflect.DelegatingMethodAccessorImpl.invoke(DelegatingMethodAcces
> sorImpl.java:43)
> 	at java.lang.reflect.Method.invoke(Method.java:606)
> 	at
> com.carrotsearch.randomizedtesting.RandomizedRunner.invoke(Randomize
> dRunner.java:1559)
> 	at
> com.carrotsearch.randomizedtesting.RandomizedRunner.access$600(Rando
> mizedRunner.java:79)
> 	at
> com.carrotsearch.randomizedtesting.RandomizedRunner$6.evaluate(Rando
> mizedRunner.java:737)
> 	at
> com.carrotsearch.randomizedtesting.RandomizedRunner$7.evaluate(Rando
> mizedRunner.java:773)
> 	at
> com.carrotsearch.randomizedtesting.RandomizedRunner$8.evaluate(Rando
> mizedRunner.java:787)
> 	at
> org.apache.lucene.util.TestRuleSetupTeardownChained$1.evaluate(TestRule
> SetupTeardownChained.java:50)
> 	at
> org.apache.lucene.util.TestRuleFieldCacheSanity$1.evaluate(TestRuleFieldCa
> cheSanity.java:51)
> 	at
> org.apache.lucene.util.AbstractBeforeAfterRule$1.evaluate(AbstractBeforeA
> fterRule.java:46)
> 	at
> com.carrotsearch.randomizedtesting.rules.SystemPropertiesInvariantRule$1
> .evaluate(SystemPropertiesInvariantRule.java:55)
> 	at
> org.apache.lucene.util.TestRuleThreadAndTestName$1.evaluate(TestRuleTh
> readAndTestName.java:49)
> 	at
> org.apache.lucene.util.TestRuleIgnoreAfterMaxFailures$1.evaluate(TestRule
> IgnoreAfterMaxFailures.java:70)
> 	at
> org.apache.lucene.util.TestRuleMarkFailure$1.evaluate(TestRuleMarkFailure
> .java:48)
> 	at
> com.carrotsearch.randomizedtesting.rules.StatementAdapter.evaluate(Stat
> ementAdapter.java:36)
> 	at
> com.carrotsearch.randomizedtesting.ThreadLeakControl$StatementRunner.
> run(ThreadLeakControl.java:358)
> 	at
> com.carrotsearch.randomizedtesting.ThreadLeakControl.forkTimeoutingTask
> (ThreadLeakControl.java:782)
> 	at
> com.carrotsearch.randomizedtesting.ThreadLeakControl$3.evaluate(ThreadL
> eakControl.java:442)
> 	at
> com.carrotsearch.randomizedtesting.RandomizedRunner.runSingleTest(Ran
> domizedRunner.java:746)
> 	at
> com.carrotsearch.randomizedtesting.RandomizedRunner$3.evaluate(Rando
> mizedRunner.java:648)
> 	at
> com.carrotsearch.randomizedtesting.RandomizedRunner$4.evaluate(Rando
> mizedRunner.java:682)
> 	at
> com.carrotsearch.randomizedtesting.RandomizedRunner$5.evaluate(Rando
> mizedRunner.java:693)
> 	at
> org.apache.lucene.util.AbstractBeforeAfterRule$1.evaluate(AbstractBeforeA
> fterRule.java:46)
> 	at
> org.apache.lucene.util.TestRuleStoreClassName$1.evaluate(TestRuleStoreCl
> assName.java:42)
> 	at
> com.carrotsearch.randomizedtesting.rules.SystemPropertiesInvariantRule$1
> .evaluate(SystemPropertiesInvariantRule.java:55)
> 	at
> com.carrotsearch.randomizedtesting.rules.NoShadowingOrOverridesOnMet
> hodsRule$1.evaluate(NoShadowingOrOverridesOnMethodsRule.java:39)
> 	at
> com.carrotsearch.randomizedtesting.rules.NoShadowingOrOverridesOnMet
> hodsRule$1.evaluate(NoShadowingOrOverridesOnMethodsRule.java:39)
> 	at
> com.carrotsearch.randomizedtesting.rules.StatementAdapter.evaluate(Stat
> ementAdapter.java:36)
> 	at
> org.apache.lucene.util.TestRuleAssertionsRequired$1.evaluate(TestRuleAss
> ertionsRequired.java:43)
> 	at
> org.apache.lucene.util.TestRuleMarkFailure$1.evaluate(TestRuleMarkFailure
> .java:48)
> 	at
> org.apache.lucene.util.TestRuleIgnoreAfterMaxFailures$1.evaluate(TestRule
> IgnoreAfterMaxFailures.java:70)
> 	at
> org.apache.lucene.util.TestRuleIgnoreTestSuites$1.evaluate(TestRuleIgnore
> TestSuites.java:55)
> 	at
> com.carrotsearch.randomizedtesting.rules.StatementAdapter.evaluate(Stat
> ementAdapter.java:36)
> 	at
> com.carrotsearch.randomizedtesting.ThreadLeakControl$StatementRunner.
> run(ThreadLeakControl.java:358)
> 	at java.lang.Thread.run(Thread.java:724)
> 
> 
> 
> 
> Build Log:
> [...truncated 10142 lines...]
>    [junit4] Suite: org.apache.solr.store.blockcache.BlockDirectoryTest
>    [junit4]   2> 2966904 T8400 oassb.BlockDirectory.<init> Block cache on write
> is disabled
>    [junit4]   2> 2966904 T8400 oassb.BlockDirectory.<init> Block cache on read
> is disabled
>    [junit4]   1> Total time is 4048ms
>    [junit4]   2> java.lang.IllegalArgumentException: n must be positive
>    [junit4]   2> 	at java.util.Random.nextInt(Random.java:300)
>    [junit4]   2> 	at
> com.carrotsearch.randomizedtesting.AssertingRandom.nextInt(AssertingRa
> ndom.java:81)
>    [junit4]   2> 	at
> org.apache.solr.store.blockcache.BlockDirectoryTest.assertInputsEquals(Bloc
> kDirectoryTest.java:182)
>    [junit4]   2> 	at
> org.apache.solr.store.blockcache.BlockDirectoryTest.testRandomAccessWrit
> es(BlockDirectoryTest.java:159)
>    [junit4]   2> 	at sun.reflect.NativeMethodAccessorImpl.invoke0(Native
> Method)
>    [junit4]   2> 	at
> sun.reflect.NativeMethodAccessorImpl.invoke(NativeMethodAccessorImpl.j
> ava:57)
>    [junit4]   2> 	at
> sun.reflect.DelegatingMethodAccessorImpl.invoke(DelegatingMethodAcces
> sorImpl.java:43)
>    [junit4]   2> 	at java.lang.reflect.Method.invoke(Method.java:606)
>    [junit4]   2> 	at
> com.carrotsearch.randomizedtesting.RandomizedRunner.invoke(Randomize
> dRunner.java:1559)
>    [junit4]   2> 	at
> com.carrotsearch.randomizedtesting.RandomizedRunner.access$600(Rando
> mizedRunner.java:79)
>    [junit4]   2> 	at
> com.carrotsearch.randomizedtesting.RandomizedRunner$6.evaluate(Rando
> mizedRunner.java:737)
>    [junit4]   2> 	at
> com.carrotsearch.randomizedtesting.RandomizedRunner$7.evaluate(Rando
> mizedRunner.java:773)
>    [junit4]   2> 	at
> com.carrotsearch.randomizedtesting.RandomizedRunner$8.evaluate(Rando
> mizedRunner.java:787)
>    [junit4]   2> 	at
> org.apache.lucene.util.TestRuleSetupTeardownChained$1.evaluate(TestRule
> SetupTeardownChained.java:50)
>    [junit4]   2> 	at
> org.apache.lucene.util.TestRuleFieldCacheSanity$1.evaluate(TestRuleFieldCa
> cheSanity.java:51)
>    [junit4]   2> 	at
> org.apache.lucene.util.AbstractBeforeAfterRule$1.evaluate(AbstractBeforeA
> fterRule.java:46)
>    [junit4]   2> 	at
> com.carrotsearch.randomizedtesting.rules.SystemPropertiesInvariantRule$1
> .evaluate(SystemPropertiesInvariantRule.java:55)
>    [junit4]   2> 	at
> org.apache.lucene.util.TestRuleThreadAndTestName$1.evaluate(TestRuleTh
> readAndTestName.java:49)
>    [junit4]   2> 	at
> org.apache.lucene.util.TestRuleIgnoreAfterMaxFailures$1.evaluate(TestRule
> IgnoreAfterMaxFailures.java:70)
>    [junit4]   2> 	at
> org.apache.lucene.util.TestRuleMarkFailure$1.evaluate(TestRuleMarkFailure
> .java:48)
>    [junit4]   2> 	at
> com.carrotsearch.randomizedtesting.rules.StatementAdapter.evaluate(Stat
> ementAdapter.java:36)
>    [junit4]   2> 	at
> com.carrotsearch.randomizedtesting.ThreadLeakControl$StatementRunner.
> run(ThreadLeakControl.java:358)
>    [junit4]   2> 	at
> com.carrotsearch.randomizedtesting.ThreadLeakControl.forkTimeoutingTask
> (ThreadLeakControl.java:782)
>    [junit4]   2> 	at
> com.carrotsearch.randomizedtesting.ThreadLeakControl$3.evaluate(ThreadL
> eakControl.java:442)
>    [junit4]   2> 	at
> com.carrotsearch.randomizedtesting.RandomizedRunner.runSingleTest(Ran
> domizedRunner.java:746)
>    [junit4]   2> 	at
> com.carrotsearch.randomizedtesting.RandomizedRunner$3.evaluate(Rando
> mizedRunner.java:648)
>    [junit4]   2> 	at
> com.carrotsearch.randomizedtesting.RandomizedRunner$4.evaluate(Rando
> mizedRunner.java:682)
>    [junit4]   2> 	at
> com.carrotsearch.randomizedtesting.RandomizedRunner$5.evaluate(Rando
> mizedRunner.java:693)
>    [junit4]   2> 	at
> org.apache.lucene.util.AbstractBeforeAfterRule$1.evaluate(AbstractBeforeA
> fterRule.java:46)
>    [junit4]   2> 	at
> org.apache.lucene.util.TestRuleStoreClassName$1.evaluate(TestRuleStoreCl
> assName.java:42)
>    [junit4]   2> 	at
> com.carrotsearch.randomizedtesting.rules.SystemPropertiesInvariantRule$1
> .evaluate(SystemPropertiesInvariantRule.java:55)
>    [junit4]   2> 	at
> com.carrotsearch.randomizedtesting.rules.NoShadowingOrOverridesOnMet
> hodsRule$1.evaluate(NoShadowingOrOverridesOnMethodsRule.java:39)
>    [junit4]   2> 	at
> com.carrotsearch.randomizedtesting.rules.NoShadowingOrOverridesOnMet
> hodsRule$1.evaluate(NoShadowingOrOverridesOnMethodsRule.java:39)
>    [junit4]   2> 	at
> com.carrotsearch.randomizedtesting.rules.StatementAdapter.evaluate(Stat
> ementAdapter.java:36)
>    [junit4]   2> 	at
> org.apache.lucene.util.TestRuleAssertionsRequired$1.evaluate(TestRuleAss
> ertionsRequired.java:43)
>    [junit4]   2> 	at
> org.apache.lucene.util.TestRuleMarkFailure$1.evaluate(TestRuleMarkFailure
> .java:48)
>    [junit4]   2> 	at
> org.apache.lucene.util.TestRuleIgnoreAfterMaxFailures$1.evaluate(TestRule
> IgnoreAfterMaxFailures.java:70)
>    [junit4]   2> 	at
> org.apache.lucene.util.TestRuleIgnoreTestSuites$1.evaluate(TestRuleIgnore
> TestSuites.java:55)
>    [junit4]   2> 	at
> com.carrotsearch.randomizedtesting.rules.StatementAdapter.evaluate(Stat
> ementAdapter.java:36)
>    [junit4]   2> 	at
> com.carrotsearch.randomizedtesting.ThreadLeakControl$StatementRunner.
> run(ThreadLeakControl.java:358)
>    [junit4]   2> 	at java.lang.Thread.run(Thread.java:724)
>    [junit4]   2> NOTE: reproduce with: ant test  -Dtestcase=BlockDirectoryTest
> -Dtests.method=testRandomAccessWrites -Dtests.seed=B5A6D867604C87FD
> -Dtests.slow=true -Dtests.locale=hi_IN -Dtests.timezone=PST8PDT -
> Dtests.file.encoding=US-ASCII
>    [junit4] FAILURE 2.48s | BlockDirectoryTest.testRandomAccessWrites <<<
>    [junit4]    > Throwable #1: java.lang.AssertionError: Test failed on pass [8]
>    [junit4]    > 	at
> __randomizedtesting.SeedInfo.seed([B5A6D867604C87FD:4507EE6E6781C3B
> 1]:0)
>    [junit4]    > 	at
> org.apache.solr.store.blockcache.BlockDirectoryTest.testRandomAccessWrit
> es(BlockDirectoryTest.java:163)
>    [junit4]    > 	at java.lang.Thread.run(Thread.java:724)
>    [junit4]   2> NOTE: test params are: codec=Lucene42: {}, docValues:{},
> sim=RandomSimilarityProvider(queryNorm=false,coord=no): {},
> locale=hi_IN, timezone=PST8PDT
>    [junit4]   2> NOTE: Windows 7 6.1 amd64/Oracle Corporation 1.7.0_25 (64-
> bit)/cpus=2,threads=1,free=254068280,total=519438336
>    [junit4]   2> NOTE: All tests run in this JVM: [TestBinaryField,
> ShardRoutingCustomTest, AnalysisAfterCoreReloadTest,
> SolrIndexConfigTest, TestJmxIntegration, TestUtils, TestDocumentBuilder,
> BasicFunctionalityTest, TestRemoteStreaming,
> TestSchemaSimilarityResource, DefaultValueUpdateProcessorTest,
> RequestHandlersTest, CurrencyFieldXmlFileTest, SolrCmdDistributorTest,
> TestLMJelinekMercerSimilarityFactory, LukeRequestHandlerTest,
> NumericFieldsTest, SolrRequestParserTest, TestWriterPerf,
> HdfsCollectionsAPIDistributedZkTest, AssignTest, TestSurroundQueryParser,
> HdfsChaosMonkeySafeLeaderTest, TestAtomicUpdateErrorCases,
> TestPluginEnable, TestMultiCoreConfBootstrap, TestMergePolicyConfig,
> TestReload, TestIndexSearcher, TimeZoneUtilsTest, DocValuesMultiTest,
> TestSolr4Spatial, ReturnFieldsTest, TestFaceting, TestCharFilters,
> PathHierarchyTokenizerFactoryTest, ChaosMonkeySafeLeaderTest,
> PrimUtilsTest, TestBadConfig, TestPostingsSolrHighlighter,
> HdfsBasicDistributedZkTest, IndexSchemaRuntimeFieldTest,
> TestDFRSimilarityFactory, SyncSliceTest, HdfsBasicDistributedZk2Test,
> DateFieldTest, ParsingFieldUpdateProcessorsTest, ShardRoutingTest,
> TestAddFieldRealTimeGet, AddSchemaFieldsUpdateProcessorFactoryTest,
> QueryResultKeyTest, TestLMDirichletSimilarityFactory,
> DirectSolrSpellCheckerTest, TestSchemaNameResource,
> SchemaVersionSpecificBehaviorTest, TestBinaryResponseWriter,
> TestSweetSpotSimilarityFactory, TestDynamicFieldCollectionResource,
> TestElisionMultitermQuery, SystemInfoHandlerTest, TestCodecSupport,
> ClusterStateTest, TestFastWriter, TermVectorComponentTest,
> TestRandomFaceting, TestArbitraryIndexDir, TestLazyCores, DOMUtilTest,
> ExternalFileFieldSortTest, BinaryUpdateRequestHandlerTest,
> IndexReaderFactoryTest, TestUpdate, IndexBasedSpellCheckerTest,
> SuggesterTSTTest, BadIndexSchemaTest, FileBasedSpellCheckerTest,
> TestSolrJ, SimpleFacetsTest, SpellCheckCollatorTest,
> UpdateRequestProcessorFactoryTest, TestSuggestSpellingConverter,
> DistanceFunctionTest, MBeansHandlerTest, SuggesterFSTTest,
> TestRangeQuery, BasicDistributedZk2Test, SortByFunctionTest,
> CSVRequestHandlerTest, TestZkChroot, SuggesterWFSTTest,
> DocumentBuilderTest, ChaosMonkeyNothingIsSafeTest,
> OverseerCollectionProcessorTest, TestCollationField, BasicHdfsTest,
> TestCSVLoader, TestNumberUtils, OutputWriterTest,
> DistributedQueryElevationComponentTest, TestCoreDiscovery,
> TestClassNameShortening, PluginInfoTest,
> SignatureUpdateProcessorFactoryTest, TestRealTimeGet,
> SpellCheckComponentTest, TestReversedWildcardFilterFactory,
> TestSolrCoreProperties, CopyFieldTest, NotRequiredUniqueKeyTest,
> TestDocSet, StandardRequestHandlerTest, TestJoin,
> TestMaxScoreQueryParser, TestRTGBase, BlockCacheTest,
> HardAutoCommitTest, TestBM25SimilarityFactory,
> DistributedSpellCheckComponentTest, DirectUpdateHandlerOptimizeTest,
> BadCopyFieldTest, TestConfig, FullSolrCloudDistribCmdsTest,
> ZkNodePropsTest, TestSolrXml, FieldAnalysisRequestHandlerTest,
> TestManagedSchema, TestRecoveryHdfs, CachingDirectoryFactoryTest,
> TestSolrXMLSerializer, TestHashPartitioner,
> TestPHPSerializedResponseWriter, TestWordDelimiterFilterFactory,
> TestManagedSchemaFieldResource, TestFieldTypeCollectionResource,
> OverseerTest, SolrCoreTest, TestSchemaVersionResource, TestRecovery,
> IndexSchemaTest, TestCSVResponseWriter, TestReplicationHandler,
> StatelessScriptUpdateProcessorFactoryTest, DebugComponentTest,
> RegexBoostProcessorTest, ShowFileRequestHandlerTest, SliceStateTest,
> SearchHandlerTest, TestTrie, JsonLoaderTest, TestSearchPerf,
> MoreLikeThisHandlerTest, BasicDistributedZkTest, UnloadDistributedZkTest,
> CollectionsAPIDistributedZkTest, OpenCloseCoreStressTest,
> LeaderElectionIntegrationTest, BasicZkTest, RecoveryZkTest,
> ClusterStateUpdateTest, LeaderElectionTest, ZkSolrClientTest,
> TestRandomDVFaceting, ZkCLITest, SliceStateUpdateTest,
> TestDistributedSearch, AutoCommitTest, TestDistributedGrouping,
> TermVectorComponentDistributedTest, ZkControllerTest,
> TestStressReorder, TestStressVersions, DistributedTermsComponentTest,
> TestCoreContainer, StatsComponentTest, TestGroupingSearch,
> QueryElevationComponentTest, PeerSyncTest, ConvertedLegacyTest,
> TestSort, TestFiltering, TestFunctionQuery, DirectUpdateHandlerTest,
> HighlighterTest, SoftAutoCommitTest, CurrencyFieldOpenExchangeTest,
> SolrIndexSplitterTest, SimplePostToolTest, TestExtendedDismaxParser,
> CoreAdminHandlerTest, TestFoldingMultitermQuery, DocValuesTest,
> SuggesterTest, TestStressLucene, SpatialFilterTest, PolyFieldTest,
> NoCacheHeaderTest, WordBreakSolrSpellCheckerTest,
> SolrCoreCheckLockOnStartupTest, TestPseudoReturnFields,
> FieldMutatingUpdateProcessorTest, QueryEqualityTest,
> TestSolrDeletionPolicy1, SolrInfoMBeanTest,
> XsltUpdateRequestHandlerTest, CacheHeaderTest,
> DisMaxRequestHandlerTest, TestQueryUtils,
> DocumentAnalysisRequestHandlerTest, TestQueryTypes,
> PrimitiveFieldTypeTest, TestOmitPositions, TermsComponentTest,
> XmlUpdateRequestHandlerTest, TestValueSourceCache,
> TestIndexingPerformance, RequiredFieldsTest, TestSolrQueryParser,
> FastVectorHighlighterTest, LoggingHandlerTest, SolrPluginUtilsTest,
> JSONWriterTest, QueryParsingTest, TestAnalyzedSuggestions,
> UniqFieldsUpdateProcessorFactoryTest, TestPartialUpdateDeduplication,
> PingRequestHandlerTest, TestComponentsName,
> CoreContainerCoreInitFailuresTest, TestLFUCache, HighlighterConfigTest,
> SOLR749Test, TestPropInject, TestQuerySenderListener,
> TestPropInjectDefaults, UpdateParamsTest, AlternateDirectoryTest,
> TestSolrIndexConfig, TestQuerySenderNoQuery,
> ResponseLogComponentTest, BadComponentTest, TestStressRecovery,
> TestSolrDeletionPolicy2, MultiTermTest, SampleTest, MinimalSchemaTest,
> TestFuzzyAnalyzedSuggestions, DirectSolrConnectionTest,
> TestLuceneMatchVersion, TestPhraseSuggestions,
> SpellPossibilityIteratorTest, SynonymTokenizerTest, TestXIncludeConfig,
> EchoParamsTest, TestPerFieldSimilarity, TestIBSimilarityFactory,
> TestDefaultSimilarityFactory, LegacyHTMLStripCharFilterTest,
> TestJmxMonitoredMap, ResourceLoaderTest, TestFastOutputStream,
> ScriptEngineTest, OpenExchangeRatesOrgProviderTest,
> URLClassifyProcessorTest, TestFastLRUCache, DateMathParserTest,
> PreAnalyzedFieldTest, TestSystemIdResolver, SpellingQueryConverterTest,
> RAMDirectoryFactoryTest, TestLRUCache, UUIDFieldTest, FileUtilsTest,
> CircularListTest, SolrTestCaseJ4Test, AliasIntegrationTest, DeleteShardTest,
> ShardSplitTest, HdfsRecoveryZkTest, HdfsSyncSliceTest,
> HdfsUnloadDistributedZkTest, TestInfoStreamLogging,
> TestReloadAndDeleteDocs, TestShardHandlerFactory,
> TestSolrXmlPersistence, CoreAdminCreateDiscoverTest,
> TestCopyFieldCollectionResource, TestDefaultSearchFieldResource,
> TestDynamicFieldResource, TestFieldCollectionResource, TestFieldResource,
> TestFieldTypeResource, TestSchemaResource,
> TestSerializedLuceneMatchVersion,
> TestSolrQueryParserDefaultOperatorResource,
> TestSolrQueryParserResource, TestUniqueKeyFieldResource,
> TestCloudManagedSchema, TestCloudManagedSchemaAddField,
> BlockDirectoryTest]
>    [junit4] Completed in 7.11s, 4 tests, 1 failure <<< FAILURES!
> 
> [...truncated 18 lines...]
> BUILD FAILED
> C:\Users\JenkinsSlave\workspace\Lucene-Solr-trunk-
> Windows\build.xml:389: The following error occurred while executing this
> line:
> C:\Users\JenkinsSlave\workspace\Lucene-Solr-trunk-
> Windows\build.xml:369: The following error occurred while executing this
> line:
> C:\Users\JenkinsSlave\workspace\Lucene-Solr-trunk-Windows\build.xml:39:
> The following error occurred while executing this line:
> C:\Users\JenkinsSlave\workspace\Lucene-Solr-trunk-
> Windows\solr\build.xml:181: The following error occurred while executing
> this line:
> C:\Users\JenkinsSlave\workspace\Lucene-Solr-trunk-
> Windows\solr\common-build.xml:449: The following error occurred while
> executing this line:
> C:\Users\JenkinsSlave\workspace\Lucene-Solr-trunk-
> Windows\lucene\common-build.xml:1247: The following error occurred
> while executing this line:
> C:\Users\JenkinsSlave\workspace\Lucene-Solr-trunk-
> Windows\lucene\common-build.xml:890: There were test failures: 316
> suites, 1333 tests, 1 failure, 39 ignored (11 assumptions)
> 
> Total time: 73 minutes 38 seconds
> Build step 'Invoke Ant' marked build as failure Description set: Java:
> 64bit/jdk1.7.0_25 -XX:+UseCompressedOops -XX:+UseConcMarkSweepGC
> Archiving artifacts Recording test results Email was triggered for: Failure
> Sending email for trigger: Failure
> 



---------------------------------------------------------------------
To unsubscribe, e-mail: dev-unsubscribe@lucene.apache.org
For additional commands, e-mail: dev-help@lucene.apache.org


Mime
View raw message