lucene-dev mailing list archives

Site index · List index
Message view « Date » · « Thread »
Top « Date » · « Thread »
From Policeman Jenkins Server <jenk...@thetaphi.de>
Subject [JENKINS] Lucene-Solr-trunk-MacOSX (64bit/jdk1.7.0) - Build # 558 - Failure!
Date Thu, 13 Jun 2013 17:07:41 GMT
Build: http://jenkins.thetaphi.de/job/Lucene-Solr-trunk-MacOSX/558/
Java: 64bit/jdk1.7.0 -XX:-UseCompressedOops -XX:+UseParallelGC

3 tests failed.
REGRESSION:  org.apache.solr.cloud.CollectionsAPIDistributedZkTest.testDistribSearch

Error Message:
collection already exists: awholynewcollection_0

Stack Trace:
org.apache.solr.client.solrj.impl.HttpSolrServer$RemoteSolrException: collection already exists: awholynewcollection_0
	at __randomizedtesting.SeedInfo.seed([DE706E57266620B7:5F96E04F5139408B]:0)
	at org.apache.solr.client.solrj.impl.HttpSolrServer.request(HttpSolrServer.java:424)
	at org.apache.solr.client.solrj.impl.HttpSolrServer.request(HttpSolrServer.java:180)
	at org.apache.solr.client.solrj.impl.LBHttpSolrServer.request(LBHttpSolrServer.java:264)
	at org.apache.solr.client.solrj.impl.CloudSolrServer.request(CloudSolrServer.java:306)
	at org.apache.solr.cloud.AbstractFullDistribZkTestBase.createCollection(AbstractFullDistribZkTestBase.java:1400)
	at org.apache.solr.cloud.CollectionsAPIDistributedZkTest.testCollectionsAPI(CollectionsAPIDistributedZkTest.java:438)
	at org.apache.solr.cloud.CollectionsAPIDistributedZkTest.doTest(CollectionsAPIDistributedZkTest.java:146)
	at org.apache.solr.BaseDistributedSearchTestCase.testDistribSearch(BaseDistributedSearchTestCase.java:815)
	at sun.reflect.NativeMethodAccessorImpl.invoke0(Native Method)
	at sun.reflect.NativeMethodAccessorImpl.invoke(NativeMethodAccessorImpl.java:57)
	at sun.reflect.DelegatingMethodAccessorImpl.invoke(DelegatingMethodAccessorImpl.java:43)
	at java.lang.reflect.Method.invoke(Method.java:601)
	at com.carrotsearch.randomizedtesting.RandomizedRunner.invoke(RandomizedRunner.java:1559)
	at com.carrotsearch.randomizedtesting.RandomizedRunner.access$600(RandomizedRunner.java:79)
	at com.carrotsearch.randomizedtesting.RandomizedRunner$6.evaluate(RandomizedRunner.java:737)
	at com.carrotsearch.randomizedtesting.RandomizedRunner$7.evaluate(RandomizedRunner.java:773)
	at com.carrotsearch.randomizedtesting.RandomizedRunner$8.evaluate(RandomizedRunner.java:787)
	at com.carrotsearch.randomizedtesting.rules.SystemPropertiesRestoreRule$1.evaluate(SystemPropertiesRestoreRule.java:53)
	at org.apache.lucene.util.TestRuleSetupTeardownChained$1.evaluate(TestRuleSetupTeardownChained.java:50)
	at org.apache.lucene.util.TestRuleFieldCacheSanity$1.evaluate(TestRuleFieldCacheSanity.java:51)
	at org.apache.lucene.util.AbstractBeforeAfterRule$1.evaluate(AbstractBeforeAfterRule.java:46)
	at com.carrotsearch.randomizedtesting.rules.SystemPropertiesInvariantRule$1.evaluate(SystemPropertiesInvariantRule.java:55)
	at org.apache.lucene.util.TestRuleThreadAndTestName$1.evaluate(TestRuleThreadAndTestName.java:49)
	at org.apache.lucene.util.TestRuleIgnoreAfterMaxFailures$1.evaluate(TestRuleIgnoreAfterMaxFailures.java:70)
	at org.apache.lucene.util.TestRuleMarkFailure$1.evaluate(TestRuleMarkFailure.java:48)
	at com.carrotsearch.randomizedtesting.rules.StatementAdapter.evaluate(StatementAdapter.java:36)
	at com.carrotsearch.randomizedtesting.ThreadLeakControl$StatementRunner.run(ThreadLeakControl.java:358)
	at com.carrotsearch.randomizedtesting.ThreadLeakControl.forkTimeoutingTask(ThreadLeakControl.java:782)
	at com.carrotsearch.randomizedtesting.ThreadLeakControl$3.evaluate(ThreadLeakControl.java:442)
	at com.carrotsearch.randomizedtesting.RandomizedRunner.runSingleTest(RandomizedRunner.java:746)
	at com.carrotsearch.randomizedtesting.RandomizedRunner$3.evaluate(RandomizedRunner.java:648)
	at com.carrotsearch.randomizedtesting.RandomizedRunner$4.evaluate(RandomizedRunner.java:682)
	at com.carrotsearch.randomizedtesting.RandomizedRunner$5.evaluate(RandomizedRunner.java:693)
	at com.carrotsearch.randomizedtesting.rules.StatementAdapter.evaluate(StatementAdapter.java:36)
	at com.carrotsearch.randomizedtesting.rules.SystemPropertiesRestoreRule$1.evaluate(SystemPropertiesRestoreRule.java:53)
	at org.apache.lucene.util.AbstractBeforeAfterRule$1.evaluate(AbstractBeforeAfterRule.java:46)
	at org.apache.lucene.util.TestRuleStoreClassName$1.evaluate(TestRuleStoreClassName.java:42)
	at com.carrotsearch.randomizedtesting.rules.SystemPropertiesInvariantRule$1.evaluate(SystemPropertiesInvariantRule.java:55)
	at com.carrotsearch.randomizedtesting.rules.NoShadowingOrOverridesOnMethodsRule$1.evaluate(NoShadowingOrOverridesOnMethodsRule.java:39)
	at com.carrotsearch.randomizedtesting.rules.NoShadowingOrOverridesOnMethodsRule$1.evaluate(NoShadowingOrOverridesOnMethodsRule.java:39)
	at com.carrotsearch.randomizedtesting.rules.StatementAdapter.evaluate(StatementAdapter.java:36)
	at org.apache.lucene.util.TestRuleAssertionsRequired$1.evaluate(TestRuleAssertionsRequired.java:43)
	at org.apache.lucene.util.TestRuleMarkFailure$1.evaluate(TestRuleMarkFailure.java:48)
	at org.apache.lucene.util.TestRuleIgnoreAfterMaxFailures$1.evaluate(TestRuleIgnoreAfterMaxFailures.java:70)
	at org.apache.lucene.util.TestRuleIgnoreTestSuites$1.evaluate(TestRuleIgnoreTestSuites.java:55)
	at com.carrotsearch.randomizedtesting.rules.StatementAdapter.evaluate(StatementAdapter.java:36)
	at com.carrotsearch.randomizedtesting.ThreadLeakControl$StatementRunner.run(ThreadLeakControl.java:358)
	at java.lang.Thread.run(Thread.java:722)


REGRESSION:  org.apache.solr.cloud.ShardSplitTest.testDistribSearch

Error Message:
Server at http://127.0.0.1:51138 returned non ok status:500, message:Server Error

Stack Trace:
org.apache.solr.client.solrj.impl.HttpSolrServer$RemoteSolrException: Server at http://127.0.0.1:51138 returned non ok status:500, message:Server Error
	at __randomizedtesting.SeedInfo.seed([DE706E57266620B7:5F96E04F5139408B]:0)
	at org.apache.solr.client.solrj.impl.HttpSolrServer.request(HttpSolrServer.java:385)
	at org.apache.solr.client.solrj.impl.HttpSolrServer.request(HttpSolrServer.java:180)
	at org.apache.solr.cloud.ShardSplitTest.splitShard(ShardSplitTest.java:228)
	at org.apache.solr.cloud.ShardSplitTest.doTest(ShardSplitTest.java:150)
	at org.apache.solr.BaseDistributedSearchTestCase.testDistribSearch(BaseDistributedSearchTestCase.java:815)
	at sun.reflect.GeneratedMethodAccessor46.invoke(Unknown Source)
	at sun.reflect.DelegatingMethodAccessorImpl.invoke(DelegatingMethodAccessorImpl.java:43)
	at java.lang.reflect.Method.invoke(Method.java:601)
	at com.carrotsearch.randomizedtesting.RandomizedRunner.invoke(RandomizedRunner.java:1559)
	at com.carrotsearch.randomizedtesting.RandomizedRunner.access$600(RandomizedRunner.java:79)
	at com.carrotsearch.randomizedtesting.RandomizedRunner$6.evaluate(RandomizedRunner.java:737)
	at com.carrotsearch.randomizedtesting.RandomizedRunner$7.evaluate(RandomizedRunner.java:773)
	at com.carrotsearch.randomizedtesting.RandomizedRunner$8.evaluate(RandomizedRunner.java:787)
	at com.carrotsearch.randomizedtesting.rules.SystemPropertiesRestoreRule$1.evaluate(SystemPropertiesRestoreRule.java:53)
	at org.apache.lucene.util.TestRuleSetupTeardownChained$1.evaluate(TestRuleSetupTeardownChained.java:50)
	at org.apache.lucene.util.TestRuleFieldCacheSanity$1.evaluate(TestRuleFieldCacheSanity.java:51)
	at org.apache.lucene.util.AbstractBeforeAfterRule$1.evaluate(AbstractBeforeAfterRule.java:46)
	at com.carrotsearch.randomizedtesting.rules.SystemPropertiesInvariantRule$1.evaluate(SystemPropertiesInvariantRule.java:55)
	at org.apache.lucene.util.TestRuleThreadAndTestName$1.evaluate(TestRuleThreadAndTestName.java:49)
	at org.apache.lucene.util.TestRuleIgnoreAfterMaxFailures$1.evaluate(TestRuleIgnoreAfterMaxFailures.java:70)
	at org.apache.lucene.util.TestRuleMarkFailure$1.evaluate(TestRuleMarkFailure.java:48)
	at com.carrotsearch.randomizedtesting.rules.StatementAdapter.evaluate(StatementAdapter.java:36)
	at com.carrotsearch.randomizedtesting.ThreadLeakControl$StatementRunner.run(ThreadLeakControl.java:358)
	at com.carrotsearch.randomizedtesting.ThreadLeakControl.forkTimeoutingTask(ThreadLeakControl.java:782)
	at com.carrotsearch.randomizedtesting.ThreadLeakControl$3.evaluate(ThreadLeakControl.java:442)
	at com.carrotsearch.randomizedtesting.RandomizedRunner.runSingleTest(RandomizedRunner.java:746)
	at com.carrotsearch.randomizedtesting.RandomizedRunner$3.evaluate(RandomizedRunner.java:648)
	at com.carrotsearch.randomizedtesting.RandomizedRunner$4.evaluate(RandomizedRunner.java:682)
	at com.carrotsearch.randomizedtesting.RandomizedRunner$5.evaluate(RandomizedRunner.java:693)
	at com.carrotsearch.randomizedtesting.rules.StatementAdapter.evaluate(StatementAdapter.java:36)
	at com.carrotsearch.randomizedtesting.rules.SystemPropertiesRestoreRule$1.evaluate(SystemPropertiesRestoreRule.java:53)
	at org.apache.lucene.util.AbstractBeforeAfterRule$1.evaluate(AbstractBeforeAfterRule.java:46)
	at org.apache.lucene.util.TestRuleStoreClassName$1.evaluate(TestRuleStoreClassName.java:42)
	at com.carrotsearch.randomizedtesting.rules.SystemPropertiesInvariantRule$1.evaluate(SystemPropertiesInvariantRule.java:55)
	at com.carrotsearch.randomizedtesting.rules.NoShadowingOrOverridesOnMethodsRule$1.evaluate(NoShadowingOrOverridesOnMethodsRule.java:39)
	at com.carrotsearch.randomizedtesting.rules.NoShadowingOrOverridesOnMethodsRule$1.evaluate(NoShadowingOrOverridesOnMethodsRule.java:39)
	at com.carrotsearch.randomizedtesting.rules.StatementAdapter.evaluate(StatementAdapter.java:36)
	at org.apache.lucene.util.TestRuleAssertionsRequired$1.evaluate(TestRuleAssertionsRequired.java:43)
	at org.apache.lucene.util.TestRuleMarkFailure$1.evaluate(TestRuleMarkFailure.java:48)
	at org.apache.lucene.util.TestRuleIgnoreAfterMaxFailures$1.evaluate(TestRuleIgnoreAfterMaxFailures.java:70)
	at org.apache.lucene.util.TestRuleIgnoreTestSuites$1.evaluate(TestRuleIgnoreTestSuites.java:55)
	at com.carrotsearch.randomizedtesting.rules.StatementAdapter.evaluate(StatementAdapter.java:36)
	at com.carrotsearch.randomizedtesting.ThreadLeakControl$StatementRunner.run(ThreadLeakControl.java:358)
	at java.lang.Thread.run(Thread.java:722)


REGRESSION:  org.apache.solr.core.TestMergePolicyConfig.testTieredMergePolicyConfig

Error Message:
expected:<0.0> but was:<1.0>

Stack Trace:
java.lang.AssertionError: expected:<0.0> but was:<1.0>
	at __randomizedtesting.SeedInfo.seed([DE706E57266620B7:7C8873D3780BD6DC]:0)
	at org.junit.Assert.fail(Assert.java:93)
	at org.junit.Assert.failNotEquals(Assert.java:647)
	at org.junit.Assert.assertEquals(Assert.java:443)
	at org.junit.Assert.assertEquals(Assert.java:512)
	at org.apache.solr.core.TestMergePolicyConfig.testTieredMergePolicyConfig(TestMergePolicyConfig.java:43)
	at sun.reflect.NativeMethodAccessorImpl.invoke0(Native Method)
	at sun.reflect.NativeMethodAccessorImpl.invoke(NativeMethodAccessorImpl.java:57)
	at sun.reflect.DelegatingMethodAccessorImpl.invoke(DelegatingMethodAccessorImpl.java:43)
	at java.lang.reflect.Method.invoke(Method.java:601)
	at com.carrotsearch.randomizedtesting.RandomizedRunner.invoke(RandomizedRunner.java:1559)
	at com.carrotsearch.randomizedtesting.RandomizedRunner.access$600(RandomizedRunner.java:79)
	at com.carrotsearch.randomizedtesting.RandomizedRunner$6.evaluate(RandomizedRunner.java:737)
	at com.carrotsearch.randomizedtesting.RandomizedRunner$7.evaluate(RandomizedRunner.java:773)
	at com.carrotsearch.randomizedtesting.RandomizedRunner$8.evaluate(RandomizedRunner.java:787)
	at com.carrotsearch.randomizedtesting.rules.SystemPropertiesRestoreRule$1.evaluate(SystemPropertiesRestoreRule.java:53)
	at org.apache.lucene.util.TestRuleSetupTeardownChained$1.evaluate(TestRuleSetupTeardownChained.java:50)
	at org.apache.lucene.util.TestRuleFieldCacheSanity$1.evaluate(TestRuleFieldCacheSanity.java:51)
	at org.apache.lucene.util.AbstractBeforeAfterRule$1.evaluate(AbstractBeforeAfterRule.java:46)
	at com.carrotsearch.randomizedtesting.rules.SystemPropertiesInvariantRule$1.evaluate(SystemPropertiesInvariantRule.java:55)
	at org.apache.lucene.util.TestRuleThreadAndTestName$1.evaluate(TestRuleThreadAndTestName.java:49)
	at org.apache.lucene.util.TestRuleIgnoreAfterMaxFailures$1.evaluate(TestRuleIgnoreAfterMaxFailures.java:70)
	at org.apache.lucene.util.TestRuleMarkFailure$1.evaluate(TestRuleMarkFailure.java:48)
	at com.carrotsearch.randomizedtesting.rules.StatementAdapter.evaluate(StatementAdapter.java:36)
	at com.carrotsearch.randomizedtesting.ThreadLeakControl$StatementRunner.run(ThreadLeakControl.java:358)
	at com.carrotsearch.randomizedtesting.ThreadLeakControl.forkTimeoutingTask(ThreadLeakControl.java:782)
	at com.carrotsearch.randomizedtesting.ThreadLeakControl$3.evaluate(ThreadLeakControl.java:442)
	at com.carrotsearch.randomizedtesting.RandomizedRunner.runSingleTest(RandomizedRunner.java:746)
	at com.carrotsearch.randomizedtesting.RandomizedRunner$3.evaluate(RandomizedRunner.java:648)
	at com.carrotsearch.randomizedtesting.RandomizedRunner$4.evaluate(RandomizedRunner.java:682)
	at com.carrotsearch.randomizedtesting.RandomizedRunner$5.evaluate(RandomizedRunner.java:693)
	at com.carrotsearch.randomizedtesting.rules.StatementAdapter.evaluate(StatementAdapter.java:36)
	at com.carrotsearch.randomizedtesting.rules.SystemPropertiesRestoreRule$1.evaluate(SystemPropertiesRestoreRule.java:53)
	at org.apache.lucene.util.AbstractBeforeAfterRule$1.evaluate(AbstractBeforeAfterRule.java:46)
	at org.apache.lucene.util.TestRuleStoreClassName$1.evaluate(TestRuleStoreClassName.java:42)
	at com.carrotsearch.randomizedtesting.rules.SystemPropertiesInvariantRule$1.evaluate(SystemPropertiesInvariantRule.java:55)
	at com.carrotsearch.randomizedtesting.rules.NoShadowingOrOverridesOnMethodsRule$1.evaluate(NoShadowingOrOverridesOnMethodsRule.java:39)
	at com.carrotsearch.randomizedtesting.rules.NoShadowingOrOverridesOnMethodsRule$1.evaluate(NoShadowingOrOverridesOnMethodsRule.java:39)
	at com.carrotsearch.randomizedtesting.rules.StatementAdapter.evaluate(StatementAdapter.java:36)
	at org.apache.lucene.util.TestRuleAssertionsRequired$1.evaluate(TestRuleAssertionsRequired.java:43)
	at org.apache.lucene.util.TestRuleMarkFailure$1.evaluate(TestRuleMarkFailure.java:48)
	at org.apache.lucene.util.TestRuleIgnoreAfterMaxFailures$1.evaluate(TestRuleIgnoreAfterMaxFailures.java:70)
	at org.apache.lucene.util.TestRuleIgnoreTestSuites$1.evaluate(TestRuleIgnoreTestSuites.java:55)
	at com.carrotsearch.randomizedtesting.rules.StatementAdapter.evaluate(StatementAdapter.java:36)
	at com.carrotsearch.randomizedtesting.ThreadLeakControl$StatementRunner.run(ThreadLeakControl.java:358)
	at java.lang.Thread.run(Thread.java:722)




Build Log:
[...truncated 9540 lines...]
[junit4:junit4] Suite: org.apache.solr.cloud.CollectionsAPIDistributedZkTest
[junit4:junit4]   2> 1290297 T2568 oas.BaseDistributedSearchTestCase.initHostContext Setting hostContext system property: /
[junit4:junit4]   2> 1290301 T2568 oas.SolrTestCaseJ4.setUp ###Starting testDistribSearch
[junit4:junit4]   2> Creating dataDir: /Users/jenkins/jenkins-slave/workspace/Lucene-Solr-trunk-MacOSX/solr/build/solr-core/test/J0/./solrtest-CollectionsAPIDistributedZkTest-1371141054480
[junit4:junit4]   2> 1290303 T2568 oasc.ZkTestServer.run STARTING ZK TEST SERVER
[junit4:junit4]   2> 1290304 T2569 oasc.ZkTestServer$ZKServerMain.runFromConfig Starting server
[junit4:junit4]   2> 1290405 T2568 oasc.ZkTestServer.run start zk server on port:49748
[junit4:junit4]   2> 1290410 T2568 oascc.ConnectionManager.waitForConnected Waiting for client to connect to ZooKeeper
[junit4:junit4]   2> 1290419 T2575 oascc.ConnectionManager.process Watcher org.apache.solr.common.cloud.ConnectionManager@283a3662 name:ZooKeeperConnection Watcher:127.0.0.1:49748 got event WatchedEvent state:SyncConnected type:None path:null path:null type:None
[junit4:junit4]   2> 1290420 T2568 oascc.ConnectionManager.waitForConnected Client is connected to ZooKeeper
[junit4:junit4]   2> 1290421 T2568 oascc.SolrZkClient.makePath makePath: /solr
[junit4:junit4]   2> 1290436 T2568 oascc.ConnectionManager.waitForConnected Waiting for client to connect to ZooKeeper
[junit4:junit4]   2> 1290443 T2577 oascc.ConnectionManager.process Watcher org.apache.solr.common.cloud.ConnectionManager@14af6f1e name:ZooKeeperConnection Watcher:127.0.0.1:49748/solr got event WatchedEvent state:SyncConnected type:None path:null path:null type:None
[junit4:junit4]   2> 1290443 T2568 oascc.ConnectionManager.waitForConnected Client is connected to ZooKeeper
[junit4:junit4]   2> 1290443 T2568 oascc.SolrZkClient.makePath makePath: /collections/collection1
[junit4:junit4]   2> 1290455 T2568 oascc.SolrZkClient.makePath makePath: /collections/collection1/shards
[junit4:junit4]   2> 1290470 T2568 oascc.SolrZkClient.makePath makePath: /collections/control_collection
[junit4:junit4]   2> 1290478 T2568 oascc.SolrZkClient.makePath makePath: /collections/control_collection/shards
[junit4:junit4]   2> 1290488 T2568 oasc.AbstractZkTestCase.putConfig put /Users/jenkins/jenkins-slave/workspace/Lucene-Solr-trunk-MacOSX/solr/build/solr-core/test-files/solr/collection1/conf/solrconfig-tlog.xml to /configs/conf1/solrconfig.xml
[junit4:junit4]   2> 1290489 T2568 oascc.SolrZkClient.makePath makePath: /configs/conf1/solrconfig.xml
[junit4:junit4]   2> 1290505 T2568 oasc.AbstractZkTestCase.putConfig put /Users/jenkins/jenkins-slave/workspace/Lucene-Solr-trunk-MacOSX/solr/build/solr-core/test-files/solr/collection1/conf/schema.xml to /configs/conf1/schema.xml
[junit4:junit4]   2> 1290506 T2568 oascc.SolrZkClient.makePath makePath: /configs/conf1/schema.xml
[junit4:junit4]   2> 1290519 T2568 oasc.AbstractZkTestCase.putConfig put /Users/jenkins/jenkins-slave/workspace/Lucene-Solr-trunk-MacOSX/solr/build/solr-core/test-files/solr/collection1/conf/stopwords.txt to /configs/conf1/stopwords.txt
[junit4:junit4]   2> 1290520 T2568 oascc.SolrZkClient.makePath makePath: /configs/conf1/stopwords.txt
[junit4:junit4]   2> 1290534 T2568 oasc.AbstractZkTestCase.putConfig put /Users/jenkins/jenkins-slave/workspace/Lucene-Solr-trunk-MacOSX/solr/build/solr-core/test-files/solr/collection1/conf/protwords.txt to /configs/conf1/protwords.txt
[junit4:junit4]   2> 1290538 T2568 oascc.SolrZkClient.makePath makePath: /configs/conf1/protwords.txt
[junit4:junit4]   2> 1290549 T2568 oasc.AbstractZkTestCase.putConfig put /Users/jenkins/jenkins-slave/workspace/Lucene-Solr-trunk-MacOSX/solr/build/solr-core/test-files/solr/collection1/conf/currency.xml to /configs/conf1/currency.xml
[junit4:junit4]   2> 1290554 T2568 oascc.SolrZkClient.makePath makePath: /configs/conf1/currency.xml
[junit4:junit4]   2> 1290566 T2568 oasc.AbstractZkTestCase.putConfig put /Users/jenkins/jenkins-slave/workspace/Lucene-Solr-trunk-MacOSX/solr/build/solr-core/test-files/solr/collection1/conf/open-exchange-rates.json to /configs/conf1/open-exchange-rates.json
[junit4:junit4]   2> 1290567 T2568 oascc.SolrZkClient.makePath makePath: /configs/conf1/open-exchange-rates.json
[junit4:junit4]   2> 1290579 T2568 oasc.AbstractZkTestCase.putConfig put /Users/jenkins/jenkins-slave/workspace/Lucene-Solr-trunk-MacOSX/solr/build/solr-core/test-files/solr/collection1/conf/mapping-ISOLatin1Accent.txt to /configs/conf1/mapping-ISOLatin1Accent.txt
[junit4:junit4]   2> 1290580 T2568 oascc.SolrZkClient.makePath makePath: /configs/conf1/mapping-ISOLatin1Accent.txt
[junit4:junit4]   2> 1290589 T2568 oasc.AbstractZkTestCase.putConfig put /Users/jenkins/jenkins-slave/workspace/Lucene-Solr-trunk-MacOSX/solr/build/solr-core/test-files/solr/collection1/conf/old_synonyms.txt to /configs/conf1/old_synonyms.txt
[junit4:junit4]   2> 1290590 T2568 oascc.SolrZkClient.makePath makePath: /configs/conf1/old_synonyms.txt
[junit4:junit4]   2> 1290603 T2568 oasc.AbstractZkTestCase.putConfig put /Users/jenkins/jenkins-slave/workspace/Lucene-Solr-trunk-MacOSX/solr/build/solr-core/test-files/solr/collection1/conf/synonyms.txt to /configs/conf1/synonyms.txt
[junit4:junit4]   2> 1290604 T2568 oascc.SolrZkClient.makePath makePath: /configs/conf1/synonyms.txt
[junit4:junit4]   2> 1291222 T2568 oejs.Server.doStart jetty-8.1.10.v20130312
[junit4:junit4]   2> 1291238 T2568 oejs.AbstractConnector.doStart Started SelectChannelConnector@127.0.0.1:49751
[junit4:junit4]   2> 1291242 T2568 oass.SolrDispatchFilter.init SolrDispatchFilter.init()
[junit4:junit4]   2> 1291244 T2568 oasc.SolrResourceLoader.locateSolrHome JNDI not configured for solr (NoInitialContextEx)
[junit4:junit4]   2> 1291244 T2568 oasc.SolrResourceLoader.locateSolrHome using system property solr.solr.home: /Users/jenkins/jenkins-slave/workspace/Lucene-Solr-trunk-MacOSX/solr/build/solr-core/test/J0/./org.apache.solr.cloud.CollectionsAPIDistributedZkTest-controljetty-1371141054795
[junit4:junit4]   2> 1291245 T2568 oasc.CoreContainer$Initializer.initialize looking for solr config file: /Users/jenkins/jenkins-slave/workspace/Lucene-Solr-trunk-MacOSX/solr/build/solr-core/test/J0/./org.apache.solr.cloud.CollectionsAPIDistributedZkTest-controljetty-1371141054795/solr.xml
[junit4:junit4]   2> 1291245 T2568 oasc.CoreContainer.<init> New CoreContainer 1235987500
[junit4:junit4]   2> 1291246 T2568 oasc.CoreContainer.load Loading CoreContainer using Solr Home: '/Users/jenkins/jenkins-slave/workspace/Lucene-Solr-trunk-MacOSX/solr/build/solr-core/test/J0/./org.apache.solr.cloud.CollectionsAPIDistributedZkTest-controljetty-1371141054795/'
[junit4:junit4]   2> 1291246 T2568 oasc.SolrResourceLoader.<init> new SolrResourceLoader for directory: '/Users/jenkins/jenkins-slave/workspace/Lucene-Solr-trunk-MacOSX/solr/build/solr-core/test/J0/./org.apache.solr.cloud.CollectionsAPIDistributedZkTest-controljetty-1371141054795/'
[junit4:junit4]   2> 1291447 T2568 oasc.SolrCoreDiscoverer.walkFromHere Looking for cores in /Users/jenkins/jenkins-slave/workspace/Lucene-Solr-trunk-MacOSX/solr/build/solr-core/test/J0/org.apache.solr.cloud.CollectionsAPIDistributedZkTest-controljetty-1371141054795
[junit4:junit4]   2> 1291449 T2568 oasc.SolrCoreDiscoverer.walkFromHere Looking for cores in /Users/jenkins/jenkins-slave/workspace/Lucene-Solr-trunk-MacOSX/solr/build/solr-core/test/J0/org.apache.solr.cloud.CollectionsAPIDistributedZkTest-controljetty-1371141054795/collection1
[junit4:junit4]   2> 1291451 T2568 oasc.SolrCoreDiscoverer.walkFromHere Looking for cores in /Users/jenkins/jenkins-slave/workspace/Lucene-Solr-trunk-MacOSX/solr/build/solr-core/test/J0/org.apache.solr.cloud.CollectionsAPIDistributedZkTest-controljetty-1371141054795/collection1/conf
[junit4:junit4]   2> 1291632 T2568 oasc.SolrCoreDiscoverer.walkFromHere Looking for cores in /Users/jenkins/jenkins-slave/workspace/Lucene-Solr-trunk-MacOSX/solr/build/solr-core/test/J0/org.apache.solr.cloud.CollectionsAPIDistributedZkTest-controljetty-1371141054795/collection1/conf/xslt
[junit4:junit4]   2> 1291636 T2568 oasc.SolrCoreDiscoverer.walkFromHere Looking for cores in /Users/jenkins/jenkins-slave/workspace/Lucene-Solr-trunk-MacOSX/solr/build/solr-core/test/J0/org.apache.solr.cloud.CollectionsAPIDistributedZkTest-controljetty-1371141054795/collection1/lib
[junit4:junit4]   2> 1291637 T2568 oasc.SolrCoreDiscoverer.walkFromHere Looking for cores in /Users/jenkins/jenkins-slave/workspace/Lucene-Solr-trunk-MacOSX/solr/build/solr-core/test/J0/org.apache.solr.cloud.CollectionsAPIDistributedZkTest-controljetty-1371141054795/collection1/lib/classes
[junit4:junit4]   2> 1291639 T2568 oasc.SolrCoreDiscoverer.addCore Discovered properties file /Users/jenkins/jenkins-slave/workspace/Lucene-Solr-trunk-MacOSX/solr/build/solr-core/test/J0/./org.apache.solr.cloud.CollectionsAPIDistributedZkTest-controljetty-1371141054795/conf/core.properties, adding to cores
[junit4:junit4]   2> 1291655 T2568 oashc.HttpShardHandlerFactory.getParameter Setting socketTimeout to: 0
[junit4:junit4]   2> 1291656 T2568 oashc.HttpShardHandlerFactory.getParameter Setting urlScheme to: http://
[junit4:junit4]   2> 1291656 T2568 oashc.HttpShardHandlerFactory.getParameter Setting connTimeout to: 0
[junit4:junit4]   2> 1291657 T2568 oashc.HttpShardHandlerFactory.getParameter Setting maxConnectionsPerHost to: 20
[junit4:junit4]   2> 1291657 T2568 oashc.HttpShardHandlerFactory.getParameter Setting corePoolSize to: 0
[junit4:junit4]   2> 1291658 T2568 oashc.HttpShardHandlerFactory.getParameter Setting maximumPoolSize to: 2147483647
[junit4:junit4]   2> 1291658 T2568 oashc.HttpShardHandlerFactory.getParameter Setting maxThreadIdleTime to: 5
[junit4:junit4]   2> 1291659 T2568 oashc.HttpShardHandlerFactory.getParameter Setting sizeOfQueue to: -1
[junit4:junit4]   2> 1291659 T2568 oashc.HttpShardHandlerFactory.getParameter Setting fairnessPolicy to: false
[junit4:junit4]   2> 1291660 T2568 oascsi.HttpClientUtil.createClient Creating new http client, config:maxConnectionsPerHost=20&maxConnections=10000&socketTimeout=0&connTimeout=0&retry=false
[junit4:junit4]   2> 1291685 T2568 oasl.LogWatcher.newRegisteredLogWatcher Registering Log Listener
[junit4:junit4]   2> 1291686 T2568 oasc.ZkContainer.initZooKeeper Zookeeper client=127.0.0.1:49748/solr
[junit4:junit4]   2> 1291688 T2568 oasc.ZkController.checkChrootPath zkHost includes chroot
[junit4:junit4]   2> 1291697 T2568 oascc.ConnectionManager.waitForConnected Waiting for client to connect to ZooKeeper
[junit4:junit4]   2> 1291699 T2588 oascc.ConnectionManager.process Watcher org.apache.solr.common.cloud.ConnectionManager@381fb21 name:ZooKeeperConnection Watcher:127.0.0.1:49748 got event WatchedEvent state:SyncConnected type:None path:null path:null type:None
[junit4:junit4]   2> 1291700 T2568 oascc.ConnectionManager.waitForConnected Client is connected to ZooKeeper
[junit4:junit4]   2> 1291705 T2568 oascsi.HttpClientUtil.createClient Creating new http client, config:maxConnections=500&maxConnectionsPerHost=16&socketTimeout=120000&connTimeout=15000
[junit4:junit4]   2> 1291732 T2568 oascc.ConnectionManager.waitForConnected Waiting for client to connect to ZooKeeper
[junit4:junit4]   2> 1291736 T2590 oascc.ConnectionManager.process Watcher org.apache.solr.common.cloud.ConnectionManager@48d28b04 name:ZooKeeperConnection Watcher:127.0.0.1:49748/solr got event WatchedEvent state:SyncConnected type:None path:null path:null type:None
[junit4:junit4]   2> 1291737 T2568 oascc.ConnectionManager.waitForConnected Client is connected to ZooKeeper
[junit4:junit4]   2> 1291741 T2568 oascc.SolrZkClient.makePath makePath: /overseer/queue
[junit4:junit4]   2> 1291751 T2568 oascc.SolrZkClient.makePath makePath: /overseer/collection-queue-work
[junit4:junit4]   2> 1291766 T2568 oascc.SolrZkClient.makePath makePath: /live_nodes
[junit4:junit4]   2> 1291774 T2568 oasc.ZkController.createEphemeralLiveNode Register node as live in ZooKeeper:/live_nodes/127.0.0.1:49751_
[junit4:junit4]   2> 1291777 T2568 oascc.SolrZkClient.makePath makePath: /live_nodes/127.0.0.1:49751_
[junit4:junit4]   2> 1291788 T2568 oascc.SolrZkClient.makePath makePath: /overseer_elect/election
[junit4:junit4]   2> 1291809 T2568 oascc.SolrZkClient.makePath makePath: /overseer_elect/leader
[junit4:junit4]   2> 1291817 T2568 oasc.Overseer.start Overseer (id=89859100146991107-127.0.0.1:49751_-n_0000000000) starting
[junit4:junit4]   2> 1291828 T2568 oascc.SolrZkClient.makePath makePath: /overseer/queue-work
[junit4:junit4]   2> 1291845 T2592 oasc.OverseerCollectionProcessor.run Process current queue of collection creations
[junit4:junit4]   2> 1291848 T2568 oascc.SolrZkClient.makePath makePath: /clusterstate.json
[junit4:junit4]   2> 1291857 T2568 oascc.SolrZkClient.makePath makePath: /aliases.json
[junit4:junit4]   2> 1291863 T2568 oascc.ZkStateReader.createClusterStateWatchersAndUpdate Updating cluster state from ZooKeeper... 
[junit4:junit4]   2> 1291876 T2568 oass.SolrDispatchFilter.init user.dir=/Users/jenkins/jenkins-slave/workspace/Lucene-Solr-trunk-MacOSX/solr/build/solr-core/test/J0
[junit4:junit4]   2> 1291877 T2568 oass.SolrDispatchFilter.init SolrDispatchFilter.init() done
[junit4:junit4]   2> 1291877 T2568 oascsi.HttpClientUtil.createClient Creating new http client, config:maxConnections=128&maxConnectionsPerHost=32&followRedirects=false
[junit4:junit4]   2> 1291893 T2591 oasc.Overseer$ClusterStateUpdater.run Starting to work on the main queue
[junit4:junit4]   2> 1291905 T2568 oascsi.HttpClientUtil.createClient Creating new http client, config:
[junit4:junit4]   2> 1291909 T2568 oascc.ConnectionManager.waitForConnected Waiting for client to connect to ZooKeeper
[junit4:junit4]   2> 1291913 T2595 oascc.ConnectionManager.process Watcher org.apache.solr.common.cloud.ConnectionManager@77c93dcb name:ZooKeeperConnection Watcher:127.0.0.1:49748/solr got event WatchedEvent state:SyncConnected type:None path:null path:null type:None
[junit4:junit4]   2> 1291913 T2568 oascc.ConnectionManager.waitForConnected Client is connected to ZooKeeper
[junit4:junit4]   2> 1291917 T2568 oascc.ZkStateReader.createClusterStateWatchersAndUpdate Updating cluster state from ZooKeeper... 
[junit4:junit4]   2> 1291925 T2568 oasc.ChaosMonkey.monkeyLog monkey: init - expire sessions:true cause connection loss:true
[junit4:junit4]   2> 1292485 T2568 oejs.Server.doStart jetty-8.1.10.v20130312
[junit4:junit4]   2> 1292498 T2568 oejs.AbstractConnector.doStart Started SelectChannelConnector@127.0.0.1:49755
[junit4:junit4]   2> 1292500 T2568 oass.SolrDispatchFilter.init SolrDispatchFilter.init()
[junit4:junit4]   2> 1292500 T2568 oasc.SolrResourceLoader.locateSolrHome JNDI not configured for solr (NoInitialContextEx)
[junit4:junit4]   2> 1292501 T2568 oasc.SolrResourceLoader.locateSolrHome using system property solr.solr.home: /Users/jenkins/jenkins-slave/workspace/Lucene-Solr-trunk-MacOSX/solr/build/solr-core/test/J0/./org.apache.solr.cloud.CollectionsAPIDistributedZkTest-jetty1-1371141056104
[junit4:junit4]   2> 1292501 T2568 oasc.CoreContainer$Initializer.initialize looking for solr config file: /Users/jenkins/jenkins-slave/workspace/Lucene-Solr-trunk-MacOSX/solr/build/solr-core/test/J0/./org.apache.solr.cloud.CollectionsAPIDistributedZkTest-jetty1-1371141056104/solr.xml
[junit4:junit4]   2> 1292502 T2568 oasc.CoreContainer.<init> New CoreContainer 373280061
[junit4:junit4]   2> 1292503 T2568 oasc.CoreContainer.load Loading CoreContainer using Solr Home: '/Users/jenkins/jenkins-slave/workspace/Lucene-Solr-trunk-MacOSX/solr/build/solr-core/test/J0/./org.apache.solr.cloud.CollectionsAPIDistributedZkTest-jetty1-1371141056104/'
[junit4:junit4]   2> 1292503 T2568 oasc.SolrResourceLoader.<init> new SolrResourceLoader for directory: '/Users/jenkins/jenkins-slave/workspace/Lucene-Solr-trunk-MacOSX/solr/build/solr-core/test/J0/./org.apache.solr.cloud.CollectionsAPIDistributedZkTest-jetty1-1371141056104/'
[junit4:junit4]   2> 1292668 T2568 oasc.SolrCoreDiscoverer.walkFromHere Looking for cores in /Users/jenkins/jenkins-slave/workspace/Lucene-Solr-trunk-MacOSX/solr/build/solr-core/test/J0/org.apache.solr.cloud.CollectionsAPIDistributedZkTest-jetty1-1371141056104
[junit4:junit4]   2> 1292670 T2568 oasc.SolrCoreDiscoverer.walkFromHere Looking for cores in /Users/jenkins/jenkins-slave/workspace/Lucene-Solr-trunk-MacOSX/solr/build/solr-core/test/J0/org.apache.solr.cloud.CollectionsAPIDistributedZkTest-jetty1-1371141056104/collection1
[junit4:junit4]   2> 1292671 T2568 oasc.SolrCoreDiscoverer.walkFromHere Looking for cores in /Users/jenkins/jenkins-slave/workspace/Lucene-Solr-trunk-MacOSX/solr/build/solr-core/test/J0/org.apache.solr.cloud.CollectionsAPIDistributedZkTest-jetty1-1371141056104/collection1/conf
[junit4:junit4]   2> 1292846 T2568 oasc.SolrCoreDiscoverer.walkFromHere Looking for cores in /Users/jenkins/jenkins-slave/workspace/Lucene-Solr-trunk-MacOSX/solr/build/solr-core/test/J0/org.apache.solr.cloud.CollectionsAPIDistributedZkTest-jetty1-1371141056104/collection1/conf/xslt
[junit4:junit4]   2> 1292851 T2568 oasc.SolrCoreDiscoverer.walkFromHere Looking for cores in /Users/jenkins/jenkins-slave/workspace/Lucene-Solr-trunk-MacOSX/solr/build/solr-core/test/J0/org.apache.solr.cloud.CollectionsAPIDistributedZkTest-jetty1-1371141056104/collection1/lib
[junit4:junit4]   2> 1292852 T2568 oasc.SolrCoreDiscoverer.walkFromHere Looking for cores in /Users/jenkins/jenkins-slave/workspace/Lucene-Solr-trunk-MacOSX/solr/build/solr-core/test/J0/org.apache.solr.cloud.CollectionsAPIDistributedZkTest-jetty1-1371141056104/collection1/lib/classes
[junit4:junit4]   2> 1292856 T2568 oasc.SolrCoreDiscoverer.addCore Discovered properties file /Users/jenkins/jenkins-slave/workspace/Lucene-Solr-trunk-MacOSX/solr/build/solr-core/test/J0/./org.apache.solr.cloud.CollectionsAPIDistributedZkTest-jetty1-1371141056104/conf/core.properties, adding to cores
[junit4:junit4]   2> 1292872 T2568 oashc.HttpShardHandlerFactory.getParameter Setting socketTimeout to: 0
[junit4:junit4]   2> 1292872 T2568 oashc.HttpShardHandlerFactory.getParameter Setting urlScheme to: http://
[junit4:junit4]   2> 1292873 T2568 oashc.HttpShardHandlerFactory.getParameter Setting connTimeout to: 0
[junit4:junit4]   2> 1292873 T2568 oashc.HttpShardHandlerFactory.getParameter Setting maxConnectionsPerHost to: 20
[junit4:junit4]   2> 1292874 T2568 oashc.HttpShardHandlerFactory.getParameter Setting corePoolSize to: 0
[junit4:junit4]   2> 1292875 T2568 oashc.HttpShardHandlerFactory.getParameter Setting maximumPoolSize to: 2147483647
[junit4:junit4]   2> 1292875 T2568 oashc.HttpShardHandlerFactory.getParameter Setting maxThreadIdleTime to: 5
[junit4:junit4]   2> 1292875 T2568 oashc.HttpShardHandlerFactory.getParameter Setting sizeOfQueue to: -1
[junit4:junit4]   2> 1292876 T2568 oashc.HttpShardHandlerFactory.getParameter Setting fairnessPolicy to: false
[junit4:junit4]   2> 1292876 T2568 oascsi.HttpClientUtil.createClient Creating new http client, config:maxConnectionsPerHost=20&maxConnections=10000&socketTimeout=0&connTimeout=0&retry=false
[junit4:junit4]   2> 1292905 T2568 oasl.LogWatcher.newRegisteredLogWatcher Registering Log Listener
[junit4:junit4]   2> 1292906 T2568 oasc.ZkContainer.initZooKeeper Zookeeper client=127.0.0.1:49748/solr
[junit4:junit4]   2> 1292907 T2568 oasc.ZkController.checkChrootPath zkHost includes chroot
[junit4:junit4]   2> 1292909 T2568 oascc.ConnectionManager.waitForConnected Waiting for client to connect to ZooKeeper
[junit4:junit4]   2> 1293005 T2606 oascc.ConnectionManager.process Watcher org.apache.solr.common.cloud.ConnectionManager@411ab620 name:ZooKeeperConnection Watcher:127.0.0.1:49748 got event WatchedEvent state:SyncConnected type:None path:null path:null type:None
[junit4:junit4]   2> 1293006 T2568 oascc.ConnectionManager.waitForConnected Client is connected to ZooKeeper
[junit4:junit4]   2> 1293011 T2568 oascsi.HttpClientUtil.createClient Creating new http client, config:maxConnections=500&maxConnectionsPerHost=16&socketTimeout=120000&connTimeout=15000
[junit4:junit4]   2> 1293038 T2568 oascc.ConnectionManager.waitForConnected Waiting for client to connect to ZooKeeper
[junit4:junit4]   2> 1293042 T2608 oascc.ConnectionManager.process Watcher org.apache.solr.common.cloud.ConnectionManager@79deef18 name:ZooKeeperConnection Watcher:127.0.0.1:49748/solr got event WatchedEvent state:SyncConnected type:None path:null path:null type:None
[junit4:junit4]   2> 1293043 T2568 oascc.ConnectionManager.waitForConnected Client is connected to ZooKeeper
[junit4:junit4]   2> 1293055 T2568 oascc.ZkStateReader.createClusterStateWatchersAndUpdate Updating cluster state from ZooKeeper... 
[junit4:junit4]   2> 1294069 T2568 oasc.ZkController.createEphemeralLiveNode Register node as live in ZooKeeper:/live_nodes/127.0.0.1:49755_
[junit4:junit4]   2> 1294076 T2568 oascc.SolrZkClient.makePath makePath: /live_nodes/127.0.0.1:49755_
[junit4:junit4]   2> 1294089 T2595 oascc.ZkStateReader$3.process Updating live nodes... (2)
[junit4:junit4]   2> 1294092 T2608 oascc.ZkStateReader$3.process Updating live nodes... (2)
[junit4:junit4]   2> 1294094 T2590 oascc.ZkStateReader$3.process Updating live nodes... (2)
[junit4:junit4]   2> 1294116 T2568 oass.SolrDispatchFilter.init user.dir=/Users/jenkins/jenkins-slave/workspace/Lucene-Solr-trunk-MacOSX/solr/build/solr-core/test/J0
[junit4:junit4]   2> 1294116 T2568 oass.SolrDispatchFilter.init SolrDispatchFilter.init() done
[junit4:junit4]   2> 1294117 T2568 oascsi.HttpClientUtil.createClient Creating new http client, config:maxConnections=128&maxConnectionsPerHost=32&followRedirects=false
[junit4:junit4]   2> 1294692 T2568 oejs.Server.doStart jetty-8.1.10.v20130312
[junit4:junit4]   2> 1294708 T2568 oejs.AbstractConnector.doStart Started SelectChannelConnector@127.0.0.1:49758
[junit4:junit4]   2> 1294709 T2568 oass.SolrDispatchFilter.init SolrDispatchFilter.init()
[junit4:junit4]   2> 1294710 T2568 oasc.SolrResourceLoader.locateSolrHome JNDI not configured for solr (NoInitialContextEx)
[junit4:junit4]   2> 1294710 T2568 oasc.SolrResourceLoader.locateSolrHome using system property solr.solr.home: /Users/jenkins/jenkins-slave/workspace/Lucene-Solr-trunk-MacOSX/solr/build/solr-core/test/J0/./org.apache.solr.cloud.CollectionsAPIDistributedZkTest-jetty2-1371141058317
[junit4:junit4]   2> 1294710 T2568 oasc.CoreContainer$Initializer.initialize looking for solr config file: /Users/jenkins/jenkins-slave/workspace/Lucene-Solr-trunk-MacOSX/solr/build/solr-core/test/J0/./org.apache.solr.cloud.CollectionsAPIDistributedZkTest-jetty2-1371141058317/solr.xml
[junit4:junit4]   2> 1294711 T2568 oasc.CoreContainer.<init> New CoreContainer 1150091228
[junit4:junit4]   2> 1294711 T2568 oasc.CoreContainer.load Loading CoreContainer using Solr Home: '/Users/jenkins/jenkins-slave/workspace/Lucene-Solr-trunk-MacOSX/solr/build/solr-core/test/J0/./org.apache.solr.cloud.CollectionsAPIDistributedZkTest-jetty2-1371141058317/'
[junit4:junit4]   2> 1294712 T2568 oasc.SolrResourceLoader.<init> new SolrResourceLoader for directory: '/Users/jenkins/jenkins-slave/workspace/Lucene-Solr-trunk-MacOSX/solr/build/solr-core/test/J0/./org.apache.solr.cloud.CollectionsAPIDistributedZkTest-jetty2-1371141058317/'
[junit4:junit4]   2> 1294928 T2568 oasc.SolrCoreDiscoverer.walkFromHere Looking for cores in /Users/jenkins/jenkins-slave/workspace/Lucene-Solr-trunk-MacOSX/solr/build/solr-core/test/J0/org.apache.solr.cloud.CollectionsAPIDistributedZkTest-jetty2-1371141058317
[junit4:junit4]   2> 1294930 T2568 oasc.SolrCoreDiscoverer.walkFromHere Looking for cores in /Users/jenkins/jenkins-slave/workspace/Lucene-Solr-trunk-MacOSX/solr/build/solr-core/test/J0/org.apache.solr.cloud.CollectionsAPIDistributedZkTest-jetty2-1371141058317/collection1
[junit4:junit4]   2> 1294932 T2568 oasc.SolrCoreDiscoverer.walkFromHere Looking for cores in /Users/jenkins/jenkins-slave/workspace/Lucene-Solr-trunk-MacOSX/solr/build/solr-core/test/J0/org.apache.solr.cloud.CollectionsAPIDistributedZkTest-jetty2-1371141058317/collection1/conf
[junit4:junit4]   2> 1295113 T2568 oasc.SolrCoreDiscoverer.walkFromHere Looking for cores in /Users/jenkins/jenkins-slave/workspace/Lucene-Solr-trunk-MacOSX/solr/build/solr-core/test/J0/org.apache.solr.cloud.CollectionsAPIDistributedZkTest-jetty2-1371141058317/collection1/conf/xslt
[junit4:junit4]   2> 1295117 T2568 oasc.SolrCoreDiscoverer.walkFromHere Looking for cores in /Users/jenkins/jenkins-slave/workspace/Lucene-Solr-trunk-MacOSX/solr/build/solr-core/test/J0/org.apache.solr.cloud.CollectionsAPIDistributedZkTest-jetty2-1371141058317/collection1/lib
[junit4:junit4]   2> 1295119 T2568 oasc.SolrCoreDiscoverer.walkFromHere Looking for cores in /Users/jenkins/jenkins-slave/workspace/Lucene-Solr-trunk-MacOSX/solr/build/solr-core/test/J0/org.apache.solr.cloud.CollectionsAPIDistributedZkTest-jetty2-1371141058317/collection1/lib/classes
[junit4:junit4]   2> 1295122 T2568 oasc.SolrCoreDiscoverer.addCore Discovered properties file /Users/jenkins/jenkins-slave/workspace/Lucene-Solr-trunk-MacOSX/solr/build/solr-core/test/J0/./org.apache.solr.cloud.CollectionsAPIDistributedZkTest-jetty2-1371141058317/conf/core.properties, adding to cores
[junit4:junit4]   2> 1295142 T2568 oashc.HttpShardHandlerFactory.getParameter Setting socketTimeout to: 0
[junit4:junit4]   2> 1295142 T2568 oashc.HttpShardHandlerFactory.getParameter Setting urlScheme to: http://
[junit4:junit4]   2> 1295143 T2568 oashc.HttpShardHandlerFactory.getParameter Setting connTimeout to: 0
[junit4:junit4]   2> 1295144 T2568 oashc.HttpShardHandlerFactory.getParameter Setting maxConnectionsPerHost to: 20
[junit4:junit4]   2> 1295144 T2568 oashc.HttpShardHandlerFactory.getParameter Setting corePoolSize to: 0
[junit4:junit4]   2> 1295145 T2568 oashc.HttpShardHandlerFactory.getParameter Setting maximumPoolSize to: 2147483647
[junit4:junit4]   2> 1295145 T2568 oashc.HttpShardHandlerFactory.getParameter Setting maxThreadIdleTime to: 5
[junit4:junit4]   2> 1295150 T2568 oashc.HttpShardHandlerFactory.getParameter Setting sizeOfQueue to: -1
[junit4:junit4]   2> 1295151 T2568 oashc.HttpShardHandlerFactory.getParameter Setting fairnessPolicy to: false
[junit4:junit4]   2> 1295151 T2568 oascsi.HttpClientUtil.createClient Creating new http client, config:maxConnectionsPerHost=20&maxConnections=10000&socketTimeout=0&connTimeout=0&retry=false
[junit4:junit4]   2> 1295186 T2568 oasl.LogWatcher.newRegisteredLogWatcher Registering Log Listener
[junit4:junit4]   2> 1295187 T2568 oasc.ZkContainer.initZooKeeper Zookeeper client=127.0.0.1:49748/solr
[junit4:junit4]   2> 1295188 T2568 oasc.ZkController.checkChrootPath zkHost includes chroot
[junit4:junit4]   2> 1295195 T2568 oascc.ConnectionManager.waitForConnected Waiting for client to connect to ZooKeeper
[junit4:junit4]   2> 1295197 T2620 oascc.ConnectionManager.process Watcher org.apache.solr.common.cloud.ConnectionManager@70f99830 name:ZooKeeperConnection Watcher:127.0.0.1:49748 got event WatchedEvent state:SyncConnected type:None path:null path:null type:None
[junit4:junit4]   2> 1295198 T2568 oascc.ConnectionManager.waitForConnected Client is connected to ZooKeeper
[junit4:junit4]   2> 1295204 T2568 oascsi.HttpClientUtil.createClient Creating new http client, config:maxConnections=500&maxConnectionsPerHost=16&socketTimeout=120000&connTimeout=15000
[junit4:junit4]   2> 1295228 T2568 oascc.ConnectionManager.waitForConnected Waiting for client to connect to ZooKeeper
[junit4:junit4]   2> 1295234 T2622 oascc.ConnectionManager.process Watcher org.apache.solr.common.cloud.ConnectionManager@54792174 name:ZooKeeperConnection Watcher:127.0.0.1:49748/solr got event WatchedEvent state:SyncConnected type:None path:null path:null type:None
[junit4:junit4]   2> 1295235 T2568 oascc.ConnectionManager.waitForConnected Client is connected to ZooKeeper
[junit4:junit4]   2> 1295253 T2568 oascc.ZkStateReader.createClusterStateWatchersAndUpdate Updating cluster state from ZooKeeper... 
[junit4:junit4]   2> 1296267 T2568 oasc.ZkController.createEphemeralLiveNode Register node as live in ZooKeeper:/live_nodes/127.0.0.1:49758_
[junit4:junit4]   2> 1296276 T2568 oascc.SolrZkClient.makePath makePath: /live_nodes/127.0.0.1:49758_
[junit4:junit4]   2> 1296287 T2622 oascc.ZkStateReader$3.process Updating live nodes... (3)
[junit4:junit4]   2> 1296287 T2608 oascc.ZkStateReader$3.process Updating live nodes... (3)
[junit4:junit4]   2> 1296287 T2595 oascc.ZkStateReader$3.process Updating live nodes... (3)
[junit4:junit4]   2> 1296288 T2590 oascc.ZkStateReader$3.process Updating live nodes... (3)
[junit4:junit4]   2> 1296302 T2568 oass.SolrDispatchFilter.init user.dir=/Users/jenkins/jenkins-slave/workspace/Lucene-Solr-trunk-MacOSX/solr/build/solr-core/test/J0
[junit4:junit4]   2> 1296303 T2568 oass.SolrDispatchFilter.init SolrDispatchFilter.init() done
[junit4:junit4]   2> 1296304 T2568 oascsi.HttpClientUtil.createClient Creating new http client, config:maxConnections=128&maxConnectionsPerHost=32&followRedirects=false
[junit4:junit4]   2> 1296882 T2568 oejs.Server.doStart jetty-8.1.10.v20130312
[junit4:junit4]   2> 1296904 T2568 oejs.AbstractConnector.doStart Started SelectChannelConnector@127.0.0.1:49761
[junit4:junit4]   2> 1296905 T2568 oass.SolrDispatchFilter.init SolrDispatchFilter.init()
[junit4:junit4]   2> 1296905 T2568 oasc.SolrResourceLoader.locateSolrHome JNDI not configured for solr (NoInitialContextEx)
[junit4:junit4]   2> 1296906 T2568 oasc.SolrResourceLoader.locateSolrHome using system property solr.solr.home: /Users/jenkins/jenkins-slave/workspace/Lucene-Solr-trunk-MacOSX/solr/build/solr-core/test/J0/./org.apache.solr.cloud.CollectionsAPIDistributedZkTest-jetty3-1371141060503
[junit4:junit4]   2> 1296907 T2568 oasc.CoreContainer$Initializer.initialize looking for solr config file: /Users/jenkins/jenkins-slave/workspace/Lucene-Solr-trunk-MacOSX/solr/build/solr-core/test/J0/./org.apache.solr.cloud.CollectionsAPIDistributedZkTest-jetty3-1371141060503/solr.xml
[junit4:junit4]   2> 1296908 T2568 oasc.CoreContainer.<init> New CoreContainer 195042534
[junit4:junit4]   2> 1296908 T2568 oasc.CoreContainer.load Loading CoreContainer using Solr Home: '/Users/jenkins/jenkins-slave/workspace/Lucene-Solr-trunk-MacOSX/solr/build/solr-core/test/J0/./org.apache.solr.cloud.CollectionsAPIDistributedZkTest-jetty3-1371141060503/'
[junit4:junit4]   2> 1296909 T2568 oasc.SolrResourceLoader.<init> new SolrResourceLoader for directory: '/Users/jenkins/jenkins-slave/workspace/Lucene-Solr-trunk-MacOSX/solr/build/solr-core/test/J0/./org.apache.solr.cloud.CollectionsAPIDistributedZkTest-jetty3-1371141060503/'
[junit4:junit4]   2> 1297081 T2568 oasc.SolrCoreDiscoverer.walkFromHere Looking for cores in /Users/jenkins/jenkins-slave/workspace/Lucene-Solr-trunk-MacOSX/solr/build/solr-core/test/J0/org.apache.solr.cloud.CollectionsAPIDistributedZkTest-jetty3-1371141060503
[junit4:junit4]   2> 1297082 T2568 oasc.SolrCoreDiscoverer.walkFromHere Looking for cores in /Users/jenkins/jenkins-slave/workspace/Lucene-Solr-trunk-MacOSX/solr/build/solr-core/test/J0/org.apache.solr.cloud.CollectionsAPIDistributedZkTest-jetty3-1371141060503/collection1
[junit4:junit4]   2> 1297083 T2568 oasc.SolrCoreDiscoverer.walkFromHere Looking for cores in /Users/jenkins/jenkins-slave/workspace/Lucene-Solr-trunk-MacOSX/solr/build/solr-core/test/J0/org.apache.solr.cloud.CollectionsAPIDistributedZkTest-jetty3-1371141060503/collection1/conf
[junit4:junit4]   2> 1297330 T2568 oasc.SolrCoreDiscoverer.walkFromHere Looking for cores in /Users/jenkins/jenkins-slave/workspace/Lucene-Solr-trunk-MacOSX/solr/build/solr-core/test/J0/org.apache.solr.cloud.CollectionsAPIDistributedZkTest-jetty3-1371141060503/collection1/conf/xslt
[junit4:junit4]   2> 1297352 T2568 oasc.SolrCoreDiscoverer.walkFromHere Looking for cores in /Users/jenkins/jenkins-slave/workspace/Lucene-Solr-trunk-MacOSX/solr/build/solr-core/test/J0/org.apache.solr.cloud.CollectionsAPIDistributedZkTest-jetty3-1371141060503/collection1/lib
[junit4:junit4]   2> 1297372 T2568 oasc.SolrCoreDiscoverer.walkFromHere Looking for cores in /Users/jenkins/jenkins-slave/workspace/Lucene-Solr-trunk-MacOSX/solr/build/solr-core/test/J0/org.apache.solr.cloud.CollectionsAPIDistributedZkTest-jetty3-1371141060503/collection1/lib/classes
[junit4:junit4]   2> 1297375 T2568 oasc.SolrCoreDiscoverer.addCore Discovered properties file /Users/jenkins/jenkins-slave/workspace/Lucene-Solr-trunk-MacOSX/solr/build/solr-core/test/J0/./org.apache.solr.cloud.CollectionsAPIDistributedZkTest-jetty3-1371141060503/conf/core.properties, adding to cores
[junit4:junit4]   2> 1297397 T2568 oashc.HttpShardHandlerFactory.getParameter Setting socketTimeout to: 0
[junit4:junit4]   2> 1297399 T2568 oashc.HttpShardHandlerFactory.getParameter Setting urlScheme to: http://
[junit4:junit4]   2> 1297399 T2568 oashc.HttpShardHandlerFactory.getParameter Setting connTimeout to: 0
[junit4:junit4]   2> 1297400 T2568 oashc.HttpShardHandlerFactory.getParameter Setting maxConnectionsPerHost to: 20
[junit4:junit4]   2> 1297400 T2568 oashc.HttpShardHandlerFactory.getParameter Setting corePoolSize to: 0
[junit4:junit4]   2> 1297401 T2568 oashc.HttpShardHandlerFactory.getParameter Setting maximumPoolSize to: 2147483647
[junit4:junit4]   2> 1297401 T2568 oashc.HttpShardHandlerFactory.getParameter Setting maxThreadIdleTime to: 5
[junit4:junit4]   2> 1297402 T2568 oashc.HttpShardHandlerFactory.getParameter Setting sizeOfQueue to: -1
[junit4:junit4]   2> 1297403 T2568 oashc.HttpShardHandlerFactory.getParameter Setting fairnessPolicy to: false
[junit4:junit4]   2> 1297403 T2568 oascsi.HttpClientUtil.createClient Creating new http client, config:maxConnectionsPerHost=20&maxConnections=10000&socketTimeout=0&connTimeout=0&retry=false
[junit4:junit4]   2> 1297436 T2568 oasl.LogWatcher.newRegisteredLogWatcher Registering Log Listener
[junit4:junit4]   2> 1297438 T2568 oasc.ZkContainer.initZooKeeper Zookeeper client=127.0.0.1:49748/solr
[junit4:junit4]   2> 1297438 T2568 oasc.ZkController.checkChrootPath zkHost includes chroot
[junit4:junit4]   2> 1297441 T2568 oascc.ConnectionManager.waitForConnected Waiting for client to connect to ZooKeeper
[junit4:junit4]   2> 1297465 T2634 oascc.ConnectionManager.process Watcher org.apache.solr.common.cloud.ConnectionManager@54328801 name:ZooKeeperConnection Watcher:127.0.0.1:49748 got event WatchedEvent state:SyncConnected type:None path:null path:null type:None
[junit4:junit4]   2> 1297466 T2568 oascc.ConnectionManager.waitForConnected Client is connected to ZooKeeper
[junit4:junit4]   2> 1297472 T2568 oascsi.HttpClientUtil.createClient Creating new http client, config:maxConnections=500&maxConnectionsPerHost=16&socketTimeout=120000&connTimeout=15000
[junit4:junit4]   2> 1297493 T2568 oascc.ConnectionManager.waitForConnected Waiting for client to connect to ZooKeeper
[junit4:junit4]   2> 1297504 T2636 oascc.ConnectionManager.process Watcher org.apache.solr.common.cloud.ConnectionManager@31868417 name:ZooKeeperConnection Watcher:127.0.0.1:49748/solr got event WatchedEvent state:SyncConnected type:None path:null path:null type:None
[junit4:junit4]   2> 1297505 T2568 oascc.ConnectionManager.waitForConnected Client is connected to ZooKeeper
[junit4:junit4]   2> 1297517 T2568 oascc.ZkStateReader.createClusterStateWatchersAndUpdate Updating cluster state from ZooKeeper... 
[junit4:junit4]   2> 1298533 T2568 oasc.ZkController.createEphemeralLiveNode Register node as live in ZooKeeper:/live_nodes/127.0.0.1:49761_
[junit4:junit4]   2> 1298536 T2568 oascc.SolrZkClient.makePath makePath: /live_nodes/127.0.0.1:49761_
[junit4:junit4]   2> 1298544 T2608 oascc.ZkStateReader$3.process Updating live nodes... (4)
[junit4:junit4]   2> 1298544 T2590 oascc.ZkStateReader$3.process Updating live nodes... (4)
[junit4:junit4]   2> 1298549 T2636 oascc.ZkStateReader$3.process Updating live nodes... (4)
[junit4:junit4]   2> 1298556 T2622 oascc.ZkStateReader$3.process Updating live nodes... (4)
[junit4:junit4]   2> 1298562 T2595 oascc.ZkStateReader$3.process Updating live nodes... (4)
[junit4:junit4]   2> 1298569 T2568 oass.SolrDispatchFilter.init user.dir=/Users/jenkins/jenkins-slave/workspace/Lucene-Solr-trunk-MacOSX/solr/build/solr-core/test/J0
[junit4:junit4]   2> 1298573 T2568 oass.SolrDispatchFilter.init SolrDispatchFilter.init() done
[junit4:junit4]   2> 1298574 T2568 oascsi.HttpClientUtil.createClient Creating new http client, config:maxConnections=128&maxConnectionsPerHost=32&followRedirects=false
[junit4:junit4]   2> 1299250 T2568 oejs.Server.doStart jetty-8.1.10.v20130312
[junit4:junit4]   2> 1299264 T2568 oejs.AbstractConnector.doStart Started SelectChannelConnector@127.0.0.1:49764
[junit4:junit4]   2> 1299266 T2568 oass.SolrDispatchFilter.init SolrDispatchFilter.init()
[junit4:junit4]   2> 1299266 T2568 oasc.SolrResourceLoader.locateSolrHome JNDI not configured for solr (NoInitialContextEx)
[junit4:junit4]   2> 1299272 T2568 oasc.SolrResourceLoader.locateSolrHome using system property solr.solr.home: /Users/jenkins/jenkins-slave/workspace/Lucene-Solr-trunk-MacOSX/solr/build/solr-core/test/J0/./org.apache.solr.cloud.CollectionsAPIDistributedZkTest-jetty4-1371141062777
[junit4:junit4]   2> 1299273 T2568 oasc.CoreContainer$Initializer.initialize looking for solr config file: /Users/jenkins/jenkins-slave/workspace/Lucene-Solr-trunk-MacOSX/solr/build/solr-core/test/J0/./org.apache.solr.cloud.CollectionsAPIDistributedZkTest-jetty4-1371141062777/solr.xml
[junit4:junit4]   2> 1299273 T2568 oasc.CoreContainer.<init> New CoreContainer 2033191772
[junit4:junit4]   2> 1299274 T2568 oasc.CoreContainer.load Loading CoreContainer using Solr Home: '/Users/jenkins/jenkins-slave/workspace/Lucene-Solr-trunk-MacOSX/solr/build/solr-core/test/J0/./org.apache.solr.cloud.CollectionsAPIDistributedZkTest-jetty4-1371141062777/'
[junit4:junit4]   2> 1299275 T2568 oasc.SolrResourceLoader.<init> new SolrResourceLoader for directory: '/Users/jenkins/jenkins-slave/workspace/Lucene-Solr-trunk-MacOSX/solr/build/solr-core/test/J0/./org.apache.solr.cloud.CollectionsAPIDistributedZkTest-jetty4-1371141062777/'
[junit4:junit4]   2> 1299443 T2568 oasc.SolrCoreDiscoverer.walkFromHere Looking for cores in /Users/jenkins/jenkins-slave/workspace/Lucene-Solr-trunk-MacOSX/solr/build/solr-core/test/J0/org.apache.solr.cloud.CollectionsAPIDistributedZkTest-jetty4-1371141062777
[junit4:junit4]   2> 1299445 T2568 oasc.SolrCoreDiscoverer.walkFromHere Looking for cores in /Users/jenkins/jenkins-slave/workspace/Lucene-Solr-trunk-MacOSX/solr/build/solr-core/test/J0/org.apache.solr.cloud.CollectionsAPIDistributedZkTest-jetty4-1371141062777/collection1
[junit4:junit4]   2> 1299447 T2568 oasc.SolrCoreDiscoverer.walkFromHere Looking for cores in /Users/jenkins/jenkins-slave/workspace/Lucene-Solr-trunk-MacOSX/solr/build/solr-core/test/J0/org.apache.solr.cloud.CollectionsAPIDistributedZkTest-jetty4-1371141062777/collection1/conf
[junit4:junit4]   2> 1299635 T2568 oasc.SolrCoreDiscoverer.walkFromHere Looking for cores in /Users/jenkins/jenkins-slave/workspace/Lucene-Solr-trunk-MacOSX/solr/build/solr-core/test/J0/org.apache.solr.cloud.CollectionsAPIDistributedZkTest-jetty4-1371141062777/collection1/conf/xslt
[junit4:junit4]   2> 1299639 T2568 oasc.SolrCoreDiscoverer.walkFromHere Looking for cores in /Users/jenkins/jenkins-slave/workspace/Lucene-Solr-trunk-MacOSX/solr/build/solr-core/test/J0/org.apache.solr.cloud.CollectionsAPIDistributedZkTest-jetty4-1371141062777/collection1/lib
[junit4:junit4]   2> 1299641 T2568 oasc.SolrCoreDiscoverer.walkFromHere Looking for cores in /Users/jenkins/jenkins-slave/workspace/Lucene-Solr-trunk-MacOSX/solr/build/solr-core/test/J0/org.apache.solr.cloud.CollectionsAPIDistributedZkTest-jetty4-1371141062777/collection1/lib/classes
[junit4:junit4]   2> 1299644 T2568 oasc.SolrCoreDiscoverer.addCore Discovered properties file /Users/jenkins/jenkins-slave/workspace/Lucene-Solr-trunk-MacOSX/solr/build/solr-core/test/J0/./org.apache.solr.cloud.CollectionsAPIDistributedZkTest-jetty4-1371141062777/conf/core.properties, adding to cores
[junit4:junit4]   2> 1299659 T2568 oashc.HttpShardHandlerFactory.getParameter Setting socketTimeout to: 0
[junit4:junit4]   2> 1299660 T2568 oashc.HttpShardHandlerFactory.getParameter Setting urlScheme to: http://
[junit4:junit4]   2> 1299661 T2568 oashc.HttpShardHandlerFactory.getParameter Setting connTimeout to: 0
[junit4:junit4]   2> 1299661 T2568 oashc.HttpShardHandlerFactory.getParameter Setting maxConnectionsPerHost to: 20
[junit4:junit4]   2> 1299662 T2568 oashc.HttpShardHandlerFactory.getParameter Setting corePoolSize to: 0
[junit4:junit4]   2> 1299662 T2568 oashc.HttpShardHandlerFactory.getParameter Setting maximumPoolSize to: 2147483647
[junit4:junit4]   2> 1299663 T2568 oashc.HttpShardHandlerFactory.getParameter Setting maxThreadIdleTime to: 5
[junit4:junit4]   2> 1299663 T2568 oashc.HttpShardHandlerFactory.getParameter Setting sizeOfQueue to: -1
[junit4:junit4]   2> 1299664 T2568 oashc.HttpShardHandlerFactory.getParameter Setting fairnessPolicy to: false
[junit4:junit4]   2> 1299665 T2568 oascsi.HttpClientUtil.createClient Creating new http client, config:maxConnectionsPerHost=20&maxConnections=10000&socketTimeout=0&connTimeout=0&retry=false
[junit4:junit4]   2> 1299692 T2568 oasl.LogWatcher.newRegisteredLogWatcher Registering Log Listener
[junit4:junit4]   2> 1299693 T2568 oasc.ZkContainer.initZooKeeper Zookeeper client=127.0.0.1:49748/solr
[junit4:junit4]   2> 1299694 T2568 oasc.ZkController.checkChrootPath zkHost includes chroot
[junit4:junit4]   2> 1299700 T2568 oascc.ConnectionManager.waitForConnected Waiting for client to connect to ZooKeeper
[junit4:junit4]   2> 1299709 T2648 oascc.ConnectionManager.process Watcher org.apache.solr.common.cloud.ConnectionManager@397d13fd name:ZooKeeperConnection Watcher:127.0.0.1:49748 got event WatchedEvent state:SyncConnected type:None path:null path:null type:None
[junit4:junit4]   2> 1299710 T2568 oascc.ConnectionManager.waitForConnected Client is connected to ZooKeeper
[junit4:junit4]   2> 1299717 T2568 oascsi.HttpClientUtil.createClient Creating new http client, config:maxConnections=500&maxConnectionsPerHost=16&socketTimeout=120000&connTimeout=15000
[junit4:junit4]   2> 1299741 T2568 oascc.ConnectionManager.waitForConnected Waiting for client to connect to ZooKeeper
[junit4:junit4]   2> 1299748 T2650 oascc.ConnectionManager.process Watcher org.apache.solr.common.cloud.ConnectionManager@6d9f3993 name:ZooKeeperConnection Watcher:127.0.0.1:49748/solr got event WatchedEvent state:SyncConnected type:None path:null path:null type:None
[junit4:junit4]   2> 1299748 T2568 oascc.ConnectionManager.waitForConnected Client is connected to ZooKeeper
[junit4:junit4]   2> 1299768 T2568 oascc.ZkStateReader.createClusterStateWatchersAndUpdate Updating cluster state from ZooKeeper... 
[junit4:junit4]   2> 1300779 T2568 oasc.ZkController.createEphemeralLiveNode Register node as live in ZooKeeper:/live_nodes/127.0.0.1:49764_
[junit4:junit4]   2> 1300783 T2568 oascc.SolrZkClient.makePath makePath: /live_nodes/127.0.0.1:49764_
[junit4:junit4]   2> 1300801 T2636 oascc.ZkStateReader$3.process Updating live nodes... (5)
[junit4:junit4]   2> 1300802 T2595 oascc.ZkStateReader$3.process Updating live nodes... (5)
[junit4:junit4]   2> 1300804 T2650 oascc.ZkStateReader$3.process Updating live nodes... (5)
[junit4:junit4]   2> 1300824 T2622 oascc.ZkStateReader$3.process Updating live nodes... (5)
[junit4:junit4]   2> 1300825 T2590 oascc.ZkStateReader$3.process Updating live nodes... (5)
[junit4:junit4]   2> 1300825 T2608 oascc.ZkStateReader$3.process Updating live nodes... (5)
[junit4:junit4]   2> 1300840 T2568 oass.SolrDispatchFilter.init user.dir=/Users/jenkins/jenkins-slave/workspace/Lucene-Solr-trunk-MacOSX/solr/build/solr-core/test/J0
[junit4:junit4]   2> 1300841 T2568 oass.SolrDispatchFilter.init SolrDispatchFilter.init() done
[junit4:junit4]   2> 1300846 T2568 oascsi.HttpClientUtil.createClient Creating new http client, config:maxConnections=128&maxConnectionsPerHost=32&followRedirects=false
[junit4:junit4]   2> 1300885 T2568 oascsi.HttpClientUtil.createClient Creating new http client, config:maxConnections=128&maxConnectionsPerHost=32&followRedirects=false
[junit4:junit4]   2> 1300912 T2601 oasha.CollectionsHandler.handleCreateAction Creating Collection : numShards=2&name=nodes_used_collection&replicationFactor=2&action=CREATE&wt=javabin&version=2
[junit4:junit4]   2> 1300919 T2590 oasc.DistributedQueue$LatchChildWatcher.process Watcher fired on path: /overseer/collection-queue-work state: SyncConnected type NodeChildrenChanged
[junit4:junit4]   2> 1300930 T2592 oasc.OverseerCollectionProcessor.run Overseer Collection Processor: Get the message id:/overseer/collection-queue-work/qn-0000000000 message:{
[junit4:junit4]   2> 	  "operation":"createcollection",
[junit4:junit4]   2> 	  "numShards":"2",
[junit4:junit4]   2> 	  "maxShardsPerNode":null,
[junit4:junit4]   2> 	  "createNodeSet":null,
[junit4:junit4]   2> 	  "name":"nodes_used_collection",
[junit4:junit4]   2> 	  "replicationFactor":"2"}
[junit4:junit4]   2> 1300932 T2592 oasc.OverseerCollectionProcessor.createCollection Creating shard nodes_used_collection_shard1_replica1 as part of slice shard1 of collection nodes_used_collection on 127.0.0.1:49751_
[junit4:junit4]   2> 1300933 T2592 oasc.OverseerCollectionProcessor.createCollection Creating shard nodes_used_collection_shard1_replica2 as part of slice shard1 of collection nodes_used_collection on 127.0.0.1:49758_
[junit4:junit4]   2> 1300934 T2592 oasc.OverseerCollectionProcessor.createCollection Creating shard nodes_used_collection_shard2_replica1 as part of slice shard2 of collection nodes_used_collection on 127.0.0.1:49764_
[junit4:junit4]   2> 1300935 T2592 oasc.OverseerCollectionProcessor.createCollection Creating shard nodes_used_collection_shard2_replica2 as part of slice shard2 of collection nodes_used_collection on 127.0.0.1:49755_
[junit4:junit4]   2> 1300944 T2645 oasc.ZkController.publish publishing core=nodes_used_collection_shard2_replica1 state=down
[junit4:junit4]   2> 1300945 T2586 oasc.ZkController.publish publishing core=nodes_used_collection_shard1_replica1 state=down
[junit4:junit4]   2> 1300945 T2617 oasc.ZkController.publish publishing core=nodes_used_collection_shard1_replica2 state=down
[junit4:junit4]   2> 1300948 T2602 oasc.ZkController.publish publishing core=nodes_used_collection_shard2_replica2 state=down
[junit4:junit4]   2> 1301076 T2591 oascc.ZkStateReader.updateClusterState Updating cloud state from ZooKeeper... 
[junit4:junit4]   2> 1301079 T2591 oasc.Overseer$ClusterStateUpdater.updateState Update state numShards=2 message={
[junit4:junit4]   2> 	  "operation":"state",
[junit4:junit4]   2> 	  "core_node_name":null,
[junit4:junit4]   2> 	  "numShards":"2",
[junit4:junit4]   2> 	  "shard":"shard2",
[junit4:junit4]   2> 	  "roles":null,
[junit4:junit4]   2> 	  "state":"down",
[junit4:junit4]   2> 	  "shard_state":"active",
[junit4:junit4]   2> 	  "core":"nodes_used_collection_shard2_replica1",
[junit4:junit4]   2> 	  "collection":"nodes_used_collection",
[junit4:junit4]   2> 	  "shard_range":null,
[junit4:junit4]   2> 	  "node_name":"127.0.0.1:49764_",
[junit4:junit4]   2> 	  "base_url":"http://127.0.0.1:49764"}
[junit4:junit4]   2> 1301079 T2591 oasc.Overseer$ClusterStateUpdater.createCollection Create collection nodes_used_collection with numShards 2
[junit4:junit4]   2> 1301092 T2591 oasc.Overseer$ClusterStateUpdater.updateState Update state numShards=2 message={
[junit4:junit4]   2> 	  "operation":"state",
[junit4:junit4]   2> 	  "core_node_name":null,
[junit4:junit4]   2> 	  "numShards":"2",
[junit4:junit4]   2> 	  "shard":"shard1",
[junit4:junit4]   2> 	  "roles":null,
[junit4:junit4]   2> 	  "state":"down",
[junit4:junit4]   2> 	  "shard_state":"active",
[junit4:junit4]   2> 	  "core":"nodes_used_collection_shard1_replica1",
[junit4:junit4]   2> 	  "collection":"nodes_used_collection",
[junit4:junit4]   2> 	  "shard_range":null,
[junit4:junit4]   2> 	  "node_name":"127.0.0.1:49751_",
[junit4:junit4]   2> 	  "base_url":"http://127.0.0.1:49751"}
[junit4:junit4]   2> 1301105 T2591 oasc.Overseer$ClusterStateUpdater.updateState Update state numShards=2 message={
[junit4:junit4]   2> 	  "operation":"state",
[junit4:junit4]   2> 	  "core_node_name":null,
[junit4:junit4]   2> 	  "numShards":"2",
[junit4:junit4]   2> 	  "shard":"shard1",
[junit4:junit4]   2> 	  "roles":null,
[junit4:junit4]   2> 	  "state":"down",
[junit4:junit4]   2> 	  "shard_state":"active",
[junit4:junit4]   2> 	  "core":"nodes_used_collection_shard1_replica2",
[junit4:junit4]   2> 	  "collection":"nodes_used_collection",
[junit4:junit4]   2> 	  "shard_range":null,
[junit4:junit4]   2> 	  "node_name":"127.0.0.1:49758_",
[junit4:junit4]   2> 	  "base_url":"http://127.0.0.1:49758"}
[junit4:junit4]   2> 1301119 T2591 oasc.Overseer$ClusterStateUpdater.updateState Update state numShards=2 message={
[junit4:junit4]   2> 	  "operation":"state",
[junit4:junit4]   2> 	  "core_node_name":null,
[junit4:junit4]   2> 	  "numShards":"2",
[junit4:junit4]   2> 	  "shard":"shard2",
[junit4:junit4]   2> 	  "roles":null,
[junit4:junit4]   2> 	  "state":"down",
[junit4:junit4]   2> 	  "shard_state":"active",
[junit4:junit4]   2> 	  "core":"nodes_used_collection_shard2_replica2",
[junit4:junit4]   2> 	  "collection":"nodes_used_collection",
[junit4:junit4]   2> 	  "shard_range":null,
[junit4:junit4]   2> 	  "node_name":"127.0.0.1:49755_",
[junit4:junit4]   2> 	  "base_url":"http://127.0.0.1:49755"}
[junit4:junit4]   2> 1301133 T2595 oascc.ZkStateReader$2.process A cluster state change: WatchedEvent state:SyncConnected type:NodeDataChanged path:/clusterstate.json, has occurred - updating... (live nodes size: 5)
[junit4:junit4]   2> 1301134 T2650 oascc.ZkStateReader$2.process A cluster state change: WatchedEvent state:SyncConnected type:NodeDataChanged path:/clusterstate.json, has occurred - updating... (live nodes size: 5)
[junit4:junit4]   2> 1301146 T2608 oascc.ZkStateReader$2.process A cluster state change: WatchedEvent state:SyncConnected type:NodeDataChanged path:/clusterstate.json, has occurred - updating... (live nodes size: 5)
[junit4:junit4]   2> 1301150 T2622 oascc.ZkStateReader$2.process A cluster state change: WatchedEvent state:SyncConnected type:NodeDataChanged path:/clusterstate.json, has occurred - updating... (live nodes size: 5)
[junit4:junit4]   2> 1301151 T2636 oascc.ZkStateReader$2.process A cluster state change: WatchedEvent state:SyncConnected type:NodeDataChanged path:/clusterstate.json, has occurred - updating... (live nodes size: 5)
[junit4:junit4]   2> 1301152 T2590 oascc.ZkStateReader$2.process A cluster state change: WatchedEvent state:SyncConnected type:NodeDataChanged path:/clusterstate.json, has occurred - updating... (live nodes size: 5)
[junit4:junit4]   2> 1301952 T2602 oasc.CoreContainer.create Creating SolrCore 'nodes_used_collection_shard2_replica2' using instanceDir: /Users/jenkins/jenkins-slave/workspace/Lucene-Solr-trunk-MacOSX/solr/build/solr-core/test/J0/./org.apache.solr.cloud.CollectionsAPIDistributedZkTest-jetty1-1371141056104/nodes_used_collection_shard2_replica2
[junit4:junit4]   2> 1301955 T2602 oasc.ZkController.createCollectionZkNode Check for collection zkNode:nodes_used_collection
[junit4:junit4]   2> 1301953 T2645 oasc.CoreContainer.create Creating SolrCore 'nodes_used_collection_shard2_replica1' using instanceDir: /Users/jenkins/jenkins-slave/workspace/Lucene-Solr-trunk-MacOSX/solr/build/solr-core/test/J0/./org.apache.solr.cloud.CollectionsAPIDistributedZkTest-jetty4-1371141062777/nodes_used_collection_shard2_replica1
[junit4:junit4]   2> 1301958 T2645 oasc.ZkController.createCollectionZkNode Check for collection zkNode:nodes_used_collection
[junit4:junit4]   2> 1301953 T2617 oasc.CoreContainer.create Creating SolrCore 'nodes_used_collection_shard1_replica2' using instanceDir: /Users/jenkins/jenkins-slave/workspace/Lucene-Solr-trunk-MacOSX/solr/build/solr-core/test/J0/./org.apache.solr.cloud.CollectionsAPIDistributedZkTest-jetty2-1371141058317/nodes_used_collection_shard1_replica2
[junit4:junit4]   2> 1301960 T2617 oasc.ZkController.createCollectionZkNode Check for collection zkNode:nodes_used_collection
[junit4:junit4]   2> 1301952 T2586 oasc.CoreContainer.create Creating SolrCore 'nodes_used_collection_shard1_replica1' using instanceDir: /Users/jenkins/jenkins-slave/workspace/Lucene-Solr-trunk-MacOSX/solr/build/solr-core/test/J0/./org.apache.solr.cloud.CollectionsAPIDistributedZkTest-controljetty-1371141054795/nodes_used_collection_shard1_replica1
[junit4:junit4]   2> 1301961 T2586 oasc.ZkController.createCollectionZkNode Check for collection zkNode:nodes_used_collection
[junit4:junit4]   2> 1301967 T2586 oasc.ZkController.createCollectionZkNode Creating collection in ZooKeeper:nodes_used_collection
[junit4:junit4]   2> 1301967 T2586 oasc.ZkController.getConfName Looking for collection configName
[junit4:junit4]   2> 1301972 T2586 oasc.ZkController.getConfName Only one config set found in zk - using it:conf1
[junit4:junit4]   2> 1301973 T2586 oascc.SolrZkClient.makePath makePath: /collections/nodes_used_collection
[junit4:junit4]   2> 1301981 T2645 oasc.ZkController.createCollectionZkNode Creating collection in ZooKeeper:nodes_used_collection
[junit4:junit4]   2> 1301982 T2645 oasc.ZkController.getConfName Looking for collection configName
[junit4:junit4]   2> 1301983 T2602 oasc.ZkController.createCollectionZkNode Creating collection in ZooKeeper:nodes_used_collection
[junit4:junit4]   2> 1301983 T2602 oasc.ZkController.getConfName Looking for collection configName
[junit4:junit4]   2> 1301989 T2617 oasc.ZkController.createCollectionZkNode Creating collection in ZooKeeper:nodes_used_collection
[junit4:junit4]   2> 1301990 T2617 oasc.ZkController.getConfName Looking for collection configName
[junit4:junit4]   2> 1301991 T2602 oascc.SolrZkClient.makePath makePath: /collections/nodes_used_collection
[junit4:junit4]   2> 1302002 T2586 oasc.ZkController.readConfigName Load collection config from:/collections/nodes_used_collection
[junit4:junit4]   2> 1302009 T2617 oascc.SolrZkClient.makePath makePath: /collections/nodes_used_collection
[junit4:junit4]   2> 1302009 T2645 oascc.SolrZkClient.makePath makePath: /collections/nodes_used_collection
[junit4:junit4]   2> 1302012 T2586 oasc.SolrResourceLoader.<init> new SolrResourceLoader for directory: '/Users/jenkins/jenkins-slave/workspace/Lucene-Solr-trunk-MacOSX/solr/build/solr-core/test/J0/./org.apache.solr.cloud.CollectionsAPIDistributedZkTest-controljetty-1371141054795/nodes_used_collection_shard1_replica1/'
[junit4:junit4]   2> 1302021 T2602 oasc.ZkController.readConfigName Load collection config from:/collections/nodes_used_collection
[junit4:junit4]   2> 1302048 T2645 oasc.ZkController.readConfigName Load collection config from:/collections/nodes_used_collection
[junit4:junit4]   2> 1302059 T2645 oasc.SolrResourceLoader.<init> new SolrResourceLoader for directory: '/Users/jenkins/jenkins-slave/workspace/Lucene-Solr-trunk-MacOSX/solr/build/solr-core/test/J0/./org.apache.solr.cloud.CollectionsAPIDistributedZkTest-jetty4-1371141062777/nodes_used_collection_shard2_replica1/'
[junit4:junit4]   2> 1302062 T2602 oasc.SolrResourceLoader.<init> new SolrResourceLoader for directory: '/Users/jenkins/jenkins-slave/workspace/Lucene-Solr-trunk-MacOSX/solr/build/solr-core/test/J0/./org.apache.solr.cloud.CollectionsAPIDistributedZkTest-jetty1-1371141056104/nodes_used_collection_shard2_replica2/'
[junit4:junit4]   2> 1302068 T2617 oasc.ZkController.readConfigName Load collection config from:/collections/nodes_used_collection
[junit4:junit4]   2> 1302075 T2617 oasc.SolrResourceLoader.<init> new SolrResourceLoader for directory: '/Users/jenkins/jenkins-slave/workspace/Lucene-Solr-trunk-MacOSX/solr/build/solr-core/test/J0/./org.apache.solr.cloud.CollectionsAPIDistributedZkTest-jetty2-1371141058317/nodes_used_collection_shard1_replica2/'
[junit4:junit4]   2> 1302459 T2617 oasc.SolrConfig.<init> Using Lucene MatchVersion: LUCENE_50
[junit4:junit4]   2> 1302525 T2645 oasc.SolrConfig.<init> Using Lucene MatchVersion: LUCENE_50
[junit4:junit4]   2> 1302537 T2586 oasc.SolrConfig.<init> Using Lucene MatchVersion: LUCENE_50
[junit4:junit4]   2> 1302565 T2602 oasc.SolrConfig.<init> Using Lucene MatchVersion: LUCENE_50
[junit4:junit4]   2> 1302958 T2586 oasc.SolrConfig.<init> Loaded SolrConfig: solrconfig.xml
[junit4:junit4]   2> 1302960 T2602 oasc.SolrConfig.<init> Loaded SolrConfig: solrconfig.xml
[junit4:junit4]   2> 1302985 T2617 oasc.SolrConfig.<init> Loaded SolrConfig: solrconfig.xml
[junit4:junit4]   2> 1302991 T2586 oass.IndexSchema.readSchema Reading Solr Schema from schema.xml
[junit4:junit4]   2> 1303000 T2586 oass.IndexSchema.readSchema [nodes_used_collection_shard1_replica1] Schema name=test
[junit4:junit4]   2> 1303005 T2617 oass.IndexSchema.readSchema Reading Solr Schema from schema.xml
[junit4:junit4]   2> 1303007 T2645 oasc.SolrConfig.<init> Loaded SolrConfig: solrconfig.xml
[junit4:junit4]   2> 1303020 T2602 oass.IndexSchema.readSchema Reading Solr Schema from schema.xml
[junit4:junit4]   2> 1303034 T2602 oass.IndexSchema.readSchema [nodes_used_collection_shard2_replica2] Schema name=test
[junit4:junit4]   2> 1303021 T2645 oass.IndexSchema.readSchema Reading Solr Schema from schema.xml
[junit4:junit4]   2> 1303092 T2617 oass.IndexSchema.readSchema [nodes_used_collection_shard1_replica2] Schema name=test
[junit4:junit4]   2> 1303097 T2645 oass.IndexSchema.readSchema [nodes_used_collection_shard2_replica1] Schema name=test
[junit4:junit4]   2> 1307522 T2645 oass.OpenExchangeRatesOrgProvider.init Initialized with rates=open-exchange-rates.json, refreshInterval=1440.
[junit4:junit4]   2> 1307549 T2586 oass.OpenExchangeRatesOrgProvider.init Initialized with rates=open-exchange-rates.json, refreshInterval=1440.
[junit4:junit4]   2> 1307601 T2645 oass.IndexSchema.readSchema default search field in schema is text
[junit4:junit4]   2> 1307618 T2645 oass.IndexSchema.readSchema unique key field: id
[junit4:junit4]   2> 1307631 T2586 oass.IndexSchema.readSchema default search field in schema is text
[junit4:junit4]   2> 1307722 T2586 oass.IndexSchema.readSchema unique key field: id
[junit4:junit4]   2> 1307788 T2617 oass.OpenExchangeRatesOrgProvider.init Initialized with rates=open-exchange-rates.json, refreshInterval=1440.
[junit4:junit4]   2> 1307872 T2617 oass.IndexSchema.readSchema default search field in schema is text
[junit4:junit4]   2> 1307894 T2617 oass.IndexSchema.readSchema unique key field: id
[junit4:junit4]   2> 1307942 T2586 oass.FileExchangeRateProvider.reload Reloading exchange rates from file currency.xml
[junit4:junit4]   2> 1307965 T2586 oass.FileExchangeRateProvider.reload Reloading exchange rates from file currency.xml
[junit4:junit4]   2> 1307970 T2645 oass.FileExchangeRateProvider.reload Reloading exchange rates from file currency.xml
[junit4:junit4]   2> 1307991 T2586 oass.OpenExchangeRatesOrgProvider.reload Reloading exchange rates from open-exchange-rates.json
[junit4:junit4]   2> 1308010 T2586 oass.OpenExchangeRatesOrgProvider$OpenExchangeRates.<init> WARN Unknown key IMPORTANT NOTE
[junit4:junit4]   2> 1308032 T2586 oass.OpenExchangeRatesOrgProvider$OpenExchangeRates.<init> WARN Expected key, got STRING
[junit4:junit4]   2> 1308033 T2586 oass.OpenExchangeRatesOrgProvider.reload Reloading exchange rates from open-exchange-rates.json
[junit4:junit4]   2> 1308028 T2645 oass.FileExchangeRateProvider.reload Reloading exchange rates from file currency.xml
[junit4:junit4]   2> 1308031 T2602 oass.OpenExchangeRatesOrgProvider.init Initialized with rates=open-exchange-rates.json, refreshInterval=1440.
[junit4:junit4]   2> 1308065 T2586 oass.OpenExchangeRatesOrgProvider$OpenExchangeRates.<init> WARN Unknown key IMPORTANT NOTE
[junit4:junit4]   2> 1308069 T2586 oass.OpenExchangeRatesOrgProvider$OpenExchangeRates.<init> WARN Expected key, got STRING
[junit4:junit4]   2> 1308070 T2586 oasc.SolrCore.initDirectoryFactory org.apache.solr.core.MockDirectoryFactory
[junit4:junit4]   2> 1308071 T2586 oasc.SolrCore.<init> [nodes_used_collection_shard1_replica1] Opening new SolrCore at /Users/jenkins/jenkins-slave/workspace/Lucene-Solr-trunk-MacOSX/solr/build/solr-core/test/J0/./org.apache.solr.cloud.CollectionsAPIDistributedZkTest-controljetty-1371141054795/nodes_used_collection_shard1_replica1/, dataDir=/Users/jenkins/jenkins-slave/workspace/Lucene-Solr-trunk-MacOSX/solr/build/solr-core/test/J0/./org.apache.solr.cloud.CollectionsAPIDistributedZkTest-controljetty-1371141054795/nodes_used_collection_shard1_replica1/data/
[junit4:junit4]   2> 1308072 T2586 oasc.JmxMonitoredMap.<init> JMX monitoring is enabled. Adding Solr mbeans to JMX Server: com.sun.jmx.mbeanserver.JmxMBeanServer@286094d
[junit4:junit4]   2> 1308073 T2586 oasc.SolrCore.initDirectoryFactory org.apache.solr.core.MockDirectoryFactory
[junit4:junit4]   2> 1308075 T2586 oasc.CachingDirectoryFactory.get return new directory for /Users/jenkins/jenkins-slave/workspace/Lucene-Solr-trunk-MacOSX/solr/build/solr-core/test/J0/./org.apache.solr.cloud.CollectionsAPIDistributedZkTest-controljetty-1371141054795/nodes_used_collection_shard1_replica1/data
[junit4:junit4]   2> 1308076 T2586 oasc.SolrCore.getNewIndexDir New index directory detected: old=null new=/Users/jenkins/jenkins-slave/workspace/Lucene-Solr-trunk-MacOSX/solr/build/solr-core/test/J0/./org.apache.solr.cloud.CollectionsAPIDistributedZkTest-controljetty-1371141054795/nodes_used_collection_shard1_replica1/data/index/
[junit4:junit4]   2> 1308095 T2586 oasc.SolrCore.initIndex WARN [nodes_used_collection_shard1_replica1] Solr index directory '/Users/jenkins/jenkins-slave/workspace/Lucene-Solr-trunk-MacOSX/solr/build/solr-core/test/J0/./org.apache.solr.cloud.CollectionsAPIDistributedZkTest-controljetty-1371141054795/nodes_used_collection_shard1_replica1/data/index' doesn't exist. Creating new index...
[junit4:junit4]   2> 1308097 T2586 oasc.CachingDirectoryFactory.get return new directory for /Users/jenkins/jenkins-slave/workspace/Lucene-Solr-trunk-MacOSX/solr/build/solr-core/test/J0/./org.apache.solr.cloud.CollectionsAPIDistributedZkTest-controljetty-1371141054795/nodes_used_collection_shard1_replica1/data/index
[junit4:junit4]   2> 1308073 T2645 oass.OpenExchangeRatesOrgProvider.reload Reloading exchange rates from open-exchange-rates.json
[junit4:junit4]   2> 1308107 T2586 oasc.SolrDeletionPolicy.onCommit SolrDeletionPolicy.onCommit: commits: num=1
[junit4:junit4]   2> 		commit{dir=MockDirWrapper(org.apache.lucene.store.RAMDirectory@4cfa2ec3 lockFactory=org.apache.lucene.store.NativeFSLockFactory@1f0bbfff),segFN=segments_1,generation=1}
[junit4:junit4]   2> 1308109 T2586 oasc.SolrDeletionPolicy.updateCommits newest commit generation = 1
[junit4:junit4]   2> 1308093 T2602 oass.IndexSchema.readSchema default search field in schema is text
[junit4:junit4]   2> 1308127 T2617 oass.FileExchangeRateProvider.reload Reloading exchange rates from file currency.xml
[junit4:junit4]   2> 1308127 T2645 oass.OpenExchangeRatesOrgProvider$OpenExchangeRates.<init> WARN Unknown key IMPORTANT NOTE
[junit4:junit4]   2> 1308156 T2645 oass.OpenExchangeRatesOrgProvider$OpenExchangeRates.<init> WARN Expected key, got STRING
[junit4:junit4]   2> 1308158 T2645 oass.OpenExchangeRatesOrgProvider.reload Reloading exchange rates from open-exchange-rates.json
[junit4:junit4]   2> 1308118 T2586 oasup.UpdateRequestProcessorChain.init inserting DistributedUpdateProcessorFactory into updateRequestProcessorChain "dedupe"
[junit4:junit4]   2> 1308160 T2586 oasup.UpdateRequestProcessorChain.init inserting DistributedUpdateProcessorFactory into updateRequestProcessorChain "stored_sig"
[junit4:junit4]   2> 1308169 T2586 oasup.UpdateRequestProcessorChain.init inserting DistributedUpdateProcessorFactory into updateRequestProcessorChain "distrib-dup-test-chain-implicit"
[junit4:junit4]   2> 1308172 T2586 oasc.RequestHandlers.initHandlersFromConfig created standard: solr.StandardRequestHandler
[junit4:junit4]   2> 1308174 T2586 oasc.RequestHandlers.initHandlersFromConfig created /get: solr.RealTimeGetHandler
[junit4:junit4]   2> 1308175 T2586 oasc.RequestHandlers.initHandlersFromConfig adding lazy requestHandler: solr.ReplicationHandler
[junit4:junit4]   2> 1308176 T2586 oasc.RequestHandlers.initHandlersFromConfig created /replication: solr.ReplicationHandler
[junit4:junit4]   2> 1308177 T2586 oasc.RequestHandlers.initHandlersFromConfig created /update: solr.UpdateRequestHandler
[junit4:junit4]   2> 1308178 T2586 oasc.RequestHandlers.initHandlersFromConfig created /admin/: org.apache.solr.handler.admin.AdminHandlers
[junit4:junit4]   2> 1308185 T2645 oass.OpenExchangeRatesOrgProvider$OpenExchangeRates.<init> WARN Unknown key IMPORTANT NOTE
[junit4:junit4]   2> 1308186 T2645 oass.OpenExchangeRatesOrgProvider$OpenExchangeRates.<init> WARN Expected key, got STRING
[junit4:junit4]   2> 1308191 T2645 oasc.SolrCore.initDirectoryFactory org.apache.solr.core.MockDirectoryFactory
[junit4:junit4]   2> 1308192 T2645 oasc.SolrCore.<init> [nodes_used_collection_shard2_replica1] Opening new SolrCore at /Users/jenkins/jenkins-slave/workspace/Lucene-Solr-trunk-MacOSX/solr/build/solr-core/test/J0/./org.apache.solr.cloud.CollectionsAPIDistributedZkTest-jetty4-1371141062777/nodes_used_collection_shard2_replica1/, dataDir=/Users/jenkins/jenkins-slave/workspace/Lucene-Solr-trunk-MacOSX/solr/build/solr-core/test/J0/./org.apache.solr.cloud.CollectionsAPIDistributedZkTest-jetty4-1371141062777/nodes_used_collection_shard2_replica1/data/
[junit4:junit4]   2> 1308193 T2645 oasc.JmxMonitoredMap.<init> JMX monitoring is enabled. Adding Solr mbeans to JMX Server: com.sun.jmx.mbeanserver.JmxMBeanServer@286094d
[junit4:junit4]   2> 1308194 T2645 oasc.SolrCore.initDirectoryFactory org.apache.solr.core.MockDirectoryFactory
[junit4:junit4]   2> 1308196 T2645 oasc.CachingDirectoryFactory.get return new directory for /Users/jenkins/jenkins-slave/workspace/Lucene-Solr-trunk-MacOSX/solr/build/solr-core/test/J0/./org.apache.solr.cloud.CollectionsAPIDistributedZkTest-jetty4-1371141062777/nodes_used_collection_shard2_replica1/data
[junit4:junit4]   2> 1308197 T2645 oasc.SolrCore.getNewIndexDir New index directory detected: old=null new=/Users/jenkins/jenkins-slave/workspace/Lucene-Solr-trunk-MacOSX/solr/build/solr-core/test/J0/./org.apache.solr.cloud.CollectionsAPIDistributedZkTest-jetty4-1371141062777/nodes_used_collection_shard2_replica1/data/index/
[junit4:junit4]   2> 1308198 T2645 oasc.SolrCore.initIndex WARN [nodes_used_collection_shard2_replica1] Solr index directory '/Users/jenkins/jenkins-slave/workspace/Lucene-Solr-trunk-MacOSX/solr/build/solr-core/test/J0/./org.apache.solr.cloud.CollectionsAPIDistributedZkTest-jetty4-1371141062777/nodes_used_collection_shard2_replica1/data/index' doesn't exist. Creating new index...
[junit4:junit4]   2> 1308199 T2645 oasc.CachingDirectoryFactory.get return new directory for /Users/jenkins/jenkins-slave/workspace/Lucene-Solr-trunk-MacOSX/solr/build/solr-core/test/J0/./org.apache.solr.cloud.CollectionsAPIDistributedZkTest-jetty4-1371141062777/nodes_used_collection_shard2_replica1/data/index
[junit4:junit4]   2> 1308172 T2602 oass.IndexSchema.readSchema unique key field: id
[junit4:junit4]   2> 1308237 T2617 oass.FileExchangeRateProvider.reload Reloading exchange rates from file currency.xml
[junit4:junit4]   2> 1308241 T2645 oasc.SolrDeletionPolicy.onCommit SolrDeletionPolicy.onCommit: commits: num=1
[junit4:junit4]   2> 		commit{dir=MockDirWrapper(org.apache.lucene.store.RAMDirectory@7d0d8716 lockFactory=org.apache.lucene.store.NativeFSLockFactory@4671e12c),segFN=segments_1,generation=1}
[junit4:junit4]   2> 1308241 T2645 oasc.SolrDeletionPolicy.updateCommits newest commit generation = 1
[junit4:junit4]   2> 1308247 T2645 oasup.UpdateRequestProcessorChain.init inserting DistributedUpdateProcessorFactory into updateRequestProcessorChain "dedupe"
[junit4:junit4]   2> 1308248 T2645 oasup.UpdateRequestProcessorChain.init inserting DistributedUpdateProcessorFactory into updateRequestProcessorChain "stored_sig"
[junit4:junit4]   2> 1308250 T2645 oasup.UpdateRequestProcessorChain.init inserting DistributedUpdateProcessorFactory into updateRequestProcessorChain "distrib-dup-test-chain-implicit"
[junit4:junit4]   2> 1308254 T2645 oasc.RequestHandlers.initHandlersFromConfig created standard: solr.StandardRequestHandler
[junit4:junit4]   2> 1308255 T2645 oasc.RequestHandlers.initHandlersFromConfig created /get: solr.RealTimeGetHandler
[junit4:junit4]   2> 1308255 T2645 oasc.RequestHandlers.initHandlersFromConfig adding lazy requestHandler: solr.ReplicationHandler
[junit4:junit4]   2> 1308256 T2645 oasc.RequestHandlers.initHandlersFromConfig created /replication: solr.ReplicationHandler
[junit4:junit4]   2> 1308257 T2645 oasc.RequestHandlers.initHandlersFromConfig created /update: solr.UpdateRequestHandler
[junit4:junit4]   2> 1308258 T2645 oasc.RequestHandlers.initHandlersFromConfig created /admin/: org.apache.solr.handler.admin.AdminHandlers
[junit4:junit4]   2> 1308291 T2617 oass.OpenExchangeRatesOrgProvider.reload Reloading exchange rates from open-exchange-rates.json
[junit4:junit4]   2> 1308309 T2586 oashl.XMLLoader.init xsltCacheLifetimeSeconds=60
[junit4:junit4]   2> 1308308 T2645 oashl.XMLLoader.init xsltCacheLifetimeSeconds=60
[junit4:junit4]   2> 1308328 T2645 oass.SolrIndexSearcher.<init> Opening Searcher@3d75e566 main
[junit4:junit4]   2> 1308329 T2645 oasu.UpdateHandler.clearLog Clearing tlog files, tlogDir=/Users/jenkins/jenkins-slave/workspace/Lucene-Solr-trunk-MacOSX/solr/build/solr-core/test/J0/./org.apache.solr.cloud.CollectionsAPIDistributedZkTest-jetty4-1371141062777/nodes_used_collection_shard2_replica1/data/tlog
[junit4:junit4]   2> 1308333 T2617 oass.OpenExchangeRatesOrgProvider$OpenExchangeRates.<init> WARN Unknown key IMPORTANT NOTE
[junit4:junit4]   2> 1308367 T2617 oass.OpenExchangeRatesOrgProvider$OpenExchangeRates.<init> WARN Expected key, got STRING
[junit4:junit4]   2> 1308368 T2617 oass.OpenExchangeRatesOrgProvider.reload Reloading exchange rates from open-exchange-rates.json
[junit4:junit4]   2> 1308333 T2586 oass.SolrIndexSearcher.<init> Opening Searcher@566c53c main
[junit4:junit4]   2> 1308374 T2586 oasu.UpdateHandler.clearLog Clearing tlog files, tlogDir=/Users/jenkins/jenkins-slave/workspace/Lucene-Solr-trunk-MacOSX/solr/build/solr-core/test/J0/./org.apache.solr.cloud.CollectionsAPIDistributedZkTest-controljetty-1371141054795/nodes_used_collection_shard1_replica1/data/tlog
[junit4:junit4]   2> 1308365 T2645 oasu.CommitTracker.<init> Hard AutoCommit: disabled
[junit4:junit4]   2> 1308380 T2645 oasu.CommitTracker.<init> Soft AutoCommit: disabled
[junit4:junit4]   2> 1308382 T2586 oasu.CommitTracker.<init> Hard AutoCommit: disabled
[junit4:junit4]   2> 1308388 T2586 oasu.CommitTracker.<init> Soft AutoCommit: disabled
[junit4:junit4]   2> 1308394 T2657 oasc.SolrCore.registerSearcher [nodes_used_collection_shard2_replica1] Registered new searcher Searcher@3d75e566 main{StandardDirectoryReader(segments_1:1)}
[junit4:junit4]   2> 1308381 T2617 oass.OpenExchangeRatesOrgProvider$OpenExchangeRates.<init> WARN Unknown key IMPORTANT NOTE
[junit4:junit4]   2> 1308399 T2617 oass.OpenExchangeRatesOrgProvider$OpenExchangeRates.<init> WARN Expected key, got STRING
[junit4:junit4]   2> 1308400 T2617 oasc.SolrCore.initDirectoryFactory org.apache.solr.core.MockDirectoryFactory
[junit4:junit4]   2> 1308401 T2617 oasc.SolrCore.<init> [nodes_used_collection_shard1_replica2] Opening new SolrCore at /Users/jenkins/jenkins-slave/workspace/Lucene-Solr-trunk-MacOSX/solr/build/solr-core/test/J0/./org.apache.solr.cloud.CollectionsAPIDistributedZkTest-jetty2-1371141058317/nodes_used_collection_shard1_replica2/, dataDir=/Users/jenkins/jenkins-slave/workspace/Lucene-Solr-trunk-MacOSX/solr/build/solr-core/test/J0/./org.apache.solr.cloud.CollectionsAPIDistributedZkTest-jetty2-1371141058317/nodes_used_collection_shard1_replica2/data/
[junit4:junit4]   2> 1308402 T2617 oasc.JmxMonitoredMap.<init> JMX monitoring is enabled. Adding Solr mbeans to JMX Server: com.sun.jmx.mbeanserver.JmxMBeanServer@286094d
[junit4:junit4]   2> 1308403 T2617 oasc.SolrCore.initDirectoryFactory org.apache.solr.core.MockDirectoryFactory
[junit4:junit4]   2> 1308406 T2617 oasc.CachingDirectoryFactory.get return new directory for /Users/jenkins/jenkins-slave/workspace/Lucene-Solr-trunk-MacOSX/solr/build/solr-core/test/J0/./org.apache.solr.cloud.CollectionsAPIDistributedZkTest-jetty2-1371141058317/nodes_used_collection_shard1_replica2/data
[junit4:junit4]   2> 1308407 T2617 oasc.SolrCore.getNewIndexDir New index directory detected: old=null new=/Users/jenkins/jenkins-slave/workspace/Lucene-Solr-trunk-MacOSX/solr/build/solr-core/test/J0/./org.apache.solr.cloud.CollectionsAPIDistributedZkTest-jetty2-1371141058317/nodes_used_collection_shard1_replica2/data/index/
[junit4:junit4]   2> 1308408 T2617 oasc.SolrCore.initIndex WARN [nodes_used_collection_shard1_replica2] Solr index directory '/Users/jenkins/jenkins-slave/workspace/Lucene-Solr-trunk-MacOSX/solr/build/solr-core/test/J0/./org.apache.solr.cloud.CollectionsAPIDistributedZkTest-jetty2-1371141058317/nodes_used_collection_shard1_replica2/data/index' doesn't exist. Creating new index...
[junit4:junit4]   2> 1308412 T2617 oasc.CachingDirectoryFactory.get return new directory for /Users/jenkins/jenkins-slave/workspace/Lucene-Solr-trunk-MacOSX/solr/build/solr-core/test/J0/./org.apache.solr.cloud.CollectionsAPIDistributedZkTest-jetty2-1371141058317/nodes_used_collection_shard1_replica2/data/index
[junit4:junit4]   2> 1308395 T2602 oass.FileExchangeRateProvider.reload Reloading exchange rates from file currency.xml
[junit4:junit4]   2> 1308409 T2656 oasc.SolrCore.registerSearcher [nodes_used_collection_shard1_replica1] Registered new searcher Searcher@566c53c main{StandardDirectoryReader(segments_1:1)}
[junit4:junit4]   2> 1308423 T2645 oasc.CoreContainer.registerCore registering core: nodes_used_collection_shard2_replica1
[junit4:junit4]   2> 1308424 T2645 oasc.ZkController.register Register replica - core:nodes_used_collection_shard2_replica1 address:http://127.0.0.1:49764 collection:nodes_used_collection shard:shard2
[junit4:junit4]   2> 1308447 T2645 oascc.SolrZkClient.makePath makePath: /collections/nodes_used_collection/leader_elect/shard2/election
[junit4:junit4]   2> 1308448 T2586 oasc.CoreContainer.registerCore registering core: nodes_used_collection_shard1_replica1
[junit4:junit4]   2> 1308449 T2586 oasc.ZkController.register Register replica - core:nodes_used_collection_shard1_replica1 address:http://127.0.0.1:49751 collection:nodes_used_collection shard:shard1
[junit4:junit4]   2> 1308453 T2617 oasc.SolrDeletionPolicy.onCommit SolrDeletionPolicy.onCommit: commits: num=1
[junit4:junit4]   2> 		commit{dir=MockDirWrapper(org.apache.lucene.store.RAMDirectory@8043ef0 lockFactory=org.apache.lucene.store.NativeFSLockFactory@29814989),segFN=segments_1,generation=1}
[junit4:junit4]   2> 1308454 T2617 oasc.SolrDeletionPolicy.updateCommits newest commit generation = 1
[junit4:junit4]   2> 1308455 T2586 oascc.SolrZkClient.makePath makePath: /collections/nodes_used_collection/leader_elect/shard1/election
[junit4:junit4]   2> 1308474 T2617 oasup.UpdateRequestProcessorChain.init inserting DistributedUpdateProcessorFactory into updateRequestProcessorChain "dedupe"
[junit4:junit4]   2> 1308475 T2617 oasup.UpdateRequestProcessorChain.init inserting DistributedUpdateProcessorFactory into updateRequestProcessorChain "stored_sig"
[junit4:junit4]   2> 1308490 T2602 oass.FileExchangeRateProvider.reload Reloading exchange rates from file currency.xml
[junit4:junit4]   2> 1308494 T2617 oasup.UpdateRequestProcessorChain.init inserting DistributedUpdateProcessorFactory into updateRequestProcessorChain "distrib-dup-test-chain-implicit"
[junit4:junit4]   2> 1308501 T2617 oasc.RequestHandlers.initHandlersFromConfig created standard: solr.StandardRequestHandler
[junit4:junit4]   2> 1308502 T2617 oasc.RequestHandlers.initHandlersFromConfig created /get: solr.RealTimeGetHandler
[junit4:junit4]   2> 1308503 T2617 oasc.RequestHandlers.initHandlersFromConfig adding lazy requestHandler: solr.ReplicationHandler
[junit4:junit4]   2> 1308504 T2617 oasc.RequestHandlers.initHandlersFromConfig created /replication: solr.ReplicationHandler
[junit4:junit4]   2> 1308505 T2617 oasc.RequestHandlers.initHandlersFromConfig created /update: solr.UpdateRequestHandler
[junit4:junit4]   2> 1308507 T2617 oasc.RequestHandlers.initHandlersFromConfig created /admin/: org.apache.solr.handler.admin.AdminHandlers
[junit4:junit4]   2> 1308576 T2586 oasc.ShardLeaderElectionContext.runLeaderProcess Running the leader process.
[junit4:junit4]   2> 1308591 T2645 oasc.ShardLeaderElectionContext.runLeaderProcess Running the leader process.
[junit4:junit4]   2> 1308605 T2617 oashl.XMLLoader.init xsltCacheLifetimeSeconds=60
[junit4:junit4]   2> 1308613 T2602 oass.OpenExchangeRatesOrgProvider.reload Reloading exchange rates from open-exchange-rates.json
[junit4:junit4]   2> 1308623 T2586 oasc.ShardLeaderElectionContext.waitForReplicasToComeUp Waiting until we see more replicas up: total=2 found=1 timeoutin=179994
[junit4:junit4]   2> 1308625 T2645 oasc.ShardLeaderElectionContext.waitForReplicasToComeUp Waiting until we see more replicas up: total=2 found=1 timeoutin=179998
[junit4:junit4]   2> 1308626 T2602 oass.OpenExchangeRatesOrgProvider$OpenExchangeRates.<init> WARN Unknown key IMPORTANT NOTE
[junit4:junit4]   2> 1308627 T2602 oass.OpenExchangeRatesOrgProvider$OpenExchangeRates.<init> WARN Expected key, got STRING
[junit4:junit4]   2> 1308628 T2602 oass.OpenExchangeRatesOrgProvider.reload Reloading exchange rates from open-exchange-rates.json
[junit4:junit4]   2> 1308633 T2617 oass.SolrIndexSearcher.<init> Opening Searcher@410043fc main
[junit4:junit4]   2> 1308634 T2617 oasu.UpdateHandler.clearLog Clearing tlog files, tlogDir=/Users/jenkins/jenkins-slave/workspace/Lucene-Solr-trunk-MacOSX/solr/build/solr-core/test/J0/./org.apache.solr.cloud.CollectionsAPIDistributedZkTest-jetty2-1371141058317/nodes_used_collection_shard1_replica2/data/tlog
[junit4:junit4]   2> 1308637 T2617 oasu.CommitTracker.<init> Hard AutoCommit: disabled
[junit4:junit4]   2> 1308638 T2617 oasu.CommitTracker.<init> Soft AutoCommit: disabled
[junit4:junit4]   2> 1308647 T2602 oass.OpenExchangeRatesOrgProvider$OpenExchangeRates.<init> WARN Unknown key IMPORTANT NOTE
[junit4:junit4]   2> 1308648 T2602 oass.OpenExchangeRatesOrgProvider$OpenExchangeRates.<init> WARN Expected key, got STRING
[junit4:junit4]   2> 1308648 T2602 oasc.SolrCore.initDirectoryFactory org.apache.solr.core.MockDirectoryFactory
[junit4:junit4]   2> 1308649 T2602 oasc.SolrCore.<init> [nodes_used_collection_shard2_replica2] Opening new SolrCore at /Users/jenkins/jenkins-slave/workspace/Lucene-Solr-trunk-MacOSX/solr/build/solr-core/test/J0/./org.apache.solr.cloud.CollectionsAPIDistributedZkTest-jetty1-1371141056104/nodes_used_collection_shard2_replica2/, dataDir=/Users/jenkins/jenkins-slave/workspace/Lucene-Solr-trunk-MacOSX/solr/build/solr-core/test/J0/./org.apache.solr.cloud.CollectionsAPIDistributedZkTest-jetty1-1371141056104/nodes_used_collection_shard2_replica2/data/
[junit4:junit4]   2> 1308650 T2602 oasc.JmxMonitoredMap.<init> JMX monitoring is enabled. Adding Solr mbeans to JMX Server: com.sun.jmx.mbeanserver.JmxMBeanServer@286094d
[junit4:junit4]   2> 1308650 T2602 oasc.SolrCore.initDirectoryFactory org.apache.solr.core.MockDirectoryFactory
[junit4:junit4]   2> 1308651 T2602 oasc.CachingDirectoryFactory.get return new directory for /Users/jenkins/jenkins-slave/workspace/Lucene-Solr-trunk-MacOSX/solr/build/solr-core/test/J0/./org.apache.solr.cloud.CollectionsAPIDistributedZkTest-jetty1-1371141056104/nodes_used_collection_shard2_replica2/data
[junit4:junit4]   2> 1308652 T2602 oasc.SolrCore.getNewIndexDir New index directory detected: old=null new=/Users/jenkins/jenkins-slave/workspace/Lucene-Solr-trunk-MacOSX/solr/build/solr-core/test/J0/./org.apache.solr.cloud.CollectionsAPIDistributedZkTest-jetty1-1371141056104/nodes_used_collection_shard2_replica2/data/index/
[junit4:junit4]   2> 1308652 T2602 oasc.SolrCore.initIndex WARN [nodes_used_collection_shard2_replica2] Solr index directory '/Users/jenkins/jenkins-slave/workspace/Lucene-Solr-trunk-MacOSX/solr/build/solr-core/test/J0/./org.apache.solr.cloud.CollectionsAPIDistributedZkTest-jetty1-1371141056104/nodes_used_collection_shard2_replica2/data/index' doesn't exist. Creating new index...
[junit4:junit4]   2> 1308653 T2602 oasc.CachingDirectoryFactory.get return new directory for /Users/jenkins/jenkins-slave/workspace/Lucene-Solr-trunk-MacOSX/solr/build/solr-core/test/J0/./org.apache.solr.cloud.CollectionsAPIDistributedZkTest-jetty1-1371141056104/nodes_used_collection_shard2_replica2/data/index
[junit4:junit4]   2> 1308660 T2658 oasc.SolrCore.registerSearcher [nodes_used_collection_shard1_replica2] Registered new searcher Searcher@410043fc main{StandardDirectoryReader(segments_1:1)}
[junit4:junit4]   2> 1308672 T2617 oasc.CoreContainer.registerCore registering core: nodes_used_collection_shard1_replica2
[junit4:junit4]   2> 1308676 T2617 oasc.ZkController.register Register replica - core:nodes_used_collection_shard1_replica2 address:http://127.0.0.1:49758 collection:nodes_used_collection shard:shard1
[junit4:junit4]   2> 1308681 T2602 oasc.SolrDeletionPolicy.onCommit SolrDeletionPolicy.onCommit: commits: num=1
[junit4:junit4]   2> 		commit{dir=MockDirWrapper(org.apache.lucene.store.RAMDirectory@3cf3e27a lockFactory=org.apache.lucene.store.NativeFSLockFactory@5a295242),segFN=segments_1,generation=1}
[junit4:junit4]   2> 1308681 T2602 oasc.SolrDeletionPolicy.updateCommits newest commit generation = 1
[junit4:junit4]   2> 1308686 T2602 oasup.UpdateRequestProcessorChain.init inserting DistributedUpdateProcessorFactory into updateRequestProcessorChain "dedupe"
[junit4:junit4]   2> 1308687 T2602 oasup.UpdateRequestProcessorChain.init inserting DistributedUpdateProcessorFactory into updateRequestProcessorChain "stored_sig"
[junit4:junit4]   2> 1308688 T2602 oasup.UpdateRequestProcessorChain.init inserting DistributedUpdateProcessorFactory into updateRequestProcessorChain "distrib-dup-test-chain-implicit"
[junit4:junit4]   2> 1308695 T2602 oasc.RequestHandlers.initHandlersFromConfig created standard: solr.StandardRequestHandler
[junit4:junit4]   2> 1308697 T2602 oasc.RequestHandlers.initHandlersFromConfig created /get: solr.RealTimeGetHandler
[junit4:junit4]   2> 1308698 T2602 oasc.RequestHandlers.initHandlersFromConfig adding lazy requestHandler: solr.ReplicationHandler
[junit4:junit4]   2> 1308699 T2602 oasc.RequestHandlers.initHandlersFromConfig created /replication: solr.ReplicationHandler
[junit4:junit4]   2> 1308700 T2602 oasc.RequestHandlers.initHandlersFromConfig created /update: solr.UpdateRequestHandler
[junit4:junit4]   2> 1308702 T2602 oasc.RequestHandlers.initHandlersFromConfig created /admin/: org.apache.solr.handler.admin.AdminHandlers
[junit4:junit4]   2> 1308741 T2602 oashl.XMLLoader.init xsltCacheLifetimeSeconds=60
[junit4:junit4]   2> 1308751 T2602 oass.SolrIndexSearcher.<init> Opening Searcher@744ae790 main
[junit4:junit4]   2> 1308752 T2602 oasu.UpdateHandler.clearLog Clearing tlog files, tlogDir=/Users/jenkins/jenkins-slave/workspace/Lucene-Solr-trunk-MacOSX/solr/build/solr-core/test/J0/./org.apache.solr.cloud.CollectionsAPIDistributedZkTest-jetty1-1371141056104/nodes_used_collection_shard2_replica2/data/tlog
[junit4:junit4]   2> 1308755 T2602 oasu.CommitTracker.<init> Hard AutoCommit: disabled
[junit4:junit4]   2> 1308756 T2602 oasu.CommitTracker.<init> Soft AutoCommit: disabled
[junit4:junit4]   2> 1308763 T2659 oasc.SolrCore.registerSearcher [nodes_used_collection_shard2_replica2] Registered new searcher Searcher@744ae790 main{StandardDirectoryReader(segments_1:1)}
[junit4:junit4]   2> 1308770 T2602 oasc.CoreContainer.registerCore registering core: nodes_used_collection_shard2_replica2
[junit4:junit4]   2> 1308771 T2602 oasc.ZkController.register Register replica - core:nodes_used_collection_shard2_replica2 address:http://127.0.0.1:49755 collection:nodes_used_collection shard:shard2
[junit4:junit4]   2> 1308799 T2591 oascc.ZkStateReader.updateClusterState Updating cloud state from ZooKeeper... 
[junit4:junit4]   2> 1308851 T2636 oascc.ZkStateReader$2.process A cluster state change: WatchedEvent state:SyncConnected type:NodeDataChanged path:/clusterstate.json, has occurred - updating... (live nodes size: 5)
[junit4:junit4]   2> 1308852 T2608 oascc.ZkStateReader$2.process A cluster state change: WatchedEvent state:SyncConnected type:NodeDataChanged path:/clusterstate.json, has occurred - updating... (live nodes size: 5)
[junit4:junit4]   2> 1308852 T2622 oascc.ZkStateReader$2.process A cluster state change: WatchedEvent state:SyncConnected type:NodeDataChanged path:/clusterstate.json, has occurred - updating... (live nodes size: 5)
[junit4:junit4]   2> 1308853 T2595 oascc.ZkStateReader$2.process A cluster state change: WatchedEvent state:SyncConnected type:NodeDataChanged path:/clusterstate.json, has occurred - updating... (live nodes size: 5)
[junit4:junit4]   2> 1308855 T2590 oascc.ZkStateReader$2.process A cluster state change: WatchedEvent state:SyncConnected type:NodeDataChanged path:/clusterstate.json, has occurred - updating... (live nodes size: 5)
[junit4:junit4]   2> 1308856 T2650 oascc.ZkStateReader$2.process A cluster state change: WatchedEvent state:SyncConnected type:NodeDataChanged path:/clusterstate.json, has occurred - updating... (live nodes size: 5)
[junit4:junit4]   2> 1309127 T2586 oasc.ShardLeaderElectionContext.waitForReplicasToComeUp Enough replicas found to continue.
[junit4:junit4]   2> 1309128 T2586 oasc.ShardLeaderElectionContext.runLeaderProcess I may be the new leader - try and sync
[junit4:junit4]   2> 1309128 T2586 oasc.SyncStrategy.sync Sync replicas to http://127.0.0.1:49751/nodes_used_collection_shard1_replica1/
[junit4:junit4]   2> 1309128 T2586 oasu.PeerSync.sync PeerSync: core=nodes_used_collection_shard1_replica1 url=http://127.0.0.1:49751 START replicas=[http://127.0.0.1:49758/nodes_used_collection_shard1_replica2/] nUpdates=100
[junit4:junit4]   2> 1309130 T2645 oasc.ShardLeaderElectionContext.waitForReplicasToComeUp Enough replicas found to continue.
[junit4:junit4]   2> 1309130 T2645 oasc.ShardLeaderElectionContext.runLeaderProcess I may be the new leader - try and sync
[junit4:junit4]   2> 1309131 T2645 oasc.SyncStrategy.sync Sync replicas to http://127.0.0.1:49764/nodes_used_collection_shard2_replica1/
[junit4:junit4]   2> 1309131 T2645 oasu.PeerSync.sync PeerSync: core=nodes_used_collection_shard2_replica1 url=http://127.0.0.1:49764 START replicas=[http://127.0.0.1:49755/nodes_used_collection_shard2_replica2/] nUpdates=100
[junit4:junit4]   2> 1309132 T2586 oasu.PeerSync.sync PeerSync: core=nodes_used_collection_shard1_replica1 url=http://127.0.0.1:49751 DONE.  We have no versions.  sync failed.
[junit4:junit4]   2> 1309132 T2586 oasc.SyncStrategy.syncReplicas Leader's attempt to sync with shard failed, moving to the next canidate
[junit4:junit4]   2> 1309132 T2586 oasc.ShardLeaderElectionContext.runLeaderProcess We failed sync, but we have no versions - we can't sync in that case - we were active before, so become leader anyway
[junit4:junit4]   2> 1309133 T2586 oasc.ShardLeaderElectionContext.runLeaderProcess I am the new leader: http://127.0.0.1:49751/nodes_used_collection_shard1_replica1/
[junit4:junit4]   2> 1309133 T2586 oascc.SolrZkClient.makePath makePath: /collections/nodes_used_collection/leaders/shard1
[junit4:junit4]   2> 1309145 T2645 oasu.PeerSync.sync PeerSync: core=nodes_used_collection_shard2_replica1 url=http://127.0.0.1:49764 DONE.  We have no versions.  sync failed.
[junit4:junit4]   2> 1309145 T2645 oasc.SyncStrategy.syncReplicas Leader's attempt to sync with shard failed, moving to the next canidate
[junit4:junit4]   2> 1309147 T2645 oasc.ShardLeaderElectionContext.runLeaderProcess We failed sync, but we have no versions - we can't sync in that case - we were active before, so become leader anyway
[junit4:junit4]   2> 1309147 T2645 oasc.ShardLeaderElectionContext.runLeaderProcess I am the new leader: http://127.0.0.1:49764/nodes_used_collection_shard2_replica1/
[junit4:junit4]   2> 1309148 T2645 oascc.SolrZkClient.makePath makePath: /collections/nodes_used_collection/leaders/shard2
[junit4:junit4]   2> ASYNC  NEW_CORE C764 name=nodes_used_collection_shard1_replica2 org.apache.solr.core.SolrCore@c26200c url=http://127.0.0.1:49758/nodes_used_collection_shard1_replica2 node=127.0.0.1:49758_ C764_STATE=coll:nodes_used_collection core:nodes_used_collection_shard1_replica2 props:{shard=shard1, state=down, core=nodes_used_collection_shard1_replica2, collection=nodes_used_collection, node_name=127.0.0.1:49758_, base_url=http://127.0.0.1:49758}
[junit4:junit4]   2> 1309170 T2616 C764 P49758 oasc.SolrCore.execute [nodes_used_collection_shard1_replica2] webapp= path=/get params={getVersions=100&distrib=false&wt=javabin&qt=/get&version=2} status=0 QTime=26 
[junit4:junit4]   2> ASYNC  NEW_CORE C765 name=nodes_used_collection_shard2_replica2 org.apache.solr.core.SolrCore@2533cd42 url=http://127.0.0.1:49755/nodes_used_collection_shard2_replica2 node=127.0.0.1:49755_ C765_STATE=coll:nodes_used_collection core:nodes_used_collection_shard2_replica2 props:{shard=shard2, state=down, core=nodes_used_collection_shard2_replica2, collection=nodes_used_collection, node_name=127.0.0.1:49755_, base_url=http://127.0.0.1:49755}
[junit4:junit4]   2> 1309196 T2603 C765 P49755 oasc.SolrCore.execute [nodes_used_collection_shard2_replica2] webapp= path=/get params={getVersions=100&distrib=false&wt=javabin&qt=/get&version=2} status=0 QTime=4 
[junit4:junit4]   2> 1310388 T2591 oascc.ZkStateReader.updateClusterState Updating cloud state from ZooKeeper... 
[junit4:junit4]   2> 1310424 T2636 oascc.ZkStateReader$2.process A cluster state change: WatchedEvent state:SyncConnected type:NodeDataChanged path:/clusterstate.json, has occurred - updating... (live nodes size: 5)
[junit4:junit4]   2> 1310424 T2608 oascc.ZkStateReader$2.process A cluster state change: WatchedEvent state:SyncConnected type:NodeDataChanged path:/clusterstate.json, has occurred - updating... (live nodes size: 5)
[junit4:junit4]   2> 1310425 T2590 oascc.ZkStateReader$2.process A cluster state change: WatchedEvent state:SyncConnected type:NodeDataChanged path:/clusterstate.json, has occurred - updating... (live nodes size: 5)
[junit4:junit4]   2> 1310441 T2595 oascc.ZkStateReader$2.process A cluster state change: WatchedEvent state:SyncConnected type:NodeDataChanged path:/clusterstate.json, has occurred - updating... (live nodes size: 5)
[junit4:junit4]   2> 1310442 T2650 oascc.ZkStateReader$2.process A cluster state change: WatchedEvent state:SyncConnected type:NodeDataChanged path:/clusterstate.json, has occurred - updating... (live nodes size: 5)
[junit4:junit4]   2> 1310443 T2622 oascc.ZkStateReader$2.process A cluster state change: WatchedEvent state:SyncConnected type:NodeDataChanged path:/clusterstate.json, has occurred - updating... (live nodes size: 5)
[junit4:junit4]   2> 1310483 T2602 oasc.ZkController.register We are http://127.0.0.1:49755/nodes_used_collection_shard2_replica2/ and leader is http://127.0.0.1:49764/nodes_used_collection_shard2_replica1/
[junit4:junit4]   2> 1310485 T2602 oasc.ZkController.register No LogReplay needed for core=nodes_used_collection_shard2_replica2 baseURL=http://127.0.0.1:49755
[junit4:junit4]   2> 1310486 T2602 oasc.ZkController.checkRecovery Core needs to recover:nodes_used_collection_shard2_replica2
[junit4:junit4]   2> 1310486 T2602 oasu.DefaultSolrCoreState.doRecovery Running recovery - first canceling any ongoing recovery
[junit4:junit4]   2> 1310488 T2662 C765 P49755 oasc.RecoveryStrategy.run Starting recovery process.  core=nodes_used_collection_shard2_replica2 recoveringAfterStartup=true
[junit4:junit4]   2> 1310489 T2662 C765 P49755 oasc.RecoveryStrategy.doRecovery ###### startupVersions=[]
[junit4:junit4]   2> 1310490 T2662 C765 P49755 oasc.ZkController.publish publishing core=nodes_used_collection_shard2_replica2 state=recovering
[junit4:junit4]   2> 1310491 T2617 oasc.ZkController.register We are http://127.0.0.1:49758/nodes_used_collection_shard1_replica2/ and leader is http://127.0.0.1:49751/nodes_used_collection_shard1_replica1/
[junit4:junit4]   2> 1310492 T2617 oasc.ZkController.register No LogReplay needed for core=nodes_used_collection_shard1_replica2 baseURL=http://127.0.0.1:49758
[junit4:junit4]   2> 1310492 T2617 oasc.ZkController.checkRecovery Core needs to recover:nodes_used_collection_shard1_replica2
[junit4:junit4]   2> 1310493 T2617 oasu.DefaultSolrCoreState.doRecovery Running recovery - first canceling any ongoing recovery
[junit4:junit4]   2> 1310495 T2663 C764 P49758 oasc.RecoveryStrategy.run Starting recovery process.  core=nodes_used_collection_shard1_replica2 recoveringAfterStartup=true
[junit4:junit4]   2> 1310496 T2663 C764 P49758 oasc.RecoveryStrategy.doRecovery ###### startupVersions=[]
[junit4:junit4]   2> 1310497 T2663 C764 P49758 oasc.ZkController.publish publishing core=nodes_used_collection_shard1_replica2 state=recovering
[junit4:junit4]   2> 1310505 T2602 oascc.ZkStateReader.updateClusterState Updating cloud state from ZooKeeper... 
[junit4:junit4]   2> 1310506 T2662 C765 P49755 oascsi.HttpClientUtil.createClient Creating new http client, config:maxConnections=128&maxConnectionsPerHost=32&followRedirects=false
[junit4:junit4]   2> 1310514 T2617 oascc.ZkStateReader.updateClusterState Updating cloud state from ZooKeeper... 
[junit4:junit4]   2> 1310516 T2663 C764 P49758 oascsi.HttpClientUtil.createClient Creating new http client, config:maxConnections=128&maxConnectionsPerHost=32&followRedirects=false
[junit4:junit4]   2> 1310520 T2645 oasc.ZkController.register We are http://127.0.0.1:49764/nodes_used_collection_shard2_replica1/ and leader is http://127.0.0.1:49764/nodes_used_collection_shard2_replica1/
[junit4:junit4]   2> 1310521 T2645 oasc.ZkController.register No LogReplay needed for core=nodes_used_collection_shard2_replica1 baseURL=http://127.0.0.1:49764
[junit4:junit4]   2> 1310522 T2645 oasc.ZkController.checkRecovery I am the leader, no recovery necessary
[junit4:junit4]   2> 1310522 T2645 oasc.ZkController.publish publishing core=nodes_used_collection_shard2_replica1 state=active
[junit4:junit4]   2> 1310523 T2586 oasc.ZkController.register We are http://127.0.0.1:49751/nodes_used_collection_shard1_replica1/ and leader is http://127.0.0.1:49751/nodes_used_collection_shard1_replica1/
[junit4:junit4]   2> 1310524 T2586 oasc.ZkController.register No LogReplay needed for core=nodes_used_collection_shard1_replica1 baseURL=http://127.0.0.1:49751
[junit4:junit4]   2> 1310525 T2586 oasc.ZkController.checkRecovery I am the leader, no recovery necessary
[junit4:junit4]   2> 1310526 T2586 oasc.ZkController.publish publishing core=nodes_used_collection_shard1_replica1 state=active
[junit4:junit4]   2> 1310561 T2602 oass.SolrDispatchFilter.handleAdminRequest [admin] webapp=null path=/admin/cores params={numShards=2&shard=shard2&name=nodes_used_collection_shard2_replica2&action=CREATE&collection=nodes_used_collection&wt=javabin&qt=/admin/cores&version=2} status=0 QTime=9613 
[junit4:junit4]   2> 1310562 T2617 oass.SolrDispatchFilter.handleAdminRequest [admin] webapp=null path=/admin/cores params={numShards=2&shard=shard1&name=nodes_used_collection_shard1_replica2&action=CREATE&collection=nodes_used_collection&wt=javabin&qt=/admin/cores&version=2} status=0 QTime=9617 
[junit4:junit4]   2> 1310566 T2645 oascc.ZkStateReader.updateClusterState Updating cloud state from ZooKeeper... 
[junit4:junit4]   2> 1310570 T2645 oass.SolrDispatchFilter.handleAdminRequest [admin] webapp=null path=/admin/cores params={numShards=2&shard=shard2&name=nodes_used_collection_shard2_replica1&action=CREATE&collection=nodes_used_collection&wt=javabin&qt=/admin/cores&version=2} status=0 QTime=9627 
[junit4:junit4]   2> 1310570 T2586 oascc.ZkStateReader.updateClusterState Updating cloud state from ZooKeeper... 
[junit4:junit4]   2> 1310603 T2586 oass.SolrDispatchFilter.handleAdminRequest [admin] webapp=null path=/admin/cores params={numShards=2&shard=shard1&name=nodes_used_collection_shard1_replica1&action=CREATE&collection=nodes_used_collection&wt=javabin&qt=/admin/cores&version=2} status=0 QTime=9659 
[junit4:junit4]   2> 1310605 T2592 oasc.OverseerCollectionProcessor.createCollection Finished create command on all shards for collection: nodes_used_collection
[junit4:junit4]   2> 1310618 T2646 oasha.CoreAdminHandler.handleWaitForStateAction Going to wait for coreNodeName: 127.0.0.1:49755__nodes_used_collection_shard2_replica2, state: recovering, checkLive: true, onlyIfLeader: true
[junit4:junit4]   2> 1310620 T2584 oasha.CoreAdminHandler.handleWaitForStateAction Going to wait for coreNodeName: 127.0.0.1:49758__nodes_used_collection_shard1_replica2, state: recovering, checkLive: true, onlyIfLeader: true
[junit4:junit4]   2> 1310629 T2608 oasc.DistributedQueue$LatchChildWatcher.process Watcher fired on path: /overseer/collection-queue-work/qnr-0000000000 state: SyncConnected type NodeDataChanged
[junit4:junit4]   2> 1310647 T2601 oass.SolrDispatchFilter.handleAdminRequest [admin] webapp=null path=/admin/collections params={numShards=2&name=nodes_used_collection&replicationFactor=2&action=CREATE&wt=javabin&version=2} status=0 QTime=9735 
[junit4:junit4]   2> 1310651 T2568 oascsi.HttpClientUtil.createClient Creating new http client, config:
[junit4:junit4]   2> 1310655 T2568 oascc.ConnectionManager.waitForConnected Waiting for client to connect to ZooKeeper
[junit4:junit4]   2> 1310648 T2590 oasc.DistributedQueue$LatchChildWatcher.process Watcher fired on path: /overseer/collection-queue-work state: SyncConnected type NodeChildrenChanged
[junit4:junit4]   2> 1310659 T2592 oasc.OverseerCollectionProcessor.run Overseer Collection Processor: Message id:/overseer/collection-queue-work/qn-0000000000 complete, response:{success={null={responseHeader={status=0,QTime=9613},core=nodes_used_collection_shard2_replica2},null={responseHeader={status=0,QTime=9617},core=nodes_used_collection_shard1_replica2},null={responseHeader={status=0,QTime=9627},core=nodes_used_collection_shard2_replica1},null={responseHeader={status=0,QTime=9659},core=nodes_used_collection_shard1_replica1}}}
[junit4:junit4]   2> 1310667 T2665 oascc.ConnectionManager.process Watcher org.apache.solr.common.cloud.ConnectionManager@514af562 name:ZooKeeperConnection Watcher:127.0.0.1:49748/solr got event WatchedEvent state:SyncConnected type:None path:null path:null type:None
[junit4:junit4]   2> 1310668 T2568 oascc.ConnectionManager.waitForConnected Client is connected to ZooKeeper
[junit4:junit4]   2> 1310674 T2568 oascc.ZkStateReader.createClusterStateWatchersAndUpdate Updating cluster state from ZooKeeper... 
[junit4:junit4]   2> 1310689 T2568 oascsi.HttpClientUtil.createClient Creating new http client, config:
[junit4:junit4]   2> 1310701 T2568 oascc.ConnectionManager.waitForConnected Waiting for client to connect to ZooKeeper
[junit4:junit4]   2> 1310703 T2667 oascc.ConnectionManager.process Watcher org.apache.solr.common.cloud.ConnectionManager@743ef113 name:ZooKeeperConnection Watcher:127.0.0.1:49748/solr got event WatchedEvent state:SyncConnected type:None path:null path:null type:None
[junit4:junit4]   2> 1310704 T2568 oascc.ConnectionManager.waitForConnected Client is connected to ZooKeeper
[junit4:junit4]   2> 1310713 T2568 oascc.ZkStateReader.createClusterStateWatchersAndUpdate Updating cluster state from ZooKeeper... 
[junit4:junit4]   2> 1310781 T2585 oasha.CollectionsHandler.handleCreateAction Creating Collection : numShards=5&maxShardsPerNode=6&name=awholynewcollection_0&replicationFactor=5&action=CREATE&wt=javabin&version=2
[junit4:junit4]   2> 1310789 T2590 oasc.DistributedQueue$LatchChildWatcher.process Watcher fired on path: /overseer/collection-queue-work state: SyncConnected type NodeChildrenChanged
[junit4:junit4]   2> 1310803 T2590 oasc.DistributedQueue$LatchChildWatcher.process Watcher fired on path: /overseer/collection-queue-work state: SyncConnected type NodeChildrenChanged
[junit4:junit4]   2> 1310805 T2592 oasc.OverseerCollectionProcessor.run Overseer Collection Processor: Get the message id:/overseer/collection-queue-work/qn-0000000002 message:{
[junit4:junit4]   2> 	  "operation":"createcollection",
[junit4:junit4]   2> 	  "numShards":"5",
[junit4:junit4]   2> 	  "maxShardsPerNode":"6",
[junit4:junit4]   2> 	  "createNodeSet":null,
[junit4:junit4]   2> 	  "name":"awholynewcollection_0",
[junit4:junit4]   2> 	  "replicationFactor":"5"}
[junit4:junit4]   2> 1310805 T2592 oasc.OverseerCollectionProcessor.createCollection Creating shard awholynewcollection_0_shard1_replica1 as part of slice shard1 of collection awholynewcollection_0 on 127.0.0.1:49751_
[junit4:junit4]   2> 1310806 T2592 oasc.OverseerCollectionProcessor.createCollection Creating shard awholynewcollection_0_shard1_replica2 as part of slice shard1 of collection awholynewcollection_0 on 127.0.0.1:49761_
[junit4:junit4]   2> 1310806 T2592 oasc.OverseerCollectionProcessor.createCollection Creating shard awholynewcollection_0_shard1_replica3 as part of slice shard1 of collection awholynewcollection_0 on 127.0.0.1:49755_
[junit4:junit4]   2> 1310807 T2592 oasc.OverseerCollectionProcessor.createCollection Creating shard awholynewcollection_0_shard1_replica4 as part of slice shard1 of collection awholynewcollection_0 on 127.0.0.1:49764_
[junit4:junit4]   2> 1310808 T2592 oasc.OverseerCollectionProcessor.createCollection Creating shard awholynewcollection_0_shard1_replica5 as part of slice shard1 of collection awholynewcollection_0 on 127.0.0.1:49758_
[junit4:junit4]   2> 1310813 T2581 oasc.ZkController.publish publishing core=awholynewcollection_0_shard1_replica1 state=down
[junit4:junit4]   2> 1310819 T2592 oasc.OverseerCollectionProcessor.createCollection Creating shard awholynewcollection_0_shard2_replica1 as part of slice shard2 of collection awholynewcollection_0 on 127.0.0.1:49751_
[junit4:junit4]   2> 1310845 T2592 oasc.OverseerCollectionProcessor.createCollection Creating shard awholynewcollection_0_shard2_replica2 as part of slice shard2 of collection awholynewcollection_0 on 127.0.0.1:49761_
[junit4:junit4]   2> 1310846 T2592 oasc.OverseerCollectionProcessor.createCollection Creating shard awholynewcollection_0_shard2_replica3 as part of slice shard2 of collection awholynewcollection_0 on 127.0.0.1:49755_
[junit4:junit4]   2> 1310851 T2592 oasc.OverseerCollectionProcessor.createCollection Creating shard awholynewcollection_0_shard2_replica4 as part of slice shard2 of collection awholynewcollection_0 on 127.0.0.1:49764_
[junit4:junit4]   2> 1310875 T2582 oasc.ZkController.publish publishing core=awholynewcollection_0_shard2_replica1 state=down
[junit4:junit4]   2> 1310858 T2603 oasc.ZkController.publish publishing core=awholynewcollection_0_shard1_replica3 state=down
[junit4:junit4]   2> 1310853 T2641 oasc.ZkController.publish publishing core=awholynewcollection_0_shard1_replica4 state=down
[junit4:junit4]   2> 1310899 T2632 oasc.ZkController.publish publishing core=awholynewcollection_0_shard2_replica2 state=down
[junit4:junit4]   2> 1310889 T2615 oasc.ZkController.publish publishing core=awholynewcollection_0_shard1_replica5 state=down
[junit4:junit4]   2> 1310888 T2600 oasc.ZkController.publish publishing core=awholynewcollection_0_shard2_replica3 state=down
[junit4:junit4]   2> 1310887 T2630 oasc.ZkController.publish publishing core=awholynewcollection_0_shard1_replica2 state=down
[junit4:junit4]   2> 1310911 T2642 oasc.ZkController.publish publishing core=awholynewcollection_0_shard2_replica4 state=down
[junit4:junit4]   2> 1310883 T2592 oasc.OverseerCollectionProcessor.createCollection Creating shard awholynewcollection_0_shard2_replica5 as part of slice shard2 of collection awholynewcollection_0 on 127.0.0.1:49758_
[junit4:junit4]   2> 1310919 T2592 oasc.OverseerCollectionProcessor.createCollection Creating shard awholynewcollection_0_shard3_replica1 as part of slice shard3 of collection awholynewcollection_0 on 127.0.0.1:49751_
[junit4:junit4]   2> 1310923 T2618 oasc.ZkController.publish publishing core=awholynewcollection_0_shard2_replica5 state=down
[junit4:junit4]   2> 1310928 T2592 oasc.OverseerCollectionProcessor.createCollection Creating shard awholynewcollection_0_shard3_replica2 as part of slice shard3 of collection awholynewcollection_0 on 127.0.0.1:49761_
[junit4:junit4]   2> 1310932 T2586 oasc.ZkController.publish publishing core=awholynewcollection_0_shard3_replica1 state=down
[junit4:junit4]   2> 1310939 T2592 oasc.OverseerCollectionProcessor.createCollection Creating shard awholynewcollection_0_shard3_replica3 as part of slice shard3 of collection awholynewcollection_0 on 127.0.0.1:49755_
[junit4:junit4]   2> 1310941 T2631 oasc.ZkController.publish publishing core=awholynewcollection_0_shard3_replica2 state=down
[junit4:junit4]   2> 1310943 T2592 oasc.OverseerCollectionProcessor.createCollection Creating shard awholynewcollection_0_shard3_replica4 as part of slice shard3 of collection awholynewcollection_0 on 127.0.0.1:49764_
[junit4:junit4]   2> 1310946 T2598 oasc.ZkController.publish publishing core=awholynewcollection_0_shard3_replica3 state=down
[junit4:junit4]   2> 1310947 T2592 oasc.OverseerCollectionProcessor.createCollection Creating shard awholynewcollection_0_shard3_replica5 as part of slice shard3 of collection awholynewcollection_0 on 127.0.0.1:49758_
[junit4:junit4]   2> 1310951 T2645 oasc.ZkController.publish publishing core=awholynewcollection_0_shard3_replica4 state=down
[junit4:junit4]   2> 1310955 T2613 oasc.ZkController.publish publishing core=awholynewcollection_0_shard3_replica5 state=down
[junit4:junit4]   2> 1310955 T2592 oasc.OverseerCollectionProcessor.createCollection Creating shard awholynewcollection_0_shard4_replica1 as part of slice shard4 of collection awholynewcollection_0 on 127.0.0.1:49751_
[junit4:junit4]   2> 1310961 T2592 oasc.OverseerCollectionProcessor.createCollection Creating shard awholynewcollection_0_shard4_replica2 as part of slice shard4 of collection awholynewcollection_0 on 127.0.0.1:49761_
[junit4:junit4]   2> 1310963 T2583 oasc.ZkController.publish publishing core=awholynewcollection_0_shard4_replica1 state=down
[junit4:junit4]   2> 1310964 T2592 oasc.OverseerCollectionProcessor.createCollection Creating shard awholynewcollection_0_shard4_replica3 as part of slice shard4 of collection awholynewcollection_0 on 127.0.0.1:49755_
[junit4:junit4]   2> 1310968 T2627 oasc.ZkController.publish publishing core=awholynewcollection_0_shard4_replica2 state=down
[junit4:junit4]   2> 1310969 T2592 oasc.OverseerCollectionProcessor.createCollection Creating shard awholynewcollection_0_shard4_replica4 as part of slice shard4 of collection awholynewcollection_0 on 127.0.0.1:49764_
[junit4:junit4]   2> 1310972 T2592 oasc.OverseerCollectionProcessor.createCollection Creating shard awholynewcollection_0_shard4_replica5 as part of slice shard4 of collection awholynewcollection_0 on 127.0.0.1:49758_
[junit4:junit4]   2> 1310974 T2602 oasc.ZkController.publish publishing core=awholynewcollection_0_shard4_replica3 state=down
[junit4:junit4]   2> 1310975 T2643 oasc.ZkController.publish publishing core=awholynewcollection_0_shard4_replica4 state=down
[junit4:junit4]   2> 1310978 T2592 oasc.OverseerCollectionProcessor.createCollection Creating shard awholynewcollection_0_shard5_replica1 as part of slice shard5 of collection awholynewcollection_0 on 127.0.0.1:49751_
[junit4:junit4]   2> 1310980 T2614 oasc.ZkController.publish publishing core=awholynewcollection_0_shard4_replica5 state=down
[junit4:junit4]   2> 1310990 T2685 oasc.ZkController.publish publishing core=awholynewcollection_0_shard5_replica1 state=down
[junit4:junit4]   2> 1310999 T2592 oasc.OverseerCollectionProcessor.createCollection Creating shard awholynewcollection_0_shard5_replica2 as part of slice shard5 of collection awholynewcollection_0 on 127.0.0.1:49761_
[junit4:junit4]   2> 1311003 T2592 oasc.OverseerCollectionProcessor.createCollection Creating shard awholynewcollection_0_shard5_replica3 as part of slice shard5 of collection awholynewcollection_0 on 127.0.0.1:49755_
[junit4:junit4]   2> 1311007 T2629 oasc.ZkController.publish publishing core=awholynewcollection_0_shard5_replica2 state=down
[junit4:junit4]   2> 1311010 T2592 oasc.OverseerCollectionProcessor.createCollection Creating shard awholynewcollection_0_shard5_replica4 as part of slice shard5 of collection awholynewcollection_0 on 127.0.0.1:49764_
[junit4:junit4]   2> 1311014 T2592 oasc.OverseerCollectionProcessor.createCollection Creating shard awholynewcollection_0_shard5_replica5 as part of slice shard5 of collection awholynewcollection_0 on 127.0.0.1:49758_
[junit4:junit4]   2> 1311016 T2644 oasc.ZkController.publish publishing core=awholynewcollection_0_shard5_replica4 state=down
[junit4:junit4]   2> 1311016 T2601 oasc.ZkController.publish publishing core=awholynewcollection_0_shard5_replica3 state=down
[junit4:junit4]   2> 1311022 T2617 oasc.ZkController.publish publishing core=awholynewcollection_0_shard5_replica5 state=down
[junit4:junit4]   2> 1311994 T2591 oascc.ZkStateReader.updateClusterState Updating cloud state from ZooKeeper... 
[junit4:junit4]   2> 1311997 T2591 oasc.Overseer$ClusterStateUpdater.updateState Update state numShards=2 message={
[junit4:junit4]   2> 	  "operation":"state",
[junit4:junit4]   2> 	  "core_node_name":"127.0.0.1:49758__nodes_used_collection_shard1_replica2",
[junit4:junit4]   2> 	  "numShards":"2",
[junit4:junit4]   2> 	  "shard":"shard1",
[junit4:junit4]   2> 	  "roles":null,
[junit4:junit4]   2> 	  "state":"recovering",
[junit4:junit4]   2> 	  "shard_state":"active",
[junit4:junit4]   2> 	  "core":"nodes_used_collection_shard1_replica2",
[junit4:junit4]   2> 	  "collection":"nodes_used_collection",
[junit4:junit4]   2> 	  "shard_range":null,
[junit4:junit4]   2> 	  "node_name":"127.0.0.1:49758_",
[junit4:junit4]   2> 	  "base_url":"http://127.0.0.1:49758"}
[junit4:junit4]   2> 1312028 T2591 oasc.Overseer$ClusterStateUpdater.updateState Update state numShards=2 message={
[junit4:junit4]   2> 	  "operation":"state",
[junit4:junit4]   2> 	  "core_node_name":"127.0.0.1:49755__nodes_used_collection_shard2_replica2",
[junit4:junit4]   2> 	  "numShards":"2",
[junit4:junit4]   2> 	  "shard":"shard2",
[junit4:junit4]   2> 	  "roles":null,
[junit4:junit4]   2> 	  "state":"recovering",
[junit4:junit4]   2> 	  "shard_state":"active",
[junit4:junit4]   2> 	  "core":"nodes_used_collection_shard2_replica2",
[junit4:junit4]   2> 	  "collection":"nodes_used_collection",
[junit4:junit4]   2> 	  "shard_range":null,
[junit4:junit4]   2> 	  "node_name":"127.0.0.1:49755_",
[junit4:junit4]   2> 	  "base_url":"http://127.0.0.1:49755"}
[junit4:junit4]   2> 1312053 T2591 oasc.Overseer$ClusterStateUpdater.updateState Update state numShards=2 message={
[junit4:junit4]   2> 	  "operation":"state",
[junit4:junit4]   2> 	  "core_node_name":"127.0.0.1:49764__nodes_used_collection_shard2_replica1",
[junit4:junit4]   2> 	  "numShards":"2",
[junit4:junit4]   2> 	  "shard":"shard2",
[junit4:junit4]   2> 	  "roles":null,
[junit4:junit4]   2> 	  "state":"active",
[junit4:junit4]   2> 	  "shard_state":"active",
[junit4:junit4]   2> 	  "core":"nodes_used_collection_shard2_replica1",
[junit4:junit4]   2> 	  "collection":"nodes_used_collection",
[junit4:junit4]   2> 	  "shard_range":null,
[junit4:junit4]   2> 	  "node_name":"127.0.0.1:49764_",
[junit4:junit4]   2> 	  "base_url":"http://127.0.0.1:49764"}
[junit4:junit4]   2> 1312074 T2591 oasc.Overseer$ClusterStateUpdater.updateState Update state numShards=2 message={
[junit4:junit4]   2> 	  "operation":"state",
[junit4:junit4]   2> 	  "core_node_name":"127.0.0.1:49751__nodes_used_collection_shard1_replica1",
[junit4:junit4]   2> 	  "numShards":"2",
[junit4:junit4]   2> 	  "shard":"shard1",
[junit4:junit4]   2> 	  "roles":null,
[junit4:junit4]   2> 	  "state":"active",
[junit4:junit4]   2> 	  "shard_state":"active",
[junit4:junit4]   2> 	  "core":"nodes_used_collection_shard1_replica1",
[junit4:junit4]   2> 	  "collection":"nodes_used_collection",
[junit4:junit4]   2> 	  "shard_range":null,
[junit4:junit4]   2> 	  "node_name":"127.0.0.1:49751_",
[junit4:junit4]   2> 	  "base_url":"http://127.0.0.1:49751"}
[junit4:junit4]   2> 1312098 T2591 oasc.Overseer$ClusterStateUpdater.updateState Update state numShards=5 message={
[junit4:junit4]   2> 	  "operation":"state",
[junit4:junit4]   2> 	  "core_node_name":null,
[junit4:junit4]   2> 	  "numShards":"5",
[junit4:junit4]   2> 	  "shard":"shard1",
[junit4:junit4]   2> 	  "roles":null,
[junit4:junit4]   2> 	  "state":"down",
[junit4:junit4]   2> 	  "shard_state":"active",
[junit4:junit4]   2> 	  "core":"awholynewcollection_0_shard1_replica3",
[junit4:junit4]   2> 	  "collection":"awholynewcollection_0",
[junit4:junit4]   2> 	  "shard_range":null,
[junit4:junit4]   2> 	  "node_name":"127.0.0.1:49755_",
[junit4:junit4]   2> 	  "base_url":"http://127.0.0.1:49755"}
[junit4:junit4]   2> 1312099 T2591 oasc.Overseer$ClusterStateUpdater.createCollection Create collection awholynewcollection_0 with numShards 5
[junit4:junit4]   2> 1312142 T2591 oasc.Overseer$ClusterStateUpdater.updateState Update state numShards=5 message={
[junit4:junit4]   2> 	  "operation":"state",
[junit4:junit4]   2> 	  "core_node_name":null,
[junit4:junit4]   2> 	  "numShards":"5",
[junit4:junit4]   2> 	  "shard":"shard2",
[junit4:junit4]   2> 	  "roles":null,
[junit4:junit4]   2> 	  "state":"down",
[junit4:junit4]   2> 	  "shard_state":"active",
[junit4:junit4]   2> 	  "core":"awholynewcollection_0_shard2_replica2",
[junit4:junit4]   2> 	  "collection":"awholynewcollection_0",
[junit4:junit4]   2> 	  "shard_range":null,
[junit4:junit4]   2> 	  "node_name":"127.0.0.1:49761_",
[junit4:junit4]   2> 	  "base_url":"http://127.0.0.1:49761"}
[junit4:junit4]   2> 1312160 T2591 oasc.Overseer$ClusterStateUpdater.updateState Update state numShards=5 message={
[junit4:junit4]   2> 	  "operation":"state",
[junit4:junit4]   2> 	  "core_node_name":null,
[junit4:junit4]   2> 	  "numShards":"5",
[junit4:junit4]   2> 	  "shard":"shard1",
[junit4:junit4]   2> 	  "roles":null,
[junit4:junit4]   2> 	  "state":"down",
[junit4:junit4]   2> 	  "shard_state":"active",
[junit4:junit4]   2> 	  "core":"awholynewcollection_0_shard1_replica5",
[junit4:junit4]   2> 	  "collection":"awholynewcollection_0",
[junit4:junit4]   2> 	  "shard_range":null,
[junit4:junit4]   2> 	  "node_name":"127.0.0.1:49758_",
[junit4:junit4]   2> 	  "base_url":"http://127.0.0.1:49758"}
[junit4:junit4]   2> 1312184 T2591 oasc.Overseer$ClusterStateUpdater.updateState Update state numShards=5 message={
[junit4:junit4]   2> 	  "operation":"state",
[junit4:junit4]   2> 	  "core_node_name":null,
[junit4:junit4]   2> 	  "numShards":"5",
[junit4:junit4]   2> 	  "shard":"shard1",
[junit4:junit4]   2> 	  "roles":null,
[junit4:junit4]   2> 	  "state":"down",
[junit4:junit4]   2> 	  "shard_state":"active",
[junit4:junit4]   2> 	  "core":"awholynewcollection_0_shard1_replica4",
[junit4:junit4]   2> 	  "collection":"awholynewcollection_0",
[junit4:junit4]   2> 	  "shard_range":null,
[junit4:junit4]   2> 	  "node_name":"127.0.0.1:49764_",
[junit4:junit4]   2> 	  "base_url":"http://127.0.0.1:49764"}
[junit4:junit4]   2> 1312200 T2591 oasc.Overseer$ClusterStateUpdater.updateState Update state numShards=5 message={
[junit4:junit4]   2> 	  "operation":"state",
[junit4:junit4]   2> 	  "core_node_name":null,
[junit4:junit4]   2> 	  "numShards":"5",
[junit4:junit4]   2> 	  "shard":"shard2",
[junit4:junit4]   2> 	  "roles":null,
[junit4:junit4]   2> 	  "state":"down",
[junit4:junit4]   2> 	  "shard_state":"active",
[junit4:junit4]   2> 	  "core":"awholynewcollection_0_shard2_replica3",
[junit4:junit4]   2> 	  "collection":"awholynewcollection_0",
[junit4:junit4]   2> 	  "shard_range":null,
[junit4:junit4]   2> 	  "node_name":"127.0.0.1:49755_",
[junit4:junit4]   2> 	  "base_url":"http://127.0.0.1:49755"}
[junit4:junit4]   2> 1312215 T2591 oasc.Overseer$ClusterStateUpdater.updateState Update state numShards=5 message={
[junit4:junit4]   2> 	  "operation":"state",
[junit4:junit4]   2> 	  "core_node_name":null,
[junit4:junit4]   2> 	  "numShards":"5",
[junit4:junit4]   2> 	  "shard":"shard1",
[junit4:junit4]   2> 	  "roles":null,
[junit4:junit4]   2> 	  "state":"down",
[junit4:junit4]   2> 	  "shard_state":"active",
[junit4:junit4]   2> 	  "core":"awholynewcollection_0_shard1_replica2",
[junit4:junit4]   2> 	  "collection":"awholynewcollection_0",
[junit4:junit4]   2> 	  "shard_range":null,
[junit4:junit4]   2> 	  "node_name":"127.0.0.1:49761_",
[junit4:junit4]   2> 	  "base_url":"http://127.0.0.1:49761"}
[junit4:junit4]   2> 1312235 T2591 oasc.Overseer$ClusterStateUpdater.updateState Update state numShards=5 message={
[junit4:junit4]   2> 	  "operation":"state",
[junit4:junit4]   2> 	  "core_node_name":null,
[junit4:junit4]   2> 	  "numShards":"5",
[junit4:junit4]   2> 	  "shard":"shard2",
[junit4:junit4]   2> 	  "roles":null,
[junit4:junit4]   2> 	  "state":"down",
[junit4:junit4]   2> 	  "shard_state":"active",
[junit4:junit4]   2> 	  "core":"awholynewcollection_0_shard2_replica4",
[junit4:junit4]   2> 	  "collection":"awholynewcollection_0",
[junit4:junit4]   2> 	  "shard_range":null,
[junit4:junit4]   2> 	  "node_name":"127.0.0.1:49764_",
[junit4:junit4]   2> 	  "base_url":"http://127.0.0.1:49764"}
[junit4:junit4]   2> 1312258 T2591 oasc.Overseer$ClusterStateUpdater.updateState Update state numShards=5 message={
[junit4:junit4]   2> 	  "operation":"state",
[junit4:junit4]   2> 	  "core_node_name":null,
[junit4:junit4]   2> 	  "numShards":"5",
[junit4:junit4]   2> 	  "shard":"shard1",
[junit4:junit4]   2> 	  "roles":null,
[junit4:junit4]   2> 	  "state":"down",
[junit4:junit4]   2> 	  "shard_state":"active",
[junit4:junit4]   2> 	  "core":"awholynewcollection_0_shard1_replica1",
[junit4:junit4]   2> 	  "collection":"awholynewcollection_0",
[junit4:junit4]   2> 	  "shard_range":null,
[junit4:junit4]   2> 	  "node_name":"127.0.0.1:49751_",
[junit4:junit4]   2> 	  "base_url":"http://127.0.0.1:49751"}
[junit4:junit4]   2> 1312281 T2591 oasc.Overseer$ClusterStateUpdater.updateState Update state numShards=5 message={
[junit4:junit4]   2> 	  "operation":"state",
[junit4:junit4]   2> 	  "core_node_name":null,
[junit4:junit4]   2> 	  "numShards":"5",
[junit4:junit4]   2> 	  "shard":"shard2",
[junit4:junit4]   2> 	  "roles":null,
[junit4:junit4]   2> 	  "state":"down",
[junit4:junit4]   2> 	  "shard_state":"active",
[junit4:junit4]   2> 	  "core":"awholynewcollection_0_shard2_replica1",
[junit4:junit4]   2> 	  "collection":"awholynewcollection_0",
[junit4:junit4]   2> 	  "shard_range":null,
[junit4:junit4]   2> 	  "node_name":"127.0.0.1:49751_",
[junit4:junit4]   2> 	  "base_url":"http://127.0.0.1:49751"}
[junit4:junit4]   2> 1312298 T2591 oasc.Overseer$ClusterStateUpdater.updateState Update state numShards=5 message={
[junit4:junit4]   2> 	  "operation":"state",
[junit4:junit4]   2> 	  "core_node_name":null,
[junit4:junit4]   2> 	  "numShards":"5",
[junit4:junit4]   2> 	  "shard":"shard2",
[junit4:junit4]   2> 	  "roles":null,
[junit4:junit4]   2> 	  "state":"down",
[junit4:junit4]   2> 	  "shard_state":"active",
[junit4:junit4]   2> 	  "core":"awholynewcollection_0_shard2_replica5",
[junit4:junit4]   2> 	  "collection":"awholynewcollection_0",
[junit4:junit4]   2> 	  "shard_range":null,
[junit4:junit4]   2> 	  "node_name":"127.0.0.1:49758_",
[junit4:junit4]   2> 	  "base_url":"http://127.0.0.1:49758"}
[junit4:junit4]   2> 1312324 T2591 oasc.Overseer$ClusterStateUpdater.updateState Update state numShards=5 message={
[junit4:junit4]   2> 	  "operation":"state",
[junit4:junit4]   2> 	  "core_node_name":null,
[junit4:junit4]   2> 	  "numShards":"5",
[junit4:junit4]   2> 	  "shard":"shard3",
[junit4:junit4]   2> 	  "roles":null,
[junit4:junit4]   2> 	  "state":"down",
[junit4:junit4]   2> 	  "shard_state":"active",
[junit4:junit4]   2> 	  "core":"awholynewcollection_0_shard3_replica1",
[junit4:junit4]   2> 	  "collection":"awholynewcollection_0",
[junit4:junit4]   2> 	  "shard_range":null,
[junit4:junit4]   2> 	  "node_name":"127.0.0.1:49751_",
[junit4:junit4]   2> 	  "base_url":"http://127.0.0.1:49751"}
[junit4:junit4]   2> 1312343 T2591 oasc.Overseer$ClusterStateUpdater.updateState Update state numShards=5 message={
[junit4:junit4]   2> 	  "operation":"state",
[junit4:junit4]   2> 	  "core_node_name":null,
[junit4:junit4]   2> 	  "numShards":"5",
[junit4:junit4]   2> 	  "shard":"shard3",
[junit4:junit4]   2> 	  "roles":null,
[junit4:junit4]   2> 	  "state":"down",
[junit4:junit4]   2> 	  "shard_state":"active",
[junit4:junit4]   2> 	  "core":"awholynewcollection_0_shard3_replica2",
[junit4:junit4]   2> 	  "collection":"awholynewcollection_0",
[junit4:junit4]   2> 	  "shard_range":null,
[junit4:junit4]   2> 	  "node_name":"127.0.0.1:49761_",
[junit4:junit4]   2> 	  "base_url":"http://127.0.0.1:49761"}
[junit4:junit4]   2> 1312357 T2591 oasc.Overseer$ClusterStateUpdater.updateState Update state numShards=5 message={
[junit4:junit4]   2> 	  "operation":"state",
[junit4:junit4]   2> 	  "core_node_name":null,
[junit4:junit4]   2> 	  "numShards":"5",
[junit4:junit4]   2> 	  "shard":"shard3",
[junit4:junit4]   2> 	  "roles":null,
[junit4:junit4]   2> 	  "state":"down",
[junit4:junit4]   2> 	  "shard_state":"active",
[junit4:junit4]   2> 	  "core":"awholynewcollection_0_shard3_replica3",
[junit4:junit4]   2> 	  "collection":"awholynewcollection_0",
[junit4:junit4]   2> 	  "shard_range":null,
[junit4:junit4]   2> 	  "node_name":"127.0.0.1:49755_",
[junit4:junit4]   2> 	  "base_url":"http://127.0.0.1:49755"}
[junit4:junit4]   2> 1312384 T2591 oasc.Overseer$ClusterStateUpdater.updateState Update state numShards=5 message={
[junit4:junit4]   2> 	  "operation":"state",
[junit4:junit4]   2> 	  "core_node_name":null,
[junit4:junit4]   2> 	  "numShards":"5",
[junit4:junit4]   2> 	  "shard":"shard3",
[junit4:junit4]   2> 	  "roles":null,
[junit4:junit4]   2> 	  "state":"down",
[junit4:junit4]   2> 	  "shard_state":"active",
[junit4:junit4]   2> 	  "core":"awholynewcollection_0_shard3_replica4",
[junit4:junit4]   2> 	  "collection":"awholynewcollection_0",
[junit4:junit4]   2> 	  "shard_range":null,
[junit4:junit4]   2> 	  "node_name":"127.0.0.1:49764_",
[junit4:junit4]   2> 	  "base_url":"http://127.0.0.1:49764"}
[junit4:junit4]   2> 1312400 T2591 oasc.Overseer$ClusterStateUpdater.updateState Update state numShards=5 message={
[junit4:junit4]   2> 	  "operation":"state",
[junit4:junit4]   2> 	  "core_node_name":null,
[junit4:junit4]   2> 	  "numShards":"5",
[junit4:junit4]   2> 	  "shard":"shard3",
[junit4:junit4]   2> 	  "roles":null,
[junit4:junit4]   2> 	  "state":"down",
[junit4:junit4]   2> 	  "shard_state":"active",
[junit4:junit4]   2> 	  "core":"awholynewcollection_0_shard3_replica5",
[junit4:junit4]   2> 	  "collection":"awholynewcollection_0",
[junit4:junit4]   2> 	  "shard_range":null,
[junit4:junit4]   2> 	  "node_name":"127.0.0.1:49758_",
[junit4:junit4]   2> 	  "base_url":"http://127.0.0.1:49758"}
[junit4:junit4]   2> 1312416 T2591 oasc.Overseer$ClusterStateUpdater.updateState Update state numShards=5 message={
[junit4:junit4]   2> 	  "operation":"state",
[junit4:junit4]   2> 	  "core_node_name":null,
[junit4:junit4]   2> 	  "numShards":"5",
[junit4:junit4]   2> 	  "shard":"shard4",
[junit4:junit4]   2> 	  "roles":null,
[junit4:junit4]   2> 	  "state":"down",
[junit4:junit4]   2> 	  "shard_state":"active",
[junit4:junit4]   2> 	  "core":"awholynewcollection_0_shard4_replica1",
[junit4:junit4]   2> 	  "collection":"awholynewcollection_0",
[junit4:junit4]   2> 	  "shard_range":null,
[junit4:junit4]   2> 	  "node_name":"127.0.0.1:49751_",
[junit4:junit4]   2> 	  "base_url":"http://127.0.0.1:49751"}
[junit4:junit4]   2> 1312430 T2591 oasc.Overseer$ClusterStateUpdater.updateState Update state numShards=5 message={
[junit4:junit4]   2> 	  "operation":"state",
[junit4:junit4]   2> 	  "core_node_name":null,
[junit4:junit4]   2> 	  "numShards":"5",
[junit4:junit4]   2> 	  "shard":"shard4",
[junit4:junit4]   2> 	  "roles":null,
[junit4:junit4]   2> 	  "state":"down",
[junit4:junit4]   2> 	  "shard_state":"active",
[junit4:junit4]   2> 	  "core":"awholynewcollection_0_shard4_replica2",
[junit4:junit4]   2> 	  "collection":"awholynewcollection_0",
[junit4:junit4]   2> 	  "shard_range":null,
[junit4:junit4]   2> 	  "node_name":"127.0.0.1:49761_",
[junit4:junit4]   2> 	  "base_url":"http://127.0.0.1:49761"}
[junit4:junit4]   2> 1312452 T2591 oasc.Overseer$ClusterStateUpdater.updateState Update state numShards=5 message={
[junit4:junit4]   2> 	  "operation":"state",
[junit4:junit4]   2> 	  "core_node_name":null,
[junit4:junit4]   2> 	  "numShards":"5",
[junit4:junit4]   2> 	  "shard":"shard4",
[junit4:junit4]   2> 	  "roles":null,
[junit4:junit4]   2> 	  "state":"down",
[junit4:junit4]   2> 	  "shard_state":"active",
[junit4:junit4]   2> 	  "core":"awholynewcollection_0_shard4_replica4",
[junit4:junit4]   2> 	  "collection":"awholynewcollection_0",
[junit4:junit4]   2> 	  "shard_range":null,
[junit4:junit4]   2> 	  "node_name":"127.0.0.1:49764_",
[junit4:junit4]   2> 	  "base_url":"http://127.0.0.1:49764"}
[junit4:junit4]   2> 1312467 T2591 oasc.Overseer$ClusterStateUpdater.updateState Update state numShards=5 message={
[junit4:junit4]   2> 	  "operation":"state",
[junit4:junit4]   2> 	  "core_node_name":null,
[junit4:junit4]   2> 	  "numShards":"5",
[junit4:junit4]   2> 	  "shard":"shard4",
[junit4:junit4]   2> 	  "roles":null,
[junit4:junit4]   2> 	  "state":"down",
[junit4:junit4]   2> 	  "shard_state":"active",
[junit4:junit4]   2> 	  "core":"awholynewcollection_0_shard4_replica3",
[junit4:junit4]   2> 	  "collection":"awholynewcollection_0",
[junit4:junit4]   2> 	  "shard_range":null,
[junit4:junit4]   2> 	  "node_name":"127.0.0.1:49755_",
[junit4:junit4]   2> 	  "base_url":"http://127.0.0.1:49755"}
[junit4:junit4]   2> 1312480 T2591 oasc.Overseer$ClusterStateUpdater.updateState Update state numShards=5 message={
[junit4:junit4]   2> 	  "operation":"state",
[junit4:junit4]   2> 	  "core_node_name":null,
[junit4:junit4]   2> 	  "numShards":"5",
[junit4:junit4]   2> 	  "shard":"shard4",
[junit4:junit4]   2> 	  "roles":null,
[junit4:junit4]   2> 	  "state":"down",
[junit4:junit4]   2> 	  "shard_state":"active",
[junit4:junit4]   2> 	  "core":"awholynewcollection_0_shard4_replica5",
[junit4:junit4]   2> 	  "collection":"awholynewcollection_0",
[junit4:junit4]   2> 	  "shard_range":null,
[junit4:junit4]   2> 	  "node_name":"127.0.0.1:49758_",
[junit4:junit4]   2> 	  "base_url":"http://127.0.0.1:49758"}
[junit4:junit4]   2> 1312494 T2591 oasc.Overseer$ClusterStateUpdater.updateState Update state numShards=5 message={
[junit4:junit4]   2> 	  "operation":"state",
[junit4:junit4]   2> 	  "core_node_name":null,
[junit4:junit4]   2> 	  "numShards":"5",
[junit4:junit4]   2> 	  "shard":"shard5",
[junit4:junit4]   2> 	  "roles":null,
[junit4:junit4]   2> 	  "state":"down",
[junit4:junit4]   2> 	  "shard_state":"active",
[junit4:junit4]   2> 	  "core":"awholynewcollection_0_shard5_replica1",
[junit4:junit4]   2> 	  "collection":"awholynewcollection_0",
[junit4:junit4]   2> 	  "shard_range":null,
[junit4:junit4]   2> 	  "node_name":"127.0.0.1:49751_",
[junit4:junit4]   2> 	  "base_url":"http://127.0.0.1:49751"}
[junit4:junit4]   2> 1312513 T2591 oasc.Overseer$ClusterStateUpdater.updateState Update state numShards=5 message={
[junit4:junit4]   2> 	  "operation":"state",
[junit4:junit4]   2> 	  "core_node_name":null,
[junit4:junit4]   2> 	  "numShards":"5",
[junit4:junit4]   2> 	  "shard":"shard5",
[junit4:junit4]   2> 	  "roles":null,
[junit4:junit4]   2> 	  "state":"down",
[junit4:junit4]   2> 	  "shard_state":"active",
[junit4:junit4]   2> 	  "core":"awholynewcollection_0_shard5_replica2",
[junit4:junit4]   2> 	  "collection":"awholynewcollection_0",
[junit4:junit4]   2> 	  "shard_range":null,
[junit4:junit4]   2> 	  "node_name":"127.0.0.1:49761_",
[junit4:junit4]   2> 	  "base_url":"http://127.0.0.1:49761"}
[junit4:junit4]   2> 1312533 T2591 oasc.Overseer$ClusterStateUpdater.updateState Update state numShards=5 message={
[junit4:junit4]   2> 	  "operation":"state",
[junit4:junit4]   2> 	  "core_node_name":null,
[junit4:junit4]   2> 	  "numShards":"5",
[junit4:junit4]   2> 	  "shard":"shard5",
[junit4:junit4]   2> 	  "roles":null,
[junit4:junit4]   2> 	  "state":"down",
[junit4:junit4]   2> 	  "shard_state":"active",
[junit4:junit4]   2> 	  "core":"awholynewcollection_0_shard5_replica4",
[junit4:junit4]   2> 	  "collection":"awholynewcollection_0",
[junit4:junit4]   2> 	  "shard_range":null,
[junit4:junit4]   2> 	  "node_name":"127.0.0.1:49764_",
[junit4:junit4]   2> 	  "base_url":"http://127.0.0.1:49764"}
[junit4:junit4]   2> 1312546 T2591 oasc.Overseer$ClusterStateUpdater.updateState Update state numShards=5 message={
[junit4:junit4]   2> 	  "operation":"state",
[junit4:junit4]   2> 	  "core_node_name":null,
[junit4:junit4]   2> 	  "numShards":"5",
[junit4:junit4]   2> 	  "shard":"shard5",
[junit4:junit4]   2> 	  "roles":null,
[junit4:junit4]   2> 	  "state":"down",
[junit4:junit4]   2> 	  "shard_state":"active",
[junit4:junit4]   2> 	  "core":"awholynewcollection_0_shard5_replica3",
[junit4:junit4]   2> 	  "collection":"awholynewcollection_0",
[junit4:junit4]   2> 	  "shard_range":null,
[junit4:junit4]   2> 	  "node_name":"127.0.0.1:49755_",
[junit4:junit4]   2> 	  "base_url":"http://127.0.0.1:49755"}
[junit4:junit4]   2> 1312559 T2591 oasc.Overseer$ClusterStateUpdater.updateState Update state numShards=5 message={
[junit4:junit4]   2> 	  "operation":"state",
[junit4:junit4]   2> 	  "core_node_name":null,
[junit4:junit4]   2> 	  "numShards":"5",
[junit4:junit4]   2> 	  "shard":"shard5",
[junit4:junit4]   2> 	  "roles":null,
[junit4:junit4]   2> 	  "state":"down",
[junit4:junit4]   2> 	  "shard_state":"active",
[junit4:junit4]   2> 	  "core":"awholynewcollection_0_shard5_replica5",
[junit4:junit4]   2> 	  "collection":"awholynewcollection_0",
[junit4:junit4]   2> 	  "shard_range":null,
[junit4:junit4]   2> 	  "node_name":"127.0.0.1:49758_",
[junit4:junit4]   2> 	  "base_url":"http://127.0.0.1:49758"}
[junit4:junit4]   2> 1312572 T2595 oascc.ZkStateReader$2.process A cluster state change: WatchedEvent state:SyncConnected type:NodeDataChanged path:/clusterstate.json, has occurred - updating... (live nodes size: 5)
[junit4:junit4]   2> 1312574 T2622 oascc.ZkStateReader$2.process A cluster state change: WatchedEvent state:SyncConnected type:NodeDataChanged path:/clusterstate.json, has occurred - updating... (live nodes size: 5)
[junit4:junit4]   2> 1312576 T2650 oascc.ZkStateReader$2.process A cluster state change: WatchedEvent state:SyncConnected type:NodeDataChanged path:/clusterstate.json, has occurred - updating... (live nodes size: 5)
[junit4:junit4]   2> 1312581 T2636 oascc.ZkStateReader$2.process A cluster state change: WatchedEvent state:SyncConnected type:NodeDataChanged path:/clusterstate.json, has occurred - updating... (live nodes size: 5)
[junit4:junit4]   2> 1312584 T2608 oascc.ZkStateReader$2.process A cluster state change: WatchedEvent state:SyncConnected type:NodeDataChanged path:/clusterstate.json, has occurred - updating... (live nodes size: 5)
[junit4:junit4]   2> 1312585 T2667 oascc.ZkStateReader$2.process A cluster state change: WatchedEvent state:SyncConnected type:NodeDataChanged path:/clusterstate.json, has occurred - updating... (live nodes size: 5)
[junit4:junit4]   2> 1312592 T2590 oascc.ZkStateReader$2.process A cluster state change: WatchedEvent state:SyncConnected type:NodeDataChanged path:/clusterstate.json, has occurred - updating... (live nodes size: 5)
[junit4:junit4]   2> 1312606 T2665 oascc.ZkStateReader$2.process A cluster state change: WatchedEvent state:SyncConnected type:NodeDataChanged path:/clusterstate.json, has occurred - updating... (live nodes size: 5)
[junit4:junit4]   2> 1312623 T2646 oasha.CoreAdminHandler.handleWaitForStateAction Waited coreNodeName: 127.0.0.1:49755__nodes_used_collection_shard2_replica2, state: recovering, checkLive: true, onlyIfLeader: true for: 2 seconds.
[junit4:junit4]   2> 1312624 T2646 oass.SolrDispatchFilter.handleAdminRequest [admin] webapp=null path=/admin/cores params={coreNodeName=127.0.0.1:49755__nodes_used_collection_shard2_replica2&state=recovering&nodeName=127.0.0.1:49755_&action=PREPRECOVERY&checkLive=true&core=nodes_used_collection_shard2_replica1&wt=javabin&onlyIfLeader=true&version=2} status=0 QTime=2006 
[junit4:junit4]   2> 1312914 T2641 oasc.CoreContainer.create Creating SolrCore 'awholynewcollection_0_shard1_replica4' using instanceDir: /Users/jenkins/jenkins-slave/workspace/Lucene-Solr-trunk-MacOSX/solr/build/solr-core/test/J0/./org.apache.solr.cloud.CollectionsAPIDistributedZkTest-jetty4-1371141062777/awholynewcollection_0_shard1_replica4
[junit4:junit4]   2> 1312914 T2615 oasc.CoreContainer.create Creating SolrCore 'awholynewcollection_0_shard1_replica5' using instanceDir: /Users/jenkins/jenkins-slave/workspace/Lucene-Solr-trunk-MacOSX/solr/build/solr-core/test/J0/./org.apache.solr.cloud.CollectionsAPIDistributedZkTest-jetty2-1371141058317/awholynewcollection_0_shard1_replica5
[junit4:junit4]   2> 1312915 T2615 oasc.ZkController.createCollectionZkNode Check for collection zkNode:awholynewcollection_0
[junit4:junit4]   2> 1312914 T2603 oasc.CoreContainer.create Creating SolrCore 'awholynewcollection_0_shard1_replica3' using instanceDir: /Users/jenkins/jenkins-slave/workspace/Lucene-Solr-trunk-MacOSX/solr/build/solr-core/test/J0/./org.apache.solr.cloud.CollectionsAPIDistributedZkTest-jetty1-1371141056104/awholynewcollection_0_shard1_replica3
[junit4:junit4]   2> 1312916 T2603 oasc.ZkController.createCollectionZkNode Check for collection zkNode:awholynewcollection_0
[junit4:junit4]   2> 1312914 T2632 oasc.CoreContainer.create Creating SolrCore 'awholynewcollection_0_shard2_replica2' using instanceDir: /Users/jenkins/jenkins-slave/workspace/Lucene-Solr-trunk-MacOSX/solr/build/solr-core/test/J0/./org.apache.solr.cloud.CollectionsAPIDistributedZkTest-jetty3-1371141060503/awholynewcollection_0_shard2_replica2
[junit4:junit4]   2> 1312917 T2632 oasc.ZkController.createCollectionZkNode Check for collection zkNode:awholynewcollection_0
[junit4:junit4]   2> 1312915 T2630 oasc.CoreContainer.create Creating SolrCore 'awholynewcollection_0_shard1_replica2' using instanceDir: /Users/jenkins/jenkins-slave/workspace/Lucene-Solr-trunk-MacOSX/solr/build/solr-core/test/J0/./org.apache.solr.cloud.CollectionsAPIDistributedZkTest-jetty3-1371141060503/awholynewcollection_0_shard1_replica2
[junit4:junit4]   2> 1312917 T2630 oasc.ZkController.createCollectionZkNode Check for collection zkNode:awholynewcollection_0
[junit4:junit4]   2> 1312918 T2642 oasc.CoreContainer.create Creating SolrCore 'awholynewcollection_0_shard2_replica4' using instanceDir: /Users/jenkins/jenkins-slave/workspace/Lucene-Solr-trunk-MacOSX/solr/build/solr-core/test/J0/./org.apache.solr.cloud.CollectionsAPIDistributedZkTest-jetty4-1371141062777/awholynewcollection_0_shard2_replica4
[junit4:junit4]   2> 1312919 T2642 oasc.ZkController.createCollectionZkNode Check for collection zkNode:awholynewcollection_0
[junit4:junit4]   2> 1312915 T2600 oasc.CoreContainer.create Creating SolrCore 'awholynewcollection_0_shard2_replica3' using instanceDir: /Users/jenkins/jenkins-slave/workspace/Lucene-Solr-trunk-MacOSX/solr/build/solr-core/test/J0/./org.apache.solr.cloud.CollectionsAPIDistributedZkTest-jetty1-1371141056104/awholynewcollection_0_shard2_replica3
[junit4:junit4]   2> 1312920 T2600 oasc.ZkController.createCollectionZkNode Check for collection zkNode:awholynewcollection_0
[junit4:junit4]   2> 1312914 T2641 oasc.ZkController.createCollectionZkNode Check for collection zkNode:awholynewcollection_0
[junit4:junit4]   2> 1312919 T2603 oasc.ZkController.createCollectionZkNode Creating collection in ZooKeeper:awholynewcollection_0
[junit4:junit4]   2> 1312921 T2603 oasc.ZkController.getConfName Looking for collection configName
[junit4:junit4]   2> 1312917 T2615 oasc.ZkController.createCollectionZkNode Creating collection in ZooKeeper:awholynewcollection_0
[junit4:junit4]   2> 1312923 T2615 oasc.ZkController.getConfName Looking for collection configName
[junit4:junit4]   2> 1312924 T2632 oasc.ZkController.createCollectionZkNode Creating collection in ZooKeeper:awholynewcollection_0
[junit4:junit4]   2> 1312924 T2632 oasc.ZkController.getConfName Looking for collection configName
[junit4:junit4]   2> 1312925 T2582 oasc.CoreContainer.create Creating SolrCore 'awholynewcollection_0_shard2_replica1' using instanceDir: /Users/jenkins/jenkins-slave/workspace/Lucene-Solr-trunk-MacOSX/solr/build/solr-core/test/J0/./org.apache.solr.cloud.CollectionsAPIDistributedZkTest-controljetty-1371141054795/awholynewcollection_0_shard2_replica1
[junit4:junit4]   2> 1312925 T2582 oasc.ZkController.createCollectionZkNode Check for collection zkNode:awholynewcollection_0
[junit4:junit4]   2> 1312927 T2581 oasc.CoreContainer.create Creating SolrCore 'awholynewcollection_0_shard1_replica1' using instanceDir: /Users/jenkins/jenkins-slave/workspace/Lucene-Solr-trunk-MacOSX/solr/build/solr-core/test/J0/./org.apache.solr.cloud.CollectionsAPIDistributedZkTest-controljetty-1371141054795/awholynewcollection_0_shard1_replica1
[junit4:junit4]   2> 1312928 T2581 oasc.ZkController.createCollectionZkNode Check for collection zkNode:awholynewcollection_0
[junit4:junit4]   2> 1312930 T2618 oasc.CoreContainer.create Creating SolrCore 'awholynewcollection_0_shard2_replica5' using instanceDir: /Users/jenkins/jenkins-slave/workspace/Lucene-Solr-trunk-MacOSX/solr/build/solr-core/test/J0/./org.apache.solr.cloud.CollectionsAPIDistributedZkTest-jetty2-1371141058317/awholynewcollection_0_shard2_replica5
[junit4:junit4]   2> 1312930 T2618 oasc.ZkController.createCollectionZkNode Check for collection zkNode:awholynewcollection_0
[junit4:junit4]   2> 1312934 T2642 oasc.ZkController.createCollectionZkNode Creating collection in ZooKeeper:awholynewcollection_0
[junit4:junit4]   2> 1312934 T2642 oasc.ZkController.getConfName Looking for collection configName
[junit4:junit4]   2> 1312935 T2630 oasc.ZkController.createCollectionZkNode Creating collection in ZooKeeper:awholynewcollection_0
[junit4:junit4]   2> 1312935 T2630 oasc.ZkController.getConfName Looking for collection configName
[junit4:junit4]   2> 1312938 T2600 oasc.ZkController.createCollectionZkNode Creating collection in ZooKeeper:awholynewcollection_0
[junit4:junit4]   2> 1312938 T2600 oasc.ZkController.getConfName Looking for collection configName
[junit4:junit4]   2> 1312939 T2618 oasc.ZkController.createCollectionZkNode Creating collection in ZooKeeper:awholynewcollection_0
[junit4:junit4]   2> 1312940 T2618 oasc.ZkController.getConfName Looking for collection configName
[junit4:junit4]   2> 1312951 T2615 oasc.ZkController.getConfName Only one config set found in zk - using it:conf1
[junit4:junit4]   2> 1312955 T2615 oascc.SolrZkClient.makePath makePath: /collections/awholynewcollection_0
[junit4:junit4]   2> 1312956 T2641 oasc.ZkController.createCollectionZkNode Creating collection in ZooKeeper:awholynewcollection_0
[junit4:junit4]   2> 1312957 T2641 oasc.ZkController.getConfName Looking for collection configName
[junit4:junit4]   2> 1312958 T2603 oasc.ZkController.getConfName Only one config set found in zk - using it:conf1
[junit4:junit4]   2> 1312958 T2603 oascc.SolrZkClient.makePath makePath: /collections/awholynewcollection_0
[junit4:junit4]   2> 1312960 T2582 oasc.ZkController.createCollectionZkNode Creating collection in ZooKeeper:awholynewcollection_0
[junit4:junit4]   2> 1312960 T2582 oasc.ZkController.getConfName Looking for collection configName
[junit4:junit4]   2> 1312961 T2581 oasc.ZkController.createCollectionZkNode Creating collection in ZooKeeper:awholynewcollection_0
[junit4:junit4]   2> 1312961 T2581 oasc.ZkController.getConfName Looking for collection configName
[junit4:junit4]   2> 1312964 T2600 oasc.ZkController.getConfName Only one config set found in zk - using it:conf1
[junit4:junit4]   2> 1312964 T2600 oascc.SolrZkClient.makePath makePath: /collections/awholynewcollection_0
[junit4:junit4]   2> 1312964 T2642 oasc.ZkController.getConfName Only one config set found in zk - using it:conf1
[junit4:junit4]   2> 1312965 T2642 oascc.SolrZkClient.makePath makePath: /collections/awholynewcollection_0
[junit4:junit4]   2> 1312967 T2618 oasc.ZkController.getConfName Only one config set found in zk - using it:conf1
[junit4:junit4]   2> 1312968 T2618 oascc.SolrZkClient.makePath makePath: /collections/awholynewcollection_0
[junit4:junit4]   2> 1312968 T2632 oasc.ZkController.getConfName Only one config set found in zk - using it:conf1
[junit4:junit4]   2> 1312969 T2632 oascc.SolrZkClient.makePath makePath: /collections/awholynewcollection_0
[junit4:junit4]   2> 1312970 T2630 oasc.ZkController.getConfName Only one config set found in zk - using it:conf1
[junit4:junit4]   2> 1312971 T2630 oascc.SolrZkClient.makePath makePath: /collections/awholynewcollection_0
[junit4:junit4]   2> 1312972 T2598 oasc.CoreContainer.create Creating SolrCore 'awholynewcollection_0_shard3_replica3' using instanceDir: /Users/jenkins/jenkins-slave/workspace/Lucene-Solr-trunk-MacOSX/solr/build/solr-core/test/J0/./org.apache.solr.cloud.CollectionsAPIDistributedZkTest-jetty1-1371141056104/awholynewcollection_0_shard3_replica3
[junit4:junit4]   2> 1312972 T2598 oasc.ZkController.createCollectionZkNode Check for collection zkNode:awholynewcollection_0
[junit4:junit4]   2> 1312972 T2613 oasc.CoreContainer.create Creating SolrCore 'awholynewcollection_0_shard3_replica5' using instanceDir: /Users/jenkins/jenkins-slave/workspace/Lucene-Solr-trunk-MacOSX/solr/build/solr-core/test/J0/./org.apache.solr.cloud.CollectionsAPIDistributedZkTest-jetty2-1371141058317/awholynewcollection_0_shard3_replica5
[junit4:junit4]   2> 1312973 T2613 oasc.ZkController.createCollectionZkNode Check for collection zkNode:awholynewcollection_0
[junit4:junit4]   2> 1312972 T2645 oasc.CoreContainer.create Creating SolrCore 'awholynewcollection_0_shard3_replica4' using instanceDir: /Users/jenkins/jenkins-slave/workspace/Lucene-Solr-trunk-MacOSX/solr/build/solr-core/test/J0/./org.apache.solr.cloud.CollectionsAPIDistributedZkTest-jetty4-1371141062777/awholynewcollection_0_shard3_replica4
[junit4:junit4]   2> 1312974 T2645 oasc.ZkController.createCollectionZkNode Check for collection zkNode:awholynewcollection_0
[junit4:junit4]   2> 1312972 T2586 oasc.CoreContainer.create Creating SolrCore 'awholynewcollection_0_shard3_replica1' using instanceDir: /Users/jenkins/jenkins-slave/workspace/Lucene-Solr-trunk-MacOSX/solr/build/solr-core/test/J0/./org.apache.solr.cloud.CollectionsAPIDistributedZkTest-controljetty-1371141054795/awholynewcollection_0_shard3_replica1
[junit4:junit4]   2> 1312977 T2586 oasc.ZkController.createCollectionZkNode Check for collection zkNode:awholynewcollection_0
[junit4:junit4]   2> 1312974 T2641 oasc.ZkController.getConfName Only one config set found in zk - using it:conf1
[junit4:junit4]   2> 1312978 T2641 oascc.SolrZkClient.makePath makePath: /collections/awholynewcollection_0
[junit4:junit4]   2> 1312973 T2631 oasc.CoreContainer.create Creating SolrCore 'awholynewcollection_0_shard3_replica2' using instanceDir: /Users/jenkins/jenkins-slave/workspace/Lucene-Solr-trunk-MacOSX/solr/build/solr-core/test/J0/./org.apache.solr.cloud.CollectionsAPIDistributedZkTest-jetty3-1371141060503/awholynewcollection_0_shard3_replica2
[junit4:junit4]   2> 1312979 T2631 oasc.ZkController.createCollectionZkNode Check for collection zkNode:awholynewcollection_0
[junit4:junit4]   2> 1312982 T2582 oasc.ZkController.getConfName Only one config set found in zk - using it:conf1
[junit4:junit4]   2> 1312983 T2582 oascc.SolrZkClient.makePath makePath: /collections/awholynewcollection_0
[junit4:junit4]   2> 1312986 T2643 oasc.CoreContainer.create Creating SolrCore 'awholynewcollection_0_shard4_replica4' using instanceDir: /Users/jenkins/jenkins-slave/workspace/Lucene-Solr-trunk-MacOSX/solr/build/solr-core/test/J0/./org.apache.solr.cloud.CollectionsAPIDistributedZkTest-jetty4-1371141062777/awholynewcollection_0_shard4_replica4
[junit4:junit4]   2> 1312986 T2643 oasc.ZkController.createCollectionZkNode Check for collection zkNode:awholynewcollection_0
[junit4:junit4]   2> 1312987 T2645 oasc.ZkController.createCollectionZkNode Creating collection in ZooKeeper:awholynewcollection_0
[junit4:junit4]   2> 1312987 T2645 oasc.ZkController.getConfName Looking for collection configName
[junit4:junit4]   2> 1312994 T2614 oasc.CoreContainer.create Creating SolrCore 'awholynewcollection_0_shard4_replica5' using instanceDir: /Users/jenkins/jenkins-slave/workspace/Lucene-Solr-trunk-MacOSX/solr/build/solr-core/test/J0/./org.apache.solr.cloud.CollectionsAPIDistributedZkTest-jetty2-1371141058317/awholynewcollection_0_shard4_replica5
[junit4:junit4]   2> 1312995 T2614 oasc.ZkController.createCollectionZkNode Check for collection zkNode:awholynewcollection_0
[junit4:junit4]   2> 1312997 T2598 oasc.ZkController.createCollectionZkNode Creating collection in ZooKeeper:awholynewcollection_0
[junit4:junit4]   2> 1312997 T2598 oasc.ZkController.getConfName Looking for collection configName
[junit4:junit4]   2> 1312999 T2613 oasc.ZkController.createCollectionZkNode Creating collection in ZooKeeper:awholynewcollection_0
[junit4:junit4]   2> 1312999 T2613 oasc.ZkController.getConfName Looking for collection configName
[junit4:junit4]   2> 1313009 T2627 oasc.CoreContainer.create Creating SolrCore 'awholynewcollection_0_shard4_replica2' using instanceDir: /Users/jenkins/jenkins-slave/workspace/Lucene-Solr-trunk-MacOSX/solr/build/solr-core/test/J0/./org.apache.solr.cloud.CollectionsAPIDistributedZkTest-jetty3-1371141060503/awholynewcollection_0_shard4_replica2
[junit4:junit4]   2> 1313010 T2627 oasc.ZkController.createCollectionZkNode Check for collection zkNode:awholynewcollection_0
[junit4:junit4]   2> 1313011 T2583 oasc.CoreContainer.create Creating SolrCore 'awholynewcollection_0_shard4_replica1' using instanceDir: /Users/jenkins/jenkins-slave/workspace/Lucene-Solr-trunk-MacOSX/solr/build/solr-core/test/J0/./org.apache.solr.cloud.CollectionsAPIDistributedZkTest-controljetty-1371141054795/awholynewcollection_0_shard4_replica1
[junit4:junit4]   2> 1313011 T2583 oasc.ZkController.createCollectionZkNode Check for collection zkNode:awholynewcollection_0
[junit4:junit4]   2> 1313015 T2602 oasc.CoreContainer.create Creating SolrCore 'awholynewcollection_0_shard4_replica3' using instanceDir: /Users/jenkins/jenkins-slave/workspace/Lucene-Solr-trunk-MacOSX/solr/build/solr-core/test/J0/./org.apache.solr.cloud.CollectionsAPIDistributedZkTest-jetty1-1371141056104/awholynewcollection_0_shard4_replica3
[junit4:junit4]   2> 1313016 T2602 oasc.ZkController.createCollectionZkNode Check for collection zkNode:awholynewcollection_0
[junit4:junit4]   2> 1313021 T2581 oasc.ZkController.getConfName Only one config set found in zk - using it:conf1
[junit4:junit4]   2> 1313022 T2581 oascc.SolrZkClient.makePath makePath: /collections/awholynewcollection_0
[junit4:junit4]   2> 1313024 T2685 oasc.CoreContainer.create Creating SolrCore 'awholynewcollection_0_shard5_replica1' using instanceDir: /Users/jenkins/jenkins-slave/workspace/Lucene-Solr-trunk-MacOSX/solr/build/solr-core/test/J0/./org.apache.solr.cloud.CollectionsAPIDistributedZkTest-controljetty-1371141054795/awholynewcollection_0_shard5_replica1
[junit4:junit4]   2> 1313025 T2685 oasc.ZkController.createCollectionZkNode Check for collection zkNode:awholynewcollection_0
[junit4:junit4]   2> 1313026 T2601 oasc.CoreContainer.create Creating SolrCore 'awholynewcollection_0_shard5_replica3' using instanceDir: /Users/jenkins/jenkins-slave/workspace/Lucene-Solr-trunk-MacOSX/solr/build/solr-core/test/J0/./org.apache.solr.cloud.CollectionsAPIDistributedZkTest-jetty1-1371141056104/awholynewcollection_0_shard5_replica3
[junit4:junit4]   2> 1313027 T2601 oasc.ZkController.createCollectionZkNode Check for collection zkNode:awholynewcollection_0
[junit4:junit4]   2> 1313028 T2644 oasc.CoreContainer.create Creating SolrCore 'awholynewcollection_0_shard5_replica4' using instanceDir: /Users/jenkins/jenkins-slave/workspace/Lucene-Solr-trunk-MacOSX/solr/build/solr-core/test/J0/./org.apache.solr.cloud.CollectionsAPIDistributedZkTest-jetty4-1371141062777/awholynewcollection_0_shard5_replica4
[junit4:junit4]   2> 1313029 T2644 oasc.ZkController.createCollectionZkNode Check for collection zkNode:awholynewcollection_0
[junit4:junit4]   2> 1313030 T2617 oasc.CoreContainer.create Creating SolrCore 'awholynewcollection_0_shard5_replica5' using instanceDir: /Users/jenkins/jenkins-slave/workspace/Lucene-Solr-trunk-MacOSX/solr/build/solr-core/test/J0/./org.apache.solr.cloud.CollectionsAPIDistributedZkTest-jetty2-1371141058317/awholynewcollection_0_shard5_replica5
[junit4:junit4]   2> 1313031 T2617 oasc.ZkController.createCollectionZkNode Check for collection zkNode:awholynewcollection_0
[junit4:junit4]   2> 1313034 T2629 oasc.CoreContainer.create Creating SolrCore 'awholynewcollection_0_shard5_replica2' using instanceDir: /Users/jenkins/jenkins-slave/workspace/Lucene-Solr-trunk-MacOSX/solr/build/solr-core/test/J0/./org.apache.solr.cloud.CollectionsAPIDistributedZkTest-jetty3-1371141060503/awholynewcollection_0_shard5_replica2
[junit4:junit4]   2> 1313035 T2629 oasc.ZkController.createCollectionZkNode Check for collection zkNode:awholynewcollection_0
[junit4:junit4]   2> 1313046 T2631 oasc.ZkController.createCollectionZkNode Collection zkNode exists
[junit4:junit4]   2> 1313046 T2631 oasc.ZkController.readConfigName Load collection config from:/collections/awholynewcollection_0
[junit4:junit4]   2> 1313049 T2586 oasc.ZkController.createCollectionZkNode Collection zkNode exists
[junit4:junit4]   2> 1313049 T2586 oasc.ZkController.readConfigName Load collection config from:/collections/awholynewcollection_0
[junit4:junit4]   2> 1313059 T2643 oasc.ZkController.createCollectionZkNode Collection zkNode exists
[junit4:junit4]   2> 1313060 T2643 oasc.ZkController.readConfigName Load collection config from:/collections/awholynewcollection_0
[junit4:junit4]   2> 1313062 T2603 oasc.ZkController.readConfigName Load collection config from:/collections/awholynewcollection_0
[junit4:junit4]   2> 1313064 T2614 oasc.ZkController.createCollectionZkNode Collection zkNode exists
[junit4:junit4]   2> 1313064 T2614 oasc.ZkController.readConfigName Load collection config from:/collections/awholynewcollection_0
[junit4:junit4]   2> 1313066 T2627 oasc.ZkController.createCollectionZkNode Collection zkNode exists
[junit4:junit4]   2> 1313067 T2627 oasc.ZkController.readConfigName Load collection config from:/collections/awholynewcollection_0
[junit4:junit4]   2> 1313071 T2632 oasc.ZkController.readConfigName Load collection config from:/collections/awholynewcollection_0
[junit4:junit4]   2> 1313072 T2600 oasc.ZkController.readConfigName Load collection config from:/collections/awholynewcollection_0
[junit4:junit4]   2> 1313079 T2642 oasc.ZkController.readConfigName Load collection config from:/collections/awholynewcollection_0
[junit4:junit4]   2> 1313080 T2602 oasc.ZkController.createCollectionZkNode Collection zkNode exists
[junit4:junit4]   2> 1313080 T2602 oasc.ZkController.readConfigName Load collection config from:/collections/awholynewcollection_0
[junit4:junit4]   2> 1313079 T2615 oasc.ZkController.readConfigName Load collection config from:/collections/awholynewcollection_0
[junit4:junit4]   2> 1313081 T2629 oasc.ZkController.createCollectionZkNode Collection zkNode exists
[junit4:junit4]   2> 1313082 T2629 oasc.ZkController.readConfigName Load collection config from:/collections/awholynewcollection_0
[junit4:junit4]   2> 1313080 T2617 oasc.ZkController.createCollectionZkNode Collection zkNode exists
[junit4:junit4]   2> 1313084 T2617 oasc.ZkController.readConfigName Load collection config from:/collections/awholynewcollection_0
[junit4:junit4]   2> 1313080 T2644 oasc.ZkController.createCollectionZkNode Collection zkNode exists
[junit4:junit4]   2> 1313084 T2644 oasc.ZkController.readConfigName Load collection config from:/collections/awholynewcollection_0
[junit4:junit4]   2> 1313082 T2618 oasc.ZkController.readConfigName Load collection config from:/collections/awholynewcollection_0
[junit4:junit4]   2> 1313085 T2601 oasc.ZkController.createCollectionZkNode Collection zkNode exists
[junit4:junit4]   2> 1313087 T2601 oasc.ZkController.readConfigName Load collection config from:/collections/awholynewcollection_0
[junit4:junit4]   2> 1313088 T2583 oasc.ZkController.createCollectionZkNode Collection zkNode exists
[junit4:junit4]   2> 1313088 T2583 oasc.ZkController.readConfigName Load collection config from:/collections/awholynewcollection_0
[junit4:junit4]   2> 1313090 T2685 oasc.ZkController.createCollectionZkNode Collection zkNode exists
[junit4:junit4]   2> 1313091 T2685 oasc.ZkController.readConfigName Load collection config from:/collections/awholynewcollection_0
[junit4:junit4]   2> 1313092 T2630 oasc.ZkController.readConfigName Load collection config from:/collections/awholynewcollection_0
[junit4:junit4]   2> 1313097 T2613 oascc.SolrZkClient.makePath makePath: /collections/awholynewcollection_0
[junit4:junit4]   2> 1313098 T2598 oascc.SolrZkClient.makePath makePath: /collections/awholynewcollection_0
[junit4:junit4]   2> 1313099 T2645 oascc.SolrZkClient.makePath makePath: /collections/awholynewcollection_0
[junit4:junit4]   2> 1313103 T2641 oasc.ZkController.readConfigName Load collection config from:/collections/awholynewcollection_0
[junit4:junit4]   2> 1313113 T2631 oasc.SolrResourceLoader.<init> new SolrResourceLoader for directory: '/Users/jenkins/jenkins-slave/workspace/Lucene-Solr-trunk-MacOSX/solr/build/solr-core/test/J0/./org.apache.solr.cloud.CollectionsAPIDistributedZkTest-jetty3-1371141060503/awholynewcollection_0_shard3_replica2/'
[junit4:junit4]   2> 1313114 T2643 oasc.SolrResourceLoader.<init> new SolrResourceLoader for directory: '/Users/jenkins/jenkins-slave/workspace/Lucene-Solr-trunk-MacOSX/solr/build/solr-core/test/J0/./org.apache.solr.cloud.CollectionsAPIDistributedZkTest-jetty4-1371141062777/awholynewcollection_0_shard4_replica4/'
[junit4:junit4]   2> 1313125 T2614 oasc.SolrResourceLoader.<init> new SolrResourceLoader for directory: '/Users/jenkins/jenkins-slave/workspace/Lucene-Solr-trunk-MacOSX/solr/build/solr-core/test/J0/./org.apache.solr.cloud.CollectionsAPIDistributedZkTest-jetty2-1371141058317/awholynewcollection_0_shard4_replica5/'
[junit4:junit4]   2> 1313140 T2603 oasc.SolrResourceLoader.<init> new SolrResourceLoader for directory: '/Users/jenkins/jenkins-slave/workspace/Lucene-Solr-trunk-MacOSX/solr/build/solr-core/test/J0/./org.apache.solr.cloud.CollectionsAPIDistributedZkTest-jetty1-1371141056104/awholynewcollection_0_shard1_replica3/'
[junit4:junit4]   2> 1313167 T2644 oasc.SolrResourceLoader.<init> new SolrResourceLoader for directory: '/Users/jenkins/jenkins-slave/workspace/Lucene-Solr-trunk-MacOSX/solr/build/solr-core/test/J0/./org.apache.solr.cloud.CollectionsAPIDistributedZkTest-jetty4-1371141062777/awholynewcollection_0_shard5_replica4/'
[junit4:junit4]   2> 1313171 T2615 oasc.SolrResourceLoader.<init> new SolrResourceLoader for directory: '/Users/jenkins/jenkins-slave/workspace/Lucene-Solr-trunk-MacOSX/solr/build/solr-core/test/J0/./org.apache.solr.cloud.CollectionsAPIDistributedZkTest-jetty2-1371141058317/awholynewcollection_0_shard1_replica5/'
[junit4:junit4]   2> 1313185 T2617 oasc.SolrResourceLoader.<init> new SolrResourceLoader for directory: '/Users/jenkins/jenkins-slave/workspace/Lucene-Solr-trunk-MacOSX/solr/build/solr-core/test/J0/./org.apache.solr.cloud.CollectionsAPIDistributedZkTest-jetty2-1371141058317/awholynewcollection_0_shard5_replica5/'
[junit4:junit4]   2> 1313186 T2600 oasc.SolrResourceLoader.<init> new SolrResourceLoader for directory: '/Users/jenkins/jenkins-slave/workspace/Lucene-Solr-trunk-MacOSX/solr/build/solr-core/test/J0/./org.apache.solr.cloud.CollectionsAPIDistributedZkTest-jetty1-1371141056104/awholynewcollection_0_shard2_replica3/'
[junit4:junit4]   2> 1313188 T2602 oasc.SolrResourceLoader.<init> new SolrResourceLoader for directory: '/Users/jenkins/jenkins-slave/workspace/Lucene-Solr-trunk-MacOSX/solr/build/solr-core/test/J0/./org.apache.solr.cloud.CollectionsAPIDistributedZkTest-jetty1-1371141056104/awholynewcollection_0_shard4_replica3/'
[junit4:junit4]   2> 1313193 T2642 oasc.SolrResourceLoader.<init> new SolrResourceLoader for directory: '/Users/jenkins/jenkins-slave/workspace/Lucene-Solr-trunk-MacOSX/solr/build/solr-core/test/J0/./org.apache.solr.cloud.CollectionsAPIDistributedZkTest-jetty4-1371141062777/awholynewcollection_0_shard2_replica4/'
[junit4:junit4]   2> 1313198 T2601 oasc.SolrResourceLoader.<init> new SolrResourceLoader for directory: '/Users/jenkins/jenkins-slave/workspace/Lucene-Solr-trunk-MacOSX/solr/build/solr-core/test/J0/./org.apache.solr.cloud.CollectionsAPIDistributedZkTest-jetty1-1371141056104/awholynewcollection_0_shard5_replica3/'
[junit4:junit4]   2> 1313211 T2586 oasc.SolrResourceLoader.<init> new SolrResourceLoader for directory: '/Users/jenkins/jenkins-slave/workspace/Lucene-Solr-trunk-MacOSX/solr/build/solr-core/test/J0/./org.apache.solr.cloud.CollectionsAPIDistributedZkTest-controljetty-1371141054795/awholynewcollection_0_shard3_replica1/'
[junit4:junit4]   2> 1313216 T2618 oasc.SolrResourceLoader.<init> new SolrResourceLoader for directory: '/Users/jenkins/jenkins-slave/workspace/Lucene-Solr-trunk-MacOSX/solr/build/solr-core/test/J0/./org.apache.solr.cloud.CollectionsAPIDistributedZkTest-jetty2-1371141058317/awholynewcollection_0_shard2_replica5/'
[junit4:junit4]   2> 1313216 T2582 oasc.ZkController.readConfigName Load collection config from:/collections/awholynewcollection_0
[junit4:junit4]   2> 1313218 T2583 oasc.SolrResourceLoader.<init> new SolrResourceLoader for directory: '/Users/jenkins/jenkins-slave/workspace/Lucene-Solr-trunk-MacOSX/solr/build/solr-core/test/J0/./org.apache.solr.cloud.CollectionsAPIDistributedZkTest-controljetty-1371141054795/awholynewcollection_0_shard4_replica1/'
[junit4:junit4]   2> 1313220 T2581 oasc.ZkController.readConfigName Load collection config from:/collections/awholynewcollection_0
[junit4:junit4]   2> 1313230 T2685 oasc.SolrResourceLoader.<init> new SolrResourceLoader for directory: '/Users/jenkins/jenkins-slave/workspace/Lucene-Solr-trunk-MacOSX/solr/build/solr-core/test/J0/./org.apache.solr.cloud.CollectionsAPIDistributedZkTest-controljetty-1371141054795/awholynewcollection_0_shard5_replica1/'
[junit4:junit4]   2> 1313233 T2627 oasc.SolrResourceLoader.<init> new SolrResourceLoader for directory: '/Users/jenkins/jenkins-slave/workspace/Lucene-Solr-trunk-MacOSX/solr/build/solr-core/test/J0/./org.apache.solr.cloud.CollectionsAPIDistributedZkTest-jetty3-1371141060503/awholynewcollection_0_shard4_replica2/'
[junit4:junit4]   2> 1313240 T2641 oasc.SolrResourceLoader.<init> new SolrResourceLoader for directory: '/Users/jenkins/jenkins-slave/workspace/Lucene-Solr-trunk-MacOSX/solr/build/solr-core/test/J0/./org.apache.solr.cloud.CollectionsAPIDistributedZkTest-jetty4-1371141062777/awholynewcollection_0_shard1_replica4/'
[junit4:junit4]   2> 1313243 T2632 oasc.SolrResourceLoader.<init> new SolrResourceLoader for directory: '/Users/jenkins/jenkins-slave/workspace/Lucene-Solr-trunk-MacOSX/solr/build/solr-core/test/J0/./org.apache.solr.cloud.CollectionsAPIDistributedZkTest-jetty3-1371141060503/awholynewcollection_0_shard2_replica2/'
[junit4:junit4]   2> 1313273 T2629 oasc.SolrResourceLoader.<init> new SolrResourceLoader for directory: '/Users/jenkins/jenkins-slave/workspace/Lucene-Solr-trunk-MacOSX/solr/build/solr-core/test/J0/./org.apache.solr.cloud.CollectionsAPIDistributedZkTest-jetty3-1371141060503/awholynewcollection_0_shard5_replica2/'
[junit4:junit4]   2> 1313276 T2630 oasc.SolrResourceLoader.<init> new SolrResourceLoader for directory: '/Users/jenkins/jenkins-slave/workspace/Lucene-Solr-trunk-MacOSX/solr/build/solr-core/test/J0/./org.apache.solr.cloud.CollectionsAPIDistributedZkTest-jetty3-1371141060503/awholynewcollection_0_shard1_replica2/'
[junit4:junit4]   2> 1313345 T2613 oasc.ZkController.readConfigName Load collection config from:/collections/awholynewcollection_0
[junit4:junit4]   2> 1313347 T2582 oasc.SolrResourceLoader.<init> new SolrResourceLoader for directory: '/Users/jenkins/jenkins-slave/workspace/Lucene-Solr-trunk-MacOSX/solr/build/solr-core/test/J0/./org.apache.solr.cloud.CollectionsAPIDistributedZkTest-controljetty-1371141054795/awholynewcollection_0_shard2_replica1/'
[junit4:junit4]   2> 1313348 T2598 oasc.ZkController.readConfigName Load collection config from:/collections/awholynewcollection_0
[junit4:junit4]   2> 1313353 T2645 oasc.ZkController.readConfigName Load collection config from:/collections/awholynewcollection_0
[junit4:junit4]   2> 1313356 T2581 oasc.SolrResourceLoader.<init> new SolrResourceLoader for directory: '/Users/jenkins/jenkins-slave/workspace/Lucene-Solr-trunk-MacOSX/solr/build/solr-core/test/J0/./org.apache.solr.cloud.CollectionsAPIDistributedZkTest-controljetty-1371141054795/awholynewcollection_0_shard1_replica1/'
[junit4:junit4]   2> 1313373 T2598 oasc.SolrResourceLoader.<init> new SolrResourceLoader for directory: '/Users/jenkins/jenkins-slave/workspace/Lucene-Solr-trunk-MacOSX/solr/build/solr-core/test/J0/./org.apache.solr.cloud.CollectionsAPIDistributedZkTest-jetty1-1371141056104/awholynewcollection_0_shard3_replica3/'
[junit4:junit4]   2> 1313379 T2645 oasc.SolrResourceLoader.<init> new SolrResourceLoader for directory: '/Users/jenkins/jenkins-slave/workspace/Lucene-Solr-trunk-MacOSX/solr/build/solr-core/test/J0/./org.apache.solr.cloud.CollectionsAPIDistributedZkTest-jetty4-1371141062777/awholynewcollection_0_shard3_replica4/'
[junit4:junit4]   2> 1313385 T2613 oasc.SolrResourceLoader.<init> new SolrResourceLoader for directory: '/Users/jenkins/jenkins-slave/workspace/Lucene-Solr-trunk-MacOSX/solr/build/solr-core/test/J0/./org.apache.solr.cloud.CollectionsAPIDistributedZkTest-jetty2-1371141058317/awholynewcollection_0_shard3_replica5/'
[junit4:junit4]   2> 1313625 T2584 oasha.CoreAdminHandler.handleWaitForStateAction Waited coreNodeName: 127.0.0.1:49758__nodes_used_collection_shard1_replica2, state: recovering, checkLive: true, onlyIfLeader: true for: 3 seconds.
[junit4:junit4]   2> 1313626 T2584 oass.SolrDispatchFilter.handleAdminRequest [admin] webapp=null path=/admin/cores params={coreNodeName=127.0.0.1:49758__nodes_used_collection_shard1_replica2&state=recovering&nodeName=127.0.0.1:49758_&action=PREPRECOVERY&checkLive=true&core=nodes_used_collection_shard1_replica1&wt=javabin&onlyIfLeader=true&version=2} status=0 QTime=3006 
[junit4:junit4]   2> 1313717 T2586 oasc.SolrConfig.<init> Using Lucene MatchVersion: LUCENE_50
[junit4:junit4]   2> 1313771 T2583 oasc.SolrConfig.<init> Using Lucene MatchVersion: LUCENE_50
[junit4:junit4]   2> 1313849 T2614 oasc.SolrConfig.<init> Using Lucene MatchVersion: LUCENE_50
[junit4:junit4]   2> 1313858 T2685 oasc.SolrConfig.<init> Using Lucene MatchVersion: LUCENE_50
[junit4:junit4]   2> 1313884 T2601 oasc.SolrConfig.<init> Using Lucene MatchVersion: LUCENE_50
[junit4:junit4]   2> 1313984 T2630 oasc.SolrConfig.<init> Using Lucene MatchVersion: LUCENE_50
[junit4:junit4]   2> 1314000 T2641 oasc.SolrConfig.<init> Using Lucene MatchVersion: LUCENE_50
[junit4:junit4]   2> 1314316 T2582 oasc.SolrConfig.<init> Using Lucene MatchVersion: LUCENE_50
[junit4:junit4]   2> 1314418 T2617 oasc.SolrConfig.<init> Using Lucene MatchVersion: LUCENE_50
[junit4:junit4]   2> 1314450 T2632 oasc.SolrConfig.<init> Using Lucene MatchVersion: LUCENE_50
[junit4:junit4]   2> 1314519 T2583 oasc.SolrConfig.<init> Loaded SolrConfig: solrconfig.xml
[junit4:junit4]   2> 1314549 T2583 oass.IndexSchema.readSchema Reading Solr Schema from schema.xml
[junit4:junit4]   2> 1314569 T2615 oasc.SolrConfig.<init> Using Lucene MatchVersion: LUCENE_50
[junit4:junit4]   2> ASYNC  NEW_CORE C766 name=nodes_used_collection_shard2_replica2 org.apache.solr.core.SolrCore@2533cd42 url=http://127.0.0.1:49755/nodes_used_collection_shard2_replica2 node=127.0.0.1:49755_ C766_STATE=coll:nodes_used_collection core:nodes_used_collection_shard2_replica2 props:{shard=shard2, state=recovering, core=nodes_used_collection_shard2_replica2, collection=nodes_used_collection, node_name=127.0.0.1:49755_, base_url=http://127.0.0.1:49755}
[junit4:junit4]   2> 1314632 T2662 C766 P49755 oasc.RecoveryStrategy.doRecovery Attempting to PeerSync from http://127.0.0.1:49764/nodes_used_collection_shard2_replica1/ core=nodes_used_collection_shard2_replica2 - recoveringAfterStartup=true
[junit4:junit4]   2> 1314633 T2662 C766 P49755 oasu.PeerSync.sync PeerSync: core=nodes_used_collection_shard2_replica2 url=http://127.0.0.1:49755 START replicas=[http://127.0.0.1:49764/nodes_used_collection_shard2_replica1/] nUpdates=100
[junit4:junit4]   2> 1314634 T2662 C766 P49755 oasu.PeerSync.sync WARN no frame of reference to tell of we've missed updates
[junit4:junit4]   2> 1314634 T2662 C766 P49755 oasc.RecoveryStrategy.doRecovery PeerSync Recovery was not successful - trying replication. core=nodes_used_collection_shard2_replica2
[junit4:junit4]   2> 1314635 T2662 C766 P49755 oasc.RecoveryStrategy.doRecovery Starting Replication Recovery. core=nodes_used_collection_shard2_replica2
[junit4:junit4]   2> 1314635 T2662 C766 P49755 oasc.RecoveryStrategy.doRecovery Begin buffering updates. core=nodes_used_collection_shard2_replica2
[junit4:junit4]   2> 1314635 T2662 C766 P49755 oasu.UpdateLog.bufferUpdates Starting to buffer updates. FSUpdateLog{state=ACTIVE, tlog=null}
[junit4:junit4]   2> 1314635 T2662 C766 P49755 oasc.RecoveryStrategy.replicate Attempting to replicate from http://127.0.0.1:49764/nodes_used_collection_shard2_replica1/. core=nodes_used_collection_shard2_replica2
[junit4:junit4]   2> 1314636 T2662 C766 P49755 oascsi.HttpClientUtil.createClient Creating new http client, config:maxConnections=128&maxConnectionsPerHost=32&followRedirects=false
[junit4:junit4]   2> 1314684 T2583 oass.IndexSchema.readSchema [awholynewcollection_0_shard4_replica1] Schema name=test
[junit4:junit4]   2> 1314741 T2603 oasc.SolrConfig.<init> Using Lucene MatchVersion: LUCENE_50
[junit4:junit4]   2> 1314798 T2586 oasc.SolrConfig.<init> Loaded SolrConfig: solrconfig.xml
[junit4:junit4]   2> 1314822 T2586 oass.IndexSchema.readSchema Reading Solr Schema from schema.xml
[junit4:junit4]   2> 1314829 T2586 oass.IndexSchema.readSchema [awholynewcollection_0_shard3_replica1] Schema name=test
[junit4:junit4]   2> 1314880 T2618 oasc.SolrConfig.<init> Using Lucene MatchVersion: LUCENE_50
[junit4:junit4]   2> 1314885 T2627 oasc.SolrConfig.<init> Using Lucene MatchVersion: LUCENE_50
[junit4:junit4]   2> 1314910 T2601 oasc.SolrConfig.<init> Loaded SolrConfig: solrconfig.xml
[junit4:junit4]   2> 1314912 T2602 oasc.SolrConfig.<init> Using Lucene MatchVersion: LUCENE_50
[junit4:junit4]   2> 1314922 T2601 oass.IndexSchema.readSchema Reading Solr Schema from schema.xml
[junit4:junit4]   2> ASYNC  NEW_CORE C767 name=nodes_used_collection_shard2_replica1 org.apache.solr.core.SolrCore@3d5c3b7c url=http://127.0.0.1:49764/nodes_used_collection_shard2_replica1 node=127.0.0.1:49764_ C767_STATE=coll:nodes_used_collection core:nodes_used_collection_shard2_replica1 props:{shard=shard2, state=active, core=nodes_used_collection_shard2_replica1, collection=nodes_used_collection, node_name=127.0.0.1:49764_, base_url=http://127.0.0.1:49764, leader=true}
[junit4:junit4]   2> 1314949 T2646 C767 P49764 oasc.SolrCore.execute [nodes_used_collection_shard2_replica1] webapp= path=/get params={getVersions=100&distrib=false&wt=javabin&qt=/get&version=2} status=0 QTime=7 
[junit4:junit4]   2> 1314956 T2693 C767 P49764 oasu.DirectUpdateHandler2.commit start commit{,optimize=false,openSearcher=false,waitSearcher=true,expungeDeletes=false,softCommit=false,prepareCommit=false}
[junit4:junit4]   2> 1315015 T2693 C767 P49764 oasc.SolrDeletionPolicy.onInit SolrDeletionPolicy.onInit: commits: num=1
[junit4:junit4]   2> 		commit{dir=MockDirWrapper(org.apache.lucene.store.RAMDirectory@7d0d8716 lockFactory=org.apache.lucene.store.NativeFSLockFactory@4671e12c),segFN=segments_1,generation=1}
[junit4:junit4]   2> 1315017 T2693 C767 P49764 oasc.SolrDeletionPolicy.updateCommits newest commit generation = 1
[junit4:junit4]   2> 1315018 T2693 C767 P49764 oasc.SolrDeletionPolicy.onCommit SolrDeletionPolicy.onCommit: commits: num=2
[junit4:junit4]   2> 		commit{dir=MockDirWrapper(org.apache.lucene.store.RAMDirectory@7d0d8716 lockFactory=org.apache.lucene.store.NativeFSLockFactory@4671e12c),segFN=segments_1,generation=1}
[junit4:junit4]   2> 		commit{dir=MockDirWrapper(org.apache.lucene.store.RAMDirectory@7d0d8716 lockFactory=org.apache.lucene.store.NativeFSLockFactory@4671e12c),segFN=segments_2,generation=2}
[junit4:junit4]   2> 1315019 T2693 C767 P49764 oasc.SolrDeletionPolicy.updateCommits newest commit generation = 2
[junit4:junit4]   2> 1315020 T2693 C767 P49764 oass.SolrIndexSearcher.<init> Opening Searcher@5ba9a75b realtime
[junit4:junit4]   2> 1315020 T2693 C767 P49764 oasu.DirectUpdateHandler2.commit end_commit_flush
[junit4:junit4]   2> 1315021 T2693 C767 P49764 oasup.LogUpdateProcessor.finish [nodes_used_collection_shard2_replica1] webapp= path=/update params={waitSearcher=true&openSearcher=false&commit=true&wt=javabin&commit_end_point=true&version=2&softCommit=false} {commit=} 0 65
[junit4:junit4]   2> 1315033 T2662 C766 P49755 oash.ReplicationHandler.inform Commits will be reserved for  10000
[junit4:junit4]   2> 1315034 T2662 C766 P49755 oash.SnapPuller.<init>  No value set for 'pollInterval'. Timer Task not started.
[junit4:junit4]   2> ASYNC  NEW_CORE C768 name=nodes_used_collection_shard2_replica1 org.apache.solr.core.SolrCore@3d5c3b7c url=http://127.0.0.1:49764/nodes_used_collection_shard2_replica1 node=127.0.0.1:49764_ C768_STATE=coll:nodes_used_collection core:nodes_used_collection_shard2_replica1 props:{shard=shard2, state=active, core=nodes_used_collection_shard2_replica1, collection=nodes_used_collection, node_name=127.0.0.1:49764_, base_url=http://127.0.0.1:49764, leader=true}
[junit4:junit4]   2> 1315074 T2693 C768 P49764 oash.ReplicationHandler.inform Commits will be reserved for  10000
[junit4:junit4]   2> 1315075 T2693 C768 P49764 oasc.SolrCore.execute [nodes_used_collection_shard2_replica1] webapp= path=/replication params={command=indexversion&qt=/replication&wt=javabin&version=2} status=0 QTime=2 
[junit4:junit4]   2> ASYNC  NEW_CORE C769 name=nodes_used_collection_shard2_replica2 org.apache.solr.core.SolrCore@2533cd42 url=http://127.0.0.1:49755/nodes_used_collection_shard2_replica2 node=127.0.0.1:49755_ C769_STATE=coll:nodes_used_collection core:nodes_used_collection_shard2_replica2 props:{shard=shard2, state=recovering, core=nodes_used_collection_shard2_replica2, collection=nodes_used_collection, node_name=127.0.0.1:49755_, base_url=http://127.0.0.1:49755}
[junit4:junit4]   2> 1315080 T2662 C769 P49755 oash.SnapPuller.fetchLatestIndex Master's generation: 2
[junit4:junit4]   2> 1315081 T2662 C769 P49755 oash.SnapPuller.fetchLatestIndex Slave's generation: 1
[junit4:junit4]   2> 1315081 T2662 C769 P49755 oash.SnapPuller.fetchLatestIndex Starting replication process
[junit4:junit4]   2> 1315109 T2693 C768 P49764 oasc.SolrCore.execute [nodes_used_collection_shard2_replica1] webapp= path=/replication params={command=filelist&qt=/replication&wt=javabin&generation=2&version=2} status=0 QTime=12 
[junit4:junit4]   2> 1315111 T2662 C769 P49755 oash.SnapPuller.fetchLatestIndex Number of files in latest index in master: 1
[junit4:junit4]   2> 1315123 T2662 C769 P49755 oasc.CachingDirectoryFactory.get return new directory for /Users/jenkins/jenkins-slave/workspace/Lucene-Solr-trunk-MacOSX/solr/build/solr-core/test/J0/./org.apache.solr.cloud.CollectionsAPIDistributedZkTest-jetty1-1371141056104/nodes_used_collection_shard2_replica2/data/index.20130613163119289
[junit4:junit4]   2> 1315127 T2662 C769 P49755 oash.SnapPuller.fetchLatestIndex Starting download to MockDirWrapper(org.apache.lucene.store.RAMDirectory@177fd92c lockFactory=org.apache.lucene.store.NativeFSLockFactory@217e41b1) fullCopy=false
[junit4:junit4]   2> 1315141 T2646 C768 P49764 oasc.SolrCore.execute [nodes_used_collection_shard2_replica1] webapp= path=/replication params={file=segments_2&command=filecontent&checksum=true&wt=filestream&qt=/replication&generation=2} status=0 QTime=0 
[junit4:junit4]   2> 1315175 T2662 C769 P49755 oash.SnapPuller.fetchLatestIndex Total time taken for download : 0 secs
[junit4:junit4]   2> 1315206 T2601 oass.IndexSchema.readSchema [awholynewcollection_0_shard5_replica3] Schema name=test
[junit4:junit4]   2> 1315231 T2581 oasc.SolrConfig.<init> Using Lucene MatchVersion: LUCENE_50
[junit4:junit4]   2> 1315233 T2662 C769 P49755 oasu.DefaultSolrCoreState.newIndexWriter Creating new IndexWriter...
[junit4:junit4]   2> 1315234 T2662 C769 P49755 oasu.DefaultSolrCoreState.newIndexWriter Waiting until IndexWriter is unused... core=nodes_used_collection_shard2_replica2
[junit4:junit4]   2> 1315248 T2614 oasc.SolrConfig.<init> Loaded SolrConfig: solrconfig.xml
[junit4:junit4]   2> 1315285 T2614 oass.IndexSchema.readSchema Reading Solr Schema from schema.xml
[junit4:junit4]   2> 1315300 T2614 oass.IndexSchema.readSchema [awholynewcollection_0_shard4_replica5] Schema name=test
[junit4:junit4]   2> 1315316 T2645 oasc.SolrConfig.<init> Using Lucene MatchVersion: LUCENE_50
[junit4:junit4]   2> 1315333 T2629 oasc.SolrConfig.<init> Using Lucene MatchVersion: LUCENE_50
[junit4:junit4]   2> 1315349 T2662 C769 P49755 oasc.SolrDeletionPolicy.onInit SolrDeletionPolicy.onInit: commits: num=2
[junit4:junit4]   2> 		commit{dir=MockDirWrapper(org.apache.lucene.store.RAMDirectory@3cf3e27a lockFactory=org.apache.lucene.store.NativeFSLockFactory@5a295242),segFN=segments_1,generation=1}
[junit4:junit4]   2> 		commit{dir=MockDirWrapper(org.apache.lucene.store.RAMDirectory@3cf3e27a lockFactory=org.apache.lucene.store.NativeFSLockFactory@5a295242),segFN=segments_2,generation=2}
[junit4:junit4]   2> 1315350 T2662 C769 P49755 oasc.SolrDeletionPolicy.updateCommits newest commit generation = 2
[junit4:junit4]   2> 1315367 T2662 C769 P49755 oasu.DefaultSolrCoreState.newIndexWriter New IndexWriter is ready to be used.
[junit4:junit4]   2> 1315368 T2662 C769 P49755 oass.SolrIndexSearcher.<init> Opening Searcher@2daeb4e main
[junit4:junit4]   2> 1315380 T2659 oasc.SolrCore.registerSearcher [nodes_used_collection_shard2_replica2] Registered new searcher Searcher@2daeb4e main{StandardDirectoryReader(segments_2:1:nrt)}
[junit4:junit4]   2> 1315409 T2662 C769 P49755 oasc.CachingDirectoryFactory.closeCacheValue looking to close /Users/jenkins/jenkins-slave/workspace/Lucene-Solr-tru

[...truncated too long message...]

space/Lucene-Solr-trunk-MacOSX/solr/build/solr-core/test/J0/./org.apache.solr.cloud.ShardSplitTest-1371143012076 FAILED !!!!!
[junit4:junit4]   2> 3322741 T6907 oas.SolrTestCaseJ4.tearDown ###Ending testDistribSearch
[junit4:junit4]   2> 3322741 T6907 oasc.ZkTestServer.send4LetterWord connecting to 127.0.0.1:51131 51131
[junit4:junit4]   1> client port:0.0.0.0/0.0.0.0:0
[junit4:junit4]   2> NOTE: reproduce with: ant test  -Dtestcase=ShardSplitTest -Dtests.method=testDistribSearch -Dtests.seed=DE706E57266620B7 -Dtests.slow=true -Dtests.locale=ar_LY -Dtests.timezone=EAT -Dtests.file.encoding=US-ASCII
[junit4:junit4] ERROR   74.9s | ShardSplitTest.testDistribSearch <<<
[junit4:junit4]    > Throwable #1: org.apache.solr.client.solrj.impl.HttpSolrServer$RemoteSolrException: Server at http://127.0.0.1:51138 returned non ok status:500, message:Server Error
[junit4:junit4]    > 	at __randomizedtesting.SeedInfo.seed([DE706E57266620B7:5F96E04F5139408B]:0)
[junit4:junit4]    > 	at org.apache.solr.client.solrj.impl.HttpSolrServer.request(HttpSolrServer.java:385)
[junit4:junit4]    > 	at org.apache.solr.client.solrj.impl.HttpSolrServer.request(HttpSolrServer.java:180)
[junit4:junit4]    > 	at org.apache.solr.cloud.ShardSplitTest.splitShard(ShardSplitTest.java:228)
[junit4:junit4]    > 	at org.apache.solr.cloud.ShardSplitTest.doTest(ShardSplitTest.java:150)
[junit4:junit4]    > 	at org.apache.solr.BaseDistributedSearchTestCase.testDistribSearch(BaseDistributedSearchTestCase.java:815)
[junit4:junit4]    > 	at java.lang.Thread.run(Thread.java:722)
[junit4:junit4]   2> 3322752 T6907 oas.SolrTestCaseJ4.deleteCore ###deleteCore
[junit4:junit4]   2> 74876 T6906 ccr.ThreadLeakControl.checkThreadLeaks WARNING Will linger awaiting termination of 2 leaked thread(s).
[junit4:junit4]   2> 3323739 T6998 oascc.ZkStateReader$2.process WARN ZooKeeper watch triggered, but Solr cannot talk to ZK
[junit4:junit4]   2> 3323740 T6998 oascc.ZkStateReader$3.process WARN ZooKeeper watch triggered, but Solr cannot talk to ZK
[junit4:junit4]   2> NOTE: test params are: codec=Lucene42: {id=Lucene41(blocksize=128), _version_=PostingsFormat(name=MockRandom), n_ti=MockVariableIntBlock(baseBlockSize=17)}, docValues:{}, sim=RandomSimilarityProvider(queryNorm=false,coord=crazy): {}, locale=ar_LY, timezone=EAT
[junit4:junit4]   2> NOTE: Mac OS X 10.8.4 x86_64/Oracle Corporation 1.7.0_21 (64-bit)/cpus=2,threads=3,free=121002440,total=409206784
[junit4:junit4]   2> NOTE: All tests run in this JVM: [CircularListTest, BadIndexSchemaTest, DOMUtilTest, CoreAdminHandlerTest, TestOmitPositions, ShardRoutingCustomTest, TestBM25SimilarityFactory, DateFieldTest, DocumentAnalysisRequestHandlerTest, TestStressLucene, PolyFieldTest, TestCodecSupport, LeaderElectionTest, TestAtomicUpdateErrorCases, TestAnalyzedSuggestions, TestPluginEnable, TestUpdate, TestSearchPerf, TermsComponentTest, TestSolrQueryParserResource, TestExtendedDismaxParser, AutoCommitTest, CSVRequestHandlerTest, BinaryUpdateRequestHandlerTest, FullSolrCloudDistribCmdsTest, TestIndexingPerformance, PreAnalyzedFieldTest, BasicZkTest, TestFiltering, TestRandomDVFaceting, TestRTGBase, TestDefaultSearchFieldResource, TestPhraseSuggestions, TestCloudManagedSchema, TestManagedSchema, TestDocumentBuilder, SpellCheckComponentTest, TestSolrXml, TestFastOutputStream, BadCopyFieldTest, TestLRUCache, BadComponentTest, ConvertedLegacyTest, TestReload, ZkSolrClientTest, TestFunctionQuery, ExternalFileFieldSortTest, TestCoreContainer, DistributedQueryElevationComponentTest, ZkControllerTest, PrimUtilsTest, TestLuceneMatchVersion, TestRangeQuery, BasicDistributedZk2Test, TestSolr4Spatial, SuggesterWFSTTest, TestStressRecovery, TestSchemaSimilarityResource, SpellingQueryConverterTest, OpenCloseCoreStressTest, SolrInfoMBeanTest, TestSolrCoreProperties, TestAddFieldRealTimeGet, SuggesterFSTTest, TestFuzzyAnalyzedSuggestions, RequestHandlersTest, SolrCoreCheckLockOnStartupTest, ShowFileRequestHandlerTest, TestPostingsSolrHighlighter, ZkNodePropsTest, TestCSVResponseWriter, StatsComponentTest, JSONWriterTest, SuggesterTest, SliceStateTest, TestSolrDeletionPolicy1, NumericFieldsTest, QueryEqualityTest, TestStressVersions, TestSolrDeletionPolicy2, TestFieldCollectionResource, TestSchemaVersionResource, WordBreakSolrSpellCheckerTest, TestSchemaNameResource, AlternateDirectoryTest, PluginInfoTest, TestRemoteStreaming, HardAutoCommitTest, TestArbitraryIndexDir, SpellPossibilityIteratorTest, TestReplicationHandler, TestReloadAndDeleteDocs, SolrIndexSplitterTest, LoggingHandlerTest, ClusterStateTest, TestHashPartitioner, TestManagedSchemaFieldResource, TestFoldingMultitermQuery, TestPropInjectDefaults, DirectUpdateHandlerTest, SolrTestCaseJ4Test, SpellCheckCollatorTest, MoreLikeThisHandlerTest, PreAnalyzedUpdateProcessorTest, CoreContainerCoreInitFailuresTest, TestIBSimilarityFactory, TermVectorComponentDistributedTest, CollectionsAPIDistributedZkTest, TestSolrQueryParserDefaultOperatorResource, ChaosMonkeyNothingIsSafeTest, TestSolrIndexConfig, SignatureUpdateProcessorFactoryTest, BasicDistributedZkTest, TestCharFilters, UUIDFieldTest, SolrCoreTest, DistanceFunctionTest, StandardRequestHandlerTest, TestComponentsName, SliceStateUpdateTest, TestNumberUtils, SortByFunctionTest, SuggesterTSTTest, NoCacheHeaderTest, TestBinaryResponseWriter, FileUtilsTest, TestTrie, SolrRequestParserTest, TestCSVLoader, FieldAnalysisRequestHandlerTest, TestJoin, TestPropInject, SolrCmdDistributorTest, CachingDirectoryFactoryTest, DefaultValueUpdateProcessorTest, DistributedSpellCheckComponentTest, BasicFunctionalityTest, TestClassNameShortening, PingRequestHandlerTest, FileBasedSpellCheckerTest, ChaosMonkeySafeLeaderTest, UnloadDistributedZkTest, SyncSliceTest, OverseerTest, LeaderElectionIntegrationTest, ShardRoutingTest, RecoveryZkTest, ClusterStateUpdateTest, TestRandomFaceting, TestZkChroot, ZkCLITest, TestDistributedSearch, TestDistributedGrouping, TestFaceting, TestRecovery, TestRealTimeGet, TestStressReorder, TestMultiCoreConfBootstrap, DistributedTermsComponentTest, SimpleFacetsTest, TestGroupingSearch, QueryElevationComponentTest, PeerSyncTest, TestSort, TestLazyCores, TestBadConfig, OverseerCollectionProcessorTest, TestIndexSearcher, HighlighterTest, SoftAutoCommitTest, CurrencyFieldOpenExchangeTest, CurrencyFieldXmlFileTest, SimplePostToolTest, TestCoreDiscovery, AnalysisAfterCoreReloadTest, DocValuesTest, SpatialFilterTest, SchemaVersionSpecificBehaviorTest, TestPseudoReturnFields, FieldMutatingUpdateProcessorTest, TestWordDelimiterFilterFactory, DirectUpdateHandlerOptimizeTest, StatelessScriptUpdateProcessorFactoryTest, DocValuesMultiTest, XsltUpdateRequestHandlerTest, DebugComponentTest, CacheHeaderTest, IndexBasedSpellCheckerTest, TestSurroundQueryParser, LukeRequestHandlerTest, DisMaxRequestHandlerTest, TestQueryUtils, TestWriterPerf, DirectSolrSpellCheckerTest, TestReversedWildcardFilterFactory, TestQueryTypes, PrimitiveFieldTypeTest, XmlUpdateRequestHandlerTest, DocumentBuilderTest, TestValueSourceCache, PathHierarchyTokenizerFactoryTest, TermVectorComponentTest, RequiredFieldsTest, TestSolrQueryParser, FastVectorHighlighterTest, IndexSchemaRuntimeFieldTest, RegexBoostProcessorTest, SolrPluginUtilsTest, IndexSchemaTest, TestJmxIntegration, TestCollationField, ReturnFieldsTest, UpdateRequestProcessorFactoryTest, MBeansHandlerTest, QueryParsingTest, UniqFieldsUpdateProcessorFactoryTest, JsonLoaderTest, TestPartialUpdateDeduplication, TestPHPSerializedResponseWriter, SearchHandlerTest, TestLFUCache, HighlighterConfigTest, SOLR749Test, TestQuerySenderListener, IndexReaderFactoryTest, UpdateParamsTest, TestQuerySenderNoQuery, CopyFieldTest, ResponseLogComponentTest, SolrIndexConfigTest, TestMergePolicyConfig, MultiTermTest, SampleTest, TestDocSet, TestBinaryField, MinimalSchemaTest, TestElisionMultitermQuery, TestConfig, OutputWriterTest, DirectSolrConnectionTest, NotRequiredUniqueKeyTest, SynonymTokenizerTest, TestXIncludeConfig, EchoParamsTest, TestSweetSpotSimilarityFactory, TestDFRSimilarityFactory, TestPerFieldSimilarity, TestLMDirichletSimilarityFactory, TestLMJelinekMercerSimilarityFactory, TestDefaultSimilarityFactory, TestFastWriter, LegacyHTMLStripCharFilterTest, TestJmxMonitoredMap, TimeZoneUtilsTest, ResourceLoaderTest, ScriptEngineTest, OpenExchangeRatesOrgProviderTest, URLClassifyProcessorTest, TestFastLRUCache, DateMathParserTest, TestSolrXMLSerializer, TestSystemIdResolver, TestSuggestSpellingConverter, RAMDirectoryFactoryTest, TestSolrJ, TestUtils, SystemInfoHandlerTest, AliasIntegrationTest, ChaosMonkeyShardSplitTest, ShardSplitTest]
[junit4:junit4] Completed in 75.93s, 1 test, 1 error <<< FAILURES!

[...truncated 54 lines...]
BUILD FAILED
/Users/jenkins/jenkins-slave/workspace/Lucene-Solr-trunk-MacOSX/build.xml:385: The following error occurred while executing this line:
/Users/jenkins/jenkins-slave/workspace/Lucene-Solr-trunk-MacOSX/build.xml:365: The following error occurred while executing this line:
/Users/jenkins/jenkins-slave/workspace/Lucene-Solr-trunk-MacOSX/build.xml:39: The following error occurred while executing this line:
/Users/jenkins/jenkins-slave/workspace/Lucene-Solr-trunk-MacOSX/solr/build.xml:181: The following error occurred while executing this line:
/Users/jenkins/jenkins-slave/workspace/Lucene-Solr-trunk-MacOSX/solr/common-build.xml:437: The following error occurred while executing this line:
/Users/jenkins/jenkins-slave/workspace/Lucene-Solr-trunk-MacOSX/lucene/common-build.xml:1240: The following error occurred while executing this line:
/Users/jenkins/jenkins-slave/workspace/Lucene-Solr-trunk-MacOSX/lucene/common-build.xml:884: There were test failures: 296 suites, 1243 tests, 2 errors, 1 failure, 18 ignored (6 assumptions)

Total time: 99 minutes 12 seconds
Build step 'Invoke Ant' marked build as failure
Description set: Java: 64bit/jdk1.7.0 -XX:-UseCompressedOops -XX:+UseParallelGC
Archiving artifacts
Recording test results
Email was triggered for: Failure
Sending email for trigger: Failure



Mime
View raw message