lucene-dev mailing list archives

Site index · List index
Message view « Date » · « Thread »
Top « Date » · « Thread »
From Policeman Jenkins Server <jenk...@thetaphi.de>
Subject [JENKINS] Lucene-Solr-trunk-Linux (64bit/jdk1.7.0_21) - Build # 6038 - Failure!
Date Sat, 08 Jun 2013 09:53:05 GMT
Build: http://jenkins.thetaphi.de/job/Lucene-Solr-trunk-Linux/6038/
Java: 64bit/jdk1.7.0_21 -XX:-UseCompressedOops -XX:+UseG1GC

1 tests failed.
REGRESSION:  org.apache.solr.cloud.CollectionsAPIDistributedZkTest.testDistribSearch

Error Message:
There are still nodes recoverying - waited for 230 seconds

Stack Trace:
java.lang.AssertionError: There are still nodes recoverying - waited for 230 seconds
	at __randomizedtesting.SeedInfo.seed([4530A094D6F810C0:C4D62E8CA1A770FC]:0)
	at org.junit.Assert.fail(Assert.java:93)
	at org.apache.solr.cloud.AbstractDistribZkTestBase.waitForRecoveriesToFinish(AbstractDistribZkTestBase.java:173)
	at org.apache.solr.cloud.AbstractDistribZkTestBase.waitForRecoveriesToFinish(AbstractDistribZkTestBase.java:131)
	at org.apache.solr.cloud.AbstractDistribZkTestBase.waitForRecoveriesToFinish(AbstractDistribZkTestBase.java:126)
	at org.apache.solr.cloud.CollectionsAPIDistributedZkTest.testCollectionsAPI(CollectionsAPIDistributedZkTest.java:512)
	at org.apache.solr.cloud.CollectionsAPIDistributedZkTest.doTest(CollectionsAPIDistributedZkTest.java:146)
	at org.apache.solr.BaseDistributedSearchTestCase.testDistribSearch(BaseDistributedSearchTestCase.java:815)
	at sun.reflect.NativeMethodAccessorImpl.invoke0(Native Method)
	at sun.reflect.NativeMethodAccessorImpl.invoke(NativeMethodAccessorImpl.java:57)
	at sun.reflect.DelegatingMethodAccessorImpl.invoke(DelegatingMethodAccessorImpl.java:43)
	at java.lang.reflect.Method.invoke(Method.java:601)
	at com.carrotsearch.randomizedtesting.RandomizedRunner.invoke(RandomizedRunner.java:1559)
	at com.carrotsearch.randomizedtesting.RandomizedRunner.access$600(RandomizedRunner.java:79)
	at com.carrotsearch.randomizedtesting.RandomizedRunner$6.evaluate(RandomizedRunner.java:737)
	at com.carrotsearch.randomizedtesting.RandomizedRunner$7.evaluate(RandomizedRunner.java:773)
	at com.carrotsearch.randomizedtesting.RandomizedRunner$8.evaluate(RandomizedRunner.java:787)
	at com.carrotsearch.randomizedtesting.rules.SystemPropertiesRestoreRule$1.evaluate(SystemPropertiesRestoreRule.java:53)
	at org.apache.lucene.util.TestRuleSetupTeardownChained$1.evaluate(TestRuleSetupTeardownChained.java:50)
	at org.apache.lucene.util.TestRuleFieldCacheSanity$1.evaluate(TestRuleFieldCacheSanity.java:51)
	at org.apache.lucene.util.AbstractBeforeAfterRule$1.evaluate(AbstractBeforeAfterRule.java:46)
	at com.carrotsearch.randomizedtesting.rules.SystemPropertiesInvariantRule$1.evaluate(SystemPropertiesInvariantRule.java:55)
	at org.apache.lucene.util.TestRuleThreadAndTestName$1.evaluate(TestRuleThreadAndTestName.java:49)
	at org.apache.lucene.util.TestRuleIgnoreAfterMaxFailures$1.evaluate(TestRuleIgnoreAfterMaxFailures.java:70)
	at org.apache.lucene.util.TestRuleMarkFailure$1.evaluate(TestRuleMarkFailure.java:48)
	at com.carrotsearch.randomizedtesting.rules.StatementAdapter.evaluate(StatementAdapter.java:36)
	at com.carrotsearch.randomizedtesting.ThreadLeakControl$StatementRunner.run(ThreadLeakControl.java:358)
	at com.carrotsearch.randomizedtesting.ThreadLeakControl.forkTimeoutingTask(ThreadLeakControl.java:782)
	at com.carrotsearch.randomizedtesting.ThreadLeakControl$3.evaluate(ThreadLeakControl.java:442)
	at com.carrotsearch.randomizedtesting.RandomizedRunner.runSingleTest(RandomizedRunner.java:746)
	at com.carrotsearch.randomizedtesting.RandomizedRunner$3.evaluate(RandomizedRunner.java:648)
	at com.carrotsearch.randomizedtesting.RandomizedRunner$4.evaluate(RandomizedRunner.java:682)
	at com.carrotsearch.randomizedtesting.RandomizedRunner$5.evaluate(RandomizedRunner.java:693)
	at com.carrotsearch.randomizedtesting.rules.StatementAdapter.evaluate(StatementAdapter.java:36)
	at com.carrotsearch.randomizedtesting.rules.SystemPropertiesRestoreRule$1.evaluate(SystemPropertiesRestoreRule.java:53)
	at org.apache.lucene.util.AbstractBeforeAfterRule$1.evaluate(AbstractBeforeAfterRule.java:46)
	at org.apache.lucene.util.TestRuleStoreClassName$1.evaluate(TestRuleStoreClassName.java:42)
	at com.carrotsearch.randomizedtesting.rules.SystemPropertiesInvariantRule$1.evaluate(SystemPropertiesInvariantRule.java:55)
	at com.carrotsearch.randomizedtesting.rules.NoShadowingOrOverridesOnMethodsRule$1.evaluate(NoShadowingOrOverridesOnMethodsRule.java:39)
	at com.carrotsearch.randomizedtesting.rules.NoShadowingOrOverridesOnMethodsRule$1.evaluate(NoShadowingOrOverridesOnMethodsRule.java:39)
	at com.carrotsearch.randomizedtesting.rules.StatementAdapter.evaluate(StatementAdapter.java:36)
	at org.apache.lucene.util.TestRuleAssertionsRequired$1.evaluate(TestRuleAssertionsRequired.java:43)
	at org.apache.lucene.util.TestRuleMarkFailure$1.evaluate(TestRuleMarkFailure.java:48)
	at org.apache.lucene.util.TestRuleIgnoreAfterMaxFailures$1.evaluate(TestRuleIgnoreAfterMaxFailures.java:70)
	at org.apache.lucene.util.TestRuleIgnoreTestSuites$1.evaluate(TestRuleIgnoreTestSuites.java:55)
	at com.carrotsearch.randomizedtesting.rules.StatementAdapter.evaluate(StatementAdapter.java:36)
	at com.carrotsearch.randomizedtesting.ThreadLeakControl$StatementRunner.run(ThreadLeakControl.java:358)
	at java.lang.Thread.run(Thread.java:722)




Build Log:
[...truncated 9619 lines...]
[junit4:junit4] Suite: org.apache.solr.cloud.CollectionsAPIDistributedZkTest
[junit4:junit4]   2> 466590 T1106 oas.BaseDistributedSearchTestCase.initHostContext Setting hostContext system property: /
[junit4:junit4]   2> 466594 T1106 oas.SolrTestCaseJ4.setUp ###Starting testDistribSearch
[junit4:junit4]   2> Creating dataDir: /mnt/ssd/jenkins/workspace/Lucene-Solr-trunk-Linux/solr/build/solr-core/test/J1/./solrtest-CollectionsAPIDistributedZkTest-1370684274160
[junit4:junit4]   2> 466595 T1106 oasc.ZkTestServer.run STARTING ZK TEST SERVER
[junit4:junit4]   2> 466596 T1107 oasc.ZkTestServer$ZKServerMain.runFromConfig Starting server
[junit4:junit4]   2> 466696 T1106 oasc.ZkTestServer.run start zk server on port:45503
[junit4:junit4]   2> 466697 T1106 oascc.ConnectionManager.waitForConnected Waiting for client to connect to ZooKeeper
[junit4:junit4]   2> 466776 T1113 oascc.ConnectionManager.process Watcher org.apache.solr.common.cloud.ConnectionManager@5fcd0815 name:ZooKeeperConnection Watcher:127.0.0.1:45503 got event WatchedEvent state:SyncConnected type:None path:null path:null type:None
[junit4:junit4]   2> 466776 T1106 oascc.ConnectionManager.waitForConnected Client is connected to ZooKeeper
[junit4:junit4]   2> 466777 T1106 oascc.SolrZkClient.makePath makePath: /solr
[junit4:junit4]   2> 466781 T1106 oascc.ConnectionManager.waitForConnected Waiting for client to connect to ZooKeeper
[junit4:junit4]   2> 466782 T1115 oascc.ConnectionManager.process Watcher org.apache.solr.common.cloud.ConnectionManager@4e8c5c9a name:ZooKeeperConnection Watcher:127.0.0.1:45503/solr got event WatchedEvent state:SyncConnected type:None path:null path:null type:None
[junit4:junit4]   2> 466782 T1106 oascc.ConnectionManager.waitForConnected Client is connected to ZooKeeper
[junit4:junit4]   2> 466783 T1106 oascc.SolrZkClient.makePath makePath: /collections/collection1
[junit4:junit4]   2> 466786 T1106 oascc.SolrZkClient.makePath makePath: /collections/collection1/shards
[junit4:junit4]   2> 466788 T1106 oascc.SolrZkClient.makePath makePath: /collections/control_collection
[junit4:junit4]   2> 466790 T1106 oascc.SolrZkClient.makePath makePath: /collections/control_collection/shards
[junit4:junit4]   2> 466792 T1106 oasc.AbstractZkTestCase.putConfig put /mnt/ssd/jenkins/workspace/Lucene-Solr-trunk-Linux/solr/build/solr-core/test-files/solr/collection1/conf/solrconfig-tlog.xml to /configs/conf1/solrconfig.xml
[junit4:junit4]   2> 466793 T1106 oascc.SolrZkClient.makePath makePath: /configs/conf1/solrconfig.xml
[junit4:junit4]   2> 466796 T1106 oasc.AbstractZkTestCase.putConfig put /mnt/ssd/jenkins/workspace/Lucene-Solr-trunk-Linux/solr/build/solr-core/test-files/solr/collection1/conf/schema.xml to /configs/conf1/schema.xml
[junit4:junit4]   2> 466797 T1106 oascc.SolrZkClient.makePath makePath: /configs/conf1/schema.xml
[junit4:junit4]   2> 466800 T1106 oasc.AbstractZkTestCase.putConfig put /mnt/ssd/jenkins/workspace/Lucene-Solr-trunk-Linux/solr/build/solr-core/test-files/solr/collection1/conf/stopwords.txt to /configs/conf1/stopwords.txt
[junit4:junit4]   2> 466800 T1106 oascc.SolrZkClient.makePath makePath: /configs/conf1/stopwords.txt
[junit4:junit4]   2> 466802 T1106 oasc.AbstractZkTestCase.putConfig put /mnt/ssd/jenkins/workspace/Lucene-Solr-trunk-Linux/solr/build/solr-core/test-files/solr/collection1/conf/protwords.txt to /configs/conf1/protwords.txt
[junit4:junit4]   2> 466803 T1106 oascc.SolrZkClient.makePath makePath: /configs/conf1/protwords.txt
[junit4:junit4]   2> 466805 T1106 oasc.AbstractZkTestCase.putConfig put /mnt/ssd/jenkins/workspace/Lucene-Solr-trunk-Linux/solr/build/solr-core/test-files/solr/collection1/conf/currency.xml to /configs/conf1/currency.xml
[junit4:junit4]   2> 466805 T1106 oascc.SolrZkClient.makePath makePath: /configs/conf1/currency.xml
[junit4:junit4]   2> 466808 T1106 oasc.AbstractZkTestCase.putConfig put /mnt/ssd/jenkins/workspace/Lucene-Solr-trunk-Linux/solr/build/solr-core/test-files/solr/collection1/conf/open-exchange-rates.json to /configs/conf1/open-exchange-rates.json
[junit4:junit4]   2> 466808 T1106 oascc.SolrZkClient.makePath makePath: /configs/conf1/open-exchange-rates.json
[junit4:junit4]   2> 466810 T1106 oasc.AbstractZkTestCase.putConfig put /mnt/ssd/jenkins/workspace/Lucene-Solr-trunk-Linux/solr/build/solr-core/test-files/solr/collection1/conf/mapping-ISOLatin1Accent.txt to /configs/conf1/mapping-ISOLatin1Accent.txt
[junit4:junit4]   2> 466811 T1106 oascc.SolrZkClient.makePath makePath: /configs/conf1/mapping-ISOLatin1Accent.txt
[junit4:junit4]   2> 466813 T1106 oasc.AbstractZkTestCase.putConfig put /mnt/ssd/jenkins/workspace/Lucene-Solr-trunk-Linux/solr/build/solr-core/test-files/solr/collection1/conf/old_synonyms.txt to /configs/conf1/old_synonyms.txt
[junit4:junit4]   2> 466814 T1106 oascc.SolrZkClient.makePath makePath: /configs/conf1/old_synonyms.txt
[junit4:junit4]   2> 466816 T1106 oasc.AbstractZkTestCase.putConfig put /mnt/ssd/jenkins/workspace/Lucene-Solr-trunk-Linux/solr/build/solr-core/test-files/solr/collection1/conf/synonyms.txt to /configs/conf1/synonyms.txt
[junit4:junit4]   2> 466817 T1106 oascc.SolrZkClient.makePath makePath: /configs/conf1/synonyms.txt
[junit4:junit4]   2> 466889 T1106 oejs.Server.doStart jetty-8.1.10.v20130312
[junit4:junit4]   2> 466911 T1106 oejs.AbstractConnector.doStart Started SelectChannelConnector@127.0.0.1:53187
[junit4:junit4]   2> 466912 T1106 oass.SolrDispatchFilter.init SolrDispatchFilter.init()
[junit4:junit4]   2> 466912 T1106 oasc.SolrResourceLoader.locateSolrHome JNDI not configured for solr (NoInitialContextEx)
[junit4:junit4]   2> 466913 T1106 oasc.SolrResourceLoader.locateSolrHome using system property solr.solr.home: /mnt/ssd/jenkins/workspace/Lucene-Solr-trunk-Linux/solr/build/solr-core/test/J1/./org.apache.solr.cloud.CollectionsAPIDistributedZkTest-controljetty-1370684274386
[junit4:junit4]   2> 466913 T1106 oasc.CoreContainer$Initializer.initialize looking for solr config file: /mnt/ssd/jenkins/workspace/Lucene-Solr-trunk-Linux/solr/build/solr-core/test/J1/./org.apache.solr.cloud.CollectionsAPIDistributedZkTest-controljetty-1370684274386/solr.xml
[junit4:junit4]   2> 466914 T1106 oasc.CoreContainer.<init> New CoreContainer 4135232
[junit4:junit4]   2> 466914 T1106 oasc.CoreContainer.load Loading CoreContainer using Solr Home: '/mnt/ssd/jenkins/workspace/Lucene-Solr-trunk-Linux/solr/build/solr-core/test/J1/./org.apache.solr.cloud.CollectionsAPIDistributedZkTest-controljetty-1370684274386/'
[junit4:junit4]   2> 466915 T1106 oasc.SolrResourceLoader.<init> new SolrResourceLoader for directory: '/mnt/ssd/jenkins/workspace/Lucene-Solr-trunk-Linux/solr/build/solr-core/test/J1/./org.apache.solr.cloud.CollectionsAPIDistributedZkTest-controljetty-1370684274386/'
[junit4:junit4]   2> 466959 T1106 oasc.SolrCoreDiscoverer.walkFromHere Looking for cores in /mnt/ssd/jenkins/workspace/Lucene-Solr-trunk-Linux/solr/build/solr-core/test/J1/org.apache.solr.cloud.CollectionsAPIDistributedZkTest-controljetty-1370684274386
[junit4:junit4]   2> 466960 T1106 oasc.SolrCoreDiscoverer.walkFromHere Looking for cores in /mnt/ssd/jenkins/workspace/Lucene-Solr-trunk-Linux/solr/build/solr-core/test/J1/org.apache.solr.cloud.CollectionsAPIDistributedZkTest-controljetty-1370684274386/collection1
[junit4:junit4]   2> 466961 T1106 oasc.SolrCoreDiscoverer.walkFromHere Looking for cores in /mnt/ssd/jenkins/workspace/Lucene-Solr-trunk-Linux/solr/build/solr-core/test/J1/org.apache.solr.cloud.CollectionsAPIDistributedZkTest-controljetty-1370684274386/collection1/conf
[junit4:junit4]   2> 466969 T1106 oasc.SolrCoreDiscoverer.walkFromHere Looking for cores in /mnt/ssd/jenkins/workspace/Lucene-Solr-trunk-Linux/solr/build/solr-core/test/J1/org.apache.solr.cloud.CollectionsAPIDistributedZkTest-controljetty-1370684274386/collection1/conf/xslt
[junit4:junit4]   2> 466986 T1106 oasc.SolrCoreDiscoverer.walkFromHere Looking for cores in /mnt/ssd/jenkins/workspace/Lucene-Solr-trunk-Linux/solr/build/solr-core/test/J1/org.apache.solr.cloud.CollectionsAPIDistributedZkTest-controljetty-1370684274386/collection1/lib
[junit4:junit4]   2> 466987 T1106 oasc.SolrCoreDiscoverer.walkFromHere Looking for cores in /mnt/ssd/jenkins/workspace/Lucene-Solr-trunk-Linux/solr/build/solr-core/test/J1/org.apache.solr.cloud.CollectionsAPIDistributedZkTest-controljetty-1370684274386/collection1/lib/classes
[junit4:junit4]   2> 466988 T1106 oasc.SolrCoreDiscoverer.addCore Discovered properties file /mnt/ssd/jenkins/workspace/Lucene-Solr-trunk-Linux/solr/build/solr-core/test/J1/./org.apache.solr.cloud.CollectionsAPIDistributedZkTest-controljetty-1370684274386/conf/core.properties, adding to cores
[junit4:junit4]   2> 466990 T1106 oashc.HttpShardHandlerFactory.getParameter Setting socketTimeout to: 0
[junit4:junit4]   2> 466991 T1106 oashc.HttpShardHandlerFactory.getParameter Setting urlScheme to: http://
[junit4:junit4]   2> 466991 T1106 oashc.HttpShardHandlerFactory.getParameter Setting connTimeout to: 0
[junit4:junit4]   2> 466991 T1106 oashc.HttpShardHandlerFactory.getParameter Setting maxConnectionsPerHost to: 20
[junit4:junit4]   2> 466992 T1106 oashc.HttpShardHandlerFactory.getParameter Setting corePoolSize to: 0
[junit4:junit4]   2> 466992 T1106 oashc.HttpShardHandlerFactory.getParameter Setting maximumPoolSize to: 2147483647
[junit4:junit4]   2> 466992 T1106 oashc.HttpShardHandlerFactory.getParameter Setting maxThreadIdleTime to: 5
[junit4:junit4]   2> 466993 T1106 oashc.HttpShardHandlerFactory.getParameter Setting sizeOfQueue to: -1
[junit4:junit4]   2> 466993 T1106 oashc.HttpShardHandlerFactory.getParameter Setting fairnessPolicy to: false
[junit4:junit4]   2> 466993 T1106 oascsi.HttpClientUtil.createClient Creating new http client, config:maxConnectionsPerHost=20&maxConnections=10000&socketTimeout=0&connTimeout=0&retry=false
[junit4:junit4]   2> 466997 T1106 oasl.LogWatcher.newRegisteredLogWatcher Registering Log Listener
[junit4:junit4]   2> 466997 T1106 oasc.ZkContainer.initZooKeeper Zookeeper client=127.0.0.1:45503/solr
[junit4:junit4]   2> 466998 T1106 oasc.ZkController.checkChrootPath zkHost includes chroot
[junit4:junit4]   2> 466998 T1106 oascc.ConnectionManager.waitForConnected Waiting for client to connect to ZooKeeper
[junit4:junit4]   2> 467000 T1126 oascc.ConnectionManager.process Watcher org.apache.solr.common.cloud.ConnectionManager@5f13e9dc name:ZooKeeperConnection Watcher:127.0.0.1:45503 got event WatchedEvent state:SyncConnected type:None path:null path:null type:None
[junit4:junit4]   2> 467000 T1106 oascc.ConnectionManager.waitForConnected Client is connected to ZooKeeper
[junit4:junit4]   2> 467002 T1106 oascsi.HttpClientUtil.createClient Creating new http client, config:maxConnections=500&maxConnectionsPerHost=16&socketTimeout=120000&connTimeout=15000
[junit4:junit4]   2> 467005 T1106 oascc.ConnectionManager.waitForConnected Waiting for client to connect to ZooKeeper
[junit4:junit4]   2> 467007 T1128 oascc.ConnectionManager.process Watcher org.apache.solr.common.cloud.ConnectionManager@350bb690 name:ZooKeeperConnection Watcher:127.0.0.1:45503/solr got event WatchedEvent state:SyncConnected type:None path:null path:null type:None
[junit4:junit4]   2> 467007 T1106 oascc.ConnectionManager.waitForConnected Client is connected to ZooKeeper
[junit4:junit4]   2> 467008 T1106 oascc.SolrZkClient.makePath makePath: /overseer/queue
[junit4:junit4]   2> 467011 T1106 oascc.SolrZkClient.makePath makePath: /overseer/collection-queue-work
[junit4:junit4]   2> 467014 T1106 oascc.SolrZkClient.makePath makePath: /live_nodes
[junit4:junit4]   2> 467015 T1106 oasc.ZkController.createEphemeralLiveNode Register node as live in ZooKeeper:/live_nodes/127.0.0.1:53187_
[junit4:junit4]   2> 467016 T1106 oascc.SolrZkClient.makePath makePath: /live_nodes/127.0.0.1:53187_
[junit4:junit4]   2> 467018 T1106 oascc.SolrZkClient.makePath makePath: /overseer_elect/election
[junit4:junit4]   2> 467023 T1106 oascc.SolrZkClient.makePath makePath: /overseer_elect/leader
[junit4:junit4]   2> 467025 T1106 oasc.Overseer.start Overseer (id=89829164591480835-127.0.0.1:53187_-n_0000000000) starting
[junit4:junit4]   2> 467028 T1106 oascc.SolrZkClient.makePath makePath: /overseer/queue-work
[junit4:junit4]   2> 467031 T1130 oasc.OverseerCollectionProcessor.run Process current queue of collection creations
[junit4:junit4]   2> 467032 T1106 oascc.SolrZkClient.makePath makePath: /clusterstate.json
[junit4:junit4]   2> 467034 T1106 oascc.SolrZkClient.makePath makePath: /aliases.json
[junit4:junit4]   2> 467035 T1106 oascc.ZkStateReader.createClusterStateWatchersAndUpdate Updating cluster state from ZooKeeper... 
[junit4:junit4]   2> 467037 T1129 oasc.Overseer$ClusterStateUpdater.run Starting to work on the main queue
[junit4:junit4]   2> 467039 T1106 oass.SolrDispatchFilter.init user.dir=/mnt/ssd/jenkins/workspace/Lucene-Solr-trunk-Linux/solr/build/solr-core/test/J1
[junit4:junit4]   2> 467039 T1106 oass.SolrDispatchFilter.init SolrDispatchFilter.init() done
[junit4:junit4]   2> 467039 T1106 oascsi.HttpClientUtil.createClient Creating new http client, config:maxConnections=128&maxConnectionsPerHost=32&followRedirects=false
[junit4:junit4]   2> 467042 T1106 oascsi.HttpClientUtil.createClient Creating new http client, config:
[junit4:junit4]   2> 467043 T1106 oascc.ConnectionManager.waitForConnected Waiting for client to connect to ZooKeeper
[junit4:junit4]   2> 467045 T1133 oascc.ConnectionManager.process Watcher org.apache.solr.common.cloud.ConnectionManager@2435d059 name:ZooKeeperConnection Watcher:127.0.0.1:45503/solr got event WatchedEvent state:SyncConnected type:None path:null path:null type:None
[junit4:junit4]   2> 467045 T1106 oascc.ConnectionManager.waitForConnected Client is connected to ZooKeeper
[junit4:junit4]   2> 467046 T1106 oascc.ZkStateReader.createClusterStateWatchersAndUpdate Updating cluster state from ZooKeeper... 
[junit4:junit4]   2> 467048 T1106 oasc.ChaosMonkey.monkeyLog monkey: init - expire sessions:true cause connection loss:true
[junit4:junit4]   2> 467116 T1106 oejs.Server.doStart jetty-8.1.10.v20130312
[junit4:junit4]   2> 467118 T1106 oejs.AbstractConnector.doStart Started SelectChannelConnector@127.0.0.1:43797
[junit4:junit4]   2> 467119 T1106 oass.SolrDispatchFilter.init SolrDispatchFilter.init()
[junit4:junit4]   2> 467119 T1106 oasc.SolrResourceLoader.locateSolrHome JNDI not configured for solr (NoInitialContextEx)
[junit4:junit4]   2> 467119 T1106 oasc.SolrResourceLoader.locateSolrHome using system property solr.solr.home: /mnt/ssd/jenkins/workspace/Lucene-Solr-trunk-Linux/solr/build/solr-core/test/J1/./org.apache.solr.cloud.CollectionsAPIDistributedZkTest-jetty1-1370684274614
[junit4:junit4]   2> 467120 T1106 oasc.CoreContainer$Initializer.initialize looking for solr config file: /mnt/ssd/jenkins/workspace/Lucene-Solr-trunk-Linux/solr/build/solr-core/test/J1/./org.apache.solr.cloud.CollectionsAPIDistributedZkTest-jetty1-1370684274614/solr.xml
[junit4:junit4]   2> 467120 T1106 oasc.CoreContainer.<init> New CoreContainer 1264791409
[junit4:junit4]   2> 467121 T1106 oasc.CoreContainer.load Loading CoreContainer using Solr Home: '/mnt/ssd/jenkins/workspace/Lucene-Solr-trunk-Linux/solr/build/solr-core/test/J1/./org.apache.solr.cloud.CollectionsAPIDistributedZkTest-jetty1-1370684274614/'
[junit4:junit4]   2> 467121 T1106 oasc.SolrResourceLoader.<init> new SolrResourceLoader for directory: '/mnt/ssd/jenkins/workspace/Lucene-Solr-trunk-Linux/solr/build/solr-core/test/J1/./org.apache.solr.cloud.CollectionsAPIDistributedZkTest-jetty1-1370684274614/'
[junit4:junit4]   2> 467163 T1106 oasc.SolrCoreDiscoverer.walkFromHere Looking for cores in /mnt/ssd/jenkins/workspace/Lucene-Solr-trunk-Linux/solr/build/solr-core/test/J1/org.apache.solr.cloud.CollectionsAPIDistributedZkTest-jetty1-1370684274614
[junit4:junit4]   2> 467164 T1106 oasc.SolrCoreDiscoverer.walkFromHere Looking for cores in /mnt/ssd/jenkins/workspace/Lucene-Solr-trunk-Linux/solr/build/solr-core/test/J1/org.apache.solr.cloud.CollectionsAPIDistributedZkTest-jetty1-1370684274614/collection1
[junit4:junit4]   2> 467164 T1106 oasc.SolrCoreDiscoverer.walkFromHere Looking for cores in /mnt/ssd/jenkins/workspace/Lucene-Solr-trunk-Linux/solr/build/solr-core/test/J1/org.apache.solr.cloud.CollectionsAPIDistributedZkTest-jetty1-1370684274614/collection1/conf
[junit4:junit4]   2> 467169 T1106 oasc.SolrCoreDiscoverer.walkFromHere Looking for cores in /mnt/ssd/jenkins/workspace/Lucene-Solr-trunk-Linux/solr/build/solr-core/test/J1/org.apache.solr.cloud.CollectionsAPIDistributedZkTest-jetty1-1370684274614/collection1/conf/xslt
[junit4:junit4]   2> 467186 T1106 oasc.SolrCoreDiscoverer.walkFromHere Looking for cores in /mnt/ssd/jenkins/workspace/Lucene-Solr-trunk-Linux/solr/build/solr-core/test/J1/org.apache.solr.cloud.CollectionsAPIDistributedZkTest-jetty1-1370684274614/collection1/lib
[junit4:junit4]   2> 467187 T1106 oasc.SolrCoreDiscoverer.walkFromHere Looking for cores in /mnt/ssd/jenkins/workspace/Lucene-Solr-trunk-Linux/solr/build/solr-core/test/J1/org.apache.solr.cloud.CollectionsAPIDistributedZkTest-jetty1-1370684274614/collection1/lib/classes
[junit4:junit4]   2> 467188 T1106 oasc.SolrCoreDiscoverer.addCore Discovered properties file /mnt/ssd/jenkins/workspace/Lucene-Solr-trunk-Linux/solr/build/solr-core/test/J1/./org.apache.solr.cloud.CollectionsAPIDistributedZkTest-jetty1-1370684274614/conf/core.properties, adding to cores
[junit4:junit4]   2> 467190 T1106 oashc.HttpShardHandlerFactory.getParameter Setting socketTimeout to: 0
[junit4:junit4]   2> 467191 T1106 oashc.HttpShardHandlerFactory.getParameter Setting urlScheme to: http://
[junit4:junit4]   2> 467191 T1106 oashc.HttpShardHandlerFactory.getParameter Setting connTimeout to: 0
[junit4:junit4]   2> 467191 T1106 oashc.HttpShardHandlerFactory.getParameter Setting maxConnectionsPerHost to: 20
[junit4:junit4]   2> 467192 T1106 oashc.HttpShardHandlerFactory.getParameter Setting corePoolSize to: 0
[junit4:junit4]   2> 467192 T1106 oashc.HttpShardHandlerFactory.getParameter Setting maximumPoolSize to: 2147483647
[junit4:junit4]   2> 467192 T1106 oashc.HttpShardHandlerFactory.getParameter Setting maxThreadIdleTime to: 5
[junit4:junit4]   2> 467193 T1106 oashc.HttpShardHandlerFactory.getParameter Setting sizeOfQueue to: -1
[junit4:junit4]   2> 467193 T1106 oashc.HttpShardHandlerFactory.getParameter Setting fairnessPolicy to: false
[junit4:junit4]   2> 467193 T1106 oascsi.HttpClientUtil.createClient Creating new http client, config:maxConnectionsPerHost=20&maxConnections=10000&socketTimeout=0&connTimeout=0&retry=false
[junit4:junit4]   2> 467197 T1106 oasl.LogWatcher.newRegisteredLogWatcher Registering Log Listener
[junit4:junit4]   2> 467197 T1106 oasc.ZkContainer.initZooKeeper Zookeeper client=127.0.0.1:45503/solr
[junit4:junit4]   2> 467198 T1106 oasc.ZkController.checkChrootPath zkHost includes chroot
[junit4:junit4]   2> 467198 T1106 oascc.ConnectionManager.waitForConnected Waiting for client to connect to ZooKeeper
[junit4:junit4]   2> 467200 T1144 oascc.ConnectionManager.process Watcher org.apache.solr.common.cloud.ConnectionManager@136ef2ca name:ZooKeeperConnection Watcher:127.0.0.1:45503 got event WatchedEvent state:SyncConnected type:None path:null path:null type:None
[junit4:junit4]   2> 467201 T1106 oascc.ConnectionManager.waitForConnected Client is connected to ZooKeeper
[junit4:junit4]   2> 467203 T1106 oascsi.HttpClientUtil.createClient Creating new http client, config:maxConnections=500&maxConnectionsPerHost=16&socketTimeout=120000&connTimeout=15000
[junit4:junit4]   2> 467207 T1106 oascc.ConnectionManager.waitForConnected Waiting for client to connect to ZooKeeper
[junit4:junit4]   2> 467208 T1146 oascc.ConnectionManager.process Watcher org.apache.solr.common.cloud.ConnectionManager@7501b5b8 name:ZooKeeperConnection Watcher:127.0.0.1:45503/solr got event WatchedEvent state:SyncConnected type:None path:null path:null type:None
[junit4:junit4]   2> 467209 T1106 oascc.ConnectionManager.waitForConnected Client is connected to ZooKeeper
[junit4:junit4]   2> 467212 T1106 oascc.ZkStateReader.createClusterStateWatchersAndUpdate Updating cluster state from ZooKeeper... 
[junit4:junit4]   2> 468215 T1106 oasc.ZkController.createEphemeralLiveNode Register node as live in ZooKeeper:/live_nodes/127.0.0.1:43797_
[junit4:junit4]   2> 468216 T1106 oascc.SolrZkClient.makePath makePath: /live_nodes/127.0.0.1:43797_
[junit4:junit4]   2> 468219 T1133 oascc.ZkStateReader$3.process Updating live nodes... (2)
[junit4:junit4]   2> 468219 T1146 oascc.ZkStateReader$3.process Updating live nodes... (2)
[junit4:junit4]   2> 468219 T1128 oascc.ZkStateReader$3.process Updating live nodes... (2)
[junit4:junit4]   2> 468224 T1106 oass.SolrDispatchFilter.init user.dir=/mnt/ssd/jenkins/workspace/Lucene-Solr-trunk-Linux/solr/build/solr-core/test/J1
[junit4:junit4]   2> 468224 T1106 oass.SolrDispatchFilter.init SolrDispatchFilter.init() done
[junit4:junit4]   2> 468225 T1106 oascsi.HttpClientUtil.createClient Creating new http client, config:maxConnections=128&maxConnectionsPerHost=32&followRedirects=false
[junit4:junit4]   2> 468296 T1106 oejs.Server.doStart jetty-8.1.10.v20130312
[junit4:junit4]   2> 468298 T1106 oejs.AbstractConnector.doStart Started SelectChannelConnector@127.0.0.1:33426
[junit4:junit4]   2> 468299 T1106 oass.SolrDispatchFilter.init SolrDispatchFilter.init()
[junit4:junit4]   2> 468299 T1106 oasc.SolrResourceLoader.locateSolrHome JNDI not configured for solr (NoInitialContextEx)
[junit4:junit4]   2> 468300 T1106 oasc.SolrResourceLoader.locateSolrHome using system property solr.solr.home: /mnt/ssd/jenkins/workspace/Lucene-Solr-trunk-Linux/solr/build/solr-core/test/J1/./org.apache.solr.cloud.CollectionsAPIDistributedZkTest-jetty2-1370684275792
[junit4:junit4]   2> 468300 T1106 oasc.CoreContainer$Initializer.initialize looking for solr config file: /mnt/ssd/jenkins/workspace/Lucene-Solr-trunk-Linux/solr/build/solr-core/test/J1/./org.apache.solr.cloud.CollectionsAPIDistributedZkTest-jetty2-1370684275792/solr.xml
[junit4:junit4]   2> 468300 T1106 oasc.CoreContainer.<init> New CoreContainer 1949126450
[junit4:junit4]   2> 468301 T1106 oasc.CoreContainer.load Loading CoreContainer using Solr Home: '/mnt/ssd/jenkins/workspace/Lucene-Solr-trunk-Linux/solr/build/solr-core/test/J1/./org.apache.solr.cloud.CollectionsAPIDistributedZkTest-jetty2-1370684275792/'
[junit4:junit4]   2> 468301 T1106 oasc.SolrResourceLoader.<init> new SolrResourceLoader for directory: '/mnt/ssd/jenkins/workspace/Lucene-Solr-trunk-Linux/solr/build/solr-core/test/J1/./org.apache.solr.cloud.CollectionsAPIDistributedZkTest-jetty2-1370684275792/'
[junit4:junit4]   2> 468342 T1106 oasc.SolrCoreDiscoverer.walkFromHere Looking for cores in /mnt/ssd/jenkins/workspace/Lucene-Solr-trunk-Linux/solr/build/solr-core/test/J1/org.apache.solr.cloud.CollectionsAPIDistributedZkTest-jetty2-1370684275792
[junit4:junit4]   2> 468343 T1106 oasc.SolrCoreDiscoverer.walkFromHere Looking for cores in /mnt/ssd/jenkins/workspace/Lucene-Solr-trunk-Linux/solr/build/solr-core/test/J1/org.apache.solr.cloud.CollectionsAPIDistributedZkTest-jetty2-1370684275792/collection1
[junit4:junit4]   2> 468344 T1106 oasc.SolrCoreDiscoverer.walkFromHere Looking for cores in /mnt/ssd/jenkins/workspace/Lucene-Solr-trunk-Linux/solr/build/solr-core/test/J1/org.apache.solr.cloud.CollectionsAPIDistributedZkTest-jetty2-1370684275792/collection1/conf
[junit4:junit4]   2> 468348 T1106 oasc.SolrCoreDiscoverer.walkFromHere Looking for cores in /mnt/ssd/jenkins/workspace/Lucene-Solr-trunk-Linux/solr/build/solr-core/test/J1/org.apache.solr.cloud.CollectionsAPIDistributedZkTest-jetty2-1370684275792/collection1/conf/xslt
[junit4:junit4]   2> 468365 T1106 oasc.SolrCoreDiscoverer.walkFromHere Looking for cores in /mnt/ssd/jenkins/workspace/Lucene-Solr-trunk-Linux/solr/build/solr-core/test/J1/org.apache.solr.cloud.CollectionsAPIDistributedZkTest-jetty2-1370684275792/collection1/lib
[junit4:junit4]   2> 468366 T1106 oasc.SolrCoreDiscoverer.walkFromHere Looking for cores in /mnt/ssd/jenkins/workspace/Lucene-Solr-trunk-Linux/solr/build/solr-core/test/J1/org.apache.solr.cloud.CollectionsAPIDistributedZkTest-jetty2-1370684275792/collection1/lib/classes
[junit4:junit4]   2> 468367 T1106 oasc.SolrCoreDiscoverer.addCore Discovered properties file /mnt/ssd/jenkins/workspace/Lucene-Solr-trunk-Linux/solr/build/solr-core/test/J1/./org.apache.solr.cloud.CollectionsAPIDistributedZkTest-jetty2-1370684275792/conf/core.properties, adding to cores
[junit4:junit4]   2> 468369 T1106 oashc.HttpShardHandlerFactory.getParameter Setting socketTimeout to: 0
[junit4:junit4]   2> 468369 T1106 oashc.HttpShardHandlerFactory.getParameter Setting urlScheme to: http://
[junit4:junit4]   2> 468370 T1106 oashc.HttpShardHandlerFactory.getParameter Setting connTimeout to: 0
[junit4:junit4]   2> 468370 T1106 oashc.HttpShardHandlerFactory.getParameter Setting maxConnectionsPerHost to: 20
[junit4:junit4]   2> 468370 T1106 oashc.HttpShardHandlerFactory.getParameter Setting corePoolSize to: 0
[junit4:junit4]   2> 468371 T1106 oashc.HttpShardHandlerFactory.getParameter Setting maximumPoolSize to: 2147483647
[junit4:junit4]   2> 468371 T1106 oashc.HttpShardHandlerFactory.getParameter Setting maxThreadIdleTime to: 5
[junit4:junit4]   2> 468371 T1106 oashc.HttpShardHandlerFactory.getParameter Setting sizeOfQueue to: -1
[junit4:junit4]   2> 468372 T1106 oashc.HttpShardHandlerFactory.getParameter Setting fairnessPolicy to: false
[junit4:junit4]   2> 468372 T1106 oascsi.HttpClientUtil.createClient Creating new http client, config:maxConnectionsPerHost=20&maxConnections=10000&socketTimeout=0&connTimeout=0&retry=false
[junit4:junit4]   2> 468375 T1106 oasl.LogWatcher.newRegisteredLogWatcher Registering Log Listener
[junit4:junit4]   2> 468376 T1106 oasc.ZkContainer.initZooKeeper Zookeeper client=127.0.0.1:45503/solr
[junit4:junit4]   2> 468376 T1106 oasc.ZkController.checkChrootPath zkHost includes chroot
[junit4:junit4]   2> 468377 T1106 oascc.ConnectionManager.waitForConnected Waiting for client to connect to ZooKeeper
[junit4:junit4]   2> 468379 T1158 oascc.ConnectionManager.process Watcher org.apache.solr.common.cloud.ConnectionManager@75ab1847 name:ZooKeeperConnection Watcher:127.0.0.1:45503 got event WatchedEvent state:SyncConnected type:None path:null path:null type:None
[junit4:junit4]   2> 468379 T1106 oascc.ConnectionManager.waitForConnected Client is connected to ZooKeeper
[junit4:junit4]   2> 468381 T1106 oascsi.HttpClientUtil.createClient Creating new http client, config:maxConnections=500&maxConnectionsPerHost=16&socketTimeout=120000&connTimeout=15000
[junit4:junit4]   2> 468384 T1106 oascc.ConnectionManager.waitForConnected Waiting for client to connect to ZooKeeper
[junit4:junit4]   2> 468385 T1160 oascc.ConnectionManager.process Watcher org.apache.solr.common.cloud.ConnectionManager@d181618 name:ZooKeeperConnection Watcher:127.0.0.1:45503/solr got event WatchedEvent state:SyncConnected type:None path:null path:null type:None
[junit4:junit4]   2> 468386 T1106 oascc.ConnectionManager.waitForConnected Client is connected to ZooKeeper
[junit4:junit4]   2> 468389 T1106 oascc.ZkStateReader.createClusterStateWatchersAndUpdate Updating cluster state from ZooKeeper... 
[junit4:junit4]   2> 469392 T1106 oasc.ZkController.createEphemeralLiveNode Register node as live in ZooKeeper:/live_nodes/127.0.0.1:33426_
[junit4:junit4]   2> 469394 T1106 oascc.SolrZkClient.makePath makePath: /live_nodes/127.0.0.1:33426_
[junit4:junit4]   2> 469399 T1133 oascc.ZkStateReader$3.process Updating live nodes... (3)
[junit4:junit4]   2> 469399 T1128 oascc.ZkStateReader$3.process Updating live nodes... (3)
[junit4:junit4]   2> 469400 T1146 oascc.ZkStateReader$3.process Updating live nodes... (3)
[junit4:junit4]   2> 469400 T1160 oascc.ZkStateReader$3.process Updating live nodes... (3)
[junit4:junit4]   2> 469407 T1106 oass.SolrDispatchFilter.init user.dir=/mnt/ssd/jenkins/workspace/Lucene-Solr-trunk-Linux/solr/build/solr-core/test/J1
[junit4:junit4]   2> 469408 T1106 oass.SolrDispatchFilter.init SolrDispatchFilter.init() done
[junit4:junit4]   2> 469408 T1106 oascsi.HttpClientUtil.createClient Creating new http client, config:maxConnections=128&maxConnectionsPerHost=32&followRedirects=false
[junit4:junit4]   2> 469480 T1106 oejs.Server.doStart jetty-8.1.10.v20130312
[junit4:junit4]   2> 469482 T1106 oejs.AbstractConnector.doStart Started SelectChannelConnector@127.0.0.1:49858
[junit4:junit4]   2> 469482 T1106 oass.SolrDispatchFilter.init SolrDispatchFilter.init()
[junit4:junit4]   2> 469483 T1106 oasc.SolrResourceLoader.locateSolrHome JNDI not configured for solr (NoInitialContextEx)
[junit4:junit4]   2> 469483 T1106 oasc.SolrResourceLoader.locateSolrHome using system property solr.solr.home: /mnt/ssd/jenkins/workspace/Lucene-Solr-trunk-Linux/solr/build/solr-core/test/J1/./org.apache.solr.cloud.CollectionsAPIDistributedZkTest-jetty3-1370684276979
[junit4:junit4]   2> 469483 T1106 oasc.CoreContainer$Initializer.initialize looking for solr config file: /mnt/ssd/jenkins/workspace/Lucene-Solr-trunk-Linux/solr/build/solr-core/test/J1/./org.apache.solr.cloud.CollectionsAPIDistributedZkTest-jetty3-1370684276979/solr.xml
[junit4:junit4]   2> 469484 T1106 oasc.CoreContainer.<init> New CoreContainer 9317926
[junit4:junit4]   2> 469485 T1106 oasc.CoreContainer.load Loading CoreContainer using Solr Home: '/mnt/ssd/jenkins/workspace/Lucene-Solr-trunk-Linux/solr/build/solr-core/test/J1/./org.apache.solr.cloud.CollectionsAPIDistributedZkTest-jetty3-1370684276979/'
[junit4:junit4]   2> 469485 T1106 oasc.SolrResourceLoader.<init> new SolrResourceLoader for directory: '/mnt/ssd/jenkins/workspace/Lucene-Solr-trunk-Linux/solr/build/solr-core/test/J1/./org.apache.solr.cloud.CollectionsAPIDistributedZkTest-jetty3-1370684276979/'
[junit4:junit4]   2> 469531 T1106 oasc.SolrCoreDiscoverer.walkFromHere Looking for cores in /mnt/ssd/jenkins/workspace/Lucene-Solr-trunk-Linux/solr/build/solr-core/test/J1/org.apache.solr.cloud.CollectionsAPIDistributedZkTest-jetty3-1370684276979
[junit4:junit4]   2> 469532 T1106 oasc.SolrCoreDiscoverer.walkFromHere Looking for cores in /mnt/ssd/jenkins/workspace/Lucene-Solr-trunk-Linux/solr/build/solr-core/test/J1/org.apache.solr.cloud.CollectionsAPIDistributedZkTest-jetty3-1370684276979/collection1
[junit4:junit4]   2> 469533 T1106 oasc.SolrCoreDiscoverer.walkFromHere Looking for cores in /mnt/ssd/jenkins/workspace/Lucene-Solr-trunk-Linux/solr/build/solr-core/test/J1/org.apache.solr.cloud.CollectionsAPIDistributedZkTest-jetty3-1370684276979/collection1/conf
[junit4:junit4]   2> 469538 T1106 oasc.SolrCoreDiscoverer.walkFromHere Looking for cores in /mnt/ssd/jenkins/workspace/Lucene-Solr-trunk-Linux/solr/build/solr-core/test/J1/org.apache.solr.cloud.CollectionsAPIDistributedZkTest-jetty3-1370684276979/collection1/conf/xslt
[junit4:junit4]   2> 469555 T1106 oasc.SolrCoreDiscoverer.walkFromHere Looking for cores in /mnt/ssd/jenkins/workspace/Lucene-Solr-trunk-Linux/solr/build/solr-core/test/J1/org.apache.solr.cloud.CollectionsAPIDistributedZkTest-jetty3-1370684276979/collection1/lib
[junit4:junit4]   2> 469555 T1106 oasc.SolrCoreDiscoverer.walkFromHere Looking for cores in /mnt/ssd/jenkins/workspace/Lucene-Solr-trunk-Linux/solr/build/solr-core/test/J1/org.apache.solr.cloud.CollectionsAPIDistributedZkTest-jetty3-1370684276979/collection1/lib/classes
[junit4:junit4]   2> 469557 T1106 oasc.SolrCoreDiscoverer.addCore Discovered properties file /mnt/ssd/jenkins/workspace/Lucene-Solr-trunk-Linux/solr/build/solr-core/test/J1/./org.apache.solr.cloud.CollectionsAPIDistributedZkTest-jetty3-1370684276979/conf/core.properties, adding to cores
[junit4:junit4]   2> 469559 T1106 oashc.HttpShardHandlerFactory.getParameter Setting socketTimeout to: 0
[junit4:junit4]   2> 469559 T1106 oashc.HttpShardHandlerFactory.getParameter Setting urlScheme to: http://
[junit4:junit4]   2> 469559 T1106 oashc.HttpShardHandlerFactory.getParameter Setting connTimeout to: 0
[junit4:junit4]   2> 469560 T1106 oashc.HttpShardHandlerFactory.getParameter Setting maxConnectionsPerHost to: 20
[junit4:junit4]   2> 469560 T1106 oashc.HttpShardHandlerFactory.getParameter Setting corePoolSize to: 0
[junit4:junit4]   2> 469560 T1106 oashc.HttpShardHandlerFactory.getParameter Setting maximumPoolSize to: 2147483647
[junit4:junit4]   2> 469561 T1106 oashc.HttpShardHandlerFactory.getParameter Setting maxThreadIdleTime to: 5
[junit4:junit4]   2> 469561 T1106 oashc.HttpShardHandlerFactory.getParameter Setting sizeOfQueue to: -1
[junit4:junit4]   2> 469561 T1106 oashc.HttpShardHandlerFactory.getParameter Setting fairnessPolicy to: false
[junit4:junit4]   2> 469562 T1106 oascsi.HttpClientUtil.createClient Creating new http client, config:maxConnectionsPerHost=20&maxConnections=10000&socketTimeout=0&connTimeout=0&retry=false
[junit4:junit4]   2> 469565 T1106 oasl.LogWatcher.newRegisteredLogWatcher Registering Log Listener
[junit4:junit4]   2> 469566 T1106 oasc.ZkContainer.initZooKeeper Zookeeper client=127.0.0.1:45503/solr
[junit4:junit4]   2> 469566 T1106 oasc.ZkController.checkChrootPath zkHost includes chroot
[junit4:junit4]   2> 469567 T1106 oascc.ConnectionManager.waitForConnected Waiting for client to connect to ZooKeeper
[junit4:junit4]   2> 469568 T1172 oascc.ConnectionManager.process Watcher org.apache.solr.common.cloud.ConnectionManager@2dac3999 name:ZooKeeperConnection Watcher:127.0.0.1:45503 got event WatchedEvent state:SyncConnected type:None path:null path:null type:None
[junit4:junit4]   2> 469569 T1106 oascc.ConnectionManager.waitForConnected Client is connected to ZooKeeper
[junit4:junit4]   2> 469571 T1106 oascsi.HttpClientUtil.createClient Creating new http client, config:maxConnections=500&maxConnectionsPerHost=16&socketTimeout=120000&connTimeout=15000
[junit4:junit4]   2> 469575 T1106 oascc.ConnectionManager.waitForConnected Waiting for client to connect to ZooKeeper
[junit4:junit4]   2> 469576 T1174 oascc.ConnectionManager.process Watcher org.apache.solr.common.cloud.ConnectionManager@6dda3822 name:ZooKeeperConnection Watcher:127.0.0.1:45503/solr got event WatchedEvent state:SyncConnected type:None path:null path:null type:None
[junit4:junit4]   2> 469576 T1106 oascc.ConnectionManager.waitForConnected Client is connected to ZooKeeper
[junit4:junit4]   2> 469582 T1106 oascc.ZkStateReader.createClusterStateWatchersAndUpdate Updating cluster state from ZooKeeper... 
[junit4:junit4]   2> 470585 T1106 oasc.ZkController.createEphemeralLiveNode Register node as live in ZooKeeper:/live_nodes/127.0.0.1:49858_
[junit4:junit4]   2> 470587 T1106 oascc.SolrZkClient.makePath makePath: /live_nodes/127.0.0.1:49858_
[junit4:junit4]   2> 470591 T1146 oascc.ZkStateReader$3.process Updating live nodes... (4)
[junit4:junit4]   2> 470591 T1160 oascc.ZkStateReader$3.process Updating live nodes... (4)
[junit4:junit4]   2> 470591 T1133 oascc.ZkStateReader$3.process Updating live nodes... (4)
[junit4:junit4]   2> 470591 T1128 oascc.ZkStateReader$3.process Updating live nodes... (4)
[junit4:junit4]   2> 470592 T1174 oascc.ZkStateReader$3.process Updating live nodes... (4)
[junit4:junit4]   2> 470596 T1106 oass.SolrDispatchFilter.init user.dir=/mnt/ssd/jenkins/workspace/Lucene-Solr-trunk-Linux/solr/build/solr-core/test/J1
[junit4:junit4]   2> 470597 T1106 oass.SolrDispatchFilter.init SolrDispatchFilter.init() done
[junit4:junit4]   2> 470597 T1106 oascsi.HttpClientUtil.createClient Creating new http client, config:maxConnections=128&maxConnectionsPerHost=32&followRedirects=false
[junit4:junit4]   2> 470677 T1106 oejs.Server.doStart jetty-8.1.10.v20130312
[junit4:junit4]   2> 470680 T1106 oejs.AbstractConnector.doStart Started SelectChannelConnector@127.0.0.1:39619
[junit4:junit4]   2> 470681 T1106 oass.SolrDispatchFilter.init SolrDispatchFilter.init()
[junit4:junit4]   2> 470681 T1106 oasc.SolrResourceLoader.locateSolrHome JNDI not configured for solr (NoInitialContextEx)
[junit4:junit4]   2> 470682 T1106 oasc.SolrResourceLoader.locateSolrHome using system property solr.solr.home: /mnt/ssd/jenkins/workspace/Lucene-Solr-trunk-Linux/solr/build/solr-core/test/J1/./org.apache.solr.cloud.CollectionsAPIDistributedZkTest-jetty4-1370684278165
[junit4:junit4]   2> 470682 T1106 oasc.CoreContainer$Initializer.initialize looking for solr config file: /mnt/ssd/jenkins/workspace/Lucene-Solr-trunk-Linux/solr/build/solr-core/test/J1/./org.apache.solr.cloud.CollectionsAPIDistributedZkTest-jetty4-1370684278165/solr.xml
[junit4:junit4]   2> 470682 T1106 oasc.CoreContainer.<init> New CoreContainer 1777909627
[junit4:junit4]   2> 470683 T1106 oasc.CoreContainer.load Loading CoreContainer using Solr Home: '/mnt/ssd/jenkins/workspace/Lucene-Solr-trunk-Linux/solr/build/solr-core/test/J1/./org.apache.solr.cloud.CollectionsAPIDistributedZkTest-jetty4-1370684278165/'
[junit4:junit4]   2> 470683 T1106 oasc.SolrResourceLoader.<init> new SolrResourceLoader for directory: '/mnt/ssd/jenkins/workspace/Lucene-Solr-trunk-Linux/solr/build/solr-core/test/J1/./org.apache.solr.cloud.CollectionsAPIDistributedZkTest-jetty4-1370684278165/'
[junit4:junit4]   2> 470736 T1106 oasc.SolrCoreDiscoverer.walkFromHere Looking for cores in /mnt/ssd/jenkins/workspace/Lucene-Solr-trunk-Linux/solr/build/solr-core/test/J1/org.apache.solr.cloud.CollectionsAPIDistributedZkTest-jetty4-1370684278165
[junit4:junit4]   2> 470737 T1106 oasc.SolrCoreDiscoverer.walkFromHere Looking for cores in /mnt/ssd/jenkins/workspace/Lucene-Solr-trunk-Linux/solr/build/solr-core/test/J1/org.apache.solr.cloud.CollectionsAPIDistributedZkTest-jetty4-1370684278165/collection1
[junit4:junit4]   2> 470737 T1106 oasc.SolrCoreDiscoverer.walkFromHere Looking for cores in /mnt/ssd/jenkins/workspace/Lucene-Solr-trunk-Linux/solr/build/solr-core/test/J1/org.apache.solr.cloud.CollectionsAPIDistributedZkTest-jetty4-1370684278165/collection1/conf
[junit4:junit4]   2> 470742 T1106 oasc.SolrCoreDiscoverer.walkFromHere Looking for cores in /mnt/ssd/jenkins/workspace/Lucene-Solr-trunk-Linux/solr/build/solr-core/test/J1/org.apache.solr.cloud.CollectionsAPIDistributedZkTest-jetty4-1370684278165/collection1/conf/xslt
[junit4:junit4]   2> 470758 T1106 oasc.SolrCoreDiscoverer.walkFromHere Looking for cores in /mnt/ssd/jenkins/workspace/Lucene-Solr-trunk-Linux/solr/build/solr-core/test/J1/org.apache.solr.cloud.CollectionsAPIDistributedZkTest-jetty4-1370684278165/collection1/lib
[junit4:junit4]   2> 470759 T1106 oasc.SolrCoreDiscoverer.walkFromHere Looking for cores in /mnt/ssd/jenkins/workspace/Lucene-Solr-trunk-Linux/solr/build/solr-core/test/J1/org.apache.solr.cloud.CollectionsAPIDistributedZkTest-jetty4-1370684278165/collection1/lib/classes
[junit4:junit4]   2> 470760 T1106 oasc.SolrCoreDiscoverer.addCore Discovered properties file /mnt/ssd/jenkins/workspace/Lucene-Solr-trunk-Linux/solr/build/solr-core/test/J1/./org.apache.solr.cloud.CollectionsAPIDistributedZkTest-jetty4-1370684278165/conf/core.properties, adding to cores
[junit4:junit4]   2> 470762 T1106 oashc.HttpShardHandlerFactory.getParameter Setting socketTimeout to: 0
[junit4:junit4]   2> 470763 T1106 oashc.HttpShardHandlerFactory.getParameter Setting urlScheme to: http://
[junit4:junit4]   2> 470763 T1106 oashc.HttpShardHandlerFactory.getParameter Setting connTimeout to: 0
[junit4:junit4]   2> 470763 T1106 oashc.HttpShardHandlerFactory.getParameter Setting maxConnectionsPerHost to: 20
[junit4:junit4]   2> 470764 T1106 oashc.HttpShardHandlerFactory.getParameter Setting corePoolSize to: 0
[junit4:junit4]   2> 470764 T1106 oashc.HttpShardHandlerFactory.getParameter Setting maximumPoolSize to: 2147483647
[junit4:junit4]   2> 470764 T1106 oashc.HttpShardHandlerFactory.getParameter Setting maxThreadIdleTime to: 5
[junit4:junit4]   2> 470765 T1106 oashc.HttpShardHandlerFactory.getParameter Setting sizeOfQueue to: -1
[junit4:junit4]   2> 470765 T1106 oashc.HttpShardHandlerFactory.getParameter Setting fairnessPolicy to: false
[junit4:junit4]   2> 470765 T1106 oascsi.HttpClientUtil.createClient Creating new http client, config:maxConnectionsPerHost=20&maxConnections=10000&socketTimeout=0&connTimeout=0&retry=false
[junit4:junit4]   2> 470769 T1106 oasl.LogWatcher.newRegisteredLogWatcher Registering Log Listener
[junit4:junit4]   2> 470770 T1106 oasc.ZkContainer.initZooKeeper Zookeeper client=127.0.0.1:45503/solr
[junit4:junit4]   2> 470770 T1106 oasc.ZkController.checkChrootPath zkHost includes chroot
[junit4:junit4]   2> 470771 T1106 oascc.ConnectionManager.waitForConnected Waiting for client to connect to ZooKeeper
[junit4:junit4]   2> 470773 T1186 oascc.ConnectionManager.process Watcher org.apache.solr.common.cloud.ConnectionManager@24f51a28 name:ZooKeeperConnection Watcher:127.0.0.1:45503 got event WatchedEvent state:SyncConnected type:None path:null path:null type:None
[junit4:junit4]   2> 470774 T1106 oascc.ConnectionManager.waitForConnected Client is connected to ZooKeeper
[junit4:junit4]   2> 470776 T1106 oascsi.HttpClientUtil.createClient Creating new http client, config:maxConnections=500&maxConnectionsPerHost=16&socketTimeout=120000&connTimeout=15000
[junit4:junit4]   2> 470781 T1106 oascc.ConnectionManager.waitForConnected Waiting for client to connect to ZooKeeper
[junit4:junit4]   2> 470782 T1188 oascc.ConnectionManager.process Watcher org.apache.solr.common.cloud.ConnectionManager@3a9c384d name:ZooKeeperConnection Watcher:127.0.0.1:45503/solr got event WatchedEvent state:SyncConnected type:None path:null path:null type:None
[junit4:junit4]   2> 470783 T1106 oascc.ConnectionManager.waitForConnected Client is connected to ZooKeeper
[junit4:junit4]   2> 470786 T1106 oascc.ZkStateReader.createClusterStateWatchersAndUpdate Updating cluster state from ZooKeeper... 
[junit4:junit4]   2> 471790 T1106 oasc.ZkController.createEphemeralLiveNode Register node as live in ZooKeeper:/live_nodes/127.0.0.1:39619_
[junit4:junit4]   2> 471792 T1106 oascc.SolrZkClient.makePath makePath: /live_nodes/127.0.0.1:39619_
[junit4:junit4]   2> 471797 T1188 oascc.ZkStateReader$3.process Updating live nodes... (5)
[junit4:junit4]   2> 471797 T1160 oascc.ZkStateReader$3.process Updating live nodes... (5)
[junit4:junit4]   2> 471797 T1174 oascc.ZkStateReader$3.process Updating live nodes... (5)
[junit4:junit4]   2> 471797 T1146 oascc.ZkStateReader$3.process Updating live nodes... (5)
[junit4:junit4]   2> 471797 T1133 oascc.ZkStateReader$3.process Updating live nodes... (5)
[junit4:junit4]   2> 471797 T1128 oascc.ZkStateReader$3.process Updating live nodes... (5)
[junit4:junit4]   2> 471801 T1106 oass.SolrDispatchFilter.init user.dir=/mnt/ssd/jenkins/workspace/Lucene-Solr-trunk-Linux/solr/build/solr-core/test/J1
[junit4:junit4]   2> 471801 T1106 oass.SolrDispatchFilter.init SolrDispatchFilter.init() done
[junit4:junit4]   2> 471801 T1106 oascsi.HttpClientUtil.createClient Creating new http client, config:maxConnections=128&maxConnectionsPerHost=32&followRedirects=false
[junit4:junit4]   2> 471805 T1106 oascsi.HttpClientUtil.createClient Creating new http client, config:maxConnections=128&maxConnectionsPerHost=32&followRedirects=false
[junit4:junit4]   2> 471808 T1139 oasha.CollectionsHandler.handleCreateAction Creating Collection : numShards=2&name=nodes_used_collection&replicationFactor=2&action=CREATE&wt=javabin&version=2
[junit4:junit4]   2> 471809 T1128 oasc.DistributedQueue$LatchChildWatcher.process Watcher fired on path: /overseer/collection-queue-work state: SyncConnected type NodeChildrenChanged
[junit4:junit4]   2> 471810 T1130 oasc.OverseerCollectionProcessor.run Overseer Collection Processor: Get the message id:/overseer/collection-queue-work/qn-0000000000 message:{
[junit4:junit4]   2> 	  "operation":"createcollection",
[junit4:junit4]   2> 	  "numShards":"2",
[junit4:junit4]   2> 	  "maxShardsPerNode":null,
[junit4:junit4]   2> 	  "createNodeSet":null,
[junit4:junit4]   2> 	  "name":"nodes_used_collection",
[junit4:junit4]   2> 	  "replicationFactor":"2"}
[junit4:junit4]   2> 471811 T1130 oasc.OverseerCollectionProcessor.createCollection Creating shard nodes_used_collection_shard1_replica1 as part of slice shard1 of collection nodes_used_collection on 127.0.0.1:39619_
[junit4:junit4]   2> 471811 T1130 oasc.OverseerCollectionProcessor.createCollection Creating shard nodes_used_collection_shard1_replica2 as part of slice shard1 of collection nodes_used_collection on 127.0.0.1:49858_
[junit4:junit4]   2> 471811 T1130 oasc.OverseerCollectionProcessor.createCollection Creating shard nodes_used_collection_shard2_replica1 as part of slice shard2 of collection nodes_used_collection on 127.0.0.1:53187_
[junit4:junit4]   2> 471812 T1130 oasc.OverseerCollectionProcessor.createCollection Creating shard nodes_used_collection_shard2_replica2 as part of slice shard2 of collection nodes_used_collection on 127.0.0.1:43797_
[junit4:junit4]   2> 471813 T1180 oasc.CoreContainer.create Creating SolrCore 'nodes_used_collection_shard1_replica1' using instanceDir: /mnt/ssd/jenkins/workspace/Lucene-Solr-trunk-Linux/solr/build/solr-core/test/J1/./org.apache.solr.cloud.CollectionsAPIDistributedZkTest-jetty4-1370684278165/nodes_used_collection_shard1_replica1
[junit4:junit4]   2> 471813 T1168 oasc.CoreContainer.create Creating SolrCore 'nodes_used_collection_shard1_replica2' using instanceDir: /mnt/ssd/jenkins/workspace/Lucene-Solr-trunk-Linux/solr/build/solr-core/test/J1/./org.apache.solr.cloud.CollectionsAPIDistributedZkTest-jetty3-1370684276979/nodes_used_collection_shard1_replica2
[junit4:junit4]   2> 471814 T1168 oasc.ZkController.createCollectionZkNode Check for collection zkNode:nodes_used_collection
[junit4:junit4]   2> 471814 T1121 oasc.CoreContainer.create Creating SolrCore 'nodes_used_collection_shard2_replica1' using instanceDir: /mnt/ssd/jenkins/workspace/Lucene-Solr-trunk-Linux/solr/build/solr-core/test/J1/./org.apache.solr.cloud.CollectionsAPIDistributedZkTest-controljetty-1370684274386/nodes_used_collection_shard2_replica1
[junit4:junit4]   2> 471814 T1121 oasc.ZkController.createCollectionZkNode Check for collection zkNode:nodes_used_collection
[junit4:junit4]   2> 471815 T1168 oasc.ZkController.createCollectionZkNode Creating collection in ZooKeeper:nodes_used_collection
[junit4:junit4]   2> 471814 T1180 oasc.ZkController.createCollectionZkNode Check for collection zkNode:nodes_used_collection
[junit4:junit4]   2> 471815 T1121 oasc.ZkController.createCollectionZkNode Creating collection in ZooKeeper:nodes_used_collection
[junit4:junit4]   2> 471815 T1168 oasc.ZkController.getConfName Looking for collection configName
[junit4:junit4]   2> 471814 T1141 oasc.CoreContainer.create Creating SolrCore 'nodes_used_collection_shard2_replica2' using instanceDir: /mnt/ssd/jenkins/workspace/Lucene-Solr-trunk-Linux/solr/build/solr-core/test/J1/./org.apache.solr.cloud.CollectionsAPIDistributedZkTest-jetty1-1370684274614/nodes_used_collection_shard2_replica2
[junit4:junit4]   2> 471816 T1141 oasc.ZkController.createCollectionZkNode Check for collection zkNode:nodes_used_collection
[junit4:junit4]   2> 471816 T1180 oasc.ZkController.createCollectionZkNode Creating collection in ZooKeeper:nodes_used_collection
[junit4:junit4]   2> 471816 T1121 oasc.ZkController.getConfName Looking for collection configName
[junit4:junit4]   2> 471817 T1141 oasc.ZkController.createCollectionZkNode Creating collection in ZooKeeper:nodes_used_collection
[junit4:junit4]   2> 471817 T1180 oasc.ZkController.getConfName Looking for collection configName
[junit4:junit4]   2> 471817 T1168 oasc.ZkController.getConfName Only one config set found in zk - using it:conf1
[junit4:junit4]   2> 471818 T1121 oasc.ZkController.getConfName Only one config set found in zk - using it:conf1
[junit4:junit4]   2> 471818 T1180 oasc.ZkController.getConfName Only one config set found in zk - using it:conf1
[junit4:junit4]   2> 471817 T1141 oasc.ZkController.getConfName Looking for collection configName
[junit4:junit4]   2> 471818 T1180 oascc.SolrZkClient.makePath makePath: /collections/nodes_used_collection
[junit4:junit4]   2> 471818 T1121 oascc.SolrZkClient.makePath makePath: /collections/nodes_used_collection
[junit4:junit4]   2> 471818 T1168 oascc.SolrZkClient.makePath makePath: /collections/nodes_used_collection
[junit4:junit4]   2> 471819 T1141 oasc.ZkController.getConfName Only one config set found in zk - using it:conf1
[junit4:junit4]   2> 471820 T1141 oascc.SolrZkClient.makePath makePath: /collections/nodes_used_collection
[junit4:junit4]   2> 471821 T1121 oasc.ZkController.readConfigName Load collection config from:/collections/nodes_used_collection
[junit4:junit4]   2> 471821 T1180 oasc.ZkController.readConfigName Load collection config from:/collections/nodes_used_collection
[junit4:junit4]   2> 471821 T1168 oasc.ZkController.readConfigName Load collection config from:/collections/nodes_used_collection
[junit4:junit4]   2> 471822 T1141 oasc.ZkController.readConfigName Load collection config from:/collections/nodes_used_collection
[junit4:junit4]   2> 471822 T1121 oasc.SolrResourceLoader.<init> new SolrResourceLoader for directory: '/mnt/ssd/jenkins/workspace/Lucene-Solr-trunk-Linux/solr/build/solr-core/test/J1/./org.apache.solr.cloud.CollectionsAPIDistributedZkTest-controljetty-1370684274386/nodes_used_collection_shard2_replica1/'
[junit4:junit4]   2> 471822 T1180 oasc.SolrResourceLoader.<init> new SolrResourceLoader for directory: '/mnt/ssd/jenkins/workspace/Lucene-Solr-trunk-Linux/solr/build/solr-core/test/J1/./org.apache.solr.cloud.CollectionsAPIDistributedZkTest-jetty4-1370684278165/nodes_used_collection_shard1_replica1/'
[junit4:junit4]   2> 471825 T1168 oasc.SolrResourceLoader.<init> new SolrResourceLoader for directory: '/mnt/ssd/jenkins/workspace/Lucene-Solr-trunk-Linux/solr/build/solr-core/test/J1/./org.apache.solr.cloud.CollectionsAPIDistributedZkTest-jetty3-1370684276979/nodes_used_collection_shard1_replica2/'
[junit4:junit4]   2> 471826 T1141 oasc.SolrResourceLoader.<init> new SolrResourceLoader for directory: '/mnt/ssd/jenkins/workspace/Lucene-Solr-trunk-Linux/solr/build/solr-core/test/J1/./org.apache.solr.cloud.CollectionsAPIDistributedZkTest-jetty1-1370684274614/nodes_used_collection_shard2_replica2/'
[junit4:junit4]   2> 471893 T1121 oasc.SolrConfig.<init> Using Lucene MatchVersion: LUCENE_50
[junit4:junit4]   2> 471894 T1141 oasc.SolrConfig.<init> Using Lucene MatchVersion: LUCENE_50
[junit4:junit4]   2> 471897 T1168 oasc.SolrConfig.<init> Using Lucene MatchVersion: LUCENE_50
[junit4:junit4]   2> 471907 T1180 oasc.SolrConfig.<init> Using Lucene MatchVersion: LUCENE_50
[junit4:junit4]   2> 471931 T1121 oasc.SolrConfig.<init> Loaded SolrConfig: solrconfig.xml
[junit4:junit4]   2> 471933 T1121 oass.IndexSchema.readSchema Reading Solr Schema from schema.xml
[junit4:junit4]   2> 471936 T1168 oasc.SolrConfig.<init> Loaded SolrConfig: solrconfig.xml
[junit4:junit4]   2> 471938 T1168 oass.IndexSchema.readSchema Reading Solr Schema from schema.xml
[junit4:junit4]   2> 471940 T1121 oass.IndexSchema.readSchema [nodes_used_collection_shard2_replica1] Schema name=test
[junit4:junit4]   2> 471944 T1168 oass.IndexSchema.readSchema [nodes_used_collection_shard1_replica2] Schema name=test
[junit4:junit4]   2> 471946 T1141 oasc.SolrConfig.<init> Loaded SolrConfig: solrconfig.xml
[junit4:junit4]   2> 471946 T1180 oasc.SolrConfig.<init> Loaded SolrConfig: solrconfig.xml
[junit4:junit4]   2> 471947 T1141 oass.IndexSchema.readSchema Reading Solr Schema from schema.xml
[junit4:junit4]   2> 471948 T1180 oass.IndexSchema.readSchema Reading Solr Schema from schema.xml
[junit4:junit4]   2> 471952 T1141 oass.IndexSchema.readSchema [nodes_used_collection_shard2_replica2] Schema name=test
[junit4:junit4]   2> 471955 T1180 oass.IndexSchema.readSchema [nodes_used_collection_shard1_replica1] Schema name=test
[junit4:junit4]   2> 472446 T1180 oass.OpenExchangeRatesOrgProvider.init Initialized with rates=open-exchange-rates.json, refreshInterval=1440.
[junit4:junit4]   2> 472453 T1180 oass.IndexSchema.readSchema default search field in schema is text
[junit4:junit4]   2> 472453 T1121 oass.OpenExchangeRatesOrgProvider.init Initialized with rates=open-exchange-rates.json, refreshInterval=1440.
[junit4:junit4]   2> 472455 T1180 oass.IndexSchema.readSchema unique key field: id
[junit4:junit4]   2> 472459 T1168 oass.OpenExchangeRatesOrgProvider.init Initialized with rates=open-exchange-rates.json, refreshInterval=1440.
[junit4:junit4]   2> 472460 T1121 oass.IndexSchema.readSchema default search field in schema is text
[junit4:junit4]   2> 472463 T1121 oass.IndexSchema.readSchema unique key field: id
[junit4:junit4]   2> 472469 T1168 oass.IndexSchema.readSchema default search field in schema is text
[junit4:junit4]   2> 472473 T1180 oass.FileExchangeRateProvider.reload Reloading exchange rates from file currency.xml
[junit4:junit4]   2> 472474 T1168 oass.IndexSchema.readSchema unique key field: id
[junit4:junit4]   2> 472477 T1180 oass.FileExchangeRateProvider.reload Reloading exchange rates from file currency.xml
[junit4:junit4]   2> 472482 T1121 oass.FileExchangeRateProvider.reload Reloading exchange rates from file currency.xml
[junit4:junit4]   2> 472483 T1180 oass.OpenExchangeRatesOrgProvider.reload Reloading exchange rates from open-exchange-rates.json
[junit4:junit4]   2> 472484 T1180 oass.OpenExchangeRatesOrgProvider$OpenExchangeRates.<init> WARN Unknown key IMPORTANT NOTE
[junit4:junit4]   2> 472485 T1180 oass.OpenExchangeRatesOrgProvider$OpenExchangeRates.<init> WARN Expected key, got STRING
[junit4:junit4]   2> 472485 T1180 oass.OpenExchangeRatesOrgProvider.reload Reloading exchange rates from open-exchange-rates.json
[junit4:junit4]   2> 472486 T1180 oass.OpenExchangeRatesOrgProvider$OpenExchangeRates.<init> WARN Unknown key IMPORTANT NOTE
[junit4:junit4]   2> 472487 T1180 oass.OpenExchangeRatesOrgProvider$OpenExchangeRates.<init> WARN Expected key, got STRING
[junit4:junit4]   2> 472487 T1121 oass.FileExchangeRateProvider.reload Reloading exchange rates from file currency.xml
[junit4:junit4]   2> 472487 T1180 oasc.SolrCore.initDirectoryFactory org.apache.solr.core.MockDirectoryFactory
[junit4:junit4]   2> 472488 T1180 oasc.SolrCore.<init> [nodes_used_collection_shard1_replica1] Opening new SolrCore at /mnt/ssd/jenkins/workspace/Lucene-Solr-trunk-Linux/solr/build/solr-core/test/J1/./org.apache.solr.cloud.CollectionsAPIDistributedZkTest-jetty4-1370684278165/nodes_used_collection_shard1_replica1/, dataDir=/mnt/ssd/jenkins/workspace/Lucene-Solr-trunk-Linux/solr/build/solr-core/test/J1/./org.apache.solr.cloud.CollectionsAPIDistributedZkTest-jetty4-1370684278165/nodes_used_collection_shard1_replica1/data/
[junit4:junit4]   2> 472489 T1180 oasc.JmxMonitoredMap.<init> JMX monitoring is enabled. Adding Solr mbeans to JMX Server: com.sun.jmx.mbeanserver.JmxMBeanServer@9ef90e0
[junit4:junit4]   2> 472489 T1180 oasc.SolrCore.initDirectoryFactory org.apache.solr.core.MockDirectoryFactory
[junit4:junit4]   2> 472490 T1168 oass.FileExchangeRateProvider.reload Reloading exchange rates from file currency.xml
[junit4:junit4]   2> 472491 T1121 oass.OpenExchangeRatesOrgProvider.reload Reloading exchange rates from open-exchange-rates.json
[junit4:junit4]   2> 472490 T1180 oasc.CachingDirectoryFactory.get return new directory for /mnt/ssd/jenkins/workspace/Lucene-Solr-trunk-Linux/solr/build/solr-core/test/J1/./org.apache.solr.cloud.CollectionsAPIDistributedZkTest-jetty4-1370684278165/nodes_used_collection_shard1_replica1/data
[junit4:junit4]   2> 472491 T1180 oasc.SolrCore.getNewIndexDir New index directory detected: old=null new=/mnt/ssd/jenkins/workspace/Lucene-Solr-trunk-Linux/solr/build/solr-core/test/J1/./org.apache.solr.cloud.CollectionsAPIDistributedZkTest-jetty4-1370684278165/nodes_used_collection_shard1_replica1/data/index/
[junit4:junit4]   2> 472492 T1121 oass.OpenExchangeRatesOrgProvider$OpenExchangeRates.<init> WARN Unknown key IMPORTANT NOTE
[junit4:junit4]   2> 472492 T1180 oasc.SolrCore.initIndex WARN [nodes_used_collection_shard1_replica1] Solr index directory '/mnt/ssd/jenkins/workspace/Lucene-Solr-trunk-Linux/solr/build/solr-core/test/J1/./org.apache.solr.cloud.CollectionsAPIDistributedZkTest-jetty4-1370684278165/nodes_used_collection_shard1_replica1/data/index' doesn't exist. Creating new index...
[junit4:junit4]   2> 472493 T1121 oass.OpenExchangeRatesOrgProvider$OpenExchangeRates.<init> WARN Expected key, got STRING
[junit4:junit4]   2> 472493 T1180 oasc.CachingDirectoryFactory.get return new directory for /mnt/ssd/jenkins/workspace/Lucene-Solr-trunk-Linux/solr/build/solr-core/test/J1/./org.apache.solr.cloud.CollectionsAPIDistributedZkTest-jetty4-1370684278165/nodes_used_collection_shard1_replica1/data/index
[junit4:junit4]   2> 472494 T1121 oass.OpenExchangeRatesOrgProvider.reload Reloading exchange rates from open-exchange-rates.json
[junit4:junit4]   2> 472495 T1168 oass.FileExchangeRateProvider.reload Reloading exchange rates from file currency.xml
[junit4:junit4]   2> 472495 T1121 oass.OpenExchangeRatesOrgProvider$OpenExchangeRates.<init> WARN Unknown key IMPORTANT NOTE
[junit4:junit4]   2> 472495 T1121 oass.OpenExchangeRatesOrgProvider$OpenExchangeRates.<init> WARN Expected key, got STRING
[junit4:junit4]   2> 472495 T1180 oasc.SolrDeletionPolicy.onCommit SolrDeletionPolicy.onCommit: commits: num=1
[junit4:junit4]   2> 		commit{dir=MockDirWrapper(org.apache.lucene.store.RAMDirectory@780b1a7e lockFactory=org.apache.lucene.store.NativeFSLockFactory@41fcb2a7),segFN=segments_1,generation=1}
[junit4:junit4]   2> 472496 T1121 oasc.SolrCore.initDirectoryFactory org.apache.solr.core.MockDirectoryFactory
[junit4:junit4]   2> 472496 T1180 oasc.SolrDeletionPolicy.updateCommits newest commit generation = 1
[junit4:junit4]   2> 472497 T1121 oasc.SolrCore.<init> [nodes_used_collection_shard2_replica1] Opening new SolrCore at /mnt/ssd/jenkins/workspace/Lucene-Solr-trunk-Linux/solr/build/solr-core/test/J1/./org.apache.solr.cloud.CollectionsAPIDistributedZkTest-controljetty-1370684274386/nodes_used_collection_shard2_replica1/, dataDir=/mnt/ssd/jenkins/workspace/Lucene-Solr-trunk-Linux/solr/build/solr-core/test/J1/./org.apache.solr.cloud.CollectionsAPIDistributedZkTest-controljetty-1370684274386/nodes_used_collection_shard2_replica1/data/
[junit4:junit4]   2> 472497 T1121 oasc.JmxMonitoredMap.<init> JMX monitoring is enabled. Adding Solr mbeans to JMX Server: com.sun.jmx.mbeanserver.JmxMBeanServer@9ef90e0
[junit4:junit4]   2> 472498 T1121 oasc.SolrCore.initDirectoryFactory org.apache.solr.core.MockDirectoryFactory
[junit4:junit4]   2> 472499 T1180 oasup.UpdateRequestProcessorChain.init inserting DistributedUpdateProcessorFactory into updateRequestProcessorChain "dedupe"
[junit4:junit4]   2> 472499 T1121 oasc.CachingDirectoryFactory.get return new directory for /mnt/ssd/jenkins/workspace/Lucene-Solr-trunk-Linux/solr/build/solr-core/test/J1/./org.apache.solr.cloud.CollectionsAPIDistributedZkTest-controljetty-1370684274386/nodes_used_collection_shard2_replica1/data
[junit4:junit4]   2> 472499 T1168 oass.OpenExchangeRatesOrgProvider.reload Reloading exchange rates from open-exchange-rates.json
[junit4:junit4]   2> 472499 T1121 oasc.SolrCore.getNewIndexDir New index directory detected: old=null new=/mnt/ssd/jenkins/workspace/Lucene-Solr-trunk-Linux/solr/build/solr-core/test/J1/./org.apache.solr.cloud.CollectionsAPIDistributedZkTest-controljetty-1370684274386/nodes_used_collection_shard2_replica1/data/index/
[junit4:junit4]   2> 472500 T1121 oasc.SolrCore.initIndex WARN [nodes_used_collection_shard2_replica1] Solr index directory '/mnt/ssd/jenkins/workspace/Lucene-Solr-trunk-Linux/solr/build/solr-core/test/J1/./org.apache.solr.cloud.CollectionsAPIDistributedZkTest-controljetty-1370684274386/nodes_used_collection_shard2_replica1/data/index' doesn't exist. Creating new index...
[junit4:junit4]   2> 472499 T1180 oasup.UpdateRequestProcessorChain.init inserting DistributedUpdateProcessorFactory into updateRequestProcessorChain "stored_sig"
[junit4:junit4]   2> 472500 T1121 oasc.CachingDirectoryFactory.get return new directory for /mnt/ssd/jenkins/workspace/Lucene-Solr-trunk-Linux/solr/build/solr-core/test/J1/./org.apache.solr.cloud.CollectionsAPIDistributedZkTest-controljetty-1370684274386/nodes_used_collection_shard2_replica1/data/index
[junit4:junit4]   2> 472500 T1168 oass.OpenExchangeRatesOrgProvider$OpenExchangeRates.<init> WARN Unknown key IMPORTANT NOTE
[junit4:junit4]   2> 472501 T1168 oass.OpenExchangeRatesOrgProvider$OpenExchangeRates.<init> WARN Expected key, got STRING
[junit4:junit4]   2> 472501 T1180 oasup.UpdateRequestProcessorChain.init inserting DistributedUpdateProcessorFactory into updateRequestProcessorChain "distrib-dup-test-chain-implicit"
[junit4:junit4]   2> 472502 T1168 oass.OpenExchangeRatesOrgProvider.reload Reloading exchange rates from open-exchange-rates.json
[junit4:junit4]   2> 472502 T1180 oasc.RequestHandlers.initHandlersFromConfig created standard: solr.StandardRequestHandler
[junit4:junit4]   2> 472503 T1121 oasc.SolrDeletionPolicy.onCommit SolrDeletionPolicy.onCommit: commits: num=1
[junit4:junit4]   2> 		commit{dir=MockDirWrapper(org.apache.lucene.store.RAMDirectory@1d75d44f lockFactory=org.apache.lucene.store.NativeFSLockFactory@1e41b070),segFN=segments_1,generation=1}
[junit4:junit4]   2> 472503 T1180 oasc.RequestHandlers.initHandlersFromConfig created /get: solr.RealTimeGetHandler
[junit4:junit4]   2> 472503 T1180 oasc.RequestHandlers.initHandlersFromConfig adding lazy requestHandler: solr.ReplicationHandler
[junit4:junit4]   2> 472503 T1168 oass.OpenExchangeRatesOrgProvider$OpenExchangeRates.<init> WARN Unknown key IMPORTANT NOTE
[junit4:junit4]   2> 472504 T1168 oass.OpenExchangeRatesOrgProvider$OpenExchangeRates.<init> WARN Expected key, got STRING
[junit4:junit4]   2> 472504 T1180 oasc.RequestHandlers.initHandlersFromConfig created /replication: solr.ReplicationHandler
[junit4:junit4]   2> 472503 T1121 oasc.SolrDeletionPolicy.updateCommits newest commit generation = 1
[junit4:junit4]   2> 472505 T1180 oasc.RequestHandlers.initHandlersFromConfig created /update: solr.UpdateRequestHandler
[junit4:junit4]   2> 472504 T1141 oass.OpenExchangeRatesOrgProvider.init Initialized with rates=open-exchange-rates.json, refreshInterval=1440.
[junit4:junit4]   2> 472504 T1168 oasc.SolrCore.initDirectoryFactory org.apache.solr.core.MockDirectoryFactory
[junit4:junit4]   2> 472505 T1180 oasc.RequestHandlers.initHandlersFromConfig created /admin/: org.apache.solr.handler.admin.AdminHandlers
[junit4:junit4]   2> 472506 T1168 oasc.SolrCore.<init> [nodes_used_collection_shard1_replica2] Opening new SolrCore at /mnt/ssd/jenkins/workspace/Lucene-Solr-trunk-Linux/solr/build/solr-core/test/J1/./org.apache.solr.cloud.CollectionsAPIDistributedZkTest-jetty3-1370684276979/nodes_used_collection_shard1_replica2/, dataDir=/mnt/ssd/jenkins/workspace/Lucene-Solr-trunk-Linux/solr/build/solr-core/test/J1/./org.apache.solr.cloud.CollectionsAPIDistributedZkTest-jetty3-1370684276979/nodes_used_collection_shard1_replica2/data/
[junit4:junit4]   2> 472507 T1168 oasc.JmxMonitoredMap.<init> JMX monitoring is enabled. Adding Solr mbeans to JMX Server: com.sun.jmx.mbeanserver.JmxMBeanServer@9ef90e0
[junit4:junit4]   2> 472507 T1121 oasup.UpdateRequestProcessorChain.init inserting DistributedUpdateProcessorFactory into updateRequestProcessorChain "dedupe"
[junit4:junit4]   2> 472507 T1168 oasc.SolrCore.initDirectoryFactory org.apache.solr.core.MockDirectoryFactory
[junit4:junit4]   2> 472507 T1121 oasup.UpdateRequestProcessorChain.init inserting DistributedUpdateProcessorFactory into updateRequestProcessorChain "stored_sig"
[junit4:junit4]   2> 472508 T1168 oasc.CachingDirectoryFactory.get return new directory for /mnt/ssd/jenkins/workspace/Lucene-Solr-trunk-Linux/solr/build/solr-core/test/J1/./org.apache.solr.cloud.CollectionsAPIDistributedZkTest-jetty3-1370684276979/nodes_used_collection_shard1_replica2/data
[junit4:junit4]   2> 472508 T1168 oasc.SolrCore.getNewIndexDir New index directory detected: old=null new=/mnt/ssd/jenkins/workspace/Lucene-Solr-trunk-Linux/solr/build/solr-core/test/J1/./org.apache.solr.cloud.CollectionsAPIDistributedZkTest-jetty3-1370684276979/nodes_used_collection_shard1_replica2/data/index/
[junit4:junit4]   2> 472508 T1121 oasup.UpdateRequestProcessorChain.init inserting DistributedUpdateProcessorFactory into updateRequestProcessorChain "distrib-dup-test-chain-implicit"
[junit4:junit4]   2> 472509 T1168 oasc.SolrCore.initIndex WARN [nodes_used_collection_shard1_replica2] Solr index directory '/mnt/ssd/jenkins/workspace/Lucene-Solr-trunk-Linux/solr/build/solr-core/test/J1/./org.apache.solr.cloud.CollectionsAPIDistributedZkTest-jetty3-1370684276979/nodes_used_collection_shard1_replica2/data/index' doesn't exist. Creating new index...
[junit4:junit4]   2> 472509 T1121 oasc.RequestHandlers.initHandlersFromConfig created standard: solr.StandardRequestHandler
[junit4:junit4]   2> 472509 T1168 oasc.CachingDirectoryFactory.get return new directory for /mnt/ssd/jenkins/workspace/Lucene-Solr-trunk-Linux/solr/build/solr-core/test/J1/./org.apache.solr.cloud.CollectionsAPIDistributedZkTest-jetty3-1370684276979/nodes_used_collection_shard1_replica2/data/index
[junit4:junit4]   2> 472510 T1121 oasc.RequestHandlers.initHandlersFromConfig created /get: solr.RealTimeGetHandler
[junit4:junit4]   2> 472510 T1121 oasc.RequestHandlers.initHandlersFromConfig adding lazy requestHandler: solr.ReplicationHandler
[junit4:junit4]   2> 472511 T1121 oasc.RequestHandlers.initHandlersFromConfig created /replication: solr.ReplicationHandler
[junit4:junit4]   2> 472511 T1180 oashl.XMLLoader.init xsltCacheLifetimeSeconds=60
[junit4:junit4]   2> 472512 T1141 oass.IndexSchema.readSchema default search field in schema is text
[junit4:junit4]   2> 472512 T1121 oasc.RequestHandlers.initHandlersFromConfig created /update: solr.UpdateRequestHandler
[junit4:junit4]   2> 472511 T1168 oasc.SolrDeletionPolicy.onCommit SolrDeletionPolicy.onCommit: commits: num=1
[junit4:junit4]   2> 		commit{dir=MockDirWrapper(org.apache.lucene.store.RAMDirectory@144fe407 lockFactory=org.apache.lucene.store.NativeFSLockFactory@15470e9a),segFN=segments_1,generation=1}
[junit4:junit4]   2> 472513 T1121 oasc.RequestHandlers.initHandlersFromConfig created /admin/: org.apache.solr.handler.admin.AdminHandlers
[junit4:junit4]   2> 472514 T1168 oasc.SolrDeletionPolicy.updateCommits newest commit generation = 1
[junit4:junit4]   2> 472515 T1180 oass.SolrIndexSearcher.<init> Opening Searcher@193ff313 main
[junit4:junit4]   2> 472515 T1180 oasu.UpdateHandler.clearLog Clearing tlog files, tlogDir=/mnt/ssd/jenkins/workspace/Lucene-Solr-trunk-Linux/solr/build/solr-core/test/J1/./org.apache.solr.cloud.CollectionsAPIDistributedZkTest-jetty4-1370684278165/nodes_used_collection_shard1_replica1/data/tlog
[junit4:junit4]   2> 472516 T1168 oasup.UpdateRequestProcessorChain.init inserting DistributedUpdateProcessorFactory into updateRequestProcessorChain "dedupe"
[junit4:junit4]   2> 472516 T1180 oasu.CommitTracker.<init> Hard AutoCommit: disabled
[junit4:junit4]   2> 472517 T1180 oasu.CommitTracker.<init> Soft AutoCommit: disabled
[junit4:junit4]   2> 472516 T1141 oass.IndexSchema.readSchema unique key field: id
[junit4:junit4]   2> 472516 T1168 oasup.UpdateRequestProcessorChain.init inserting DistributedUpdateProcessorFactory into updateRequestProcessorChain "stored_sig"
[junit4:junit4]   2> 472518 T1121 oashl.XMLLoader.init xsltCacheLifetimeSeconds=60
[junit4:junit4]   2> 472518 T1168 oasup.UpdateRequestProcessorChain.init inserting DistributedUpdateProcessorFactory into updateRequestProcessorChain "distrib-dup-test-chain-implicit"
[junit4:junit4]   2> 472520 T1168 oasc.RequestHandlers.initHandlersFromConfig created standard: solr.StandardRequestHandler
[junit4:junit4]   2> 472521 T1168 oasc.RequestHandlers.initHandlersFromConfig created /get: solr.RealTimeGetHandler
[junit4:junit4]   2> 472521 T1121 oass.SolrIndexSearcher.<init> Opening Searcher@6a8c73d3 main
[junit4:junit4]   2> 472522 T1194 oasc.SolrCore.registerSearcher [nodes_used_collection_shard1_replica1] Registered new searcher Searcher@193ff313 main{StandardDirectoryReader(segments_1:1)}
[junit4:junit4]   2> 472521 T1168 oasc.RequestHandlers.initHandlersFromConfig adding lazy requestHandler: solr.ReplicationHandler
[junit4:junit4]   2> 472522 T1121 oasu.UpdateHandler.clearLog Clearing tlog files, tlogDir=/mnt/ssd/jenkins/workspace/Lucene-Solr-trunk-Linux/solr/build/solr-core/test/J1/./org.apache.solr.cloud.CollectionsAPIDistributedZkTest-controljetty-1370684274386/nodes_used_collection_shard2_replica1/data/tlog
[junit4:junit4]   2> 472523 T1168 oasc.RequestHandlers.initHandlersFromConfig created /replication: solr.ReplicationHandler
[junit4:junit4]   2> 472524 T1121 oasu.CommitTracker.<init> Hard AutoCommit: disabled
[junit4:junit4]   2> 472523 T1180 oasc.ZkController.publish publishing core=nodes_used_collection_shard1_replica1 state=down
[junit4:junit4]   2> 472524 T1121 oasu.CommitTracker.<init> Soft AutoCommit: disabled
[junit4:junit4]   2> 472524 T1168 oasc.RequestHandlers.initHandlersFromConfig created /update: solr.UpdateRequestHandler
[junit4:junit4]   2> 472525 T1168 oasc.RequestHandlers.initHandlersFromConfig created /admin/: org.apache.solr.handler.admin.AdminHandlers
[junit4:junit4]   2> 472528 T1195 oasc.SolrCore.registerSearcher [nodes_used_collection_shard2_replica1] Registered new searcher Searcher@6a8c73d3 main{StandardDirectoryReader(segments_1:1)}
[junit4:junit4]   2> 472528 T1168 oashl.XMLLoader.init xsltCacheLifetimeSeconds=60
[junit4:junit4]   2> 472529 T1121 oasc.ZkController.publish publishing core=nodes_used_collection_shard2_replica1 state=down
[junit4:junit4]   2> 472531 T1168 oass.SolrIndexSearcher.<init> Opening Searcher@61466453 main
[junit4:junit4]   2> 472531 T1168 oasu.UpdateHandler.clearLog Clearing tlog files, tlogDir=/mnt/ssd/jenkins/workspace/Lucene-Solr-trunk-Linux/solr/build/solr-core/test/J1/./org.apache.solr.cloud.CollectionsAPIDistributedZkTest-jetty3-1370684276979/nodes_used_collection_shard1_replica2/data/tlog
[junit4:junit4]   2> 472532 T1168 oasu.CommitTracker.<init> Hard AutoCommit: disabled
[junit4:junit4]   2> 472532 T1168 oasu.CommitTracker.<init> Soft AutoCommit: disabled
[junit4:junit4]   2> 472535 T1196 oasc.SolrCore.registerSearcher [nodes_used_collection_shard1_replica2] Registered new searcher Searcher@61466453 main{StandardDirectoryReader(segments_1:1)}
[junit4:junit4]   2> 472536 T1168 oasc.ZkController.publish publishing core=nodes_used_collection_shard1_replica2 state=down
[junit4:junit4]   2> 472539 T1141 oass.FileExchangeRateProvider.reload Reloading exchange rates from file currency.xml
[junit4:junit4]   2> 472544 T1141 oass.FileExchangeRateProvider.reload Reloading exchange rates from file currency.xml
[junit4:junit4]   2> 472548 T1141 oass.OpenExchangeRatesOrgProvider.reload Reloading exchange rates from open-exchange-rates.json
[junit4:junit4]   2> 472549 T1141 oass.OpenExchangeRatesOrgProvider$OpenExchangeRates.<init> WARN Unknown key IMPORTANT NOTE
[junit4:junit4]   2> 472549 T1141 oass.OpenExchangeRatesOrgProvider$OpenExchangeRates.<init> WARN Expected key, got STRING
[junit4:junit4]   2> 472549 T1141 oass.OpenExchangeRatesOrgProvider.reload Reloading exchange rates from open-exchange-rates.json
[junit4:junit4]   2> 472551 T1141 oass.OpenExchangeRatesOrgProvider$OpenExchangeRates.<init> WARN Unknown key IMPORTANT NOTE
[junit4:junit4]   2> 472551 T1141 oass.OpenExchangeRatesOrgProvider$OpenExchangeRates.<init> WARN Expected key, got STRING
[junit4:junit4]   2> 472551 T1141 oasc.SolrCore.initDirectoryFactory org.apache.solr.core.MockDirectoryFactory
[junit4:junit4]   2> 472552 T1141 oasc.SolrCore.<init> [nodes_used_collection_shard2_replica2] Opening new SolrCore at /mnt/ssd/jenkins/workspace/Lucene-Solr-trunk-Linux/solr/build/solr-core/test/J1/./org.apache.solr.cloud.CollectionsAPIDistributedZkTest-jetty1-1370684274614/nodes_used_collection_shard2_replica2/, dataDir=/mnt/ssd/jenkins/workspace/Lucene-Solr-trunk-Linux/solr/build/solr-core/test/J1/./org.apache.solr.cloud.CollectionsAPIDistributedZkTest-jetty1-1370684274614/nodes_used_collection_shard2_replica2/data/
[junit4:junit4]   2> 472552 T1141 oasc.JmxMonitoredMap.<init> JMX monitoring is enabled. Adding Solr mbeans to JMX Server: com.sun.jmx.mbeanserver.JmxMBeanServer@9ef90e0
[junit4:junit4]   2> 472552 T1141 oasc.SolrCore.initDirectoryFactory org.apache.solr.core.MockDirectoryFactory
[junit4:junit4]   2> 472553 T1141 oasc.CachingDirectoryFactory.get return new directory for /mnt/ssd/jenkins/workspace/Lucene-Solr-trunk-Linux/solr/build/solr-core/test/J1/./org.apache.solr.cloud.CollectionsAPIDistributedZkTest-jetty1-1370684274614/nodes_used_collection_shard2_replica2/data
[junit4:junit4]   2> 472553 T1141 oasc.SolrCore.getNewIndexDir New index directory detected: old=null new=/mnt/ssd/jenkins/workspace/Lucene-Solr-trunk-Linux/solr/build/solr-core/test/J1/./org.apache.solr.cloud.CollectionsAPIDistributedZkTest-jetty1-1370684274614/nodes_used_collection_shard2_replica2/data/index/
[junit4:junit4]   2> 472554 T1141 oasc.SolrCore.initIndex WARN [nodes_used_collection_shard2_replica2] Solr index directory '/mnt/ssd/jenkins/workspace/Lucene-Solr-trunk-Linux/solr/build/solr-core/test/J1/./org.apache.solr.cloud.CollectionsAPIDistributedZkTest-jetty1-1370684274614/nodes_used_collection_shard2_replica2/data/index' doesn't exist. Creating new index...
[junit4:junit4]   2> 472554 T1141 oasc.CachingDirectoryFactory.get return new directory for /mnt/ssd/jenkins/workspace/Lucene-Solr-trunk-Linux/solr/build/solr-core/test/J1/./org.apache.solr.cloud.CollectionsAPIDistributedZkTest-jetty1-1370684274614/nodes_used_collection_shard2_replica2/data/index
[junit4:junit4]   2> 472556 T1141 oasc.SolrDeletionPolicy.onCommit SolrDeletionPolicy.onCommit: commits: num=1
[junit4:junit4]   2> 		commit{dir=MockDirWrapper(org.apache.lucene.store.RAMDirectory@3a587fe7 lockFactory=org.apache.lucene.store.NativeFSLockFactory@252ab80d),segFN=segments_1,generation=1}
[junit4:junit4]   2> 472556 T1141 oasc.SolrDeletionPolicy.updateCommits newest commit generation = 1
[junit4:junit4]   2> 472558 T1141 oasup.UpdateRequestProcessorChain.init inserting DistributedUpdateProcessorFactory into updateRequestProcessorChain "dedupe"
[junit4:junit4]   2> 472558 T1141 oasup.UpdateRequestProcessorChain.init inserting DistributedUpdateProcessorFactory into updateRequestProcessorChain "stored_sig"
[junit4:junit4]   2> 472559 T1141 oasup.UpdateRequestProcessorChain.init inserting DistributedUpdateProcessorFactory into updateRequestProcessorChain "distrib-dup-test-chain-implicit"
[junit4:junit4]   2> 472559 T1141 oasc.RequestHandlers.initHandlersFromConfig created standard: solr.StandardRequestHandler
[junit4:junit4]   2> 472560 T1141 oasc.RequestHandlers.initHandlersFromConfig created /get: solr.RealTimeGetHandler
[junit4:junit4]   2> 472560 T1141 oasc.RequestHandlers.initHandlersFromConfig adding lazy requestHandler: solr.ReplicationHandler
[junit4:junit4]   2> 472561 T1141 oasc.RequestHandlers.initHandlersFromConfig created /replication: solr.ReplicationHandler
[junit4:junit4]   2> 472561 T1141 oasc.RequestHandlers.initHandlersFromConfig created /update: solr.UpdateRequestHandler
[junit4:junit4]   2> 472561 T1141 oasc.RequestHandlers.initHandlersFromConfig created /admin/: org.apache.solr.handler.admin.AdminHandlers
[junit4:junit4]   2> 472564 T1141 oashl.XMLLoader.init xsltCacheLifetimeSeconds=60
[junit4:junit4]   2> 472567 T1141 oass.SolrIndexSearcher.<init> Opening Searcher@f8b3a65 main
[junit4:junit4]   2> 472567 T1141 oasu.UpdateHandler.clearLog Clearing tlog files, tlogDir=/mnt/ssd/jenkins/workspace/Lucene-Solr-trunk-Linux/solr/build/solr-core/test/J1/./org.apache.solr.cloud.CollectionsAPIDistributedZkTest-jetty1-1370684274614/nodes_used_collection_shard2_replica2/data/tlog
[junit4:junit4]   2> 472568 T1141 oasu.CommitTracker.<init> Hard AutoCommit: disabled
[junit4:junit4]   2> 472568 T1141 oasu.CommitTracker.<init> Soft AutoCommit: disabled
[junit4:junit4]   2> 472572 T1197 oasc.SolrCore.registerSearcher [nodes_used_collection_shard2_replica2] Registered new searcher Searcher@f8b3a65 main{StandardDirectoryReader(segments_1:1)}
[junit4:junit4]   2> 472573 T1141 oasc.ZkController.publish publishing core=nodes_used_collection_shard2_replica2 state=down
[junit4:junit4]   2> 473046 T1129 oascc.ZkStateReader.updateClusterState Updating cloud state from ZooKeeper... 
[junit4:junit4]   2> 473047 T1129 oasc.Overseer$ClusterStateUpdater.updateState Update state numShards=2 message={
[junit4:junit4]   2> 	  "operation":"state",
[junit4:junit4]   2> 	  "core_node_name":null,
[junit4:junit4]   2> 	  "numShards":"2",
[junit4:junit4]   2> 	  "shard":"shard1",
[junit4:junit4]   2> 	  "roles":null,
[junit4:junit4]   2> 	  "state":"down",
[junit4:junit4]   2> 	  "shard_state":"active",
[junit4:junit4]   2> 	  "core":"nodes_used_collection_shard1_replica1",
[junit4:junit4]   2> 	  "collection":"nodes_used_collection",
[junit4:junit4]   2> 	  "shard_range":null,
[junit4:junit4]   2> 	  "node_name":"127.0.0.1:39619_",
[junit4:junit4]   2> 	  "base_url":"http://127.0.0.1:39619"}
[junit4:junit4]   2> 473048 T1129 oasc.Overseer$ClusterStateUpdater.createCollection Create collection nodes_used_collection with numShards 2
[junit4:junit4]   2> 473052 T1129 oasc.Overseer$ClusterStateUpdater.updateState Update state numShards=2 message={
[junit4:junit4]   2> 	  "operation":"state",
[junit4:junit4]   2> 	  "core_node_name":null,
[junit4:junit4]   2> 	  "numShards":"2",
[junit4:junit4]   2> 	  "shard":"shard2",
[junit4:junit4]   2> 	  "roles":null,
[junit4:junit4]   2> 	  "state":"down",
[junit4:junit4]   2> 	  "shard_state":"active",
[junit4:junit4]   2> 	  "core":"nodes_used_collection_shard2_replica1",
[junit4:junit4]   2> 	  "collection":"nodes_used_collection",
[junit4:junit4]   2> 	  "shard_range":null,
[junit4:junit4]   2> 	  "node_name":"127.0.0.1:53187_",
[junit4:junit4]   2> 	  "base_url":"http://127.0.0.1:53187"}
[junit4:junit4]   2> 473057 T1129 oasc.Overseer$ClusterStateUpdater.updateState Update state numShards=2 message={
[junit4:junit4]   2> 	  "operation":"state",
[junit4:junit4]   2> 	  "core_node_name":null,
[junit4:junit4]   2> 	  "numShards":"2",
[junit4:junit4]   2> 	  "shard":"shard1",
[junit4:junit4]   2> 	  "roles":null,
[junit4:junit4]   2> 	  "state":"down",
[junit4:junit4]   2> 	  "shard_state":"active",
[junit4:junit4]   2> 	  "core":"nodes_used_collection_shard1_replica2",
[junit4:junit4]   2> 	  "collection":"nodes_used_collection",
[junit4:junit4]   2> 	  "shard_range":null,
[junit4:junit4]   2> 	  "node_name":"127.0.0.1:49858_",
[junit4:junit4]   2> 	  "base_url":"http://127.0.0.1:49858"}
[junit4:junit4]   2> 473061 T1129 oasc.Overseer$ClusterStateUpdater.updateState Update state numShards=2 message={
[junit4:junit4]   2> 	  "operation":"state",
[junit4:junit4]   2> 	  "core_node_name":null,
[junit4:junit4]   2> 	  "numShards":"2",
[junit4:junit4]   2> 	  "shard":"shard2",
[junit4:junit4]   2> 	  "roles":null,
[junit4:junit4]   2> 	  "state":"down",
[junit4:junit4]   2> 	  "shard_state":"active",
[junit4:junit4]   2> 	  "core":"nodes_used_collection_shard2_replica2",
[junit4:junit4]   2> 	  "collection":"nodes_used_collection",
[junit4:junit4]   2> 	  "shard_range":null,
[junit4:junit4]   2> 	  "node_name":"127.0.0.1:43797_",
[junit4:junit4]   2> 	  "base_url":"http://127.0.0.1:43797"}
[junit4:junit4]   2> 473066 T1128 oascc.ZkStateReader$2.process A cluster state change: WatchedEvent state:SyncConnected type:NodeDataChanged path:/clusterstate.json, has occurred - updating... (live nodes size: 5)
[junit4:junit4]   2> 473066 T1146 oascc.ZkStateReader$2.process A cluster state change: WatchedEvent state:SyncConnected type:NodeDataChanged path:/clusterstate.json, has occurred - updating... (live nodes size: 5)
[junit4:junit4]   2> 473066 T1174 oascc.ZkStateReader$2.process A cluster state change: WatchedEvent state:SyncConnected type:NodeDataChanged path:/clusterstate.json, has occurred - updating... (live nodes size: 5)
[junit4:junit4]   2> 473066 T1160 oascc.ZkStateReader$2.process A cluster state change: WatchedEvent state:SyncConnected type:NodeDataChanged path:/clusterstate.json, has occurred - updating... (live nodes size: 5)
[junit4:junit4]   2> 473066 T1133 oascc.ZkStateReader$2.process A cluster state change: WatchedEvent state:SyncConnected type:NodeDataChanged path:/clusterstate.json, has occurred - updating... (live nodes size: 5)
[junit4:junit4]   2> 473068 T1188 oascc.ZkStateReader$2.process A cluster state change: WatchedEvent state:SyncConnected type:NodeDataChanged path:/clusterstate.json, has occurred - updating... (live nodes size: 5)
[junit4:junit4]   2> 473526 T1180 oasc.CoreContainer.registerCore registering core: nodes_used_collection_shard1_replica1
[junit4:junit4]   2> 473527 T1180 oasc.ZkController.register Register replica - core:nodes_used_collection_shard1_replica1 address:http://127.0.0.1:39619 collection:nodes_used_collection shard:shard1
[junit4:junit4]   2> 473528 T1180 oascc.SolrZkClient.makePath makePath: /collections/nodes_used_collection/leader_elect/shard1/election
[junit4:junit4]   2> 473533 T1121 oasc.CoreContainer.registerCore registering core: nodes_used_collection_shard2_replica1
[junit4:junit4]   2> 473533 T1121 oasc.ZkController.register Register replica - core:nodes_used_collection_shard2_replica1 address:http://127.0.0.1:53187 collection:nodes_used_collection shard:shard2
[junit4:junit4]   2> 473534 T1121 oascc.SolrZkClient.makePath makePath: /collections/nodes_used_collection/leader_elect/shard2/election
[junit4:junit4]   2> 473537 T1180 oasc.ShardLeaderElectionContext.runLeaderProcess Running the leader process.
[junit4:junit4]   2> 473537 T1168 oasc.CoreContainer.registerCore registering core: nodes_used_collection_shard1_replica2
[junit4:junit4]   2> 473538 T1168 oasc.ZkController.register Register replica - core:nodes_used_collection_shard1_replica2 address:http://127.0.0.1:49858 collection:nodes_used_collection shard:shard1
[junit4:junit4]   2> 473539 T1180 oasc.ShardLeaderElectionContext.waitForReplicasToComeUp Enough replicas found to continue.
[junit4:junit4]   2> 473539 T1180 oasc.ShardLeaderElectionContext.runLeaderProcess I may be the new leader - try and sync
[junit4:junit4]   2> 473540 T1180 oasc.SyncStrategy.sync Sync replicas to http://127.0.0.1:39619/nodes_used_collection_shard1_replica1/
[junit4:junit4]   2> 473540 T1180 oasu.PeerSync.sync PeerSync: core=nodes_used_collection_shard1_replica1 url=http://127.0.0.1:39619 START replicas=[http://127.0.0.1:49858/nodes_used_collection_shard1_replica2/] nUpdates=100
[junit4:junit4]   2> 473540 T1121 oasc.ShardLeaderElectionContext.runLeaderProcess Running the leader process.
[junit4:junit4]   2> 473541 T1180 oasu.PeerSync.sync PeerSync: core=nodes_used_collection_shard1_replica1 url=http://127.0.0.1:39619 DONE.  We have no versions.  sync failed.
[junit4:junit4]   2> 473541 T1180 oasc.SyncStrategy.syncReplicas Leader's attempt to sync with shard failed, moving to the next canidate
[junit4:junit4]   2> 473541 T1180 oasc.ShardLeaderElectionContext.runLeaderProcess We failed sync, but we have no versions - we can't sync in that case - we were active before, so become leader anyway
[junit4:junit4]   2> 473542 T1180 oasc.ShardLeaderElectionContext.runLeaderProcess I am the new leader: http://127.0.0.1:39619/nodes_used_collection_shard1_replica1/
[junit4:junit4]   2> 473542 T1180 oascc.SolrZkClient.makePath makePath: /collections/nodes_used_collection/leaders/shard1
[junit4:junit4]   2> 473543 T1121 oasc.ShardLeaderElectionContext.waitForReplicasToComeUp Waiting until we see more replicas up: total=2 found=1 timeoutin=179999
[junit4:junit4]   2> ASYNC  NEW_CORE C583 name=nodes_used_collection_shard1_replica2 org.apache.solr.core.SolrCore@29735bbc url=http://127.0.0.1:49858/nodes_used_collection_shard1_replica2 node=127.0.0.1:49858_ C583_STATE=coll:nodes_used_collection core:nodes_used_collection_shard1_replica2 props:{shard=shard1, state=down, core=nodes_used_collection_shard1_replica2, collection=nodes_used_collection, node_name=127.0.0.1:49858_, base_url=http://127.0.0.1:49858}
[junit4:junit4]   2> 473546 T1169 C583 P49858 oasc.SolrCore.execute [nodes_used_collection_shard1_replica2] webapp= path=/get params={getVersions=100&distrib=false&wt=javabin&qt=/get&version=2} status=0 QTime=1 
[junit4:junit4]   2> 473575 T1141 oasc.CoreContainer.registerCore registering core: nodes_used_collection_shard2_replica2
[junit4:junit4]   2> 473576 T1141 oasc.ZkController.register Register replica - core:nodes_used_collection_shard2_replica2 address:http://127.0.0.1:43797 collection:nodes_used_collection shard:shard2
[junit4:junit4]   2> 474044 T1121 oasc.ShardLeaderElectionContext.waitForReplicasToComeUp Enough replicas found to continue.
[junit4:junit4]   2> 474044 T1121 oasc.ShardLeaderElectionContext.runLeaderProcess I may be the new leader - try and sync
[junit4:junit4]   2> 474045 T1121 oasc.SyncStrategy.sync Sync replicas to http://127.0.0.1:53187/nodes_used_collection_shard2_replica1/
[junit4:junit4]   2> 474045 T1121 oasu.PeerSync.sync PeerSync: core=nodes_used_collection_shard2_replica1 url=http://127.0.0.1:53187 START replicas=[http://127.0.0.1:43797/nodes_used_collection_shard2_replica2/] nUpdates=100
[junit4:junit4]   2> 474045 T1121 oasu.PeerSync.sync PeerSync: core=nodes_used_collection_shard2_replica1 url=http://127.0.0.1:53187 DONE.  We have no versions.  sync failed.
[junit4:junit4]   2> 474046 T1121 oasc.SyncStrategy.syncReplicas Leader's attempt to sync with shard failed, moving to the next canidate
[junit4:junit4]   2> 474046 T1121 oasc.ShardLeaderElectionContext.runLeaderProcess We failed sync, but we have no versions - we can't sync in that case - we were active before, so become leader anyway
[junit4:junit4]   2> 474046 T1121 oasc.ShardLeaderElectionContext.runLeaderProcess I am the new leader: http://127.0.0.1:53187/nodes_used_collection_shard2_replica1/
[junit4:junit4]   2> 474047 T1121 oascc.SolrZkClient.makePath makePath: /collections/nodes_used_collection/leaders/shard2
[junit4:junit4]   2> ASYNC  NEW_CORE C584 name=nodes_used_collection_shard2_replica2 org.apache.solr.core.SolrCore@5fa6d049 url=http://127.0.0.1:43797/nodes_used_collection_shard2_replica2 node=127.0.0.1:43797_ C584_STATE=coll:nodes_used_collection core:nodes_used_collection_shard2_replica2 props:{shard=shard2, state=down, core=nodes_used_collection_shard2_replica2, collection=nodes_used_collection, node_name=127.0.0.1:43797_, base_url=http://127.0.0.1:43797}
[junit4:junit4]   2> 474052 T1142 C584 P43797 oasc.SolrCore.execute [nodes_used_collection_shard2_replica2] webapp= path=/get params={getVersions=100&distrib=false&wt=javabin&qt=/get&version=2} status=0 QTime=1 
[junit4:junit4]   2> 474580 T1129 oascc.ZkStateReader.updateClusterState Updating cloud state from ZooKeeper... 
[junit4:junit4]   2> 474591 T1188 oascc.ZkStateReader$2.process A cluster state change: WatchedEvent state:SyncConnected type:NodeDataChanged path:/clusterstate.json, has occurred - updating... (live nodes size: 5)
[junit4:junit4]   2> 474591 T1174 oascc.ZkStateReader$2.process A cluster state change: WatchedEvent state:SyncConnected type:NodeDataChanged path:/clusterstate.json, has occurred - updating... (live nodes size: 5)
[junit4:junit4]   2> 474592 T1128 oascc.ZkStateReader$2.process A cluster state change: WatchedEvent state:SyncConnected type:NodeDataChanged path:/clusterstate.json, has occurred - updating... (live nodes size: 5)
[junit4:junit4]   2> 474592 T1146 oascc.ZkStateReader$2.process A cluster state change: WatchedEvent state:SyncConnected type:NodeDataChanged path:/clusterstate.json, has occurred - updating... (live nodes size: 5)
[junit4:junit4]   2> 474591 T1133 oascc.ZkStateReader$2.process A cluster state change: WatchedEvent state:SyncConnected type:NodeDataChanged path:/clusterstate.json, has occurred - updating... (live nodes size: 5)
[junit4:junit4]   2> 474591 T1160 oascc.ZkStateReader$2.process A cluster state change: WatchedEvent state:SyncConnected type:NodeDataChanged path:/clusterstate.json, has occurred - updating... (live nodes size: 5)
[junit4:junit4]   2> 474599 T1180 oasc.ZkController.register We are http://127.0.0.1:39619/nodes_used_collection_shard1_replica1/ and leader is http://127.0.0.1:39619/nodes_used_collection_shard1_replica1/
[junit4:junit4]   2> 474599 T1180 oasc.ZkController.register No LogReplay needed for core=nodes_used_collection_shard1_replica1 baseURL=http://127.0.0.1:39619
[junit4:junit4]   2> 474599 T1180 oasc.ZkController.checkRecovery I am the leader, no recovery necessary
[junit4:junit4]   2> 474600 T1180 oasc.ZkController.publish publishing core=nodes_used_collection_shard1_replica1 state=active
[junit4:junit4]   2> 474601 T1180 oascc.ZkStateReader.updateClusterState Updating cloud state from ZooKeeper... 
[junit4:junit4]   2> 474602 T1180 oass.SolrDispatchFilter.handleAdminRequest [admin] webapp=null path=/admin/cores params={numShards=2&shard=shard1&name=nodes_used_collection_shard1_replica1&action=CREATE&collection=nodes_used_collection&wt=javabin&qt=/admin/cores&version=2} status=0 QTime=2789 
[junit4:junit4]   2> 474603 T1121 oasc.ZkController.register We are http://127.0.0.1:53187/nodes_used_collection_shard2_replica1/ and leader is http://127.0.0.1:53187/nodes_used_collection_shard2_replica1/
[junit4:junit4]   2> 474604 T1121 oasc.ZkController.register No LogReplay needed for core=nodes_used_collection_shard2_replica1 baseURL=http://127.0.0.1:53187
[junit4:junit4]   2> 474604 T1121 oasc.ZkController.checkRecovery I am the leader, no recovery necessary
[junit4:junit4]   2> 474605 T1121 oasc.ZkController.publish publishing core=nodes_used_collection_shard2_replica1 state=active
[junit4:junit4]   2> 474607 T1121 oascc.ZkStateReader.updateClusterState Updating cloud state from ZooKeeper... 
[junit4:junit4]   2> 474608 T1121 oass.SolrDispatchFilter.handleAdminRequest [admin] webapp=null path=/admin/cores params={numShards=2&shard=shard2&name=nodes_used_collection_shard2_replica1&action=CREATE&collection=nodes_used_collection&wt=javabin&qt=/admin/cores&version=2} status=0 QTime=2795 
[junit4:junit4]   2> 474630 T1141 oasc.ZkController.register We are http://127.0.0.1:43797/nodes_used_collection_shard2_replica2/ and leader is http://127.0.0.1:53187/nodes_used_collection_shard2_replica1/
[junit4:junit4]   2> 474630 T1141 oasc.ZkController.register No LogReplay needed for core=nodes_used_collection_shard2_replica2 baseURL=http://127.0.0.1:43797
[junit4:junit4]   2> 474631 T1141 oasc.ZkController.checkRecovery Core needs to recover:nodes_used_collection_shard2_replica2
[junit4:junit4]   2> 474631 T1141 oasu.DefaultSolrCoreState.doRecovery Running recovery - first canceling any ongoing recovery
[junit4:junit4]   2> 474632 T1200 C584 P43797 oasc.RecoveryStrategy.run Starting recovery process.  core=nodes_used_collection_shard2_replica2 recoveringAfterStartup=true
[junit4:junit4]   2> 474633 T1200 C584 P43797 oasc.RecoveryStrategy.doRecovery ###### startupVersions=[]
[junit4:junit4]   2> 474634 T1200 C584 P43797 oasc.ZkController.publish publishing core=nodes_used_collection_shard2_replica2 state=recovering
[junit4:junit4]   2> 474634 T1141 oascc.ZkStateReader.updateClusterState Updating cloud state from ZooKeeper... 
[junit4:junit4]   2> 474635 T1200 C584 P43797 oascsi.HttpClientUtil.createClient Creating new http client, config:maxConnections=128&maxConnectionsPerHost=32&followRedirects=false
[junit4:junit4]   2> 474636 T1141 oass.SolrDispatchFilter.handleAdminRequest [admin] webapp=null path=/admin/cores params={numShards=2&shard=shard2&name=nodes_used_collection_shard2_replica2&action=CREATE&collection=nodes_used_collection&wt=javabin&qt=/admin/cores&version=2} status=0 QTime=2822 
[junit4:junit4]   2> 474642 T1168 oasc.ZkController.register We are http://127.0.0.1:49858/nodes_used_collection_shard1_replica2/ and leader is http://127.0.0.1:39619/nodes_used_collection_shard1_replica1/
[junit4:junit4]   2> 474643 T1168 oasc.ZkController.register No LogReplay needed for core=nodes_used_collection_shard1_replica2 baseURL=http://127.0.0.1:49858
[junit4:junit4]   2> 474643 T1168 oasc.ZkController.checkRecovery Core needs to recover:nodes_used_collection_shard1_replica2
[junit4:junit4]   2> 474644 T1168 oasu.DefaultSolrCoreState.doRecovery Running recovery - first canceling any ongoing recovery
[junit4:junit4]   2> 474645 T1201 C583 P49858 oasc.RecoveryStrategy.run Starting recovery process.  core=nodes_used_collection_shard1_replica2 recoveringAfterStartup=true
[junit4:junit4]   2> 474645 T1123 oasha.CoreAdminHandler.handleWaitForStateAction Going to wait for coreNodeName: 127.0.0.1:43797__nodes_used_collection_shard2_replica2, state: recovering, checkLive: true, onlyIfLeader: true
[junit4:junit4]   2> 474646 T1201 C583 P49858 oasc.RecoveryStrategy.doRecovery ###### startupVersions=[]
[junit4:junit4]   2> 474646 T1168 oascc.ZkStateReader.updateClusterState Updating cloud state from ZooKeeper... 
[junit4:junit4]   2> 474647 T1201 C583 P49858 oasc.ZkController.publish publishing core=nodes_used_collection_shard1_replica2 state=recovering
[junit4:junit4]   2> 474648 T1168 oass.SolrDispatchFilter.handleAdminRequest [admin] webapp=null path=/admin/cores params={numShards=2&shard=shard1&name=nodes_used_collection_shard1_replica2&action=CREATE&collection=nodes_used_collection&wt=javabin&qt=/admin/cores&version=2} status=0 QTime=2835 
[junit4:junit4]   2> 474650 T1201 C583 P49858 oascsi.HttpClientUtil.createClient Creating new http client, config:maxConnections=128&maxConnectionsPerHost=32&followRedirects=false
[junit4:junit4]   2> 474650 T1130 oasc.OverseerCollectionProcessor.createCollection Finished create command on all shards for collection: nodes_used_collection
[junit4:junit4]   2> 474654 T1146 oasc.DistributedQueue$LatchChildWatcher.process Watcher fired on path: /overseer/collection-queue-work/qnr-0000000000 state: SyncConnected type NodeDataChanged
[junit4:junit4]   2> 474656 T1128 oasc.DistributedQueue$LatchChildWatcher.process Watcher fired on path: /overseer/collection-queue-work state: SyncConnected type NodeChildrenChanged
[junit4:junit4]   2> 474656 T1130 oasc.OverseerCollectionProcessor.run Overseer Collection Processor: Message id:/overseer/collection-queue-work/qn-0000000000 complete, response:{success={null={responseHeader={status=0,QTime=2789},core=nodes_used_collection_shard1_replica1},null={responseHeader={status=0,QTime=2795},core=nodes_used_collection_shard2_replica1},null={responseHeader={status=0,QTime=2822},core=nodes_used_collection_shard2_replica2},null={responseHeader={status=0,QTime=2835},core=nodes_used_collection_shard1_replica2}}}
[junit4:junit4]   2> 474657 T1182 oasha.CoreAdminHandler.handleWaitForStateAction Going to wait for coreNodeName: 127.0.0.1:49858__nodes_used_collection_shard1_replica2, state: recovering, checkLive: true, onlyIfLeader: true
[junit4:junit4]   2> 474657 T1139 oass.SolrDispatchFilter.handleAdminRequest [admin] webapp=null path=/admin/collections params={numShards=2&name=nodes_used_collection&replicationFactor=2&action=CREATE&wt=javabin&version=2} status=0 QTime=2849 
[junit4:junit4]   2> 474659 T1106 oascsi.HttpClientUtil.createClient Creating new http client, config:
[junit4:junit4]   2> 474659 T1106 oascc.ConnectionManager.waitForConnected Waiting for client to connect to ZooKeeper
[junit4:junit4]   2> 474661 T1203 oascc.ConnectionManager.process Watcher org.apache.solr.common.cloud.ConnectionManager@4bade15a name:ZooKeeperConnection Watcher:127.0.0.1:45503/solr got event WatchedEvent state:SyncConnected type:None path:null path:null type:None
[junit4:junit4]   2> 474661 T1106 oascc.ConnectionManager.waitForConnected Client is connected to ZooKeeper
[junit4:junit4]   2> 474662 T1106 oascc.ZkStateReader.createClusterStateWatchersAndUpdate Updating cluster state from ZooKeeper... 
[junit4:junit4]   2> 474664 T1106 oascsi.HttpClientUtil.createClient Creating new http client, config:
[junit4:junit4]   2> 474666 T1106 oascc.ConnectionManager.waitForConnected Waiting for client to connect to ZooKeeper
[junit4:junit4]   2> 474667 T1205 oascc.ConnectionManager.process Watcher org.apache.solr.common.cloud.ConnectionManager@3cc2f15 name:ZooKeeperConnection Watcher:127.0.0.1:45503/solr got event WatchedEvent state:SyncConnected type:None path:null path:null type:None
[junit4:junit4]   2> 474667 T1106 oascc.ConnectionManager.waitForConnected Client is connected to ZooKeeper
[junit4:junit4]   2> 474668 T1106 oascc.ZkStateReader.createClusterStateWatchersAndUpdate Updating cluster state from ZooKeeper... 
[junit4:junit4]   2> 474674 T1155 oasha.CollectionsHandler.handleCreateAction Creating Collection : numShards=5&maxShardsPerNode=6&name=awholynewcollection_0&replicationFactor=5&action=CREATE&wt=javabin&version=2
[junit4:junit4]   2> 474675 T1128 oasc.DistributedQueue$LatchChildWatcher.process Watcher fired on path: /overseer/collection-queue-work state: SyncConnected type NodeChildrenChanged
[junit4:junit4]   2> 474676 T1130 oasc.OverseerCollectionProcessor.run Overseer Collection Processor: Get the message id:/overseer/collection-queue-work/qn-0000000002 message:{
[junit4:junit4]   2> 	  "operation":"createcollection",
[junit4:junit4]   2> 	  "numShards":"5",
[junit4:junit4]   2> 	  "maxShardsPerNode":"6",
[junit4:junit4]   2> 	  "createNodeSet":null,
[junit4:junit4]   2> 	  "name":"awholynewcollection_0",
[junit4:junit4]   2> 	  "replicationFactor":"5"}
[junit4:junit4]   2> 474676 T1130 oasc.OverseerCollectionProcessor.createCollection Creating shard awholynewcollection_0_shard1_replica1 as part of slice shard1 of collection awholynewcollection_0 on 127.0.0.1:53187_
[junit4:junit4]   2> 474677 T1130 oasc.OverseerCollectionProcessor.createCollection Creating shard awholynewcollection_0_shard1_replica2 as part of slice shard1 of collection awholynewcollection_0 on 127.0.0.1:39619_
[junit4:junit4]   2> 474677 T1130 oasc.OverseerCollectionProcessor.createCollection Creating shard awholynewcollection_0_shard1_replica3 as part of slice shard1 of collection awholynewcollection_0 on 127.0.0.1:49858_
[junit4:junit4]   2> 474677 T1130 oasc.OverseerCollectionProcessor.createCollection Creating shard awholynewcollection_0_shard1_replica4 as part of slice shard1 of collection awholynewcollection_0 on 127.0.0.1:33426_
[junit4:junit4]   2> 474677 T1130 oasc.OverseerCollectionProcessor.createCollection Creating shard awholynewcollection_0_shard1_replica5 as part of slice shard1 of collection awholynewcollection_0 on 127.0.0.1:43797_
[junit4:junit4]   2> 474678 T1130 oasc.OverseerCollectionProcessor.createCollection Creating shard awholynewcollection_0_shard2_replica1 as part of slice shard2 of collection awholynewcollection_0 on 127.0.0.1:53187_
[junit4:junit4]   2> 474679 T1130 oasc.OverseerCollectionProcessor.createCollection Creating shard awholynewcollection_0_shard2_replica2 as part of slice shard2 of collection awholynewcollection_0 on 127.0.0.1:39619_
[junit4:junit4]   2> 474679 T1130 oasc.OverseerCollectionProcessor.createCollection Creating shard awholynewcollection_0_shard2_replica3 as part of slice shard2 of collection awholynewcollection_0 on 127.0.0.1:49858_
[junit4:junit4]   2> 474679 T1156 oasc.CoreContainer.create Creating SolrCore 'awholynewcollection_0_shard1_replica4' using instanceDir: /mnt/ssd/jenkins/workspace/Lucene-Solr-trunk-Linux/solr/build/solr-core/test/J1/./org.apache.solr.cloud.CollectionsAPIDistributedZkTest-jetty2-1370684275792/awholynewcollection_0_shard1_replica4
[junit4:junit4]   2> 474680 T1180 oasc.CoreContainer.create Creating SolrCore 'awholynewcollection_0_shard1_replica2' using instanceDir: /mnt/ssd/jenkins/workspace/Lucene-Solr-trunk-Linux/solr/build/solr-core/test/J1/./org.apache.solr.cloud.CollectionsAPIDistributedZkTest-jetty4-1370684278165/awholynewcollection_0_shard1_replica2
[junit4:junit4]   2> 474680 T1180 oasc.ZkController.createCollectionZkNode Check for collection zkNode:awholynewcollection_0
[junit4:junit4]   2> 474680 T1140 oasc.CoreContainer.create Creating SolrCore 'awholynewcollection_0_shard1_replica5' using instanceDir: /mnt/ssd/jenkins/workspace/Lucene-Solr-trunk-Linux/solr/build/solr-core/test/J1/./org.apache.solr.cloud.CollectionsAPIDistributedZkTest-jetty1-1370684274614/awholynewcollection_0_shard1_replica5
[junit4:junit4]   2> 474681 T1140 oasc.ZkController.createCollectionZkNode Check for collection zkNode:awholynewcollection_0
[junit4:junit4]   2> 474680 T1156 oasc.ZkController.createCollectionZkNode Check for collection zkNode:awholynewcollection_0
[junit4:junit4]   2> 474680 T1170 oasc.CoreContainer.create Creating SolrCore 'awholynewcollection_0_shard1_replica3' using instanceDir: /mnt/ssd/jenkins/workspace/Lucene-Solr-trunk-Linux/solr/build/solr-core/test/J1/./org.apache.solr.cloud.CollectionsAPIDistributedZkTest-jetty3-1370684276979/awholynewcollection_0_shard1_replica3
[junit4:junit4]   2> 474682 T1156 oasc.ZkController.createCollectionZkNode Creating collection in ZooKeeper:awholynewcollection_0
[junit4:junit4]   2> 474680 T1130 oasc.OverseerCollectionProcessor.createCollection Creating shard awholynewcollection_0_shard2_replica4 as part of slice shard2 of collection awholynewcollection_0 on 127.0.0.1:33426_
[junit4:junit4]   2> 474679 T1124 oasc.CoreContainer.create Creating SolrCore 'awholynewcollection_0_shard1_replica1' using instanceDir: /mnt/ssd/jenkins/workspace/Lucene-Solr-trunk-Linux/solr/build/solr-core/test/J1/./org.apache.solr.cloud.CollectionsAPIDistributedZkTest-controljetty-1370684274386/awholynewcollection_0_shard1_replica1
[junit4:junit4]   2> 474682 T1124 oasc.ZkController.createCollectionZkNode Check for collection zkNode:awholynewcollection_0
[junit4:junit4]   2> 474682 T1130 oasc.OverseerCollectionProcessor.createCollection Creating shard awholynewcollection_0_shard2_replica5 as part of slice shard2 of collection awholynewcollection_0 on 127.0.0.1:43797_
[junit4:junit4]   2> 474683 T1124 oasc.ZkController.createCollectionZkNode Creating collection in ZooKeeper:awholynewcollection_0
[junit4:junit4]   2> 474682 T1156 oasc.ZkController.getConfName Looking for collection configName
[junit4:junit4]   2> 474682 T1170 oasc.ZkController.createCollectionZkNode Check for collection zkNode:awholynewcollection_0
[junit4:junit4]   2> 474682 T1140 oasc.ZkController.createCollectionZkNode Creating collection in ZooKeeper:awholynewcollection_0
[junit4:junit4]   2> 474685 T1170 oasc.ZkController.createCollectionZkNode Creating collection in ZooKeeper:awholynewcollection_0
[junit4:junit4]   2> 474681 T1180 oasc.ZkController.createCollectionZkNode Creating collection in ZooKeeper:awholynewcollection_0
[junit4:junit4]   2> 474681 T1169 oasc.CoreContainer.create Creating SolrCore 'awholynewcollection_0_shard2_replica3' using instanceDir: /mnt/ssd/jenkins/workspace/Lucene-Solr-trunk-Linux/solr/build/solr-core/test/J1/./org.apache.solr.cloud.CollectionsAPIDistributedZkTest-jetty3-1370684276979/awholynewcollection_0_shard2_replica3
[junit4:junit4]   2> 474681 T1183 oasc.CoreContainer.create Creating SolrCore 'awholynewcollection_0_shard2_replica2' using instanceDir: /mnt/ssd/jenkins/workspace/Lucene-Solr-trunk-Linux/solr/build/solr-core/test/J1/./org.apache.solr.cloud.CollectionsAPIDistributedZkTest-jetty4-1370684278165/awholynewcollection_0_shard2_replica2
[junit4:junit4]   2> 474681 T1121 oasc.CoreContainer.create Creating SolrCore 'awholynewcollection_0_shard2_replica1' using instanceDir: /mnt/ssd/jenkins/workspace/Lucene-Solr-trunk-Linux/solr/build/solr-core/test/J1/./org.apache.solr.cloud.CollectionsAPIDistributedZkTest-controljetty-1370684274386/awholynewcollection_0_shard2_replica1
[junit4:junit4]   2> 474686 T1183 oasc.ZkController.createCollectionZkNode Check for collection zkNode:awholynewcollection_0
[junit4:junit4]   2> 474686 T1169 oasc.ZkController.createCollectionZkNode Check for collection zkNode:awholynewcollection_0
[junit4:junit4]   2> 474685 T1180 oasc.ZkController.getConfName Looking for collection configName
[junit4:junit4]   2> 474685 T1170 oasc.ZkController.getConfName Looking for collection configName
[junit4:junit4]   2> 474685 T1140 oasc.ZkController.getConfName Looking for collection configName
[junit4:junit4]   2> 474685 T1156 oasc.ZkController.getConfName Only one config set found in zk - using it:conf1
[junit4:junit4]   2> 474684 T1142 oasc.CoreContainer.create Creating SolrCore 'awholynewcollection_0_shard2_replica5' using instanceDir: /mnt/ssd/jenkins/workspace/Lucene-Solr-trunk-Linux/solr/build/solr-core/test/J1/./org.apache.solr.cloud.CollectionsAPIDistributedZkTest-jetty1-1370684274614/awholynewcollection_0_shard2_replica5
[junit4:junit4]   2> 474688 T1142 oasc.ZkController.createCollectionZkNode Check for collection zkNode:awholynewcollection_0
[junit4:junit4]   2> 474684 T1154 oasc.CoreContainer.create Creating SolrCore 'awholynewcollection_0_shard2_replica4' using instanceDir: /mnt/ssd/jenkins/workspace/Lucene-Solr-trunk-Linux/solr/build/solr-core/test/J1/./org.apache.solr.cloud.CollectionsAPIDistributedZkTest-jetty2-1370684275792/awholynewcollection_0_shard2_replica4
[junit4:junit4]   2> 474689 T1154 oasc.ZkController.createCollectionZkNode Check for collection zkNode:awholynewcollection_0
[junit4:junit4]   2> 474683 T1124 oasc.ZkController.getConfName Looking for collection configName
[junit4:junit4]   2> 474683 T1130 oasc.OverseerCollectionProcessor.createCollection Creating shard awholynewcollection_0_shard3_replica1 as part of slice shard3 of collection awholynewcollection_0 on 127.0.0.1:53187_
[junit4:junit4]   2> 474689 T1154 oasc.ZkController.createCollectionZkNode Creating collection in ZooKeeper:awholynewcollection_0
[junit4:junit4]   2> 474689 T1142 oasc.ZkController.createCollectionZkNode Creating collection in ZooKeeper:awholynewcollection_0
[junit4:junit4]   2> 474689 T1170 oasc.ZkController.getConfName Only one config set found in zk - using it:conf1
[junit4:junit4]   2> 474688 T1140 oasc.ZkController.getConfName Only one config set found in zk - using it:conf1
[junit4:junit4]   2> 474688 T1156 oascc.SolrZkClient.makePath makePath: /collections/awholynewcollection_0
[junit4:junit4]   2> 474688 T1180 oasc.ZkController.getConfName Only one config set found in zk - using it:conf1
[junit4:junit4]   2> 474687 T1169 oasc.ZkController.createCollectionZkNode Creating collection in ZooKeeper:awholynewcollection_0
[junit4:junit4]   2> 474692 T1169 oasc.ZkController.getConfName Looking for collection configName
[junit4:junit4]   2> 474687 T1183 oasc.ZkController.createCollectionZkNode Creating collection in ZooKeeper:awholynewcollection_0
[junit4:junit4]   2> 474686 T1121 oasc.ZkController.createCollectionZkNode Check for collection zkNode:awholynewcollection_0
[junit4:junit4]   2> 474693 T1156 oasc.ZkController.readConfigName Load collection config from:/collections/awholynewcollection_0
[junit4:junit4]   2> 474693 T1183 oasc.ZkController.getConfName Looking for collection configName
[junit4:junit4]   2> 474692 T1180 oascc.SolrZkClient.makePath makePath: /collections/awholynewcollection_0
[junit4:junit4]   2> 474691 T1122 oasc.CoreContainer.create Creating SolrCore 'awholynewcollection_0_shard3_replica1' using instanceDir: /mnt/ssd/jenkins/workspace/Lucene-Solr-trunk-Linux/solr/build/solr-core/test/J1/./org.apache.solr.cloud.CollectionsAPIDistributedZkTest-controljetty-1370684274386/awholynewcollection_0_shard3_replica1
[junit4:junit4]   2> 474691 T1140 oascc.SolrZkClient.makePath makePath: /collections/awholynewcollection_0
[junit4:junit4]   2> 474695 T1156 oasc.SolrResourceLoader.<init> new SolrResourceLoader for directory: '/mnt/ssd/jenkins/workspace/Lucene-Solr-trunk-Linux/solr/build/solr-core/test/J1/./org.apache.solr.cloud.CollectionsAPIDistributedZkTest-jetty2-1370684275792/awholynewcollection_0_shard1_replica4/'
[junit4:junit4]   2> 474691 T1170 oascc.SolrZkClient.makePath makePath: /collections/awholynewcollection_0
[junit4:junit4]   2> 474690 T1142 oasc.ZkController.getConfName Looking for collection configName
[junit4:junit4]   2> 474690 T1124 oasc.ZkController.getConfName Only one config set found in zk - using it:conf1
[junit4:junit4]   2> 474690 T1154 oasc.ZkController.getConfName Looking for collection configName
[junit4:junit4]   2> 474690 T1130 oasc.OverseerCollectionProcessor.createCollection Creating shard awholynewcollection_0_shard3_replica2 as part of slice shard3 of collection awholynewcollection_0 on 127.0.0.1:39619_
[junit4:junit4]   2> 474697 T1142 oascc.SolrZkClient.makePath makePath: /collections/awholynewcollection_0
[junit4:junit4]   2> 474697 T1130 oasc.OverseerCollectionProcessor.createCollection Creating shard awholynewcollection_0_shard3_replica3 as part of slice shard3 of collection awholynewcollection_0 on 127.0.0.1:49858_
[junit4:junit4]   2> 474697 T1170 oasc.ZkController.readConfigName Load collection config from:/collections/awholynewcollection_0
[junit4:junit4]   2> 474699 T1130 oasc.OverseerCollectionProcessor.createCollection Creating shard awholynewcollection_0_shard3_replica4 as part of slice shard3 of collection awholynewcollection_0 on 127.0.0.1:33426_
[junit4:junit4]   2> 474699 T1130 oasc.OverseerCollectionProcessor.createCollection Creating shard awholynewcollection_0_shard3_replica5 as part of slice shard3 of collection awholynewcollection_0 on 127.0.0.1:43797_
[junit4:junit4]   2> 474699 T1181 oasc.CoreContainer.create Creating SolrCore 'awholynewcollection_0_shard3_replica2' using instanceDir: /mnt/ssd/jenkins/workspace/Lucene-Solr-trunk-Linux/solr/build/solr-core/test/J1/./org.apache.solr.cloud.CollectionsAPIDistributedZkTest-jetty4-1370684278165/awholynewcollection_0_shard3_replica2
[junit4:junit4]   2> 474700 T1181 oasc.ZkController.createCollectionZkNode Check for collection zkNode:awholynewcollection_0
[junit4:junit4]   2> 474701 T1139 oasc.CoreContainer.create Creating SolrCore 'awholynewcollection_0_shard3_replica5' using instanceDir: /mnt/ssd/jenkins/workspace/Lucene-Solr-trunk-Linux/solr/build/solr-core/test/J1/./org.apache.solr.cloud.CollectionsAPIDistributedZkTest-jetty1-1370684274614/awholynewcollection_0_shard3_replica5
[junit4:junit4]   2> 474697 T1140 oasc.ZkController.readConfigName Load collection config from:/collections/awholynewcollection_0
[junit4:junit4]   2> 474697 T1124 oascc.SolrZkClient.makePath makePath: /collections/awholynewcollection_0
[junit4:junit4]   2> 474695 T1180 oasc.ZkController.readConfigName Load collection config from:/collections/awholynewcollection_0
[junit4:junit4]   2> 474704 T1142 oasc.ZkController.readConfigName Load collection config from:/collections/awholynewcollection_0
[junit4:junit4]   2> 474695 T1183 oascc.SolrZkClient.makePath makePath: /collections/awholynewcollection_0
[junit4:junit4]   2> 474694 T1122 oasc.ZkController.createCollectionZkNode Check for collection zkNode:awholynewcollection_0
[junit4:junit4]   2> 474693 T1121 oasc.ZkController.createCollectionZkNode Collection zkNode exists
[junit4:junit4]   2> 474705 T1121 oasc.ZkController.readConfigName Load collection config from:/collections/awholynewcollection_0
[junit4:junit4]   2> 474693 T1169 oascc.SolrZkClient.makePath makePath: /collections/awholynewcollection_0
[junit4:junit4]   2> 474706 T1124 oasc.ZkController.readConfigName Load collection config from:/collections/awholynewcollection_0
[junit4:junit4]   2> 474707 T1183 oasc.ZkController.readConfigName Load collection config from:/collections/awholynewcollection_0
[junit4:junit4]   2> 474706 T1142 oasc.SolrResourceLoader.<init> new SolrResourceLoader for directory: '/mnt/ssd/jenkins/workspace/Lucene-Solr-trunk-Linux/solr/build/solr-core/test/J1/./org.apache.solr.cloud.CollectionsAPIDistributedZkTest-jetty1-1370684274614/awholynewcollection_0_shard2_replica5/'
[junit4:junit4]   2> 474708 T1121 oasc.SolrResourceLoader.<init> new SolrResourceLoader for directory: '/mnt/ssd/jenkins/workspace/Lucene-Solr-trunk-Linux/solr/build/solr-core/test/J1/./org.apache.solr.cloud.CollectionsAPIDistributedZkTest-controljetty-1370684274386/awholynewcollection_0_shard2_replica1/'
[junit4:junit4]   2> 474708 T1169 oasc.ZkController.readConfigName Load collection config from:/collections/awholynewcollection_0
[junit4:junit4]   2> 474710 T1169 oasc.SolrResourceLoader.<init> new SolrResourceLoader for directory: '/mnt/ssd/jenkins/workspace/Lucene-Solr-trunk-Linux/solr/build/solr-core/test/J1/./org.apache.solr.cloud.CollectionsAPIDistributedZkTest-jetty3-1370684276979/awholynewcollection_0_shard2_replica3/'
[junit4:junit4]   2> 474705 T1180 oasc.SolrResourceLoader.<init> new SolrResourceLoader for directory: '/mnt/ssd/jenkins/workspace/Lucene-Solr-trunk-Linux/solr/build/solr-core/test/J1/./org.apache.solr.cloud.CollectionsAPIDistributedZkTest-jetty4-1370684278165/awholynewcollection_0_shard1_replica2/'
[junit4:junit4]   2> 474705 T1140 oasc.SolrResourceLoader.<init> new SolrResourceLoader for directory: '/mnt/ssd/jenkins/workspace/Lucene-Solr-trunk-Linux/solr/build/solr-core/test/J1/./org.apache.solr.cloud.CollectionsAPIDistributedZkTest-jetty1-1370684274614/awholynewcollection_0_shard1_replica5/'
[junit4:junit4]   2> 474702 T1154 oascc.SolrZkClient.makePath makePath: /collections/awholynewcollection_0
[junit4:junit4]   2> 474702 T1139 oasc.ZkController.createCollectionZkNode Check for collection zkNode:awholynewcollection_0
[junit4:junit4]   2> 474714 T1139 oasc.ZkController.createCollectionZkNode Collection zkNode exists
[junit4:junit4]   2> 474714 T1139 oasc.ZkController.readConfigName Load collection config from:/collections/awholynewcollection_0
[junit4:junit4]   2> 474702 T1170 oasc.SolrResourceLoader.<init> new SolrResourceLoader for directory: '/mnt/ssd/jenkins/workspace/Lucene-Solr-trunk-Linux/solr/build/solr-core/test/J1/./org.apache.solr.cloud.CollectionsAPIDistributedZkTest-jetty3-1370684276979/awholynewcollection_0_shard1_replica3/'
[junit4:junit4]   2> 474702 T1181 oasc.ZkController.createCollectionZkNode Collection zkNode exists
[junit4:junit4]   2> 474722 T1181 oasc.ZkController.readConfigName Load collection config from:/collections/awholynewcollection_0
[junit4:junit4]   2> 474701 T1153 oasc.CoreContainer.create Creating SolrCore 'awholynewcollection_0_shard3_replica4' using instanceDir: /mnt/ssd/jenkins/workspace/Lucene-Solr-trunk-Linux/solr/build/solr-core/test/J1/./org.apache.solr.cloud.CollectionsAPIDistributedZkTest-jetty2-1370684275792/awholynewcollection_0_shard3_replica4
[junit4:junit4]   2> 474723 T1153 oasc.ZkController.createCollectionZkNode Check for collection zkNode:awholynewcollection_0
[junit4:junit4]   2> 474700 T1168 oasc.CoreContainer.create Creating SolrCore 'awholynewcollection_0_shard3_replica3' using instanceDir: /mnt/ssd/jenkins/workspace/Lucene-Solr-trunk-Linux/solr/build/solr-core/test/J1/./org.apache.solr.cloud.CollectionsAPIDistributedZkTest-jetty3-1370684276979/awholynewcollection_0_shard3_replica3
[junit4:junit4]   2> 474723 T1168 oasc.ZkController.createCollectionZkNode Check for collection zkNode:awholynewcollection_0
[junit4:junit4]   2> 474699 T1130 oasc.OverseerCollectionProcessor.createCollection Creating shard awholynewcollection_0_shard4_replica1 as part of slice shard4 of collection awholynewcollection_0 on 127.0.0.1:53187_
[junit4:junit4]   2> 474724 T1181 oasc.SolrResourceLoader.<init> new SolrResourceLoader for directory: '/mnt/ssd/jenkins/workspace/Lucene-Solr-trunk-Linux/solr/build/solr-core/test/J1/./org.apache.solr.cloud.CollectionsAPIDistributedZkTest-jetty4-1370684278165/awholynewcollection_0_shard3_replica2/'
[junit4:junit4]   2> 474719 T1154 oasc.ZkController.readConfigName Load collection config from:/collections/awholynewcollection_0
[junit4:junit4]   2> 474718 T1139 oasc.SolrResourceLoader.<init> new SolrResourceLoader for directory: '/mnt/ssd/jenkins/workspace/Lucene-Solr-trunk-Linux/solr/build/solr-core/test/J1/./org.apache.solr.cloud.CollectionsAPIDistributedZkTest-jetty1-1370684274614/awholynewcollection_0_shard3_replica5/'
[junit4:junit4]   2> 474713 T1183 oasc.SolrResourceLoader.<init> new SolrResourceLoader for directory: '/mnt/ssd/jenkins/workspace/Lucene-Solr-trunk-Linux/solr/build/solr-core/test/J1/./org.apache.solr.cloud.CollectionsAPIDistributedZkTest-jetty4-1370684278165/awholynewcollection_0_shard2_replica2/'
[junit4:junit4]   2> 474708 T1124 oasc.SolrResourceLoader.<init> new SolrResourceLoader for directory: '/mnt/ssd/jenkins/workspace/Lucene-Solr-trunk-Linux/solr/build/solr-core/test/J1/./org.apache.solr.cloud.CollectionsAPIDistributedZkTest-controljetty-1370684274386/awholynewcollection_0_shard1_replica1/'
[junit4:junit4]   2> 474707 T1122 oasc.ZkController.createCollectionZkNode Collection zkNode exists
[junit4:junit4]   2> 474727 T1122 oasc.ZkController.readConfigName Load collection config from:/collections/awholynewcollection_0
[junit4:junit4]   2> 474728 T1153 oasc.ZkController.createCollectionZkNode Collection zkNode exists
[junit4:junit4]   2> 474729 T1153 oasc.ZkController.readConfigName Load collection config from:/collections/awholynewcollection_0
[junit4:junit4]   2> 474729 T1130 oasc.OverseerCollectionProcessor.createCollection Creating shard awholynewcollection_0_shard4_replica2 as part of slice shard4 of collection awholynewcollection_0 on 127.0.0.1:39619_
[junit4:junit4]   2> 474731 T1168 oasc.ZkController.createCollectionZkNode Collection zkNode exists
[junit4:junit4]   2> 474731 T1168 oasc.ZkController.readConfigName Load collection config from:/collections/awholynewcollection_0
[junit4:junit4]   2> 474734 T1154 oasc.SolrResourceLoader.<init> new SolrResourceLoader for directory: '/mnt/ssd/jenkins/workspace/Lucene-Solr-trunk-Linux/solr/build/solr-core/test/J1/./org.apache.solr.cloud.CollectionsAPIDistributedZkTest-jetty2-1370684275792/awholynewcollection_0_shard2_replica4/'
[junit4:junit4]   2> 474734 T1168 oasc.SolrResourceLoader.<init> new SolrResourceLoader for directory: '/mnt/ssd/jenkins/workspace/Lucene-Solr-trunk-Linux/solr/build/solr-core/test/J1/./org.apache.solr.cloud.CollectionsAPIDistributedZkTest-jetty3-1370684276979/awholynewcollection_0_shard3_replica3/'
[junit4:junit4]   2> 474736 T1130 oasc.OverseerCollectionProcessor.createCollection Creating shard awholynewcollection_0_shard4_replica3 as part of slice shard4 of collection awholynewcollection_0 on 127.0.0.1:49858_
[junit4:junit4]   2> 474736 T1153 oasc.SolrResourceLoader.<init> new SolrResourceLoader for directory: '/mnt/ssd/jenkins/workspace/Lucene-Solr-trunk-Linux/solr/build/solr-core/test/J1/./org.apache.solr.cloud.CollectionsAPIDistributedZkTest-jetty2-1370684275792/awholynewcollection_0_shard3_replica4/'
[junit4:junit4]   2> 474737 T1130 oasc.OverseerCollectionProcessor.createCollection Creating shard awholynewcollection_0_shard4_replica4 as part of slice shard4 of collection awholynewcollection_0 on 127.0.0.1:33426_
[junit4:junit4]   2> 474739 T1167 oasc.CoreContainer.create Creating SolrCore 'awholynewcollection_0_shard4_replica3' using instanceDir: /mnt/ssd/jenkins/workspace/Lucene-Solr-trunk-Linux/solr/build/solr-core/test/J1/./org.apache.solr.cloud.CollectionsAPIDistributedZkTest-jetty3-1370684276979/awholynewcollection_0_shard4_replica3
[junit4:junit4]   2> 474739 T1167 oasc.ZkController.createCollectionZkNode Check for collection zkNode:awholynewcollection_0
[junit4:junit4]   2> 474740 T1167 oasc.ZkController.createCollectionZkNode Collection zkNode exists
[junit4:junit4]   2> 474740 T1167 oasc.ZkController.readConfigName Load collection config from:/collections/awholynewcollection_0
[junit4:junit4]   2> 474740 T1122 oasc.SolrResourceLoader.<init> new SolrResourceLoader for directory: '/mnt/ssd/jenkins/workspace/Lucene-Solr-trunk-Linux/solr/build/solr-core/test/J1/./org.apache.solr.cloud.CollectionsAPIDistributedZkTest-controljetty-1370684274386/awholynewcollection_0_shard3_replica1/'
[junit4:junit4]   2> 474743 T1167 oasc.SolrResourceLoader.<init> new SolrResourceLoader for directory: '/mnt/ssd/jenkins/workspace/Lucene-Solr-trunk-Linux/solr/build/solr-core/test/J1/./org.apache.solr.cloud.CollectionsAPIDistributedZkTest-jetty3-1370684276979/awholynewcollection_0_shard4_replica3/'
[junit4:junit4]   2> 474748 T1220 oasc.CoreContainer.create Creating SolrCore 'awholynewcollection_0_shard4_replica1' using instanceDir: /mnt/ssd/jenkins/workspace/Lucene-Solr-trunk-Linux/solr/build/solr-core/test/J1/./org.apache.solr.cloud.CollectionsAPIDistributedZkTest-controljetty-1370684274386/awholynewcollection_0_shard4_replica1
[junit4:junit4]   2> 474749 T1220 oasc.ZkController.createCollectionZkNode Check for collection zkNode:awholynewcollection_0
[junit4:junit4]   2> 474753 T1220 oasc.ZkController.createCollectionZkNode Collection zkNode exists
[junit4:junit4]   2> 474754 T1220 oasc.ZkController.readConfigName Load collection config from:/collections/awholynewcollection_0
[junit4:junit4]   2> 474756 T1130 oasc.OverseerCollectionProcessor.createCollection Creating shard awholynewcollection_0_shard4_replica5 as part of slice shard4 of collection awholynewcollection_0 on 127.0.0.1:43797_
[junit4:junit4]   2> 474756 T1156 oasc.SolrConfig.<init> Using Lucene MatchVersion: LUCENE_50
[junit4:junit4]   2> 474759 T1130 oasc.OverseerCollectionProcessor.createCollection Creating shard awholynewcollection_0_shard5_replica1 as part of slice shard5 of collection awholynewcollection_0 on 127.0.0.1:53187_
[junit4:junit4]   2> 474762 T1141 oasc.CoreContainer.create Creating SolrCore 'awholynewcollection_0_shard4_replica5' using instanceDir: /mnt/ssd/jenkins/workspace/Lucene-Solr-trunk-Linux/solr/build/solr-core/test/J1/./org.apache.solr.cloud.CollectionsAPIDistributedZkTest-jetty1-1370684274614/awholynewcollection_0_shard4_replica5
[junit4:junit4]   2> 474763 T1141 oasc.ZkController.createCollectionZkNode Check for collection zkNode:awholynewcollection_0
[junit4:junit4]   2> 474764 T1141 oasc.ZkController.createCollectionZkNode Collection zkNode exists
[junit4:junit4]   2> 474765 T1141 oasc.ZkController.readConfigName Load collection config from:/collections/awholynewcollection_0
[junit4:junit4]   2> 474769 T1141 oasc.SolrResourceLoader.<init> new SolrResourceLoader for directory: '/mnt/ssd/jenkins/workspace/Lucene-Solr-trunk-Linux/solr/build/solr-core/test/J1/./org.apache.solr.cloud.CollectionsAPIDistributedZkTest-jetty1-1370684274614/awholynewcollection_0_shard4_replica5/'
[junit4:junit4]   2> 474771 T1130 oasc.OverseerCollectionProcessor.createCollection Creating shard awholynewcollection_0_shard5_replica2 as part of slice shard5 of collection awholynewcollection_0 on 127.0.0.1:39619_
[junit4:junit4]   2> 474776 T1220 oasc.SolrResourceLoader.<init> new SolrResourceLoader for directory: '/mnt/ssd/jenkins/workspace/Lucene-Solr-trunk-Linux/solr/build/solr-core/test/J1/./org.apache.solr.cloud.CollectionsAPIDistributedZkTest-controljetty-1370684274386/awholynewcollection_0_shard4_replica1/'
[junit4:junit4]   2> 474786 T1130 oasc.OverseerCollectionProcessor.createCollection Creating shard awholynewcollection_0_shard5_replica3 as part of slice shard5 of collection awholynewcollection_0 on 127.0.0.1:49858_
[junit4:junit4]   2> 474787 T1130 oasc.OverseerCollectionProcessor.createCollection Creating shard awholynewcollection_0_shard5_replica4 as part of slice shard5 of collection awholynewcollection_0 on 127.0.0.1:33426_
[junit4:junit4]   2> 474819 T1130 oasc.OverseerCollectionProcessor.createCollection Creating shard awholynewcollection_0_shard5_replica5 as part of slice shard5 of collection awholynewcollection_0 on 127.0.0.1:43797_
[junit4:junit4]   2> 474823 T1226 oasc.CoreContainer.create Creating SolrCore 'awholynewcollection_0_shard4_replica2' using instanceDir: /mnt/ssd/jenkins/workspace/Lucene-Solr-trunk-Linux/solr/build/solr-core/test/J1/./org.apache.solr.cloud.CollectionsAPIDistributedZkTest-jetty4-1370684278165/awholynewcollection_0_shard4_replica2
[junit4:junit4]   2> 474833 T1142 oasc.SolrConfig.<init> Using Lucene MatchVersion: LUCENE_50
[junit4:junit4]   2> 474835 T1226 oasc.ZkController.createCollectionZkNode Check for collection zkNode:awholynewcollection_0
[junit4:junit4]   2> 474836 T1228 oasc.CoreContainer.create Creating SolrCore 'awholynewcollection_0_shard4_replica4' using instanceDir: /mnt/ssd/jenkins/workspace/Lucene-Solr-trunk-Linux/solr/build/solr-core/test/J1/./org.apache.solr.cloud.CollectionsAPIDistributedZkTest-jetty2-1370684275792/awholynewcollection_0_shard4_replica4
[junit4:junit4]   2> 474836 T1227 oasc.CoreContainer.create Creating SolrCore 'awholynewcollection_0_shard5_replica1' using instanceDir: /mnt/ssd/jenkins/workspace/Lucene-Solr-trunk-Linux/solr/build/solr-core/test/J1/./org.apache.solr.cloud.CollectionsAPIDistributedZkTest-controljetty-1370684274386/awholynewcollection_0_shard5_replica1
[junit4:junit4]   2> 474844 T1227 oasc.ZkController.createCollectionZkNode Check for collection zkNode:awholynewcollection_0
[junit4:junit4]   2> 474843 T1228 oasc.ZkController.createCollectionZkNode Check for collection zkNode:awholynewcollection_0
[junit4:junit4]   2> 474843 T1232 oasc.CoreContainer.create Creating SolrCore 'awholynewcollection_0_shard5_replica3' using instanceDir: /mnt/ssd/jenkins/workspace/Lucene-Solr-trunk-Linux/solr/build/solr-core/test/J1/./org.apache.solr.cloud.CollectionsAPIDistributedZkTest-jetty3-1370684276979/awholynewcollection_0_shard5_replica3
[junit4:junit4]   2> 474855 T1232 oasc.ZkController.createCollectionZkNode Check for collection zkNode:awholynewcollection_0
[junit4:junit4]   2> 474842 T1226 oasc.ZkController.createCollectionZkNode Collection zkNode exists
[junit4:junit4]   2> 474842 T1229 oasc.CoreContainer.create Creating SolrCore 'awholynewcollection_0_shard5_replica2' using instanceDir: /mnt/ssd/jenkins/workspace/Lucene-Solr-trunk-Linux/solr/build/solr-core/test/J1/./org.apache.solr.cloud.CollectionsAPIDistributedZkTest-jetty4-1370684278165/awholynewcollection_0_shard5_replica2
[junit4:junit4]   2> 474857 T1232 oasc.ZkController.createCollectionZkNode Collection zkNode exists
[junit4:junit4]   2> 474858 T1232 oasc.ZkController.readConfigName Load collection config from:/collections/awholynewcollection_0
[junit4:junit4]   2> 474857 T1227 oasc.ZkController.createCollectionZkNode Collection zkNode exists
[junit4:junit4]   2> 474858 T1227 oasc.ZkController.readConfigName Load collection config from:/collections/awholynewcollection_0
[junit4:junit4]   2> 474857 T1228 oasc.ZkController.createCollectionZkNode Collection zkNode exists
[junit4:junit4]   2> 474859 T1228 oasc.ZkController.readConfigName Load collection config from:/collections/awholynewcollection_0
[junit4:junit4]   2> 474856 T1154 oasc.SolrConfig.<init> Using Lucene MatchVersion: LUCENE_50
[junit4:junit4]   2> 474855 T1226 oasc.ZkController.readConfigName Load collection config from:/collections/awholynewcollection_0
[junit4:junit4]   2> 474863 T1227 oasc.SolrResourceLoader.<init> new SolrResourceLoader for directory: '/mnt/ssd/jenkins/workspace/Lucene-Solr-trunk-Linux/solr/build/solr-core/test/J1/./org.apache.solr.cloud.CollectionsAPIDistributedZkTest-controljetty-1370684274386/awholynewcollection_0_shard5_replica1/'
[junit4:junit4]   2> 474864 T1226 oasc.SolrResourceLoader.<init> new SolrResourceLoader for directory: '/mnt/ssd/jenkins/workspace/Lucene-Solr-trunk-Linux/solr/build/solr-core/test/J1/./org.apache.solr.cloud.CollectionsAPIDistributedZkTest-jetty4-1370684278165/awholynewcollection_0_shard4_replica2/'
[junit4:junit4]   2> 474864 T1232 oasc.SolrResourceLoader.<init> new SolrResourceLoader for directory: '/mnt/ssd/jenkins/workspace/Lucene-Solr-trunk-Linux/solr/build/solr-core/test/J1/./org.apache.solr.cloud.CollectionsAPIDistributedZkTest-jetty3-1370684276979/awholynewcollection_0_shard5_replica3/'
[junit4:junit4]   2> 474848 T1235 oasc.CoreContainer.create Creating SolrCore 'awholynewcollection_0_shard5_replica4' using instanceDir: /mnt/ssd/jenkins/workspace/Lucene-Solr-trunk-Linux/solr/build/solr-core/test/J1/./org.apache.solr.cloud.CollectionsAPIDistributedZkTest-jetty2-1370684275792/awholynewcollection_0_shard5_replica4
[junit4:junit4]   2> 474847 T1234 oasc.CoreContainer.create Creating SolrCore 'awholynewcollection_0_shard5_replica5' using instanceDir: /mnt/ssd/jenkins/workspace/Lucene-Solr-trunk-Linux/solr/build/solr-core/test/J1/./org.apache.solr.cloud.CollectionsAPIDistributedZkTest-jetty1-1370684274614/awholynewcollection_0_shard5_replica5
[junit4:junit4]   2> 474872 T1234 oasc.ZkController.createCollectionZkNode Check for collection zkNode:awholynewcollection_0
[junit4:junit4]   2> 474868 T1180 oasc.SolrConfig.<init> Using Lucene MatchVersion: LUCENE_50
[junit4:junit4]   2> 474864 T1228 oasc.SolrResourceLoader.<init> new SolrResourceLoader for directory: '/mnt/ssd/jenkins/workspace/Lucene-Solr-trunk-Linux/solr/build/solr-core/test/J1/./org.apache.solr.cloud.CollectionsAPIDistributedZkTest-jetty2-1370684275792/awholynewcollection_0_shard4_replica4/'
[junit4:junit4]   2> 474857 T1229 oasc.ZkController.createCollectionZkNode Check for collection zkNode:awholynewcollection_0
[junit4:junit4]   2> 474884 T1234 oasc.ZkController.createCollectionZkNode Collection zkNode exists
[junit4:junit4]   2> 474884 T1234 oasc.ZkController.readConfigName Load collection config from:/collections/awholynewcollection_0
[junit4:junit4]   2> 474879 T1121 oasc.SolrConfig.<init> Using Lucene MatchVersion: LUCENE_50
[junit4:junit4]   2> 474887 T1234 oasc.SolrResourceLoader.<init> new SolrResourceLoader for directory: '/mnt/ssd/jenkins/workspace/Lucene-Solr-trunk-Linux/solr/build/solr-core/test/J1/./org.apache.solr.cloud.CollectionsAPIDistributedZkTest-jetty1-1370684274614/awholynewcollection_0_shard5_replica5/'
[junit4:junit4]   2> 474887 T1169 oasc.SolrConfig.<init> Using Lucene MatchVersion: LUCENE_50
[junit4:junit4]   2> 474874 T1122 oasc.SolrConfig.<init> Using Lucene MatchVersion: LUCENE_50
[junit4:junit4]   2> 474889 T1168 oasc.SolrConfig.<init> Using Lucene MatchVersion: LUCENE_50
[junit4:junit4]   2> 474872 T1235 oasc.ZkController.createCollectionZkNode Check for collection zkNode:awholynewcollection_0
[junit4:junit4]   2> 474886 T1229 oasc.ZkController.createCollectionZkNode Collection zkNode exists
[junit4:junit4]   2> 474885 T1140 oasc.SolrConfig.<init> Using Lucene MatchVersion: LUCENE_50
[junit4:junit4]   2> 474885 T1170 oasc.SolrConfig.<init> Using Lucene MatchVersion: LUCENE_50
[junit4:junit4]   2> 474884 T1124 oasc.SolrConfig.<init> Using Lucene MatchVersion: LUCENE_50
[junit4:junit4]   2> 474892 T1235 oasc.ZkController.createCollectionZkNode Collection zkNode exists
[junit4:junit4]   2> 474898 T1235 oasc.ZkController.readConfigName Load collection config from:/collections/awholynewcollection_0
[junit4:junit4]   2> 474900 T1235 oasc.SolrResourceLoader.<init> new SolrResourceLoader for directory: '/mnt/ssd/jenkins/workspace/Lucene-Solr-trunk-Linux/solr/build/solr-core/test/J1/./org.apache.solr.cloud.CollectionsAPIDistributedZkTest-jetty2-1370684275792/awholynewcollection_0_shard5_replica4/'
[junit4:junit4]   2> 474902 T1229 oasc.ZkController.readConfigName Load collection config from:/collections/awholynewcollection_0
[junit4:junit4]   2> 474905 T1229 oasc.SolrResourceLoader.<init> new SolrResourceLoader for directory: '/mnt/ssd/jenkins/workspace/Lucene-Solr-trunk-Linux/solr/build/solr-core/test/J1/./org.apache.solr.cloud.CollectionsAPIDistributedZkTest-jetty4-1370684278165/awholynewcollection_0_shard5_replica2/'
[junit4:junit4]   2> 474926 T1139 oasc.SolrConfig.<init> Using Lucene MatchVersion: LUCENE_50
[junit4:junit4]   2> 474967 T1181 oasc.SolrConfig.<init> Using Lucene MatchVersion: LUCENE_50
[junit4:junit4]   2> 474968 T1167 oasc.SolrConfig.<init> Using Lucene MatchVersion: LUCENE_50
[junit4:junit4]   2> 474989 T1153 oasc.SolrConfig.<init> Using Lucene MatchVersion: LUCENE_50
[junit4:junit4]   2> 475011 T1156 oasc.SolrConfig.<init> Loaded SolrConfig: solrconfig.xml
[junit4:junit4]   2> 475014 T1156 oass.IndexSchema.readSchema Reading Solr Schema from schema.xml
[junit4:junit4]   2> 475027 T1232 oasc.SolrConfig.<init> Using Lucene MatchVersion: LUCENE_50
[junit4:junit4]   2> 475033 T1156 oass.IndexSchema.readSchema [awholynewcollection_0_shard1_replica4] Schema name=test
[junit4:junit4]   2> 475057 T1220 oasc.SolrConfig.<init> Using Lucene MatchVersion: LUCENE_50
[junit4:junit4]   2> 475076 T1228 oasc.SolrConfig.<init> Using Lucene MatchVersion: LUCENE_50
[junit4:junit4]   2> 475081 T1234 oasc.SolrConfig.<init> Using Lucene MatchVersion: LUCENE_50
[junit4:junit4]   2> 475083 T1229 oasc.SolrConfig.<init> Using Lucene MatchVersion: LUCENE_50
[junit4:junit4]   2> 475084 T1226 oasc.SolrConfig.<init> Using Lucene MatchVersion: LUCENE_50
[junit4:junit4]   2> 475084 T1168 oasc.SolrConfig.<init> Loaded SolrConfig: solrconfig.xml
[junit4:junit4]   2> 475088 T1168 oass.IndexSchema.readSchema Reading Solr Schema from schema.xml
[junit4:junit4]   2> 475090 T1183 oasc.SolrConfig.<init> Using Lucene MatchVersion: LUCENE_50
[junit4:junit4]   2> 475098 T1235 oasc.SolrConfig.<init> Using Lucene MatchVersion: LUCENE_50
[junit4:junit4]   2> 475098 T1168 oass.IndexSchema.readSchema [awholynewcollection_0_shard3_replica3] Schema name=test
[junit4:junit4]   2> 475102 T1154 oasc.SolrConfig.<init> Loaded SolrConfig: solrconfig.xml
[junit4:junit4]   2> 475105 T1141 oasc.SolrConfig.<init> Using Lucene MatchVersion: LUCENE_50
[junit4:junit4]   2> 475106 T1227 oasc.SolrConfig.<init> Using Lucene MatchVersion: LUCENE_50
[junit4:junit4]   2> 475107 T1154 oass.IndexSchema.readSchema Reading Solr Schema from schema.xml
[junit4:junit4]   2> 475111 T1170 oasc.SolrConfig.<init> Loaded SolrConfig: solrconfig.xml
[junit4:junit4]   2> 475115 T1170 oass.IndexSchema.readSchema Reading Solr Schema from schema.xml
[junit4:junit4]   2> 475143 T1180 oasc.SolrConfig.<init> Loaded SolrConfig: solrconfig.xml
[junit4:junit4]   2> 475145 T1154 oass.IndexSchema.readSchema [awholynewcollection_0_shard2_replica4] Schema name=test
[junit4:junit4]   2> 475150 T1180 oass.IndexSchema.readSchema Reading Solr Schema from schema.xml
[junit4:junit4]   2> 475154 T1142 oasc.SolrConfig.<init> Loaded SolrConfig: solrconfig.xml
[junit4:junit4]   2> 475160 T1169 oasc.SolrConfig.<init> Loaded SolrConfig: solrconfig.xml
[junit4:junit4]   2> 475162 T1142 oass.IndexSchema.readSchema Reading Solr Schema from schema.xml
[junit4:junit4]   2> 475162 T1170 oass.IndexSchema.readSchema [awholynewcollection_0_shard1_replica3] Schema name=test
[junit4:junit4]   2> 475163 T1180 oass.IndexSchema.readSchema [awholynewcollection_0_shard1_replica2] Schema name=test
[junit4:junit4]   2> 475167 T1169 oass.IndexSchema.readSchema Reading Solr Schema from schema.xml
[junit4:junit4]   2> 475172 T1142 oass.IndexSchema.readSchema [awholynewcollection_0_shard2_replica5] Schema name=test
[junit4:junit4]   2> 475175 T1122 oasc.SolrConfig.<init> Loaded SolrConfig: solrconfig.xml
[junit4:junit4]   2> 475177 T1122 oass.IndexSchema.readSchema Reading Solr Schema from schema.xml
[junit4:junit4]   2> 475184 T1122 oass.IndexSchema.readSchema [awholynewcollection_0_shard3_replica1] Schema name=test
[junit4:junit4]   2> 475193 T1140 oasc.SolrConfig.<init> Loaded SolrConfig: solrconfig.xml
[junit4:junit4]   2> 475195 T1140 oass.IndexSchema.readSchema Reading Solr Schema from schema.xml
[junit4:junit4]   2> 475196 T1139 oasc.SolrConfig.<init> Loaded SolrConfig: solrconfig.xml
[junit4:junit4]   2> 475199 T1139 oass.IndexSchema.readSchema Reading Solr Schema from schema.xml
[junit4:junit4]   2> 475202 T1140 oass.IndexSchema.readSchema [awholynewcollection_0_shard1_replica5] Schema name=test
[junit4:junit4]   2> 475224 T1139 oass.IndexSchema.readSchema [awholynewcollection_0_shard3_replica5] Schema name=test
[junit4:junit4]   2> 475233 T1169 oass.IndexSchema.readSchema [awholynewcollection_0_shard2_replica3] Schema name=test
[junit4:junit4]   2> 475242 T1121 oasc.SolrConfig.<init> Loaded SolrConfig: solrconfig.xml
[junit4:junit4]   2> 475245 T1124 oasc.SolrConfig.<init> Loaded SolrConfig: solrconfig.xml
[junit4:junit4]   2> 475246 T1121 oass.IndexSchema.readSchema Reading Solr Schema from schema.xml
[junit4:junit4]   2> 475247 T1124 oass.IndexSchema.readSchema Reading Solr Schema from schema.xml
[junit4:junit4]   2> 475248 T1181 oasc.SolrConfig.<init> Loaded SolrConfig: solrconfig.xml
[junit4:junit4]   2> 475249 T1181 oass.IndexSchema.readSchema Reading Solr Schema from schema.xml
[junit4:junit4]   2> 475254 T1124 oass.IndexSchema.readSchema [awholynewcollection_0_shard1_replica1] Schema name=test
[junit4:junit4]   2> 475257 T1181 oass.IndexSchema.readSchema [awholynewcollection_0_shard3_replica2] Schema name=test
[junit4:junit4]   2> 475286 T1153 oasc.SolrConfig.<init> Loaded SolrConfig: solrconfig.xml
[junit4:junit4]   2> 475287 T1121 oass.IndexSchema.readSchema [awholynewcollection_0_shard2_replica1] Schema name=test
[junit4:junit4]   2> 475294 T1153 oass.IndexSchema.readSchema Reading Solr Schema from schema.xml
[junit4:junit4]   2> 475298 T1232 oasc.SolrConfig.<init> Loaded SolrConfig: solrconfig.xml
[junit4:junit4]   2> 475302 T1232 oass.IndexSchema.readSchema Reading Solr Schema from schema.xml
[junit4:junit4]   2> 475305 T1228 oasc.SolrConfig.<init> Loaded SolrConfig: solrconfig.xml
[junit4:junit4]   2> 475332 T1228 oass.IndexSchema.readSchema Reading Solr Schema from schema.xml
[junit4:junit4]   2> 475333 T1234 oasc.SolrConfig.<init> Loaded SolrConfig: solrconfig.xml
[junit4:junit4]   2> 475347 T1235 oasc.SolrConfig.<init> Loaded SolrConfig: solrconfig.xml
[junit4:junit4]   2> 475349 T1153 oass.IndexSchema.readSchema [awholynewcollection_0_shard3_replica4] Schema name=test
[junit4:junit4]   2> 475353 T1228 oass.IndexSchema.readSchema [awholynewcollection_0_shard4_replica4] Schema name=test
[junit4:junit4]   2> 475353 T1167 oasc.SolrConfig.<init> Loaded SolrConfig: solrconfig.xml
[junit4:junit4]   2> 475356 T1167 oass.IndexSchema.readSchema Reading Solr Schema from schema.xml
[junit4:junit4]   2> 475357 T1235 oass.IndexSchema.readSchema Reading Solr Schema from schema.xml
[junit4:junit4]   2> 475357 T1234 oass.IndexSchema.readSchema Reading Solr Schema from schema.xml
[junit4:junit4]   2> 475359 T1232 oass.IndexSchema.readSchema [awholynewcollection_0_shard5_replica3] Schema name=test
[junit4:junit4]   2> 475369 T1235 oass.IndexSchema.readSchema [awholynewcollection_0_shard5_replica4] Schema name=test
[junit4:junit4]   2> 475378 T1220 oasc.SolrConfig.<init> Loaded SolrConfig: solrconfig.xml
[junit4:junit4]   2> 475381 T1220 oass.IndexSchema.readSchema Reading Solr Schema from schema.xml
[junit4:junit4]   2> 475385 T1167 oass.IndexSchema.readSchema [awholynewcollection_0_shard4_replica3] Schema name=test
[junit4:junit4]   2> 475386 T1229 oasc.SolrConfig.<init> Loaded SolrConfig: solrconfig.xml
[junit4:junit4]   2> 475387 T1234 oass.IndexSchema.readSchema [awholynewcollection_0_shard5_replica5] Schema name=test
[junit4:junit4]   2> 475388 T1220 oass.IndexSchema.readSchema [awholynewcollection_0_shard4_replica1] Schema name=test
[junit4:junit4]   2> 475388 T1229 oass.IndexSchema.readSchema Reading Solr Schema from schema.xml
[junit4:junit4]   2> 475405 T1183 oasc.SolrConfig.<init> Loaded SolrConfig: solrconfig.xml
[junit4:junit4]   2> 475409 T1183 oass.IndexSchema.readSchema Reading Solr Schema from schema.xml
[junit4:junit4]   2> 475442 T1229 oass.IndexSchema.readSchema [awholynewcollection_0_shard5_replica2] Schema name=test
[junit4:junit4]   2> 475455 T1183 oass.IndexSchema.readSchema [awholynewcollection_0_shard2_replica2] Schema name=test
[junit4:junit4]   2> 475467 T1227 oasc.SolrConfig.<init> Loaded SolrConfig: solrconfig.xml
[junit4:junit4]   2> 475471 T1227 oass.IndexSchema.readSchema Reading Solr Schema from schema.xml
[junit4:junit4]   2> 475474 T1226 oasc.SolrConfig.<init> Loaded SolrConfig: solrconfig.xml
[junit4:junit4]   2> 475478 T1226 oass.IndexSchema.readSchema Reading Solr Schema from schema.xml
[junit4:junit4]   2> 475483 T1227 oass.IndexSchema.readSchema [awholynewcollection_0_shard5_replica1] Schema name=test
[junit4:junit4]   2> 475497 T1226 oass.IndexSchema.readSchema [awholynewcollection_0_shard4_replica2] Schema name=test
[junit4:junit4]   2> 475569 T1141 oasc.SolrConfig.<init> Loaded SolrConfig: solrconfig.xml
[junit4:junit4]   2> 475576 T1141 oass.IndexSchema.readSchema Reading Solr Schema from schema.xml
[junit4:junit4]   2> 475586 T1141 oass.IndexSchema.readSchema [awholynewcollection_0_shard4_replica5] Schema name=test
[junit4:junit4]   2> 476101 T1129 oascc.ZkStateReader.updateClusterState Updating cloud state from ZooKeeper... 
[junit4:junit4]   2> 476102 T1129 oasc.Overseer$ClusterStateUpdater.updateState Update state numShards=2 message={
[junit4:junit4]   2> 	  "operation":"state",
[junit4:junit4]   2> 	  "core_node_name":"127.0.0.1:39619__nodes_used_collection_shard1_replica1",
[junit4:junit4]   2> 	  "numShards":"2",
[junit4:junit4]   2> 	  "shard":"shard1",
[junit4:junit4]   2> 	  "roles":null,
[junit4:junit4]   2> 	  "state":"active",
[junit4:junit4]   2> 	  "shard_state":"active",
[junit4:junit4]   2> 	  "core":"nodes_used_collection_shard1_replica1",
[junit4:junit4]   2> 	  "collection":"nodes_used_collection",
[junit4:junit4]   2> 	  "shard_range":null,
[junit4:junit4]   2> 	  "node_name":"127.0.0.1:39619_",
[junit4:junit4]   2> 	  "base_url":"http://127.0.0.1:39619"}
[junit4:junit4]   2> 476109 T1129 oasc.Overseer$ClusterStateUpdater.updateState Update state numShards=2 message={
[junit4:junit4]   2> 	  "operation":"state",
[junit4:junit4]   2> 	  "core_node_name":"127.0.0.1:53187__nodes_used_collection_shard2_replica1",
[junit4:junit4]   2> 	  "numShards":"2",
[junit4:junit4]   2> 	  "shard":"shard2",
[junit4:junit4]   2> 	  "roles":null,
[junit4:junit4]   2> 	  "state":"active",
[junit4:junit4]   2> 	  "shard_state":"active",
[junit4:junit4]   2> 	  "core":"nodes_used_collection_shard2_replica1",
[junit4:junit4]   2> 	  "collection":"nodes_used_collection",
[junit4:junit4]   2> 	  "shard_range":null,
[junit4:junit4]   2> 	  "node_name":"127.0.0.1:53187_",
[junit4:junit4]   2> 	  "base_url":"http://127.0.0.1:53187"}
[junit4:junit4]   2> 476113 T1129 oasc.Overseer$ClusterStateUpdater.updateState Update state numShards=2 message={
[junit4:junit4]   2> 	  "operation":"state",
[junit4:junit4]   2> 	  "core_node_name":"127.0.0.1:43797__nodes_used_collection_shard2_replica2",
[junit4:junit4]   2> 	  "numShards":"2",
[junit4:junit4]   2> 	  "shard":"shard2",
[junit4:junit4]   2> 	  "roles":null,
[junit4:junit4]   2> 	  "state":"recovering",
[junit4:junit4]   2> 	  "shard_state":"active",
[junit4:junit4]   2> 	  "core":"nodes_used_collection_shard2_replica2",
[junit4:junit4]   2> 	  "collection":"nodes_used_collection",
[junit4:junit4]   2> 	  "shard_range":null,
[junit4:junit4]   2> 	  "node_name":"127.0.0.1:43797_",
[junit4:junit4]   2> 	  "base_url":"http://127.0.0.1:43797"}
[junit4:junit4]   2> 476118 T1129 oasc.Overseer$ClusterStateUpdater.updateState Update state numShards=2 message={
[junit4:junit4]   2> 	  "operation":"state",
[junit4:junit4]   2> 	  "core_node_name":"127.0.0.1:49858__nodes_used_collection_shard1_replica2",
[junit4:junit4]   2> 	  "numShards":"2",
[junit4:junit4]   2> 	  "shard":"shard1",
[junit4:junit4]   2> 	  "roles":null,
[junit4:junit4]   2> 	  "state":"recovering",
[junit4:junit4]   2> 	  "shard_state":"active",
[junit4:junit4]   2> 	  "core":"nodes_used_collection_shard1_replica2",
[junit4:junit4]   2> 	  "collection":"nodes_used_collection",
[junit4:junit4]   2> 	  "shard_range":null,
[junit4:junit4]   2> 	  "node_name":"127.0.0.1:49858_",
[junit4:junit4]   2> 	  "base_url":"http://127.0.0.1:49858"}
[junit4:junit4]   2> 476127 T1160 oascc.ZkStateReader$2.process A cluster state change: WatchedEvent state:SyncConnected type:NodeDataChanged path:/clusterstate.json, has occurred - updating... (live nodes size: 5)
[junit4:junit4]   2> 476128 T1203 oascc.ZkStateReader$2.process A cluster state change: WatchedEvent state:SyncConnected type:NodeDataChanged path:/clusterstate.json, has occurred - updating... (live nodes size: 5)
[junit4:junit4]   2> 476128 T1188 oascc.ZkStateReader$2.process A cluster state change: WatchedEvent state:SyncConnected type:NodeDataChanged path:/clusterstate.json, has occurred - updating... (live nodes size: 5)
[junit4:junit4]   2> 476128 T1128 oascc.ZkStateReader$2.process A cluster state change: WatchedEvent state:SyncConnected type:NodeDataChanged path:/clusterstate.json, has occurred - updating... (live nodes size: 5)
[junit4:junit4]   2> 476128 T1146 oascc.ZkStateReader$2.process A cluster state change: WatchedEvent state:SyncConnected type:NodeDataChanged path:/clusterstate.json, has occurred - updating... (live nodes size: 5)
[junit4:junit4]   2> 476128 T1174 oascc.ZkStateReader$2.process A cluster state change: WatchedEvent state:SyncConnected type:NodeDataChanged path:/clusterstate.json, has occurred - updating... (live nodes size: 5)
[junit4:junit4]   2> 476127 T1205 oascc.ZkStateReader$2.process A cluster state change: WatchedEvent state:SyncConnected type:NodeDataChanged path:/clusterstate.json, has occurred - updating... (live nodes size: 5)
[junit4:junit4]   2> 476128 T1133 oascc.ZkStateReader$2.process A cluster state change: WatchedEvent state:SyncConnected type:NodeDataChanged path:/clusterstate.json, has occurred - updating... (live nodes size: 5)
[junit4:junit4]   2> 476665 T1182 oasha.CoreAdminHandler.handleWaitForStateAction Waited coreNodeName: 127.0.0.1:49858__nodes_used_collection_shard1_replica2, state: recovering, checkLive: true, onlyIfLeader: true for: 2 seconds.
[junit4:junit4]   2> 476665 T1123 oasha.CoreAdminHandler.handleWaitForStateAction Waited coreNodeName: 127.0.0.1:43797__nodes_used_collection_shard2_replica2, state: recovering, checkLive: true, onlyIfLeader: true for: 2 seconds.
[junit4:junit4]   2> 476665 T1182 oass.SolrDispatchFilter.handleAdminRequest [admin] webapp=null path=/admin/cores params={coreNodeName=127.0.0.1:49858__nodes_used_collection_shard1_replica2&state=recovering&nodeName=127.0.0.1:49858_&action=PREPRECOVERY&checkLive=true&core=nodes_used_collection_shard1_replica1&wt=javabin&onlyIfLeader=true&version=2} status=0 QTime=2008 
[junit4:junit4]   2> 476666 T1123 oass.SolrDispatchFilter.handleAdminRequest [admin] webapp=null path=/admin/cores params={coreNodeName=127.0.0.1:43797__nodes_used_collection_shard2_replica2&state=recovering&nodeName=127.0.0.1:43797_&action=PREPRECOVERY&checkLive=true&core=nodes_used_collection_shard2_replica1&wt=javabin&onlyIfLeader=true&version=2} status=0 QTime=2021 
[junit4:junit4]   2> 477991 T1122 oass.OpenExchangeRatesOrgProvider.init Initialized with rates=open-exchange-rates.json, refreshInterval=1440.
[junit4:junit4]   2> 477992 T1156 oass.OpenExchangeRatesOrgProvider.init Initialized with rates=open-exchange-rates.json, refreshInterval=1440.
[junit4:junit4]   2> 478004 T1122 oass.IndexSchema.readSchema default search field in schema is text
[junit4:junit4]   2> 478022 T1181 oass.OpenExchangeRatesOrgProvider.init Initialized with rates=open-exchange-rates.json, refreshInterval=1440.
[junit4:junit4]   2> 478047 T1139 oass.OpenExchangeRatesOrgProvider.init Initialized with rates=open-exchange-rates.json, refreshInterval=1440.
[junit4:junit4]   2> 478048 T1156 oass.IndexSchema.readSchema default search field in schema is text
[junit4:junit4]   2> 478053 T1122 oass.IndexSchema.readSchema unique key field: id
[junit4:junit4]   2> 478071 T1169 oass.OpenExchangeRatesOrgProvider.init Initialized with rates=open-exchange-rates.json, refreshInterval=1440.
[junit4:junit4]   2> 478073 T1124 oass.OpenExchangeRatesOrgProvider.init Initialized with rates=open-exchange-rates.json, refreshInterval=1440.
[junit4:junit4]   2> 478076 T1170 oass.OpenExchangeRatesOrgProvider.init Initialized with rates=open-exchange-rates.json, refreshInterval=1440.
[junit4:junit4]   2> 478088 T1139 oass.IndexSchema.readSchema default search field in schema is text
[junit4:junit4]   2> 478088 T1170 oass.IndexSchema.readSchema default search field in schema is text
[junit4:junit4]   2> 478093 T1181 oass.IndexSchema.readSchema default search field in schema is text
[junit4:junit4]   2> 478093 T1156 oass.IndexSchema.readSchema unique key field: id
[junit4:junit4]   2> 478095 T1169 oass.IndexSchema.readSchema default search field in schema is text
[junit4:junit4]   2> 478100 T1122 oass.FileExchangeRateProvider.reload Reloading exchange rates from file currency.xml
[junit4:junit4]   2> 478103 T1169 oass.IndexSchema.readSchema unique key field: id
[junit4:junit4]   2> 478104 T1181 oass.IndexSchema.readSchema unique key field: id
[junit4:junit4]   2> 478107 T1168 oass.OpenExchangeRatesOrgProvider.init Initialized with rates=open-exchange-rates.json, refreshInterval=1440.
[junit4:junit4]   2> 478119 T1156 oass.FileExchangeRateProvider.reload Reloading exchange rates from file currency.xml
[junit4:junit4]   2> 478127 T1168 oass.IndexSchema.readSchema default search field in schema is text
[junit4:junit4]   2> 478130 T1181 oass.FileExchangeRateProvider.reload Reloading exchange rates from file currency.xml
[junit4:junit4]   2> 478134 T1124 oass.IndexSchema.readSchema default search field in schema is text
[junit4:junit4]   2> 478137 T1121 oass.OpenExchangeRatesOrgProvider.init Initialized with rates=open-exchange-rates.json, refreshInterval=1440.
[junit4:junit4]   2> 478138 T1124 oass.IndexSchema.readSchema unique key field: id
[junit4:junit4]   2> 478143 T1180 oass.OpenExchangeRatesOrgProvider.init Initialized with rates=open-exchange-rates.json, refreshInterval=1440.
[junit4:junit4]   2> 478144 T1139 oass.IndexSchema.readSchema unique key field: id
[junit4:junit4]   2> 478147 T1121 oass.IndexSchema.readSchema default search field in schema is text
[junit4:junit4]   2> 478151 T1121 oass.IndexSchema.readSchema unique key field: id
[junit4:junit4]   2> 478151 T1168 oass.IndexSchema.readSchema unique key field: id
[junit4:junit4]   2> 478154 T1169 oass.FileExchangeRateProvider.reload Reloading exchange rates from file currency.xml
[junit4:junit4]   2> 478161 T1122 oass.FileExchangeRateProvider.reload Reloading exchange rates from file currency.xml
[junit4:junit4]   2> 478169 T1167 oass.OpenExchangeRatesOrgProvider.init Initialized with rates=open-exchange-rates.json, refreshInterval=1440.
[junit4:junit4]   2> 478170 T1124 oass.FileExchangeRateProvider.reload Reloading exchange rates from file currency.xml
[junit4:junit4]   2> 478173 T1139 oass.FileExchangeRateProvider.reload Reloading exchange rates from file currency.xml
[junit4:junit4]   2> 478173 T1170 oass.IndexSchema.readSchema unique key field: id
[junit4:junit4]   2> 478177 T1122 oass.OpenExchangeRatesOrgProvider.reload Reloading exchange rates from open-exchange-rates.json
[junit4:junit4]   2> 478180 T1169 oass.FileExchangeRateProvider.reload Reloading exchange rates from file currency.xml
[junit4:junit4]   2> 478182 T1156 oass.FileExchangeRateProvider.reload Reloading exchange rates from file currency.xml
[junit4:junit4]   2> 478185 T1122 oass.OpenExchangeRatesOrgProvider$OpenExchangeRates.<init> WARN Unknown key IMPORTANT NOTE
[junit4:junit4]   2> 478186 T1122 oass.OpenExchangeRatesOrgProvider$OpenExchangeRates.<init> WARN Expected key, got STRING
[junit4:junit4]   2> 478186 T1122 oass.OpenExchangeRatesOrgProvider.reload Reloading exchange rates from open-exchange-rates.json
[junit4:junit4]   2> 478190 T1169 oass.OpenExchangeRatesOrgProvider.reload Reloading exchange rates from open-exchange-rates.json
[junit4:junit4]   2> 478190 T1167 oass.IndexSchema.readSchema default search field in schema is text
[junit4:junit4]   2> 478193 T1169 oass.OpenExchangeRatesOrgProvider$OpenExchangeRates.<init> WARN Unknown key IMPORTANT NOTE
[junit4:junit4]   2> 478195 T1169 oass.OpenExchangeRatesOrgProvider$OpenExchangeRates.<init> WARN Expected key, got STRING
[junit4:junit4]   2> 478196 T1169 oass.OpenExchangeRatesOrgProvider.reload Reloading exchange rates from open-exchange-rates.json
[junit4:junit4]   2> 478194 T1122 oass.OpenExchangeRatesOrgProvider$OpenExchangeRates.<init> WARN Unknown key IMPORTANT NOTE
[junit4:junit4]   2> 478197 T1180 oass.IndexSchema.readSchema default search field in schema is text
[junit4:junit4]   2> 478201 T1181 oass.FileExchangeRateProvider.reload Reloading exchange rates from file currency.xml
[junit4:junit4]   2> 478204 T1124 oass.FileExchangeRateProvider.reload Reloading exchange rates from file currency.xml
[junit4:junit4]   2> 478202 T1122 oass.OpenExchangeRatesOrgProvider$OpenExchangeRates.<init> WARN Expected key, got STRING
[junit4:junit4]   2> 478202 T1180 oass.IndexSchema.readSchema unique key field: id
[junit4:junit4]   2> 478226 T1122 oasc.SolrCore.initDirectoryFactory org.apache.solr.core.MockDirectoryFactory
[junit4:junit4]   2> 478227 T1122 oasc.SolrCore.<init> [awholynewcollection_0_shard3_replica1] Opening new SolrCore at /mnt/ssd/jenkins/workspace/Lucene-Solr-trunk-Linux/solr/build/solr-core/test/J1/./org.apache.solr.cloud.CollectionsAPIDistributedZkTest-controljetty-1370684274386/awholynewcollection_0_shard3_replica1/, dataDir=/mnt/ssd/jenkins/workspace/Lucene-Solr-trunk-Linux/solr/build/solr-core/test/J1/./org.apache.solr.cloud.CollectionsAPIDistributedZkTest-controljetty-1370684274386/awholynewcollection_0_shard3_replica1/data/
[junit4:junit4]   2> 478227 T1122 oasc.JmxMonitoredMap.<init> JMX monitoring is enabled. Adding Solr mbeans to JMX Server: com.sun.jmx.mbeanserver.JmxMBeanServer@9ef90e0
[junit4:junit4]   2> 478228 T1122 oasc.SolrCore.initDirectoryFactory org.apache.solr.core.MockDirectoryFactory
[junit4:junit4]   2> 478231 T1167 oass.IndexSchema.readSchema unique key field: id
[junit4:junit4]   2> 478231 T1142 oass.OpenExchangeRatesOrgProvider.init Initialized with rates=open-exchange-rates.json, refreshInterval=1440.
[junit4:junit4]   2> 478231 T1139 oass.FileExchangeRateProvider.reload Reloading exchange rates from file currency.xml
[junit4:junit4]   2> 478233 T1122 oasc.CachingDirectoryFactory.get return new directory for /mnt/ssd/jenkins/workspace/Lucene-Solr-trunk-Linux/solr/build/solr-core/test/J1/./org.apache.solr.cloud.CollectionsAPIDistributedZkTest-controljetty-1370684274386/awholynewcollection_0_shard3_replica1/data
[junit4:junit4]   2> 478233 T1122 oasc.SolrCore.getNewIndexDir New index directory detected: old=null new=/mnt/ssd/jenkins/workspace/Lucene-Solr-trunk-Linux/solr/build/solr-core/test/J1/./org.apache.solr.cloud.CollectionsAPIDistributedZkTest-controljetty-1370684274386/awholynewcollection_0_shard3_replica1/data/index/
[junit4:junit4]   2> 478234 T1122 oasc.SolrCore.initIndex WARN [awholynewcollection_0_shard3_replica1] Solr index directory '/mnt/ssd/jenkins/workspace/Lucene-Solr-trunk-Linux/solr/build/solr-core/test/J1/./org.apache.solr.cloud.CollectionsAPIDistributedZkTest-controljetty-1370684274386/awholynewcollection_0_shard3_replica1/data/index' doesn't exist. Creating new index...
[junit4:junit4]   2> 478234 T1122 oasc.CachingDirectoryFactory.get return new directory for /mnt/ssd/jenkins/workspace/Lucene-Solr-trunk-Linux/solr/build/solr-core/test/J1/./org.apache.solr.cloud.CollectionsAPIDistributedZkTest-controljetty-1370684274386/awholynewcollection_0_shard3_replica1/data/index
[junit4:junit4]   2> 478237 T1169 oass.OpenExchangeRatesOrgProvider$OpenExchangeRates.<init> WARN Unknown key IMPORTANT NOTE
[junit4:junit4]   2> 478237 T1169 oass.OpenExchangeRatesOrgProvider$OpenExchangeRates.<init> WARN Expected key, got STRING
[junit4:junit4]   2> 478238 T1169 oasc.SolrCore.initDirectoryFactory org.apache.solr.core.MockDirectoryFactory
[junit4:junit4]   2> 478238 T1169 oasc.SolrCore.<init> [awholynewcollection_0_shard2_replica3] Opening new SolrCore at /mnt/ssd/jenkins/workspace/Lucene-Solr-trunk-Linux/solr/build/solr-core/test/J1/./org.apache.solr.cloud.CollectionsAPIDistributedZkTest-jetty3-1370684276979/awholynewcollection_0_shard2_replica3/, dataDir=/mnt/ssd/jenkins/workspace/Lucene-Solr-trunk-Linux/solr/build/solr-core/test/J1/./org.apache.solr.cloud.CollectionsAPIDistributedZkTest-jetty3-1370684276979/awholynewcollection_0_shard2_replica3/data/
[junit4:junit4]   2> 478239 T1169 oasc.JmxMonitoredMap.<init> JMX monitoring is enabled. Adding Solr mbeans to JMX Server: com.sun.jmx.mbeanserver.JmxMBeanServer@9ef90e0
[junit4:junit4]   2> 478240 T1169 oasc.SolrCore.initDirectoryFactory org.apache.solr.core.MockDirectoryFactory
[junit4:junit4]   2> 478243 T1139 oass.OpenExchangeRatesOrgProvider.reload Reloading exchange rates from open-exchange-rates.json
[junit4:junit4]   2> 478237 T1170 oass.FileExchangeRateProvider.reload Reloading exchange rates from file currency.xml
[junit4:junit4]   2> 478245 T1122 oasc.SolrDeletionPolicy.onCommit SolrDeletionPolicy.onCommit: commits: num=1
[junit4:junit4]   2> 		commit{dir=MockDirWrapper(org.apache.lucene.store.RAMDirectory@47d84d9f lockFactory=org.apache.lucene.store.NativeFSLockFactory@d72f242),segFN=segments_1,generation=1}
[junit4:junit4]   2> 478246 T1122 oasc.SolrDeletionPolicy.updateCommits newest commit generation = 1
[junit4:junit4]   2> 478249 T1122 oasup.UpdateRequestProcessorChain.init inserting DistributedUpdateProcessorFactory into updateRequestProcessorChain "dedupe"
[junit4:junit4]   2> 478257 T1170 oass.FileExchangeRateProvider.reload Reloading exchange rates from file currency.xml
[junit4:junit4]   2> 478257 T1122 oasup.UpdateRequestProcessorChain.init inserting DistributedUpdateProcessorFactory into updateRequestProcessorChain "stored_sig"
[junit4:junit4]   2> 478254 T1168 oass.FileExchangeRateProvider.reload Reloading exchange rates from file currency.xml
[junit4:junit4]   2> 478261 T1122 oasup.UpdateRequestProcessorChain.init inserting DistributedUpdateProcessorFactory into updateRequestProcessorChain "distrib-dup-test-chain-implicit"
[junit4:junit4]   2> 478260 T1169 oasc.CachingDirectoryFactory.get return new directory for /mnt/ssd/jenkins/workspace/Lucene-Solr-trunk-Linux/solr/build/solr-core/test/J1/./org.apache.solr.cloud.CollectionsAPIDistributedZkTest-jetty3-1370684276979/awholynewcollection_0_shard2_replica3/data
[junit4:junit4]   2> 478260 T1121 oass.FileExchangeRateProvider.reload Reloading exchange rates from file currency.xml
[junit4:junit4]   2> 478261 T1169 oasc.SolrCore.getNewIndexDir New index directory detected: old=null new=/mnt/ssd/jenkins/workspace/Lucene-Solr-trunk-Linux/solr/build/solr-core/test/J1/./org.apache.solr.cloud.CollectionsAPIDistributedZkTest-jetty3-1370684276979/awholynewcollection_0_shard2_replica3/data/index/
[junit4:junit4]   2> 478262 T1169 oasc.SolrCore.initIndex WARN [awholynewcollection_0_shard2_replica3] Solr index directory '/mnt/ssd/jenkins/workspace/Lucene-Solr-trunk-Linux/solr/build/solr-core/test/J1/./org.apache.solr.cloud.CollectionsAPIDistributedZkTest-jetty3-1370684276979/awholynewcollection_0_shard2_replica3/data/index' doesn't exist. Creating new index...
[junit4:junit4]   2> 478263 T1169 oasc.CachingDirectoryFactory.get return new directory for /mnt/ssd/jenkins/workspace/Lucene-Solr-trunk-Linux/solr/build/solr-core/test/J1/./org.apache.solr.cloud.CollectionsAPIDistributedZkTest-jetty3-1370684276979/awholynewcollection_0_shard2_replica3/data/index
[junit4:junit4]   2> 478265 T1181 oass.OpenExchangeRatesOrgProvider.reload Reloading exchange rates from open-exchange-rates.json
[junit4:junit4]   2> 478265 T1169 oasc.SolrDeletionPolicy.onCommit SolrDeletionPolicy.onCommit: commits: num=1
[junit4:junit4]   2> 		commit{dir=MockDirWrapper(org.apache.lucene.store.RAMDirectory@34eb67b7 lockFactory=org.apache.lucene.store.NativeFSLockFactory@71075bec),segFN=segments_1,generation=1}
[junit4:junit4]   2> 478266 T1169 oasc.SolrDeletionPolicy.updateCommits newest commit generation = 1
[junit4:junit4]   2> 478266 T1168 oass.FileExchangeRateProvider.reload Reloading exchange rates from file currency.xml
[junit4:junit4]   2> 478268 T1139 oass.OpenExchangeRatesOrgProvider$OpenExchangeRates.<init> WARN Unknown key IMPORTANT NOTE
[junit4:junit4]   2> 478272 T1139 oass.OpenExchangeRatesOrgProvider$OpenExchangeRates.<init> WARN Expected key, got STRING
[junit4:junit4]   2> 478273 T1139 oass.OpenExchangeRatesOrgProvider.reload Reloading exchange rates from open-exchange-rates.json
[junit4:junit4]   2> 478276 T1139 oass.OpenExchangeRatesOrgProvider$OpenExchangeRates.<init> WARN Unknown key IMPORTANT NOTE
[junit4:junit4]   2> 478278 T1139 oass.OpenExchangeRatesOrgProvider$OpenExchangeRates.<init> WARN Expected key, got STRING
[junit4:junit4]   2> 478278 T1139 oasc.SolrCore.initDirectoryFactory org.apache.solr.core.MockDirectoryFactory
[junit4:junit4]   2> 478270 T1122 oasc.RequestHandlers.initHandlersFromConfig created standard: solr.StandardRequestHandler
[junit4:junit4]   2> 478280 T1122 oasc.RequestHandlers.initHandlersFromConfig created /get: solr.RealTimeGetHandler
[junit4:junit4]   2> 478280 T1122 oasc.RequestHandlers.initHandlersFromConfig adding lazy requestHandler: solr.ReplicationHandler
[junit4:junit4]   2> 478281 T1122 oasc.RequestHandlers.initHandlersFromConfig created /replication: solr.ReplicationHandler
[junit4:junit4]   2> 478281 T1122 oasc.RequestHandlers.initHandlersFromConfig created /update: solr.UpdateRequestHandler
[junit4:junit4]   2> 478282 T1122 oasc.RequestHandlers.initHandlersFromConfig created /admin/: org.apache.solr.handler.admin.AdminHandlers
[junit4:junit4]   2> 478286 T1122 oashl.XMLLoader.init xsltCacheLifetimeSeconds=60
[junit4:junit4]   2> 478272 T1169 oasup.UpdateRequestProcessorChain.init inserting DistributedUpdateProcessorFactory into updateRequestProcessorChain "dedupe"
[junit4:junit4]   2> 478287 T1169 oasup.UpdateRequestProcessorChain.init inserting DistributedUpdateProcessorFactory into updateRequestProcessorChain "stored_sig"
[junit4:junit4]   2> 478288 T1169 oasup.UpdateRequestProcessorChain.init inserting DistributedUpdateProcessorFactory into updateRequestProcessorChain "distrib-dup-test-chain-implicit"
[junit4:junit4]   2> 478289 T1169 oasc.RequestHandlers.initHandlersFromConfig created standard: solr.StandardRequestHandler
[junit4:junit4]   2> 478290 T1169 oasc.RequestHandlers.initHandlersFromConfig created /get: solr.RealTimeGetHandler
[junit4:junit4]   2> 478290 T1169 oasc.RequestHandlers.initHandlersFromConfig adding lazy requestHandler: solr.ReplicationHandler
[junit4:junit4]   2> 478291 T1169 oasc.RequestHandlers.initHandlersFromConfig created /replication: solr.ReplicationHandler
[junit4:junit4]   2> 478291 T1124 oass.OpenExchangeRatesOrgProvider.reload Reloading exchange rates from open-exchange-rates.json
[junit4:junit4]   2> 478279 T1139 oasc.SolrCore.<init> [awholynewcollection_0_shard3_replica5] Opening new SolrCore at /mnt/ssd/jenkins/workspace/Lucene-Solr-trunk-Linux/solr/build/solr-core/test/J1/./org.apache.solr.cloud.CollectionsAPIDistributedZkTest-jetty1-1370684274614/awholynewcollection_0_shard3_replica5/, dataDir=/mnt/ssd/jenkins/workspace/Lucene-Solr-trunk-Linux/solr/build/solr-core/test/J1/./org.apache.solr.cloud.CollectionsAPIDistributedZkTest-jetty1-1370684274614/awholynewcollection_0_shard3_replica5/data/
[junit4:junit4]   2> 478293 T1139 oasc.JmxMonitoredMap.<init> JMX monitoring is enabled. Adding Solr mbeans to JMX Server: com.sun.jmx.mbeanserver.JmxMBeanServer@9ef90e0
[junit4:junit4]   2> 478294 T1180 oass.FileExchangeRateProvider.reload Reloading exchange rates from file currency.xml
[junit4:junit4]   2> 478294 T1228 oass.OpenExchangeRatesOrgProvider.init Initialized with rates=open-exchange-rates.json, refreshInterval=1440.
[junit4:junit4]   2> 478295 T1124 oass.OpenExchangeRatesOrgProvider$OpenExchangeRates.<init> WARN Unknown key IMPORTANT NOTE
[junit4:junit4]   2> 478296 T1124 oass.OpenExchangeRatesOrgProvider$OpenExchangeRates.<init> WARN Expected key, got STRING
[junit4:junit4]   2> 478296 T1124 oass.OpenExchangeRatesOrgProvider.reload Reloading exchange rates from open-exchange-rates.json
[junit4:junit4]   2> 478292 T1169 oasc.RequestHandlers.initHandlersFromConfig created /update: solr.UpdateRequestHandler
[junit4:junit4]   2> 478291 T1170 oass.OpenExchangeRatesOrgProvider.reload Reloading exchange rates from open-exchange-rates.json
[junit4:junit4]   2> 478312 T1122 oass.SolrIndexSearcher.<init> Opening Searcher@20fdb0a6 main
[junit4:junit4]   2> 478313 T1122 oasu.UpdateHandler.clearLog Clearing tlog files, tlogDir=/mnt/ssd/jenkins/workspace/Lucene-Solr-trunk-Linux/solr/build/solr-core/test/J1/./org.apache.solr.cloud.CollectionsAPIDistributedZkTest-controljetty-1370684274386/awholynewcollection_0_shard3_replica1/data/tlog
[junit4:junit4]   2> 478313 T1121 oass.FileExchangeRateProvider.reload Reloading exchange rates from file currency.xml
[junit4:junit4]   2> 478314 T1122 oasu.CommitTracker.<init> Hard AutoCommit: disabled
[junit4:junit4]   2> 478314 T1122 oasu.CommitTracker.<init> Soft AutoCommit: disabled
[junit4:junit4]   2> 478311 T1169 oasc.RequestHandlers.initHandlersFromConfig created /admin/: org.apache.solr.handler.admin.AdminHandlers
[junit4:junit4]   2> 478310 T1229 oass.OpenExchangeRatesOrgProvider.init Initialized with rates=open-exchange-rates.json, refreshInterval=1440.
[junit4:junit4]   2> 478307 T1142 oass.IndexSchema.readSchema default search field in schema is text
[junit4:junit4]   2> 478305 T1167 oass.FileExchangeRateProvider.reload Reloading exchange rates from file currency.xml
[junit4:junit4]   2> 478305 T1124 oass.OpenExchangeRatesOrgProvider$OpenExchangeRates.<init> WARN Unknown key IMPORTANT NOTE
[junit4:junit4]   2> 478301 T1180 oass.FileExchangeRateProvider.reload Reloading exchange rates from file currency.xml
[junit4:junit4]   2> 478298 T1181 oass.OpenExchangeRatesOrgProvider$OpenExchangeRates.<init> WARN Unknown key IMPORTANT NOTE
[junit4:junit4]   2> 478326 T1181 oass.OpenExchangeRatesOrgProvider$OpenExchangeRates.<init> WARN Expected key, got STRING
[junit4:junit4]   2> 478298 T1156 oass.OpenExchangeRatesOrgProvider.reload Reloading exchange rates from open-exchange-rates.json
[junit4:junit4]   2> 478327 T1246 oasc.SolrCore.registerSearcher [awholynewcollection_0_shard3_replica1] Registered new searcher Searcher@20fdb0a6 main{StandardDirectoryReader(segments_1:1)}
[junit4:junit4]   2> 478329 T1169 oashl.XMLLoader.init xsltCacheLifetimeSeconds=60
[junit4:junit4]   2> 478330 T1121 oass.OpenExchangeRatesOrgProvider.reload Reloading exchange rates from open-exchange-rates.json
[junit4:junit4]   2> 478332 T1154 oass.OpenExchangeRatesOrgProvider.init Initialized with rates=open-exchange-rates.json, refreshInterval=1440.
[junit4:junit4]   2> 478336 T1140 oass.OpenExchangeRatesOrgProvider.init Initialized with rates=open-exchange-rates.json, refreshInterval=1440.
[junit4:junit4]   2> 478294 T1139 oasc.SolrCore.initDirectoryFactory org.apache.solr.core.MockDirectoryFactory
[junit4:junit4]   2> 478338 T1139 oasc.CachingDirectoryFactory.get return new directory for /mnt/ssd/jenkins/workspace/Lucene-Solr-trunk-Linux/solr/build/solr-core/test/J1/./org.apache.solr.cloud.CollectionsAPIDistributedZkTest-jetty1-1370684274614/awholynewcollection_0_shard3_replica5/data
[junit4:junit4]   2> 478338 T1139 oasc.SolrCore.getNewIndexDir New index directory detected: old=null new=/mnt/ssd/jenkins/workspace/Lucene-Solr-trunk-Linux/solr/build/solr-core/test/J1/./org.apache.solr.cloud.CollectionsAPIDistributedZkTest-jetty1-1370684274614/awholynewcollection_0_shard3_replica5/data/index/
[junit4:junit4]   2> 478339 T1139 oasc.SolrCore.initIndex WARN [awholynewcollection_0_shard3_replica5] Solr index directory '/mnt/ssd/jenkins/workspace/Lucene-Solr-trunk-Linux/solr/build/solr-core/test/J1/./org.apache.solr.cloud.CollectionsAPIDistributedZkTest-jetty1-1370684274614/awholynewcollection_0_shard3_replica5/data/index' doesn't exist. Creating new index...
[junit4:junit4]   2> 478339 T1139 oasc.CachingDirectoryFactory.get return new directory for /mnt/ssd/jenkins/workspace/Lucene-Solr-trunk-Linux/solr/build/solr-core/test/J1/./org.apache.solr.cloud.CollectionsAPIDistributedZkTest-jetty1-1370684274614/awholynewcollection_0_shard3_replica5/data/index
[junit4:junit4]   2> 478330 T1167 oass.FileExchangeRateProvider.reload Reloading exchange rates from file currency.xml
[junit4:junit4]   2> 478341 T1156 oass.OpenExchangeRatesOrgProvider$OpenExchangeRates.<init> WARN Unknown key IMPORTANT NOTE
[junit4:junit4]   2> 478341 T1156 oass.OpenExchangeRatesOrgProvider$OpenExchangeRates.<init> WARN Expected key, got STRING
[junit4:junit4]   2> 478342 T1156 oass.OpenExchangeRatesOrgProvider.reload Reloading exchange rates from open-exchange-rates.json
[junit4:junit4]   2> 478327 T1181 oass.OpenExchangeRatesOrgProvider.reload Reloading exchange rates from open-exchange-rates.json
[junit4:junit4]   2> 478325 T1124 oass.OpenExchangeRatesOrgProvider$OpenExchangeRates.<init> WARN Expected key, got STRING
[junit4:junit4]   2> 478325 T1228 oass.IndexSchema.readSchema default search field in schema is text
[junit4:junit4]   2> 478314 T1168 oass.OpenExchangeRatesOrgProvider.reload Reloading exchange rates from open-exchange-rates.json
[junit4:junit4]   2> 478312 T1170 oass.OpenExchangeRatesOrgProvider$OpenExchangeRates.<init> WARN Unknown key IMPORTANT NOTE
[junit4:junit4]   2> 478344 T1170 oass.OpenExchangeRatesOrgProvider$OpenExchangeRates.<init> WARN Expected key, got STRING
[junit4:junit4]   2> 478345 T1170 oass.OpenExchangeRatesOrgProvider.reload Reloading exchange rates from open-exchange-rates.json
[junit4:junit4]   2> 478345 T1168 oass.OpenExchangeRatesOrgProvider$OpenExchangeRates.<init> WARN Unknown key IMPORTANT NOTE
[junit4:junit4]   2> 478346 T1168 oass.OpenExchangeRatesOrgProvider$OpenExchangeRates.<init> WARN Expected key, got STRING
[junit4:junit4]   2> 478346 T1168 oass.OpenExchangeRatesOrgProvider.reload Reloading exchange rates from open-exchange-rates.json
[junit4:junit4]   2> 478344 T1156 oass.OpenExchangeRatesOrgProvider$OpenExchangeRates.<init> WARN Unknown key IMPORTANT NOTE
[junit4:junit4]   2> 478348 T1156 oass.OpenExchangeRatesOrgProvider$OpenExchangeRates.<init> WARN Expected key, got STRING
[junit4:junit4]   2> 478344 T1181 oass.OpenExchangeRatesOrgProvider$OpenExchangeRates.<init> WARN Unknown key IMPORTANT NOTE
[junit4:junit4]   2> 478349 T1181 oass.OpenExchangeRatesOrgProvider$OpenExchangeRates.<init> WARN Expected key, got STRING
[junit4:junit4]   2> 478349 T1122 oasc.ZkController.publish publishing core=awholynewcollection_0_shard3_replica1 state=down
[junit4:junit4]   2> 478343 T1124 oasc.SolrCore.initDirectoryFactory org.apache.solr.core.MockDirectoryFactory
[junit4:junit4]   2> 478350 T1124 oasc.SolrCore.<init> [awholynewcollection_0_shard1_replica1] Opening new SolrCore at /mnt/ssd/jenkins/workspace/Lucene-Solr-trunk-Linux/solr/build/solr-core/test/J1/./org.apache.solr.cloud.CollectionsAPIDistributedZkTest-controljetty-1370684274386/awholynewcollection_0_shard1_replica1/, dataDir=/mnt/ssd/jenkins/workspace/Lucene-Solr-trunk-Linux/solr/build/solr-core/test/J1/./org.apache.solr.cloud.CollectionsAPIDistributedZkTest-controljetty-1370684274386/awholynewcollection_0_shard1_replica1/data/
[junit4:junit4]   2> 478351 T1124 oasc.JmxMonitoredMap.<init> JMX monitoring is enabled. Adding Solr mbeans to JMX Server: com.sun.jmx.mbeanserver.JmxMBeanServer@9ef90e0
[junit4:junit4]   2> 478351 T1124 oasc.SolrCore.initDirectoryFactory org.apache.solr.core.MockDirectoryFactory
[junit4:junit4]   2> 478343 T1139 oasc.SolrDeletionPolicy.onCommit SolrDeletionPolicy.onCommit: commits: num=1
[junit4:junit4]   2> 		commit{dir=MockDirWrapper(org.apache.lucene.store.RAMDirectory@7e5be53e lockFactory=org.apache.lucene.store.NativeFSLockFactory@58b73780),segFN=segments_1,generation=1}
[junit4:junit4]   2> 478354 T1139 oasc.SolrDeletionPolicy.updateCommits newest commit generation = 1
[junit4:junit4]   2> 478354 T1124 oasc.CachingDirectoryFactory.get return new directory for /mnt/ssd/jenkins/workspace/Lucene-Solr-trunk-Linux/solr/build/solr-core/test/J1/./org.apache.solr.cloud.CollectionsAPIDistributedZkTest-controljetty-1370684274386/awholynewcollection_0_shard1_replica1/data
[junit4:junit4]   2> 478355 T1124 oasc.SolrCore.getNewIndexDir New index directory detected: old=null new=/mnt/ssd/jenkins/workspace/Lucene-Solr-trunk-Linux/solr/build/solr-core/test/J1/./org.apache.solr.cloud.CollectionsAPIDistributedZkTest-controljetty-1370684274386/awholynewcollection_0_shard1_replica1/data/index/
[junit4:junit4]   2> 478355 T1124 oasc.SolrCore.initIndex WARN [awholynewcollection_0_shard1_replica1] Solr index directory '/mnt/ssd/jenkins/workspace/Lucene-Solr-trunk-Linux/solr/build/solr-core/test/J1/./org.apache.solr.cloud.CollectionsAPIDistributedZkTest-controljetty-1370684274386/awholynewcollection_0_shard1_replica1/data/index' doesn't exist. Creating new index...
[junit4:junit4]   2> 478342 T1229 oass.IndexSchema.readSchema default search field in schema is text
[junit4:junit4]   2> 478340 T1180 oass.OpenExchangeRatesOrgProvider.reload Reloading exchange rates from open-exchange-rates.json
[junit4:junit4]   2> 478338 T1121 oass.OpenExchangeRatesOrgProvider$OpenExchangeRates.<init> WARN Unknown key IMPORTANT NOTE
[junit4:junit4]   2> 478357 T1121 oass.OpenExchangeRatesOrgProvider$OpenExchangeRates.<init> WARN Expected key, got STRING
[junit4:junit4]   2> 478358 T1121 oass.OpenExchangeRatesOrgProvider.reload Reloading exchange rates from open-exchange-rates.json
[junit4:junit4]   2> 478357 T1124 oasc.CachingDirectoryFactory.get return new directory for /mnt/ssd/jenkins/workspace/Lucene-Solr-trunk-Linux/solr/build/solr-core/test/J1/./org.apache.solr.cloud.CollectionsAPIDistributedZkTest-controljetty-1370684274386/awholynewcollection_0_shard1_replica1/data/index
[junit4:junit4]   2> 478355 T1142 oass.IndexSchema.readSchema unique key field: id
[junit4:junit4]   2> 478359 T1121 oass.OpenExchangeRatesOrgProvider$OpenExchangeRates.<init> WARN Unknown key IMPORTANT NOTE
[junit4:junit4]   2> 478359 T1121 oass.OpenExchangeRatesOrgProvider$OpenExchangeRates.<init> WARN Expected key, got STRING
[junit4:junit4]   2> 478360 T1121 oasc.SolrCore.initDirectoryFactory org.apache.solr.core.MockDirectoryFactory
[junit4:junit4]   2> 478360 T1121 oasc.SolrCore.<init> [awholynewcollection_0_shard2_replica1] Opening new SolrCore at /mnt/ssd/jenkins/workspace/Lucene-Solr-trunk-Linux/solr/build/solr-core/test/J1/./org.apache.solr.cloud.CollectionsAPIDistributedZkTest-controljetty-1370684274386/awholynewcollection_0_shard2_replica1/, dataDir=/mnt/ssd/jenkins/workspace/Lucene-Solr-trunk-Linux/solr/build/solr-core/test/J1/./org.apache.solr.cloud.CollectionsAPIDistributedZkTest-controljetty-1370684274386/awholynewcollection_0_shard2_replica1/data/
[junit4:junit4]   2> 478361 T1121 oasc.JmxMonitoredMap.<init> JMX monitoring is enabled. Adding Solr mbeans to JMX Server: com.sun.jmx.mbeanserver.JmxMBeanServer@9ef90e0
[junit4:junit4]   2> 478362 T1121 oasc.SolrCore.initDirectoryFactory org.apache.solr.core.MockDirectoryFactory
[junit4:junit4]   2> 478354 T1154 oass.IndexSchema.readSchema default search field in schema is text
[junit4:junit4]   2> 478350 T1169 oass.SolrIndexSearcher.<init> Opening Searcher@150c44c3 main
[junit4:junit4]   2> 478350 T1167 oass.OpenExchangeRatesOrgProvider.reload Reloading exchange rates from open-exchange-rates.json
[junit4:junit4]   2> 478349 T1181 oasc.SolrCore.initDirectoryFactory org.apache.solr.core.MockDirectoryFactory
[junit4:junit4]   2> 478349 T1168 oass.OpenExchangeRatesOrgProvider$OpenExchangeRates.<init> WARN Unknown key IMPORTANT NOTE
[junit4:junit4]   2> 478348 T1156 oasc.SolrCore.initDirectoryFactory org.apache.solr.core.MockDirectoryFactory
[junit4:junit4]   2> 478347 T1228 oass.IndexSchema.readSchema unique key field: id
[junit4:junit4]   2> 478346 T1170 oass.OpenExchangeRatesOrgProvider$OpenExchangeRates.<init> WARN Unknown key IMPORTANT NOTE
[junit4:junit4]   2> 478373 T1170 oass.OpenExchangeRatesOrgProvider$OpenExchangeRates.<init> WARN Expected key, got STRING
[junit4:junit4]   2> 478374 T1170 oasc.SolrCore.initDirectoryFactory org.apache.solr.core.MockDirectoryFactory
[junit4:junit4]   2> 478374 T1229 oass.IndexSchema.readSchema unique key field: id
[junit4:junit4]   2> 478346 T1153 oass.OpenExchangeRatesOrgProvider.init Initialized with rates=open-exchange-rates.json, refreshInterval=1440.
[junit4:junit4]   2> 478372 T1167 oass.OpenExchangeRatesOrgProvider$OpenExchangeRates.<init> WARN Unknown key IMPORTANT NOTE
[junit4:junit4]   2> 478376 T1167 oass.OpenExchangeRatesOrgProvider$OpenExchangeRates.<init> WARN Expected key, got STRING
[junit4:junit4]   2> 478372 T1168 oass.OpenExchangeRatesOrgProvider$OpenExchangeRates.<init> WARN Expected key, got STRING
[junit4:junit4]   2> 478377 T1168 oasc.SolrCore.initDirectoryFactory org.apache.solr.core.MockDirectoryFactory
[junit4:junit4]   2> 478369 T1124 oasc.SolrDeletionPolicy.onCommit SolrDeletionPolicy.onCommit: commits: num=1
[junit4:junit4]   2> 		commit{dir=MockDirWrapper(org.apache.lucene.store.RAMDirectory@7b4aabb8 lockFactory=org.apache.lucene.store.NativeFSLockFactory@4b5c1b01),segFN=segments_1,generation=1}
[junit4:junit4]   2> 478378 T1124 oasc.SolrDeletionPolicy.updateCommits newest commit generation = 1
[junit4:junit4]   2> 478367 T1140 oass.IndexSchema.readSchema default search field in schema is text
[junit4:junit4]   2> 478366 T1121 oasc.CachingDirectoryFactory.get return new directory for /mnt/ssd/jenkins/workspace/Lucene-Solr-trunk-Linux/solr/build/solr-core/test/J1/./org.apache.solr.cloud.CollectionsAPIDistributedZkTest-controljetty-1370684274386/awholynewcollection_0_shard2_replica1/data
[junit4:junit4]   2> 478383 T1121 oasc.SolrCore.getNewIndexDir New index directory detected: old=null new=/mnt/ssd/jenkins/workspace/Lucene-Solr-trunk-Linux/solr/build/solr-core/test/J1/./org.apache.solr.cloud.CollectionsAPIDistributedZkTest-controljetty-1370684274386/awholynewcollection_0_shard2_replica1/data/index/
[junit4:junit4]   2> 478384 T1121 oasc.SolrCore.initIndex WARN [awholynewcollection_0_shard2_replica1] Solr index directory '/mnt/ssd/jenkins/workspace/Lucene-Solr-trunk-Linux/solr/build/solr-core/test/J1/./org.apache.solr.cloud.CollectionsAPIDistributedZkTest-controljetty-1370684274386/awholynewcollection_0_shard2_replica1/data/index' doesn't exist. Creating new index...
[junit4:junit4]   2> 478385 T1121 oasc.CachingDirectoryFactory.get return new directory for /mnt/ssd/jenkins/workspace/Lucene-Solr-trunk-Linux/solr/build/solr-core/test/J1/./org.apache.solr.cloud.CollectionsAPIDistributedZkTest-controljetty-1370684274386/awholynewcollection_0_shard2_replica1/data/index
[junit4:junit4]   2> 478361 T1139 oasup.UpdateRequestProcessorChain.init inserting DistributedUpdateProcessorFactory into updateRequestProcessorChain "dedupe"
[junit4:junit4]   2> 478387 T1139 oasup.UpdateRequestProcessorChain.init inserting DistributedUpdateProcessorFactory into updateRequestProcessorChain "stored_sig"
[junit4:junit4]   2> 478358 T1180 oass.OpenExchangeRatesOrgProvider$OpenExchangeRates.<init> WARN Unknown key IMPORTANT NOTE
[junit4:junit4]   2> 478388 T1139 oasup.UpdateRequestProcessorChain.init inserting DistributedUpdateProcessorFactory into updateRequestProcessorChain "distrib-dup-test-chain-implicit"
[junit4:junit4]   2> 478383 T1124 oasup.UpdateRequestProcessorChain.init inserting DistributedUpdateProcessorFactory into updateRequestProcessorChain "dedupe"
[junit4:junit4]   2> 478377 T1168 oasc.SolrCore.<init> [awholynewcollection_0_shard3_replica3] Opening new SolrCore at /mnt/ssd/jenkins/workspace/Lucene-Solr-trunk-Linux/solr/build/solr-core/test/J1/./org.apache.solr.cloud.CollectionsAPIDistributedZkTest-jetty3-1370684276979/awholynewcollection_0_shard3_replica3/, dataDir=/mnt/ssd/jenkins/workspace/Lucene-Solr-trunk-Linux/solr/build/solr-core/test/J1/./org.apache.solr.cloud.CollectionsAPIDistributedZkTest-jetty3-1370684276979/awholynewcollection_0_shard3_replica3/data/
[junit4:junit4]   2> 478376 T1167 oass.OpenExchangeRatesOrgProvider.reload Reloading exchange rates from open-exchange-rates.json
[junit4:junit4]   2> 478391 T1142 oass.FileExchangeRateProvider.reload Reloading exchange rates from file currency.xml
[junit4:junit4]   2> 478391 T1154 oass.IndexSchema.readSchema unique key field: id
[junit4:junit4]   2> 478376 T1183 oass.OpenExchangeRatesOrgProvider.init Initialized with rates=open-exchange-rates.json, refreshInterval=1440.
[junit4:junit4]   2> 478376 T1169 oasu.UpdateHandler.clearLog Clearing tlog files, tlogDir=/mnt/ssd/jenkins/workspace/Lucene-Solr-trunk-Linux/solr/build/solr-core/test/J1/./org.apache.solr.cloud.CollectionsAPIDistributedZkTest-jetty3-1370684276979/awholynewcollection_0_shard2_replica3/data/tlog
[junit4:junit4]   2> 478396 T1169 oasu.CommitTracker.<init> Hard AutoCommit: disabled
[junit4:junit4]   2> 478396 T1169 oasu.CommitTracker.<init> Soft AutoCommit: disabled
[junit4:junit4]   2> 478398 T1220 oass.OpenExchangeRatesOrgProvider.init Initialized with rates=open-exchange-rates.json, refreshInterval=1440.
[junit4:junit4]   2> 478400 T1247 oasc.SolrCore.registerSearcher [awholynewcollection_0_shard2_replica3] Registered new searcher Searcher@150c44c3 main{StandardDirectoryReader(segments_1:1)}
[junit4:junit4]   2> 478401 T1228 oass.FileExchangeRateProvider.reload Reloading exchange rates from file currency.xml
[junit4:junit4]   2> 478403 T1169 oasc.ZkController.publish publishing core=awholynewcollection_0_shard2_replica3 state=down
[junit4:junit4]   2> 478405 T1234 oass.OpenExchangeRatesOrgProvider.init Initialized with rates=open-exchange-rates.json, refreshInterval=1440.
[junit4:junit4]   2> 478376 T1181 oasc.SolrCore.<init> [awholynewcollection_0_shard3_replica2] Opening new SolrCore at /mnt/ssd/jenkins/workspace/Lucene-Solr-trunk-Linux/solr/build/solr-core/test/J1/./org.apache.solr.cloud.CollectionsAPIDistributedZkTest-jetty4-1370684278165/awholynewcollection_0_shard3_replica2/, dataDir=/mnt/ssd/jenkins/workspace/Lucene-Solr-trunk-Linux/solr/build/solr-core/test/J1/./org.apache.solr.cloud.CollectionsAPIDistributedZkTest-jetty4-1370684278165/awholynewcollection_0_shard3_replica2/data/
[junit4:junit4]   2> 478376 T1156 oasc.SolrCore.<init> [awholynewcollection_0_shard1_replica4] Opening new SolrCore at /mnt/ssd/jenkins/workspace/Lucene-Solr-trunk-Linux/solr/build/solr-core/test/J1/./org.apache.solr.cloud.CollectionsAPIDistributedZkTest-jetty2-1370684275792/awholynewcollection_0_shard1_replica4/, dataDir=/mnt/ssd/jenkins/workspace/Lucene-Solr-trunk-Linux/solr/build/solr-core/test/J1/./org.apache.solr.cloud.CollectionsAPIDistributedZkTest-jetty2-1370684275792/awholynewcollection_0_shard1_replica4/data/
[junit4:junit4]   2> 478409 T1156 oasc.JmxMonitoredMap.<init> JMX monitoring is enabled. Adding Solr mbeans to JMX Server: com.sun.jmx.mbeanserver.JmxMBeanServer@9ef90e0
[junit4:junit4]   2> 478410 T1156 oasc.SolrCore.initDirectoryFactory org.apache.solr.core.MockDirectoryFactory
[junit4:junit4]   2> 478376 T1170 oasc.SolrCore.<init> [awholynewcollection_0_shard1_replica3] Opening new SolrCore at /mnt/ssd/jenkins/workspace/Lucene-Solr-trunk-Linux/solr/build/solr-core/test/J1/./org.apache.solr.cloud.CollectionsAPIDistributedZkTest-jetty3-1370684276979/awholynewcollection_0_shard1_replica3/, dataDir=/mnt/ssd/jenkins/workspace/Lucene-Solr-trunk-Linux/solr/build/solr-core/test/J1/./org.apache.solr.cloud.CollectionsAPIDistributedZkTest-jetty3-1370684276979/awholynewcollection_0_shard1_replica3/data/
[junit4:junit4]   2> 478411 T1170 oasc.JmxMonitoredMap.<init> JMX monitoring is enabled. Adding Solr mbeans to JMX Server: com.sun.jmx.mbeanserver.JmxMBeanServer@9ef90e0
[junit4:junit4]   2> 478412 T1170 oasc.SolrCore.initDirectoryFactory org.apache.solr.core.MockDirectoryFactory
[junit4:junit4]   2> 478414 T1228 oass.FileExchangeRateProvider.reload Reloading exchange rates from file currency.xml
[junit4:junit4]   2> 478415 T1234 oass.IndexSchema.readSchema default search field in schema is text
[junit4:junit4]   2> 478408 T1181 oasc.JmxMonitoredMap.<init> JMX monitoring is enabled. Adding Solr mbeans to JMX Server: com.sun.jmx.mbeanserver.JmxMBeanServer@9ef90e0
[junit4:junit4]   2> 478391 T1167 oass.OpenExchangeRatesOrgProvider$OpenExchangeRates.<init> WARN Unknown key IMPORTANT NOTE
[junit4:junit4]   2> 478391 T1124 oasup.UpdateRequestProcessorChain.init inserting DistributedUpdateProcessorFactory into updateRequestProcessorChain "stored_sig"
[junit4:junit4]   2> 478418 T1142 oass.FileExchangeRateProvider.reload Reloading exchange rates from file currency.xml
[junit4:junit4]   2> 478389 T1168 oasc.JmxMonitoredMap.<init> JMX monitoring is enabled. Adding Solr mbeans to JMX Server: com.sun.jmx.mbeanserver.JmxMBeanServer@9ef90e0
[junit4:junit4]   2> 478419 T1168 oasc.SolrCore.initDirectoryFactory org.apache.solr.core.MockDirectoryFactory
[junit4:junit4]   2> 478389 T1121 oasc.SolrDeletionP

[...truncated too long message...]

olr.common.cloud.ZkCmdExecutor.retryOperation(ZkCmdExecutor.java:65)
[junit4:junit4]   2> 	at org.apache.solr.common.cloud.SolrZkClient.getChildren(SolrZkClient.java:232)
[junit4:junit4]   2> 	at org.apache.solr.cloud.LeaderElector.checkIfIamLeader(LeaderElector.java:84)
[junit4:junit4]   2> 	at org.apache.solr.cloud.LeaderElector.access$000(LeaderElector.java:55)
[junit4:junit4]   2> 	at org.apache.solr.cloud.LeaderElector$1.process(LeaderElector.java:129)
[junit4:junit4]   2> 	at org.apache.zookeeper.ClientCnxn$EventThread.processEvent(ClientCnxn.java:519)
[junit4:junit4]   2> 	at org.apache.zookeeper.ClientCnxn$EventThread.run(ClientCnxn.java:495)
[junit4:junit4]   2> 
[junit4:junit4]   2> 735973 T1188 oasc.LeaderElector$1.process WARN  org.apache.zookeeper.KeeperException$SessionExpiredException: KeeperErrorCode = Session expired for /collections/awholynewcollection_0/leader_elect/shard2/election
[junit4:junit4]   2> 	at org.apache.zookeeper.KeeperException.create(KeeperException.java:127)
[junit4:junit4]   2> 	at org.apache.zookeeper.KeeperException.create(KeeperException.java:51)
[junit4:junit4]   2> 	at org.apache.zookeeper.ZooKeeper.getChildren(ZooKeeper.java:1468)
[junit4:junit4]   2> 	at org.apache.solr.common.cloud.SolrZkClient$6.execute(SolrZkClient.java:235)
[junit4:junit4]   2> 	at org.apache.solr.common.cloud.SolrZkClient$6.execute(SolrZkClient.java:232)
[junit4:junit4]   2> 	at org.apache.solr.common.cloud.ZkCmdExecutor.retryOperation(ZkCmdExecutor.java:65)
[junit4:junit4]   2> 	at org.apache.solr.common.cloud.SolrZkClient.getChildren(SolrZkClient.java:232)
[junit4:junit4]   2> 	at org.apache.solr.cloud.LeaderElector.checkIfIamLeader(LeaderElector.java:84)
[junit4:junit4]   2> 	at org.apache.solr.cloud.LeaderElector.access$000(LeaderElector.java:55)
[junit4:junit4]   2> 	at org.apache.solr.cloud.LeaderElector$1.process(LeaderElector.java:129)
[junit4:junit4]   2> 	at org.apache.zookeeper.ClientCnxn$EventThread.processEvent(ClientCnxn.java:519)
[junit4:junit4]   2> 	at org.apache.zookeeper.ClientCnxn$EventThread.run(ClientCnxn.java:495)
[junit4:junit4]   2> 
[junit4:junit4]   2> 735973 T1188 oasc.LeaderElector$1.process WARN  org.apache.zookeeper.KeeperException$SessionExpiredException: KeeperErrorCode = Session expired for /collections/awholynewcollection_0/leader_elect/shard5/election
[junit4:junit4]   2> 	at org.apache.zookeeper.KeeperException.create(KeeperException.java:127)
[junit4:junit4]   2> 	at org.apache.zookeeper.KeeperException.create(KeeperException.java:51)
[junit4:junit4]   2> 	at org.apache.zookeeper.ZooKeeper.getChildren(ZooKeeper.java:1468)
[junit4:junit4]   2> 	at org.apache.solr.common.cloud.SolrZkClient$6.execute(SolrZkClient.java:235)
[junit4:junit4]   2> 	at org.apache.solr.common.cloud.SolrZkClient$6.execute(SolrZkClient.java:232)
[junit4:junit4]   2> 	at org.apache.solr.common.cloud.ZkCmdExecutor.retryOperation(ZkCmdExecutor.java:65)
[junit4:junit4]   2> 	at org.apache.solr.common.cloud.SolrZkClient.getChildren(SolrZkClient.java:232)
[junit4:junit4]   2> 	at org.apache.solr.cloud.LeaderElector.checkIfIamLeader(LeaderElector.java:84)
[junit4:junit4]   2> 	at org.apache.solr.cloud.LeaderElector.access$000(LeaderElector.java:55)
[junit4:junit4]   2> 	at org.apache.solr.cloud.LeaderElector$1.process(LeaderElector.java:129)
[junit4:junit4]   2> 	at org.apache.zookeeper.ClientCnxn$EventThread.processEvent(ClientCnxn.java:519)
[junit4:junit4]   2> 	at org.apache.zookeeper.ClientCnxn$EventThread.run(ClientCnxn.java:495)
[junit4:junit4]   2> 
[junit4:junit4]   2> 735974 T1188 oasc.LeaderElector$1.process WARN  org.apache.zookeeper.KeeperException$SessionExpiredException: KeeperErrorCode = Session expired for /collections/awholynewcollection_0/leader_elect/shard1/election
[junit4:junit4]   2> 	at org.apache.zookeeper.KeeperException.create(KeeperException.java:127)
[junit4:junit4]   2> 	at org.apache.zookeeper.KeeperException.create(KeeperException.java:51)
[junit4:junit4]   2> 	at org.apache.zookeeper.ZooKeeper.getChildren(ZooKeeper.java:1468)
[junit4:junit4]   2> 	at org.apache.solr.common.cloud.SolrZkClient$6.execute(SolrZkClient.java:235)
[junit4:junit4]   2> 	at org.apache.solr.common.cloud.SolrZkClient$6.execute(SolrZkClient.java:232)
[junit4:junit4]   2> 	at org.apache.solr.common.cloud.ZkCmdExecutor.retryOperation(ZkCmdExecutor.java:65)
[junit4:junit4]   2> 	at org.apache.solr.common.cloud.SolrZkClient.getChildren(SolrZkClient.java:232)
[junit4:junit4]   2> 	at org.apache.solr.cloud.LeaderElector.checkIfIamLeader(LeaderElector.java:84)
[junit4:junit4]   2> 	at org.apache.solr.cloud.LeaderElector.access$000(LeaderElector.java:55)
[junit4:junit4]   2> 	at org.apache.solr.cloud.LeaderElector$1.process(LeaderElector.java:129)
[junit4:junit4]   2> 	at org.apache.zookeeper.ClientCnxn$EventThread.processEvent(ClientCnxn.java:519)
[junit4:junit4]   2> 	at org.apache.zookeeper.ClientCnxn$EventThread.run(ClientCnxn.java:495)
[junit4:junit4]   2> 
[junit4:junit4]   2> 735975 T1188 oasc.LeaderElector$1.process WARN  org.apache.zookeeper.KeeperException$SessionExpiredException: KeeperErrorCode = Session expired for /collections/awholynewcollection_0/leader_elect/shard3/election
[junit4:junit4]   2> 	at org.apache.zookeeper.KeeperException.create(KeeperException.java:127)
[junit4:junit4]   2> 	at org.apache.zookeeper.KeeperException.create(KeeperException.java:51)
[junit4:junit4]   2> 	at org.apache.zookeeper.ZooKeeper.getChildren(ZooKeeper.java:1468)
[junit4:junit4]   2> 	at org.apache.solr.common.cloud.SolrZkClient$6.execute(SolrZkClient.java:235)
[junit4:junit4]   2> 	at org.apache.solr.common.cloud.SolrZkClient$6.execute(SolrZkClient.java:232)
[junit4:junit4]   2> 	at org.apache.solr.common.cloud.ZkCmdExecutor.retryOperation(ZkCmdExecutor.java:65)
[junit4:junit4]   2> 	at org.apache.solr.common.cloud.SolrZkClient.getChildren(SolrZkClient.java:232)
[junit4:junit4]   2> 	at org.apache.solr.cloud.LeaderElector.checkIfIamLeader(LeaderElector.java:84)
[junit4:junit4]   2> 	at org.apache.solr.cloud.LeaderElector.access$000(LeaderElector.java:55)
[junit4:junit4]   2> 	at org.apache.solr.cloud.LeaderElector$1.process(LeaderElector.java:129)
[junit4:junit4]   2> 	at org.apache.zookeeper.ClientCnxn$EventThread.processEvent(ClientCnxn.java:519)
[junit4:junit4]   2> 	at org.apache.zookeeper.ClientCnxn$EventThread.run(ClientCnxn.java:495)
[junit4:junit4]   2> 
[junit4:junit4]   2> 735975 T1188 oascc.ZkStateReader$2.process A cluster state change: WatchedEvent state:SyncConnected type:NodeChildrenChanged path:/live_nodes, has occurred - updating... (live nodes size: 1)
[junit4:junit4]   2> 735975 T1188 oascc.ZkStateReader$2.process WARN ZooKeeper watch triggered, but Solr cannot talk to ZK
[junit4:junit4]   2> 735976 T1188 oascc.ZkStateReader$3.process WARN ZooKeeper watch triggered, but Solr cannot talk to ZK
[junit4:junit4]   2> NOTE: test params are: codec=Lucene40, sim=RandomSimilarityProvider(queryNorm=true,coord=yes): {}, locale=es_MX, timezone=Asia/Nicosia
[junit4:junit4]   2> NOTE: Linux 3.2.0-45-generic amd64/Oracle Corporation 1.7.0_21 (64-bit)/cpus=8,threads=1,free=316826792,total=536870912
[junit4:junit4]   2> NOTE: All tests run in this JVM: [TestSuggestSpellingConverter, TestCSVResponseWriter, TestArbitraryIndexDir, TestUtils, HighlighterTest, TestSolrXml, TestBM25SimilarityFactory, TimeZoneUtilsTest, ConvertedLegacyTest, CurrencyFieldOpenExchangeTest, XsltUpdateRequestHandlerTest, TestLMJelinekMercerSimilarityFactory, DocValuesMultiTest, MultiTermTest, TestBinaryResponseWriter, SampleTest, ChaosMonkeyShardSplitTest, TestStressLucene, RequestHandlersTest, TestCodecSupport, ShardRoutingCustomTest, TestPropInject, TestBinaryField, StandardRequestHandlerTest, TestFoldingMultitermQuery, EchoParamsTest, TermVectorComponentDistributedTest, TestShardHandlerFactory, TestRandomFaceting, TestLuceneMatchVersion, TestJmxMonitoredMap, TestDynamicFieldCollectionResource, TestFieldTypeResource, TestFieldResource, SolrCoreCheckLockOnStartupTest, SuggesterTSTTest, TestAnalyzedSuggestions, SpellCheckComponentTest, DefaultValueUpdateProcessorTest, RequiredFieldsTest, UpdateParamsTest, TestCollationField, NotRequiredUniqueKeyTest, TestDefaultSearchFieldResource, TestNumberUtils, TestRangeQuery, OutputWriterTest, TestFieldTypeCollectionResource, TestSolrXMLSerializer, TestZkChroot, TestDFRSimilarityFactory, FullSolrCloudDistribCmdsTest, StatsComponentTest, HighlighterConfigTest, ZkSolrClientTest, TestFiltering, TestUpdate, TestStressReorder, TestQueryTypes, PathHierarchyTokenizerFactoryTest, TestComponentsName, JSONWriterTest, TestClassNameShortening, SolrRequestParserTest, CollectionsAPIDistributedZkTest]
[junit4:junit4] Completed on J1 in 269.47s, 1 test, 1 failure <<< FAILURES!

[...truncated 495 lines...]
BUILD FAILED
/mnt/ssd/jenkins/workspace/Lucene-Solr-trunk-Linux/build.xml:385: The following error occurred while executing this line:
/mnt/ssd/jenkins/workspace/Lucene-Solr-trunk-Linux/build.xml:365: The following error occurred while executing this line:
/mnt/ssd/jenkins/workspace/Lucene-Solr-trunk-Linux/build.xml:39: The following error occurred while executing this line:
/mnt/ssd/jenkins/workspace/Lucene-Solr-trunk-Linux/solr/build.xml:181: The following error occurred while executing this line:
/mnt/ssd/jenkins/workspace/Lucene-Solr-trunk-Linux/solr/common-build.xml:437: The following error occurred while executing this line:
/mnt/ssd/jenkins/workspace/Lucene-Solr-trunk-Linux/lucene/common-build.xml:1240: The following error occurred while executing this line:
/mnt/ssd/jenkins/workspace/Lucene-Solr-trunk-Linux/lucene/common-build.xml:884: There were test failures: 296 suites, 1243 tests, 1 failure, 13 ignored (7 assumptions)

Total time: 41 minutes 6 seconds
Build step 'Invoke Ant' marked build as failure
Description set: Java: 64bit/jdk1.7.0_21 -XX:-UseCompressedOops -XX:+UseG1GC
Archiving artifacts
Recording test results
Email was triggered for: Failure
Sending email for trigger: Failure



Mime
View raw message