lucene-dev mailing list archives

Site index · List index
Message view « Date » · « Thread »
Top « Date » · « Thread »
From Policeman Jenkins Server <jenk...@thetaphi.de>
Subject [JENKINS] Lucene-Solr-trunk-Linux (32bit/jdk1.7.0_21) - Build # 5550 - Failure!
Date Wed, 08 May 2013 08:08:18 GMT
Build: http://jenkins.thetaphi.de/job/Lucene-Solr-trunk-Linux/5550/
Java: 32bit/jdk1.7.0_21 -client -XX:+UseG1GC

1 tests failed.
REGRESSION:  org.apache.solr.cloud.CollectionsAPIDistributedZkTest.testDistribSearch

Error Message:
There are still nodes recoverying - waited for 230 seconds

Stack Trace:
java.lang.AssertionError: There are still nodes recoverying - waited for 230 seconds
	at __randomizedtesting.SeedInfo.seed([4EC15F3E2AF168FC:CF27D1265DAE08C0]:0)
	at org.junit.Assert.fail(Assert.java:93)
	at org.apache.solr.cloud.AbstractDistribZkTestBase.waitForRecoveriesToFinish(AbstractDistribZkTestBase.java:173)
	at org.apache.solr.cloud.AbstractDistribZkTestBase.waitForRecoveriesToFinish(AbstractDistribZkTestBase.java:131)
	at org.apache.solr.cloud.AbstractDistribZkTestBase.waitForRecoveriesToFinish(AbstractDistribZkTestBase.java:126)
	at org.apache.solr.cloud.CollectionsAPIDistributedZkTest.testCollectionsAPI(CollectionsAPIDistributedZkTest.java:512)
	at org.apache.solr.cloud.CollectionsAPIDistributedZkTest.doTest(CollectionsAPIDistributedZkTest.java:146)
	at org.apache.solr.BaseDistributedSearchTestCase.testDistribSearch(BaseDistributedSearchTestCase.java:815)
	at sun.reflect.NativeMethodAccessorImpl.invoke0(Native Method)
	at sun.reflect.NativeMethodAccessorImpl.invoke(NativeMethodAccessorImpl.java:57)
	at sun.reflect.DelegatingMethodAccessorImpl.invoke(DelegatingMethodAccessorImpl.java:43)
	at java.lang.reflect.Method.invoke(Method.java:601)
	at com.carrotsearch.randomizedtesting.RandomizedRunner.invoke(RandomizedRunner.java:1559)
	at com.carrotsearch.randomizedtesting.RandomizedRunner.access$600(RandomizedRunner.java:79)
	at com.carrotsearch.randomizedtesting.RandomizedRunner$6.evaluate(RandomizedRunner.java:737)
	at com.carrotsearch.randomizedtesting.RandomizedRunner$7.evaluate(RandomizedRunner.java:773)
	at com.carrotsearch.randomizedtesting.RandomizedRunner$8.evaluate(RandomizedRunner.java:787)
	at com.carrotsearch.randomizedtesting.rules.SystemPropertiesRestoreRule$1.evaluate(SystemPropertiesRestoreRule.java:53)
	at org.apache.lucene.util.TestRuleSetupTeardownChained$1.evaluate(TestRuleSetupTeardownChained.java:50)
	at org.apache.lucene.util.TestRuleFieldCacheSanity$1.evaluate(TestRuleFieldCacheSanity.java:51)
	at org.apache.lucene.util.AbstractBeforeAfterRule$1.evaluate(AbstractBeforeAfterRule.java:46)
	at com.carrotsearch.randomizedtesting.rules.SystemPropertiesInvariantRule$1.evaluate(SystemPropertiesInvariantRule.java:55)
	at org.apache.lucene.util.TestRuleThreadAndTestName$1.evaluate(TestRuleThreadAndTestName.java:49)
	at org.apache.lucene.util.TestRuleIgnoreAfterMaxFailures$1.evaluate(TestRuleIgnoreAfterMaxFailures.java:70)
	at org.apache.lucene.util.TestRuleMarkFailure$1.evaluate(TestRuleMarkFailure.java:48)
	at com.carrotsearch.randomizedtesting.rules.StatementAdapter.evaluate(StatementAdapter.java:36)
	at com.carrotsearch.randomizedtesting.ThreadLeakControl$StatementRunner.run(ThreadLeakControl.java:358)
	at com.carrotsearch.randomizedtesting.ThreadLeakControl.forkTimeoutingTask(ThreadLeakControl.java:782)
	at com.carrotsearch.randomizedtesting.ThreadLeakControl$3.evaluate(ThreadLeakControl.java:442)
	at com.carrotsearch.randomizedtesting.RandomizedRunner.runSingleTest(RandomizedRunner.java:746)
	at com.carrotsearch.randomizedtesting.RandomizedRunner$3.evaluate(RandomizedRunner.java:648)
	at com.carrotsearch.randomizedtesting.RandomizedRunner$4.evaluate(RandomizedRunner.java:682)
	at com.carrotsearch.randomizedtesting.RandomizedRunner$5.evaluate(RandomizedRunner.java:693)
	at com.carrotsearch.randomizedtesting.rules.StatementAdapter.evaluate(StatementAdapter.java:36)
	at com.carrotsearch.randomizedtesting.rules.SystemPropertiesRestoreRule$1.evaluate(SystemPropertiesRestoreRule.java:53)
	at org.apache.lucene.util.AbstractBeforeAfterRule$1.evaluate(AbstractBeforeAfterRule.java:46)
	at org.apache.lucene.util.TestRuleStoreClassName$1.evaluate(TestRuleStoreClassName.java:42)
	at com.carrotsearch.randomizedtesting.rules.SystemPropertiesInvariantRule$1.evaluate(SystemPropertiesInvariantRule.java:55)
	at com.carrotsearch.randomizedtesting.rules.NoShadowingOrOverridesOnMethodsRule$1.evaluate(NoShadowingOrOverridesOnMethodsRule.java:39)
	at com.carrotsearch.randomizedtesting.rules.NoShadowingOrOverridesOnMethodsRule$1.evaluate(NoShadowingOrOverridesOnMethodsRule.java:39)
	at com.carrotsearch.randomizedtesting.rules.StatementAdapter.evaluate(StatementAdapter.java:36)
	at org.apache.lucene.util.TestRuleAssertionsRequired$1.evaluate(TestRuleAssertionsRequired.java:43)
	at org.apache.lucene.util.TestRuleMarkFailure$1.evaluate(TestRuleMarkFailure.java:48)
	at org.apache.lucene.util.TestRuleIgnoreAfterMaxFailures$1.evaluate(TestRuleIgnoreAfterMaxFailures.java:70)
	at org.apache.lucene.util.TestRuleIgnoreTestSuites$1.evaluate(TestRuleIgnoreTestSuites.java:55)
	at com.carrotsearch.randomizedtesting.rules.StatementAdapter.evaluate(StatementAdapter.java:36)
	at com.carrotsearch.randomizedtesting.ThreadLeakControl$StatementRunner.run(ThreadLeakControl.java:358)
	at java.lang.Thread.run(Thread.java:722)




Build Log:
${BUILD_LOG_MULTILINE_REGEX,regex="(?x:                                                  
                                                   \
                                                                                         
                                                                               \
(?:.*\\[javac\\]\\s++(?![1-9]\\d*\\s+error).*\\r?\\n)*+.*\\[javac\\]\\s+[1-9]\\d*\\s+error.*\\r?\\n
                         \
                                                                                         
                                                                               \
|.*\\[junit4:junit4\\]\\s+Suite:.*+\\s++                                                 
                                                              \
 (?:.*\\[junit4:junit4\\]\\s++(?!Suite:)(?!Completed).*\\r?\\n)*+                        
                                                   \
 .*\\[junit4:junit4\\]\\s++Completed\\s+.*<<<\\s*FAILURES!\\r?\\n               
                                                      \
                                                                                         
                                                                               \
|.*rat-sources:.*\\r?\\n                                                                 
                                                                     \
 (?:\\s*+\\[echo\\]\\s*\\r?\\n|\\s*+\\[echo\\]\\s++(?![1-9]\\d*\\s+Unknown\\s+License)\\S.*\\r?\\n)*+
                 \
 \\s*+\\[echo\\]\\s+[1-9]\\d*\\s+Unknown\\s+License.*\\r?\\n                             
                                                \
 (?:\\s*+\\[echo\\].*\\r?\\n)*+                                                          
                                                                 \
                                                                                         
                                                                               \
|(?:.*\\r?\\n){2}.*\\[licenses\\]\\s+MISSING\\s+sha1(?:.*\\r?\\n){2}                     
                                               \
                                                                                         
                                                                               \
|.*check-licenses:.*\\r?\\n\\s*\\[echo\\].*\\r?\\n\\s*\\[licenses\\]\\s+MISSING\\s+LICENSE.*\\r?\\n
                       \
 (?:\\s*+\\[licenses\\].*\\r?\\n)++                                                      
                                                                 \
                                                                                         
                                                                                \
|(?:.*\\[javadoc\\]\\s++(?![1-9]\\d*\\s+warning).+\\r?\\n)*+.*\\[javadoc\\]\\s+[1-9]\\d*\\s+warning.*\\r?\\n
         \
                                                                                         
                                                                                \
|.*javadocs-lint:.*\\r?\\n(?:.*\\[exec\\].*\\r?\\n)*+                                    
                                                           \
                                                                                         
                                                                                \
|.*check.*:.*\\r?\\n                                                                     
                                                                        \
 (?:\\s*+\\[forbidden-apis\\]\\s*\\r?\\n                                                 
                                                                \
  |\\s*+\\[forbidden-apis\\]\\s++                                                        
                                                                  \
    (?!Scanned\\s+\\d+\\s+(?:\\(and\\s+\\d+\\s+related\\)\\s+)?class\\s+file\\(s\\))\\S.*\\r?\n)*+
                            \
 \\s*+\\[forbidden-apis\\]\\s++                                                          
                                                                   \
   Scanned\\s+\\d+\\s+(?:\\(and\\s+\\d+\\s+related\\)\\s+)?class\\s+file\\(s\\).*[1-9]\\d*\\s+error\\(s\\)\\.\\r?\\n
   \
                                                                                         
                                                                                 \
|\\S+:\\s*\\r?\\n                                                                        
                                                                          \
 (?:(?!\\S+:\\s*\\r?\\n)(?!.*:\\s+exec\\s+returned:\\s+[^0]).*\\r?\\n)*+                 
                                                \
 .*:\\s+exec\\s+returned:\\s+[^0](?s:.*+)                                                
                                                            \
                                                                                         
                                                                                 \
|.*\\r?\\n.*Full\\s+thread\\s+dump(?s:.*+)                                               
                                                             \
                                                                                         
                                                                                  \
|.*(?:FATAL|ERROR):(?s:.*+)                                                              
                                                                   \
                                                                                         
                                                                                  \
|.*BUILD\\s+FAILED(?s:.*+)                                                               
                                                                   \
)"}

Mime
View raw message