lucene-dev mailing list archives

Site index · List index
Message view « Date » · « Thread »
Top « Date » · « Thread »
From Apache Jenkins Server <jenk...@builds.apache.org>
Subject [JENKINS] Lucene-Solr-Tests-4.x-Java6 - Build # 1607 - Still Failing
Date Mon, 13 May 2013 06:16:46 GMT
Build: https://builds.apache.org/job/Lucene-Solr-Tests-4.x-Java6/1607/

2 tests failed.
REGRESSION:  org.apache.solr.cloud.ZkCLITest.testUpConfigLinkConfigClearZk

Error Message:
Make sure we did download each file in the original configuration

Stack Trace:
java.lang.AssertionError: Make sure we did download each file in the original configuration
	at __randomizedtesting.SeedInfo.seed([3376183124A48C01:1710B53FAE6B3A67]:0)
	at org.junit.Assert.fail(Assert.java:93)
	at org.junit.Assert.assertTrue(Assert.java:43)
	at org.apache.solr.cloud.ZkCLITest.testUpConfigLinkConfigClearZk(ZkCLITest.java:198)
	at sun.reflect.NativeMethodAccessorImpl.invoke0(Native Method)
	at sun.reflect.NativeMethodAccessorImpl.invoke(NativeMethodAccessorImpl.java:57)
	at sun.reflect.DelegatingMethodAccessorImpl.invoke(DelegatingMethodAccessorImpl.java:43)
	at java.lang.reflect.Method.invoke(Method.java:616)
	at com.carrotsearch.randomizedtesting.RandomizedRunner.invoke(RandomizedRunner.java:1559)
	at com.carrotsearch.randomizedtesting.RandomizedRunner.access$600(RandomizedRunner.java:79)
	at com.carrotsearch.randomizedtesting.RandomizedRunner$6.evaluate(RandomizedRunner.java:737)
	at com.carrotsearch.randomizedtesting.RandomizedRunner$7.evaluate(RandomizedRunner.java:773)
	at com.carrotsearch.randomizedtesting.RandomizedRunner$8.evaluate(RandomizedRunner.java:787)
	at com.carrotsearch.randomizedtesting.rules.SystemPropertiesRestoreRule$1.evaluate(SystemPropertiesRestoreRule.java:53)
	at org.apache.lucene.util.TestRuleSetupTeardownChained$1.evaluate(TestRuleSetupTeardownChained.java:50)
	at org.apache.lucene.util.TestRuleFieldCacheSanity$1.evaluate(TestRuleFieldCacheSanity.java:51)
	at org.apache.lucene.util.AbstractBeforeAfterRule$1.evaluate(AbstractBeforeAfterRule.java:46)
	at com.carrotsearch.randomizedtesting.rules.SystemPropertiesInvariantRule$1.evaluate(SystemPropertiesInvariantRule.java:55)
	at org.apache.lucene.util.TestRuleThreadAndTestName$1.evaluate(TestRuleThreadAndTestName.java:49)
	at org.apache.lucene.util.TestRuleIgnoreAfterMaxFailures$1.evaluate(TestRuleIgnoreAfterMaxFailures.java:70)
	at org.apache.lucene.util.TestRuleMarkFailure$1.evaluate(TestRuleMarkFailure.java:48)
	at com.carrotsearch.randomizedtesting.rules.StatementAdapter.evaluate(StatementAdapter.java:36)
	at com.carrotsearch.randomizedtesting.ThreadLeakControl$StatementRunner.run(ThreadLeakControl.java:358)
	at com.carrotsearch.randomizedtesting.ThreadLeakControl.forkTimeoutingTask(ThreadLeakControl.java:782)
	at com.carrotsearch.randomizedtesting.ThreadLeakControl$3.evaluate(ThreadLeakControl.java:442)
	at com.carrotsearch.randomizedtesting.RandomizedRunner.runSingleTest(RandomizedRunner.java:746)
	at com.carrotsearch.randomizedtesting.RandomizedRunner$3.evaluate(RandomizedRunner.java:648)
	at com.carrotsearch.randomizedtesting.RandomizedRunner$4.evaluate(RandomizedRunner.java:682)
	at com.carrotsearch.randomizedtesting.RandomizedRunner$5.evaluate(RandomizedRunner.java:693)
	at com.carrotsearch.randomizedtesting.rules.StatementAdapter.evaluate(StatementAdapter.java:36)
	at com.carrotsearch.randomizedtesting.rules.SystemPropertiesRestoreRule$1.evaluate(SystemPropertiesRestoreRule.java:53)
	at org.apache.lucene.util.AbstractBeforeAfterRule$1.evaluate(AbstractBeforeAfterRule.java:46)
	at org.apache.lucene.util.TestRuleStoreClassName$1.evaluate(TestRuleStoreClassName.java:42)
	at com.carrotsearch.randomizedtesting.rules.SystemPropertiesInvariantRule$1.evaluate(SystemPropertiesInvariantRule.java:55)
	at com.carrotsearch.randomizedtesting.rules.NoShadowingOrOverridesOnMethodsRule$1.evaluate(NoShadowingOrOverridesOnMethodsRule.java:39)
	at com.carrotsearch.randomizedtesting.rules.NoShadowingOrOverridesOnMethodsRule$1.evaluate(NoShadowingOrOverridesOnMethodsRule.java:39)
	at com.carrotsearch.randomizedtesting.rules.StatementAdapter.evaluate(StatementAdapter.java:36)
	at org.apache.lucene.util.TestRuleAssertionsRequired$1.evaluate(TestRuleAssertionsRequired.java:43)
	at org.apache.lucene.util.TestRuleMarkFailure$1.evaluate(TestRuleMarkFailure.java:48)
	at org.apache.lucene.util.TestRuleIgnoreAfterMaxFailures$1.evaluate(TestRuleIgnoreAfterMaxFailures.java:70)
	at org.apache.lucene.util.TestRuleIgnoreTestSuites$1.evaluate(TestRuleIgnoreTestSuites.java:55)
	at com.carrotsearch.randomizedtesting.rules.StatementAdapter.evaluate(StatementAdapter.java:36)
	at com.carrotsearch.randomizedtesting.ThreadLeakControl$StatementRunner.run(ThreadLeakControl.java:358)
	at java.lang.Thread.run(Thread.java:679)


FAILED:  junit.framework.TestSuite.org.apache.solr.search.QueryEqualityTest

Error Message:
testParserCoverage was run w/o any other method explicitly testing qparser: maxscore

Stack Trace:
java.lang.AssertionError: testParserCoverage was run w/o any other method explicitly testing qparser: maxscore
	at __randomizedtesting.SeedInfo.seed([3376183124A48C01]:0)
	at org.junit.Assert.fail(Assert.java:93)
	at org.junit.Assert.assertTrue(Assert.java:43)
	at org.apache.solr.search.QueryEqualityTest.afterClassParserCoverageTest(QueryEqualityTest.java:61)
	at sun.reflect.NativeMethodAccessorImpl.invoke0(Native Method)
	at sun.reflect.NativeMethodAccessorImpl.invoke(NativeMethodAccessorImpl.java:57)
	at sun.reflect.DelegatingMethodAccessorImpl.invoke(DelegatingMethodAccessorImpl.java:43)
	at java.lang.reflect.Method.invoke(Method.java:616)
	at com.carrotsearch.randomizedtesting.RandomizedRunner.invoke(RandomizedRunner.java:1559)
	at com.carrotsearch.randomizedtesting.RandomizedRunner.access$600(RandomizedRunner.java:79)
	at com.carrotsearch.randomizedtesting.RandomizedRunner$5.evaluate(RandomizedRunner.java:700)
	at com.carrotsearch.randomizedtesting.rules.StatementAdapter.evaluate(StatementAdapter.java:36)
	at com.carrotsearch.randomizedtesting.rules.SystemPropertiesRestoreRule$1.evaluate(SystemPropertiesRestoreRule.java:53)
	at org.apache.lucene.util.AbstractBeforeAfterRule$1.evaluate(AbstractBeforeAfterRule.java:46)
	at org.apache.lucene.util.TestRuleStoreClassName$1.evaluate(TestRuleStoreClassName.java:42)
	at com.carrotsearch.randomizedtesting.rules.SystemPropertiesInvariantRule$1.evaluate(SystemPropertiesInvariantRule.java:55)
	at com.carrotsearch.randomizedtesting.rules.NoShadowingOrOverridesOnMethodsRule$1.evaluate(NoShadowingOrOverridesOnMethodsRule.java:39)
	at com.carrotsearch.randomizedtesting.rules.NoShadowingOrOverridesOnMethodsRule$1.evaluate(NoShadowingOrOverridesOnMethodsRule.java:39)
	at com.carrotsearch.randomizedtesting.rules.StatementAdapter.evaluate(StatementAdapter.java:36)
	at org.apache.lucene.util.TestRuleAssertionsRequired$1.evaluate(TestRuleAssertionsRequired.java:43)
	at org.apache.lucene.util.TestRuleMarkFailure$1.evaluate(TestRuleMarkFailure.java:48)
	at org.apache.lucene.util.TestRuleIgnoreAfterMaxFailures$1.evaluate(TestRuleIgnoreAfterMaxFailures.java:70)
	at org.apache.lucene.util.TestRuleIgnoreTestSuites$1.evaluate(TestRuleIgnoreTestSuites.java:55)
	at com.carrotsearch.randomizedtesting.rules.StatementAdapter.evaluate(StatementAdapter.java:36)
	at com.carrotsearch.randomizedtesting.ThreadLeakControl$StatementRunner.run(ThreadLeakControl.java:358)
	at java.lang.Thread.run(Thread.java:679)




Build Log:
[...truncated 8836 lines...]
[junit4:junit4] Suite: org.apache.solr.cloud.ZkCLITest
[junit4:junit4]   1> INFO  - 2013-05-13 06:04:47.765; org.apache.solr.SolrTestCaseJ4; ###Starting testUpConfigLinkConfigClearZk
[junit4:junit4]   1> INFO  - 2013-05-13 06:04:47.766; org.apache.solr.cloud.ZkCLITest; ####SETUP_START testUpConfigLinkConfigClearZk
[junit4:junit4]   1> INFO  - 2013-05-13 06:04:47.767; org.apache.solr.cloud.ZkCLITest; ZooKeeper dataDir:/usr/home/hudson/hudson-slave/workspace/Lucene-Solr-Tests-4.x-Java6/solr/build/solr-core/test/J1/./solrtest-ZkCLITest-1368425087766/zookeeper/server1/data
[junit4:junit4]   1> INFO  - 2013-05-13 06:04:47.767; org.apache.solr.cloud.ZkTestServer; STARTING ZK TEST SERVER
[junit4:junit4]   1> client port:0.0.0.0/0.0.0.0:0
[junit4:junit4]   1> INFO  - 2013-05-13 06:04:47.768; org.apache.solr.cloud.ZkTestServer$ZKServerMain; Starting server
[junit4:junit4]   1> INFO  - 2013-05-13 06:04:47.869; org.apache.solr.cloud.ZkTestServer; start zk server on port:42962
[junit4:junit4]   1> INFO  - 2013-05-13 06:04:47.870; org.apache.solr.common.cloud.ConnectionManager; Waiting for client to connect to ZooKeeper
[junit4:junit4]   1> INFO  - 2013-05-13 06:04:47.874; org.apache.solr.common.cloud.ConnectionManager; Watcher org.apache.solr.common.cloud.ConnectionManager@43e75865 name:ZooKeeperConnection Watcher:127.0.0.1:42962 got event WatchedEvent state:SyncConnected type:None path:null path:null type:None
[junit4:junit4]   1> INFO  - 2013-05-13 06:04:47.874; org.apache.solr.common.cloud.ConnectionManager; Client is connected to ZooKeeper
[junit4:junit4]   1> INFO  - 2013-05-13 06:04:47.875; org.apache.solr.common.cloud.SolrZkClient; makePath: /solr
[junit4:junit4]   1> INFO  - 2013-05-13 06:04:47.880; org.apache.solr.common.cloud.ConnectionManager; Waiting for client to connect to ZooKeeper
[junit4:junit4]   1> INFO  - 2013-05-13 06:04:47.882; org.apache.solr.common.cloud.ConnectionManager; Watcher org.apache.solr.common.cloud.ConnectionManager@83976e9 name:ZooKeeperConnection Watcher:127.0.0.1:42962/solr got event WatchedEvent state:SyncConnected type:None path:null path:null type:None
[junit4:junit4]   1> INFO  - 2013-05-13 06:04:47.882; org.apache.solr.common.cloud.ConnectionManager; Client is connected to ZooKeeper
[junit4:junit4]   1> INFO  - 2013-05-13 06:04:47.883; org.apache.solr.cloud.ZkCLITest; ####SETUP_END testUpConfigLinkConfigClearZk
[junit4:junit4]   1> INFO  - 2013-05-13 06:04:47.967; org.apache.solr.common.cloud.ConnectionManager; Waiting for client to connect to ZooKeeper
[junit4:junit4]   1> INFO  - 2013-05-13 06:04:47.970; org.apache.solr.common.cloud.ConnectionManager; Watcher org.apache.solr.common.cloud.ConnectionManager@69febd5c name:ZooKeeperConnection Watcher:127.0.0.1:42962/solr got event WatchedEvent state:SyncConnected type:None path:null path:null type:None
[junit4:junit4]   1> INFO  - 2013-05-13 06:04:47.970; org.apache.solr.common.cloud.ConnectionManager; Client is connected to ZooKeeper
[junit4:junit4]   1> INFO  - 2013-05-13 06:04:47.971; org.apache.solr.cloud.ZkController; zkHost includes chroot
[junit4:junit4]   1> INFO  - 2013-05-13 06:04:47.971; org.apache.solr.common.cloud.ConnectionManager; Waiting for client to connect to ZooKeeper
[junit4:junit4]   1> INFO  - 2013-05-13 06:04:47.973; org.apache.solr.common.cloud.ConnectionManager; Watcher org.apache.solr.common.cloud.ConnectionManager@32a8ee87 name:ZooKeeperConnection Watcher:127.0.0.1:42962 got event WatchedEvent state:SyncConnected type:None path:null path:null type:None
[junit4:junit4]   1> INFO  - 2013-05-13 06:04:47.974; org.apache.solr.common.cloud.ConnectionManager; Client is connected to ZooKeeper
[junit4:junit4]   1> INFO  - 2013-05-13 06:04:47.978; org.apache.solr.common.cloud.SolrZkClient; makePath: /configs/confsetone/solrconfig.xml
[junit4:junit4]   1> INFO  - 2013-05-13 06:04:48.190; org.apache.solr.common.cloud.SolrZkClient; makePath: /configs/confsetone/mapping-FoldToASCII.txt
[junit4:junit4]   1> INFO  - 2013-05-13 06:04:48.205; org.apache.solr.common.cloud.SolrZkClient; makePath: /configs/confsetone/lang/stopwords_hi.txt
[junit4:junit4]   1> INFO  - 2013-05-13 06:04:48.211; org.apache.solr.common.cloud.SolrZkClient; makePath: /configs/confsetone/lang/stopwords_es.txt
[junit4:junit4]   1> INFO  - 2013-05-13 06:04:48.221; org.apache.solr.common.cloud.SolrZkClient; makePath: /configs/confsetone/lang/stopwords_hu.txt
[junit4:junit4]   1> INFO  - 2013-05-13 06:04:48.225; org.apache.solr.common.cloud.SolrZkClient; makePath: /configs/confsetone/lang/stopwords_sv.txt
[junit4:junit4]   1> INFO  - 2013-05-13 06:04:48.229; org.apache.solr.common.cloud.SolrZkClient; makePath: /configs/confsetone/lang/stopwords_it.txt
[junit4:junit4]   1> INFO  - 2013-05-13 06:04:48.233; org.apache.solr.common.cloud.SolrZkClient; makePath: /configs/confsetone/lang/stopwords_gl.txt
[junit4:junit4]   1> INFO  - 2013-05-13 06:04:48.237; org.apache.solr.common.cloud.SolrZkClient; makePath: /configs/confsetone/lang/stopwords_th.txt
[junit4:junit4]   1> INFO  - 2013-05-13 06:04:48.240; org.apache.solr.common.cloud.SolrZkClient; makePath: /configs/confsetone/lang/stopwords_pt.txt
[junit4:junit4]   1> INFO  - 2013-05-13 06:04:48.244; org.apache.solr.common.cloud.SolrZkClient; makePath: /configs/confsetone/lang/stopwords_eu.txt
[junit4:junit4]   1> INFO  - 2013-05-13 06:04:48.252; org.apache.solr.common.cloud.SolrZkClient; makePath: /configs/confsetone/lang/contractions_ga.txt
[junit4:junit4]   1> INFO  - 2013-05-13 06:04:48.264; org.apache.solr.common.cloud.SolrZkClient; makePath: /configs/confsetone/lang/stopwords_ar.txt
[junit4:junit4]   1> INFO  - 2013-05-13 06:04:48.268; org.apache.solr.common.cloud.SolrZkClient; makePath: /configs/confsetone/lang/contractions_ca.txt
[junit4:junit4]   1> INFO  - 2013-05-13 06:04:48.272; org.apache.solr.common.cloud.SolrZkClient; makePath: /configs/confsetone/lang/stopwords_en.txt
[junit4:junit4]   1> INFO  - 2013-05-13 06:04:48.276; org.apache.solr.common.cloud.SolrZkClient; makePath: /configs/confsetone/lang/hyphenations_ga.txt
[junit4:junit4]   1> INFO  - 2013-05-13 06:04:48.279; org.apache.solr.common.cloud.SolrZkClient; makePath: /configs/confsetone/lang/contractions_fr.txt
[junit4:junit4]   1> INFO  - 2013-05-13 06:04:48.283; org.apache.solr.common.cloud.SolrZkClient; makePath: /configs/confsetone/lang/stopwords_nl.txt
[junit4:junit4]   1> INFO  - 2013-05-13 06:04:48.288; org.apache.solr.common.cloud.SolrZkClient; makePath: /configs/confsetone/lang/stopwords_da.txt
[junit4:junit4]   1> INFO  - 2013-05-13 06:04:48.292; org.apache.solr.common.cloud.SolrZkClient; makePath: /configs/confsetone/lang/stopwords_tr.txt
[junit4:junit4]   1> INFO  - 2013-05-13 06:04:48.296; org.apache.solr.common.cloud.SolrZkClient; makePath: /configs/confsetone/lang/stopwords_no.txt
[junit4:junit4]   1> INFO  - 2013-05-13 06:04:48.300; org.apache.solr.common.cloud.SolrZkClient; makePath: /configs/confsetone/lang/stopwords_de.txt
[junit4:junit4]   1> INFO  - 2013-05-13 06:04:48.304; org.apache.solr.common.cloud.SolrZkClient; makePath: /configs/confsetone/lang/stopwords_id.txt
[junit4:junit4]   1> INFO  - 2013-05-13 06:04:48.308; org.apache.solr.common.cloud.SolrZkClient; makePath: /configs/confsetone/lang/stopwords_ja.txt
[junit4:junit4]   1> INFO  - 2013-05-13 06:04:48.312; org.apache.solr.common.cloud.SolrZkClient; makePath: /configs/confsetone/lang/stemdict_nl.txt
[junit4:junit4]   1> INFO  - 2013-05-13 06:04:48.317; org.apache.solr.common.cloud.SolrZkClient; makePath: /configs/confsetone/lang/contractions_it.txt
[junit4:junit4]   1> INFO  - 2013-05-13 06:04:48.321; org.apache.solr.common.cloud.SolrZkClient; makePath: /configs/confsetone/lang/stopwords_ru.txt
[junit4:junit4]   1> INFO  - 2013-05-13 06:04:48.325; org.apache.solr.common.cloud.SolrZkClient; makePath: /configs/confsetone/lang/stopwords_hy.txt
[junit4:junit4]   1> INFO  - 2013-05-13 06:04:48.329; org.apache.solr.common.cloud.SolrZkClient; makePath: /configs/confsetone/lang/stopwords_fa.txt
[junit4:junit4]   1> INFO  - 2013-05-13 06:04:48.333; org.apache.solr.common.cloud.SolrZkClient; makePath: /configs/confsetone/lang/userdict_ja.txt
[junit4:junit4]   1> INFO  - 2013-05-13 06:04:48.337; org.apache.solr.common.cloud.SolrZkClient; makePath: /configs/confsetone/lang/stoptags_ja.txt
[junit4:junit4]   1> INFO  - 2013-05-13 06:04:48.342; org.apache.solr.common.cloud.SolrZkClient; makePath: /configs/confsetone/lang/stopwords_cz.txt
[junit4:junit4]   1> INFO  - 2013-05-13 06:04:48.352; org.apache.solr.common.cloud.SolrZkClient; makePath: /configs/confsetone/lang/stopwords_ga.txt
[junit4:junit4]   1> INFO  - 2013-05-13 06:04:48.356; org.apache.solr.common.cloud.SolrZkClient; makePath: /configs/confsetone/lang/stopwords_ca.txt
[junit4:junit4]   1> INFO  - 2013-05-13 06:04:48.360; org.apache.solr.common.cloud.SolrZkClient; makePath: /configs/confsetone/lang/stopwords_bg.txt
[junit4:junit4]   1> INFO  - 2013-05-13 06:04:48.365; org.apache.solr.common.cloud.SolrZkClient; makePath: /configs/confsetone/lang/stopwords_fr.txt
[junit4:junit4]   1> INFO  - 2013-05-13 06:04:48.369; org.apache.solr.common.cloud.SolrZkClient; makePath: /configs/confsetone/lang/stopwords_el.txt
[junit4:junit4]   1> INFO  - 2013-05-13 06:04:48.373; org.apache.solr.common.cloud.SolrZkClient; makePath: /configs/confsetone/lang/stopwords_ro.txt
[junit4:junit4]   1> INFO  - 2013-05-13 06:04:48.377; org.apache.solr.common.cloud.SolrZkClient; makePath: /configs/confsetone/lang/stopwords_lv.txt
[junit4:junit4]   1> INFO  - 2013-05-13 06:04:48.381; org.apache.solr.common.cloud.SolrZkClient; makePath: /configs/confsetone/lang/stopwords_fi.txt
[junit4:junit4]   1> INFO  - 2013-05-13 06:04:48.386; org.apache.solr.common.cloud.SolrZkClient; makePath: /configs/confsetone/xslt/luke.xsl
[junit4:junit4]   1> INFO  - 2013-05-13 06:04:48.504; org.apache.solr.common.cloud.SolrZkClient; makePath: /configs/confsetone/xslt/example_rss.xsl
[junit4:junit4]   1> INFO  - 2013-05-13 06:04:48.508; org.apache.solr.common.cloud.SolrZkClient; makePath: /configs/confsetone/xslt/updateXml.xsl
[junit4:junit4]   1> INFO  - 2013-05-13 06:04:48.512; org.apache.solr.common.cloud.SolrZkClient; makePath: /configs/confsetone/xslt/example.xsl
[junit4:junit4]   1> INFO  - 2013-05-13 06:04:48.517; org.apache.solr.common.cloud.SolrZkClient; makePath: /configs/confsetone/xslt/example_atom.xsl
[junit4:junit4]   1> INFO  - 2013-05-13 06:04:48.521; org.apache.solr.common.cloud.SolrZkClient; makePath: /configs/confsetone/synonyms.txt
[junit4:junit4]   1> INFO  - 2013-05-13 06:04:48.524; org.apache.solr.common.cloud.SolrZkClient; makePath: /configs/confsetone/elevate.xml
[junit4:junit4]   1> INFO  - 2013-05-13 06:04:48.532; org.apache.solr.common.cloud.SolrZkClient; makePath: /configs/confsetone/admin-extra.html
[junit4:junit4]   1> INFO  - 2013-05-13 06:04:48.548; org.apache.solr.common.cloud.SolrZkClient; makePath: /configs/confsetone/scripts.conf
[junit4:junit4]   1> INFO  - 2013-05-13 06:04:48.566; org.apache.solr.common.cloud.SolrZkClient; makePath: /configs/confsetone/mapping-ISOLatin1Accent.txt
[junit4:junit4]   1> INFO  - 2013-05-13 06:04:48.571; org.apache.solr.common.cloud.SolrZkClient; makePath: /configs/confsetone/stopwords.txt
[junit4:junit4]   1> INFO  - 2013-05-13 06:04:48.606; org.apache.solr.common.cloud.SolrZkClient; makePath: /configs/confsetone/protwords.txt
[junit4:junit4]   1> INFO  - 2013-05-13 06:04:48.611; org.apache.solr.common.cloud.SolrZkClient; makePath: /configs/confsetone/currency.xml
[junit4:junit4]   1> INFO  - 2013-05-13 06:04:48.663; org.apache.solr.common.cloud.SolrZkClient; makePath: /configs/confsetone/velocity/hit_plain.vm
[junit4:junit4]   1> INFO  - 2013-05-13 06:04:48.687; org.apache.solr.common.cloud.SolrZkClient; makePath: /configs/confsetone/velocity/query.vm
[junit4:junit4]   1> INFO  - 2013-05-13 06:04:48.726; org.apache.solr.common.cloud.SolrZkClient; makePath: /configs/confsetone/velocity/browse.vm
[junit4:junit4]   1> INFO  - 2013-05-13 06:04:48.759; org.apache.solr.common.cloud.SolrZkClient; makePath: /configs/confsetone/velocity/pagination_top.vm
[junit4:junit4]   1> INFO  - 2013-05-13 06:04:48.763; org.apache.solr.common.cloud.SolrZkClient; makePath: /configs/confsetone/velocity/richtext_doc.vm
[junit4:junit4]   1> INFO  - 2013-05-13 06:04:48.803; org.apache.solr.common.cloud.SolrZkClient; makePath: /configs/confsetone/velocity/query_spatial.vm
[junit4:junit4]   1> INFO  - 2013-05-13 06:04:48.806; org.apache.solr.common.cloud.SolrZkClient; makePath: /configs/confsetone/velocity/facet_pivot.vm
[junit4:junit4]   1> INFO  - 2013-05-13 06:04:48.810; org.apache.solr.common.cloud.SolrZkClient; makePath: /configs/confsetone/velocity/pagination_bottom.vm
[junit4:junit4]   1> INFO  - 2013-05-13 06:04:48.813; org.apache.solr.common.cloud.SolrZkClient; makePath: /configs/confsetone/velocity/suggest.vm
[junit4:junit4]   1> INFO  - 2013-05-13 06:04:48.817; org.apache.solr.common.cloud.SolrZkClient; makePath: /configs/confsetone/velocity/results_list.vm
[junit4:junit4]   1> INFO  - 2013-05-13 06:04:48.820; org.apache.solr.common.cloud.SolrZkClient; makePath: /configs/confsetone/velocity/error.vm
[junit4:junit4]   1> INFO  - 2013-05-13 06:04:48.823; org.apache.solr.common.cloud.SolrZkClient; makePath: /configs/confsetone/velocity/VM_global_library.vm
[junit4:junit4]   1> INFO  - 2013-05-13 06:04:48.831; org.apache.solr.common.cloud.SolrZkClient; makePath: /configs/confsetone/velocity/cluster.vm
[junit4:junit4]   1> INFO  - 2013-05-13 06:04:48.835; org.apache.solr.common.cloud.SolrZkClient; makePath: /configs/confsetone/velocity/facet_ranges.vm
[junit4:junit4]   1> INFO  - 2013-05-13 06:04:48.838; org.apache.solr.common.cloud.SolrZkClient; makePath: /configs/confsetone/velocity/header.vm
[junit4:junit4]   1> INFO  - 2013-05-13 06:04:48.842; org.apache.solr.common.cloud.SolrZkClient; makePath: /configs/confsetone/velocity/cluster_results.vm
[junit4:junit4]   1> INFO  - 2013-05-13 06:04:48.850; org.apache.solr.common.cloud.SolrZkClient; makePath: /configs/confsetone/velocity/join_doc.vm
[junit4:junit4]   1> INFO  - 2013-05-13 06:04:48.853; org.apache.solr.common.cloud.SolrZkClient; makePath: /configs/confsetone/velocity/head.vm
[junit4:junit4]   1> INFO  - 2013-05-13 06:04:48.857; org.apache.solr.common.cloud.SolrZkClient; makePath: /configs/confsetone/velocity/README.txt
[junit4:junit4]   1> INFO  - 2013-05-13 06:04:48.860; org.apache.solr.common.cloud.SolrZkClient; makePath: /configs/confsetone/velocity/did_you_mean.vm
[junit4:junit4]   1> INFO  - 2013-05-13 06:04:48.863; org.apache.solr.common.cloud.SolrZkClient; makePath: /configs/confsetone/velocity/layout.vm
[junit4:junit4]   1> INFO  - 2013-05-13 06:04:48.871; org.apache.solr.common.cloud.SolrZkClient; makePath: /configs/confsetone/velocity/hit.vm
[junit4:junit4]   1> INFO  - 2013-05-13 06:04:48.875; org.apache.solr.common.cloud.SolrZkClient; makePath: /configs/confsetone/velocity/query_group.vm
[junit4:junit4]   1> INFO  - 2013-05-13 06:04:48.878; org.apache.solr.common.cloud.SolrZkClient; makePath: /configs/confsetone/velocity/hit_grouped.vm
[junit4:junit4]   1> INFO  - 2013-05-13 06:04:48.882; org.apache.solr.common.cloud.SolrZkClient; makePath: /configs/confsetone/velocity/main.css
[junit4:junit4]   1> INFO  - 2013-05-13 06:04:48.890; org.apache.solr.common.cloud.SolrZkClient; makePath: /configs/confsetone/velocity/facet_queries.vm
[junit4:junit4]   1> INFO  - 2013-05-13 06:04:48.893; org.apache.solr.common.cloud.SolrZkClient; makePath: /configs/confsetone/velocity/facets.vm
[junit4:junit4]   1> INFO  - 2013-05-13 06:04:48.897; org.apache.solr.common.cloud.SolrZkClient; makePath: /configs/confsetone/velocity/jquery.autocomplete.js
[junit4:junit4]   1> INFO  - 2013-05-13 06:04:48.901; org.apache.solr.common.cloud.SolrZkClient; makePath: /configs/confsetone/velocity/facet_fields.vm
[junit4:junit4]   1> INFO  - 2013-05-13 06:04:48.911; org.apache.solr.common.cloud.SolrZkClient; makePath: /configs/confsetone/velocity/product_doc.vm
[junit4:junit4]   1> INFO  - 2013-05-13 06:04:48.917; org.apache.solr.common.cloud.SolrZkClient; makePath: /configs/confsetone/velocity/query_form.vm
[junit4:junit4]   1> INFO  - 2013-05-13 06:04:48.920; org.apache.solr.common.cloud.SolrZkClient; makePath: /configs/confsetone/velocity/footer.vm
[junit4:junit4]   1> INFO  - 2013-05-13 06:04:48.924; org.apache.solr.common.cloud.SolrZkClient; makePath: /configs/confsetone/velocity/tabs.vm
[junit4:junit4]   1> INFO  - 2013-05-13 06:04:48.927; org.apache.solr.common.cloud.SolrZkClient; makePath: /configs/confsetone/velocity/jquery.autocomplete.css
[junit4:junit4]   1> INFO  - 2013-05-13 06:04:48.935; org.apache.solr.common.cloud.SolrZkClient; makePath: /configs/confsetone/velocity/mime_type_lists.vm
[junit4:junit4]   1> INFO  - 2013-05-13 06:04:48.939; org.apache.solr.common.cloud.SolrZkClient; makePath: /configs/confsetone/velocity/debug.vm
[junit4:junit4]   1> INFO  - 2013-05-13 06:04:48.942; org.apache.solr.common.cloud.SolrZkClient; makePath: /configs/confsetone/admin-extra.menu-bottom.html
[junit4:junit4]   1> INFO  - 2013-05-13 06:04:48.950; org.apache.solr.common.cloud.SolrZkClient; makePath: /configs/confsetone/schema.xml
[junit4:junit4]   1> INFO  - 2013-05-13 06:04:48.954; org.apache.solr.common.cloud.SolrZkClient; makePath: /configs/confsetone/update-script.js
[junit4:junit4]   1> INFO  - 2013-05-13 06:04:48.958; org.apache.solr.common.cloud.SolrZkClient; makePath: /configs/confsetone/spellings.txt
[junit4:junit4]   1> INFO  - 2013-05-13 06:04:48.967; org.apache.solr.common.cloud.SolrZkClient; makePath: /configs/confsetone/admin-extra.menu-top.html
[junit4:junit4]   1> INFO  - 2013-05-13 06:04:48.972; org.apache.solr.common.cloud.ConnectionManager; Waiting for client to connect to ZooKeeper
[junit4:junit4]   1> INFO  - 2013-05-13 06:04:48.980; org.apache.solr.common.cloud.ConnectionManager; Watcher org.apache.solr.common.cloud.ConnectionManager@39aba17 name:ZooKeeperConnection Watcher:127.0.0.1:42962/solr got event WatchedEvent state:SyncConnected type:None path:null path:null type:None
[junit4:junit4]   1> INFO  - 2013-05-13 06:04:48.981; org.apache.solr.common.cloud.ConnectionManager; Client is connected to ZooKeeper
[junit4:junit4]   1> INFO  - 2013-05-13 06:04:48.981; org.apache.solr.cloud.ZkController; Load collection config from:/collections/collection1
[junit4:junit4]   1> INFO  - 2013-05-13 06:04:48.982; org.apache.solr.common.cloud.SolrZkClient; makePath: /collections/collection1
[junit4:junit4]   1> INFO  - 2013-05-13 06:04:48.989; org.apache.solr.common.cloud.ConnectionManager; Waiting for client to connect to ZooKeeper
[junit4:junit4]   1> INFO  - 2013-05-13 06:04:48.997; org.apache.solr.common.cloud.ConnectionManager; Watcher org.apache.solr.common.cloud.ConnectionManager@900752e name:ZooKeeperConnection Watcher:127.0.0.1:42962/solr got event WatchedEvent state:SyncConnected type:None path:null path:null type:None
[junit4:junit4]   1> INFO  - 2013-05-13 06:04:48.997; org.apache.solr.common.cloud.ConnectionManager; Client is connected to ZooKeeper
[junit4:junit4]   1> INFO  - 2013-05-13 06:04:48.999; org.apache.solr.cloud.ZkController; Write file /usr/home/hudson/hudson-slave/workspace/Lucene-Solr-Tests-4.x-Java6/solr/build/solr-core/test/J1/./solrtest-confdropspot-org.apache.solr.cloud.ZkCLITest-1368425088988/admin-extra.menu-top.html
[junit4:junit4]   1> INFO  - 2013-05-13 06:04:49.001; org.apache.solr.cloud.ZkController; Write file /usr/home/hudson/hudson-slave/workspace/Lucene-Solr-Tests-4.x-Java6/solr/build/solr-core/test/J1/./solrtest-confdropspot-org.apache.solr.cloud.ZkCLITest-1368425088988/currency.xml
[junit4:junit4]   1> INFO  - 2013-05-13 06:04:49.003; org.apache.solr.cloud.ZkController; Write file /usr/home/hudson/hudson-slave/workspace/Lucene-Solr-Tests-4.x-Java6/solr/build/solr-core/test/J1/./solrtest-confdropspot-org.apache.solr.cloud.ZkCLITest-1368425088988/protwords.txt
[junit4:junit4]   1> INFO  - 2013-05-13 06:04:49.204; org.apache.solr.cloud.ZkController; Write file /usr/home/hudson/hudson-slave/workspace/Lucene-Solr-Tests-4.x-Java6/solr/build/solr-core/test/J1/./solrtest-confdropspot-org.apache.solr.cloud.ZkCLITest-1368425088988/mapping-FoldToASCII.txt
[junit4:junit4]   1> INFO  - 2013-05-13 06:04:49.206; org.apache.solr.cloud.ZkController; Write file /usr/home/hudson/hudson-slave/workspace/Lucene-Solr-Tests-4.x-Java6/solr/build/solr-core/test/J1/./solrtest-confdropspot-org.apache.solr.cloud.ZkCLITest-1368425088988/solrconfig.xml
[junit4:junit4]   1> INFO  - 2013-05-13 06:04:49.209; org.apache.solr.cloud.ZkController; Write file /usr/home/hudson/hudson-slave/workspace/Lucene-Solr-Tests-4.x-Java6/solr/build/solr-core/test/J1/./solrtest-confdropspot-org.apache.solr.cloud.ZkCLITest-1368425088988/lang/contractions_ga.txt
[junit4:junit4]   1> INFO  - 2013-05-13 06:04:49.210; org.apache.solr.cloud.ZkController; Write file /usr/home/hudson/hudson-slave/workspace/Lucene-Solr-Tests-4.x-Java6/solr/build/solr-core/test/J1/./solrtest-confdropspot-org.apache.solr.cloud.ZkCLITest-1368425088988/lang/stopwords_hi.txt
[junit4:junit4]   1> INFO  - 2013-05-13 06:04:49.212; org.apache.solr.cloud.ZkController; Write file /usr/home/hudson/hudson-slave/workspace/Lucene-Solr-Tests-4.x-Java6/solr/build/solr-core/test/J1/./solrtest-confdropspot-org.apache.solr.cloud.ZkCLITest-1368425088988/lang/stopwords_eu.txt
[junit4:junit4]   1> INFO  - 2013-05-13 06:04:49.214; org.apache.solr.cloud.ZkController; Write file /usr/home/hudson/hudson-slave/workspace/Lucene-Solr-Tests-4.x-Java6/solr/build/solr-core/test/J1/./solrtest-confdropspot-org.apache.solr.cloud.ZkCLITest-1368425088988/lang/userdict_ja.txt
[junit4:junit4]   1> INFO  - 2013-05-13 06:04:49.215; org.apache.solr.cloud.ZkController; Write file /usr/home/hudson/hudson-slave/workspace/Lucene-Solr-Tests-4.x-Java6/solr/build/solr-core/test/J1/./solrtest-confdropspot-org.apache.solr.cloud.ZkCLITest-1368425088988/lang/stopwords_es.txt
[junit4:junit4]   1> INFO  - 2013-05-13 06:04:49.217; org.apache.solr.cloud.ZkController; Write file /usr/home/hudson/hudson-slave/workspace/Lucene-Solr-Tests-4.x-Java6/solr/build/solr-core/test/J1/./solrtest-confdropspot-org.apache.solr.cloud.ZkCLITest-1368425088988/lang/stopwords_sv.txt
[junit4:junit4]   1> INFO  - 2013-05-13 06:04:49.219; org.apache.solr.cloud.ZkController; Write file /usr/home/hudson/hudson-slave/workspace/Lucene-Solr-Tests-4.x-Java6/solr/build/solr-core/test/J1/./solrtest-confdropspot-org.apache.solr.cloud.ZkCLITest-1368425088988/lang/contractions_it.txt
[junit4:junit4]   1> INFO  - 2013-05-13 06:04:49.221; org.apache.solr.cloud.ZkController; Write file /usr/home/hudson/hudson-slave/workspace/Lucene-Solr-Tests-4.x-Java6/solr/build/solr-core/test/J1/./solrtest-confdropspot-org.apache.solr.cloud.ZkCLITest-1368425088988/lang/stoptags_ja.txt
[junit4:junit4]   1> INFO  - 2013-05-13 06:04:49.222; org.apache.solr.cloud.ZkController; Write file /usr/home/hudson/hudson-slave/workspace/Lucene-Solr-Tests-4.x-Java6/solr/build/solr-core/test/J1/./solrtest-confdropspot-org.apache.solr.cloud.ZkCLITest-1368425088988/lang/stemdict_nl.txt
[junit4:junit4]   1> INFO  - 2013-05-13 06:04:49.224; org.apache.solr.cloud.ZkController; Write file /usr/home/hudson/hudson-slave/workspace/Lucene-Solr-Tests-4.x-Java6/solr/build/solr-core/test/J1/./solrtest-confdropspot-org.apache.solr.cloud.ZkCLITest-1368425088988/lang/stopwords_bg.txt
[junit4:junit4]   1> INFO  - 2013-05-13 06:04:49.226; org.apache.solr.cloud.ZkController; Write file /usr/home/hudson/hudson-slave/workspace/Lucene-Solr-Tests-4.x-Java6/solr/build/solr-core/test/J1/./solrtest-confdropspot-org.apache.solr.cloud.ZkCLITest-1368425088988/lang/stopwords_hy.txt
[junit4:junit4]   1> INFO  - 2013-05-13 06:04:49.227; org.apache.solr.cloud.ZkController; Write file /usr/home/hudson/hudson-slave/workspace/Lucene-Solr-Tests-4.x-Java6/solr/build/solr-core/test/J1/./solrtest-confdropspot-org.apache.solr.cloud.ZkCLITest-1368425088988/lang/stopwords_el.txt
[junit4:junit4]   1> INFO  - 2013-05-13 06:04:49.229; org.apache.solr.cloud.ZkController; Write file /usr/home/hudson/hudson-slave/workspace/Lucene-Solr-Tests-4.x-Java6/solr/build/solr-core/test/J1/./solrtest-confdropspot-org.apache.solr.cloud.ZkCLITest-1368425088988/lang/hyphenations_ga.txt
[junit4:junit4]   1> INFO  - 2013-05-13 06:04:49.230; org.apache.solr.cloud.ZkController; Write file /usr/home/hudson/hudson-slave/workspace/Lucene-Solr-Tests-4.x-Java6/solr/build/solr-core/test/J1/./solrtest-confdropspot-org.apache.solr.cloud.ZkCLITest-1368425088988/lang/stopwords_ar.txt
[junit4:junit4]   1> INFO  - 2013-05-13 06:04:49.232; org.apache.solr.cloud.ZkController; Write file /usr/home/hudson/hudson-slave/workspace/Lucene-Solr-Tests-4.x-Java6/solr/build/solr-core/test/J1/./solrtest-confdropspot-org.apache.solr.cloud.ZkCLITest-1368425088988/lang/stopwords_fr.txt
[junit4:junit4]   1> INFO  - 2013-05-13 06:04:49.234; org.apache.solr.cloud.ZkController; Write file /usr/home/hudson/hudson-slave/workspace/Lucene-Solr-Tests-4.x-Java6/solr/build/solr-core/test/J1/./solrtest-confdropspot-org.apache.solr.cloud.ZkCLITest-1368425088988/lang/stopwords_pt.txt
[junit4:junit4]   1> INFO  - 2013-05-13 06:04:49.235; org.apache.solr.cloud.ZkController; Write file /usr/home/hudson/hudson-slave/workspace/Lucene-Solr-Tests-4.x-Java6/solr/build/solr-core/test/J1/./solrtest-confdropspot-org.apache.solr.cloud.ZkCLITest-1368425088988/lang/stopwords_nl.txt
[junit4:junit4]   1> INFO  - 2013-05-13 06:04:49.237; org.apache.solr.cloud.ZkController; Write file /usr/home/hudson/hudson-slave/workspace/Lucene-Solr-Tests-4.x-Java6/solr/build/solr-core/test/J1/./solrtest-confdropspot-org.apache.solr.cloud.ZkCLITest-1368425088988/lang/stopwords_th.txt
[junit4:junit4]   1> INFO  - 2013-05-13 06:04:49.238; org.apache.solr.cloud.ZkController; Write file /usr/home/hudson/hudson-slave/workspace/Lucene-Solr-Tests-4.x-Java6/solr/build/solr-core/test/J1/./solrtest-confdropspot-org.apache.solr.cloud.ZkCLITest-1368425088988/lang/stopwords_de.txt
[junit4:junit4]   1> INFO  - 2013-05-13 06:04:49.240; org.apache.solr.cloud.ZkController; Write file /usr/home/hudson/hudson-slave/workspace/Lucene-Solr-Tests-4.x-Java6/solr/build/solr-core/test/J1/./solrtest-confdropspot-org.apache.solr.cloud.ZkCLITest-1368425088988/lang/stopwords_lv.txt
[junit4:junit4]   1> INFO  - 2013-05-13 06:04:49.242; org.apache.solr.cloud.ZkController; Write file /usr/home/hudson/hudson-slave/workspace/Lucene-Solr-Tests-4.x-Java6/solr/build/solr-core/test/J1/./solrtest-confdropspot-org.apache.solr.cloud.ZkCLITest-1368425088988/lang/contractions_ca.txt
[junit4:junit4]   1> INFO  - 2013-05-13 06:04:49.243; org.apache.solr.cloud.ZkController; Write file /usr/home/hudson/hudson-slave/workspace/Lucene-Solr-Tests-4.x-Java6/solr/build/solr-core/test/J1/./solrtest-confdropspot-org.apache.solr.cloud.ZkCLITest-1368425088988/lang/stopwords_ru.txt
[junit4:junit4]   1> INFO  - 2013-05-13 06:04:49.245; org.apache.solr.cloud.ZkController; Write file /usr/home/hudson/hudson-slave/workspace/Lucene-Solr-Tests-4.x-Java6/solr/build/solr-core/test/J1/./solrtest-confdropspot-org.apache.solr.cloud.ZkCLITest-1368425088988/lang/stopwords_ca.txt
[junit4:junit4]   1> INFO  - 2013-05-13 06:04:49.246; org.apache.solr.cloud.ZkController; Write file /usr/home/hudson/hudson-slave/workspace/Lucene-Solr-Tests-4.x-Java6/solr/build/solr-core/test/J1/./solrtest-confdropspot-org.apache.solr.cloud.ZkCLITest-1368425088988/lang/stopwords_da.txt
[junit4:junit4]   1> INFO  - 2013-05-13 06:04:49.248; org.apache.solr.cloud.ZkController; Write file /usr/home/hudson/hudson-slave/workspace/Lucene-Solr-Tests-4.x-Java6/solr/build/solr-core/test/J1/./solrtest-confdropspot-org.apache.solr.cloud.ZkCLITest-1368425088988/lang/stopwords_gl.txt
[junit4:junit4]   1> INFO  - 2013-05-13 06:04:49.250; org.apache.solr.cloud.ZkController; Write file /usr/home/hudson/hudson-slave/workspace/Lucene-Solr-Tests-4.x-Java6/solr/build/solr-core/test/J1/./solrtest-confdropspot-org.apache.solr.cloud.ZkCLITest-1368425088988/lang/stopwords_no.txt
[junit4:junit4]   1> INFO  - 2013-05-13 06:04:49.251; org.apache.solr.cloud.ZkController; Write file /usr/home/hudson/hudson-slave/workspace/Lucene-Solr-Tests-4.x-Java6/solr/build/solr-core/test/J1/./solrtest-confdropspot-org.apache.solr.cloud.ZkCLITest-1368425088988/lang/stopwords_fa.txt
[junit4:junit4]   1> INFO  - 2013-05-13 06:04:49.253; org.apache.solr.cloud.ZkController; Write file /usr/home/hudson/hudson-slave/workspace/Lucene-Solr-Tests-4.x-Java6/solr/build/solr-core/test/J1/./solrtest-confdropspot-org.apache.solr.cloud.ZkCLITest-1368425088988/lang/stopwords_hu.txt
[junit4:junit4]   1> INFO  - 2013-05-13 06:04:49.254; org.apache.solr.cloud.ZkController; Write file /usr/home/hudson/hudson-slave/workspace/Lucene-Solr-Tests-4.x-Java6/solr/build/solr-core/test/J1/./solrtest-confdropspot-org.apache.solr.cloud.ZkCLITest-1368425088988/lang/stopwords_tr.txt
[junit4:junit4]   1> INFO  - 2013-05-13 06:04:49.256; org.apache.solr.cloud.ZkController; Write file /usr/home/hudson/hudson-slave/workspace/Lucene-Solr-Tests-4.x-Java6/solr/build/solr-core/test/J1/./solrtest-confdropspot-org.apache.solr.cloud.ZkCLITest-1368425088988/lang/stopwords_ro.txt
[junit4:junit4]   1> INFO  - 2013-05-13 06:04:49.257; org.apache.solr.cloud.ZkController; Write file /usr/home/hudson/hudson-slave/workspace/Lucene-Solr-Tests-4.x-Java6/solr/build/solr-core/test/J1/./solrtest-confdropspot-org.apache.solr.cloud.ZkCLITest-1368425088988/lang/stopwords_id.txt
[junit4:junit4]   1> INFO  - 2013-05-13 06:04:49.259; org.apache.solr.cloud.ZkController; Write file /usr/home/hudson/hudson-slave/workspace/Lucene-Solr-Tests-4.x-Java6/solr/build/solr-core/test/J1/./solrtest-confdropspot-org.apache.solr.cloud.ZkCLITest-1368425088988/lang/stopwords_cz.txt
[junit4:junit4]   1> INFO  - 2013-05-13 06:04:49.261; org.apache.solr.cloud.ZkController; Write file /usr/home/hudson/hudson-slave/workspace/Lucene-Solr-Tests-4.x-Java6/solr/build/solr-core/test/J1/./solrtest-confdropspot-org.apache.solr.cloud.ZkCLITest-1368425088988/lang/stopwords_ja.txt
[junit4:junit4]   1> INFO  - 2013-05-13 06:04:49.262; org.apache.solr.cloud.ZkController; Write file /usr/home/hudson/hudson-slave/workspace/Lucene-Solr-Tests-4.x-Java6/solr/build/solr-core/test/J1/./solrtest-confdropspot-org.apache.solr.cloud.ZkCLITest-1368425088988/lang/stopwords_fi.txt
[junit4:junit4]   1> INFO  - 2013-05-13 06:04:49.264; org.apache.solr.cloud.ZkController; Write file /usr/home/hudson/hudson-slave/workspace/Lucene-Solr-Tests-4.x-Java6/solr/build/solr-core/test/J1/./solrtest-confdropspot-org.apache.solr.cloud.ZkCLITest-1368425088988/lang/stopwords_it.txt
[junit4:junit4]   1> INFO  - 2013-05-13 06:04:49.266; org.apache.solr.cloud.ZkController; Write file /usr/home/hudson/hudson-slave/workspace/Lucene-Solr-Tests-4.x-Java6/solr/build/solr-core/test/J1/./solrtest-confdropspot-org.apache.solr.cloud.ZkCLITest-1368425088988/lang/contractions_fr.txt
[junit4:junit4]   1> INFO  - 2013-05-13 06:04:49.268; org.apache.solr.cloud.ZkController; Write file /usr/home/hudson/hudson-slave/workspace/Lucene-Solr-Tests-4.x-Java6/solr/build/solr-core/test/J1/./solrtest-confdropspot-org.apache.solr.cloud.ZkCLITest-1368425088988/lang/stopwords_ga.txt
[junit4:junit4]   1> INFO  - 2013-05-13 06:04:49.269; org.apache.solr.cloud.ZkController; Write file /usr/home/hudson/hudson-slave/workspace/Lucene-Solr-Tests-4.x-Java6/solr/build/solr-core/test/J1/./solrtest-confdropspot-org.apache.solr.cloud.ZkCLITest-1368425088988/lang/stopwords_en.txt
[junit4:junit4]   1> INFO  - 2013-05-13 06:04:49.271; org.apache.solr.cloud.ZkController; Write file /usr/home/hudson/hudson-slave/workspace/Lucene-Solr-Tests-4.x-Java6/solr/build/solr-core/test/J1/./solrtest-confdropspot-org.apache.solr.cloud.ZkCLITest-1368425088988/stopwords.txt
[junit4:junit4]   1> INFO  - 2013-05-13 06:04:49.272; org.apache.solr.cloud.ZkController; Write file /usr/home/hudson/hudson-slave/workspace/Lucene-Solr-Tests-4.x-Java6/solr/build/solr-core/test/J1/./solrtest-confdropspot-org.apache.solr.cloud.ZkCLITest-1368425088988/spellings.txt
[junit4:junit4]   1> INFO  - 2013-05-13 06:04:49.274; org.apache.solr.cloud.ZkController; Write file /usr/home/hudson/hudson-slave/workspace/Lucene-Solr-Tests-4.x-Java6/solr/build/solr-core/test/J1/./solrtest-confdropspot-org.apache.solr.cloud.ZkCLITest-1368425088988/mapping-ISOLatin1Accent.txt
[junit4:junit4]   1> INFO  - 2013-05-13 06:04:49.276; org.apache.solr.cloud.ZkController; Write file /usr/home/hudson/hudson-slave/workspace/Lucene-Solr-Tests-4.x-Java6/solr/build/solr-core/test/J1/./solrtest-confdropspot-org.apache.solr.cloud.ZkCLITest-1368425088988/admin-extra.html
[junit4:junit4]   1> INFO  - 2013-05-13 06:04:49.278; org.apache.solr.cloud.ZkController; Write file /usr/home/hudson/hudson-slave/workspace/Lucene-Solr-Tests-4.x-Java6/solr/build/solr-core/test/J1/./solrtest-confdropspot-org.apache.solr.cloud.ZkCLITest-1368425088988/xslt/luke.xsl
[junit4:junit4]   1> INFO  - 2013-05-13 06:04:49.280; org.apache.solr.cloud.ZkController; Write file /usr/home/hudson/hudson-slave/workspace/Lucene-Solr-Tests-4.x-Java6/solr/build/solr-core/test/J1/./solrtest-confdropspot-org.apache.solr.cloud.ZkCLITest-1368425088988/xslt/updateXml.xsl
[junit4:junit4]   1> INFO  - 2013-05-13 06:04:49.281; org.apache.solr.cloud.ZkController; Write file /usr/home/hudson/hudson-slave/workspace/Lucene-Solr-Tests-4.x-Java6/solr/build/solr-core/test/J1/./solrtest-confdropspot-org.apache.solr.cloud.ZkCLITest-1368425088988/xslt/example_atom.xsl
[junit4:junit4]   1> INFO  - 2013-05-13 06:04:49.283; org.apache.solr.cloud.ZkController; Write file /usr/home/hudson/hudson-slave/workspace/Lucene-Solr-Tests-4.x-Java6/solr/build/solr-core/test/J1/./solrtest-confdropspot-org.apache.solr.cloud.ZkCLITest-1368425088988/xslt/example.xsl
[junit4:junit4]   1> INFO  - 2013-05-13 06:04:49.285; org.apache.solr.cloud.ZkController; Write file /usr/home/hudson/hudson-slave/workspace/Lucene-Solr-Tests-4.x-Java6/solr/build/solr-core/test/J1/./solrtest-confdropspot-org.apache.solr.cloud.ZkCLITest-1368425088988/xslt/example_rss.xsl
[junit4:junit4]   1> INFO  - 2013-05-13 06:04:49.286; org.apache.solr.cloud.ZkController; Write file /usr/home/hudson/hudson-slave/workspace/Lucene-Solr-Tests-4.x-Java6/solr/build/solr-core/test/J1/./solrtest-confdropspot-org.apache.solr.cloud.ZkCLITest-1368425088988/synonyms.txt
[junit4:junit4]   1> INFO  - 2013-05-13 06:04:49.288; org.apache.solr.cloud.ZkController; Write file /usr/home/hudson/hudson-slave/workspace/Lucene-Solr-Tests-4.x-Java6/solr/build/solr-core/test/J1/./solrtest-confdropspot-org.apache.solr.cloud.ZkCLITest-1368425088988/scripts.conf
[junit4:junit4]   1> INFO  - 2013-05-13 06:04:49.289; org.apache.solr.cloud.ZkController; Write file /usr/home/hudson/hudson-slave/workspace/Lucene-Solr-Tests-4.x-Java6/solr/build/solr-core/test/J1/./solrtest-confdropspot-org.apache.solr.cloud.ZkCLITest-1368425088988/update-script.js
[junit4:junit4]   1> INFO  - 2013-05-13 06:04:49.292; org.apache.solr.cloud.ZkController; Write file /usr/home/hudson/hudson-slave/workspace/Lucene-Solr-Tests-4.x-Java6/solr/build/solr-core/test/J1/./solrtest-confdropspot-org.apache.solr.cloud.ZkCLITest-1368425088988/velocity/query_spatial.vm
[junit4:junit4]   1> INFO  - 2013-05-13 06:04:49.293; org.apache.solr.cloud.ZkController; Write file /usr/home/hudson/hudson-slave/workspace/Lucene-Solr-Tests-4.x-Java6/solr/build/solr-core/test/J1/./solrtest-confdropspot-org.apache.solr.cloud.ZkCLITest-1368425088988/velocity/mime_type_lists.vm
[junit4:junit4]   1> INFO  - 2013-05-13 06:04:49.295; org.apache.solr.cloud.ZkController; Write file /usr/home/hudson/hudson-slave/workspace/Lucene-Solr-Tests-4.x-Java6/solr/build/solr-core/test/J1/./solrtest-confdropspot-org.apache.solr.cloud.ZkCLITest-1368425088988/velocity/results_list.vm
[junit4:junit4]   1> INFO  - 2013-05-13 06:04:49.297; org.apache.solr.cloud.ZkController; Write file /usr/home/hudson/hudson-slave/workspace/Lucene-Solr-Tests-4.x-Java6/solr/build/solr-core/test/J1/./solrtest-confdropspot-org.apache.solr.cloud.ZkCLITest-1368425088988/velocity/cluster_results.vm
[junit4:junit4]   1> INFO  - 2013-05-13 06:04:49.298; org.apache.solr.cloud.ZkController; Write file /usr/home/hudson/hudson-slave/workspace/Lucene-Solr-Tests-4.x-Java6/solr/build/solr-core/test/J1/./solrtest-confdropspot-org.apache.solr.cloud.ZkCLITest-1368425088988/velocity/hit_grouped.vm
[junit4:junit4]   1> INFO  - 2013-05-13 06:04:49.300; org.apache.solr.cloud.ZkController; Write file /usr/home/hudson/hudson-slave/workspace/Lucene-Solr-Tests-4.x-Java6/solr/build/solr-core/test/J1/./solrtest-confdropspot-org.apache.solr.cloud.ZkCLITest-1368425088988/velocity/layout.vm
[junit4:junit4]   1> INFO  - 2013-05-13 06:04:49.302; org.apache.solr.cloud.ZkController; Write file /usr/home/hudson/hudson-slave/workspace/Lucene-Solr-Tests-4.x-Java6/solr/build/solr-core/test/J1/./solrtest-confdropspot-org.apache.solr.cloud.ZkCLITest-1368425088988/velocity/debug.vm
[junit4:junit4]   1> INFO  - 2013-05-13 06:04:49.303; org.apache.solr.cloud.ZkController; Write file /usr/home/hudson/hudson-slave/workspace/Lucene-Solr-Tests-4.x-Java6/solr/build/solr-core/test/J1/./solrtest-confdropspot-org.apache.solr.cloud.ZkCLITest-1368425088988/velocity/join_doc.vm
[junit4:junit4]   1> INFO  - 2013-05-13 06:04:49.305; org.apache.solr.cloud.ZkController; Write file /usr/home/hudson/hudson-slave/workspace/Lucene-Solr-Tests-4.x-Java6/solr/build/solr-core/test/J1/./solrtest-confdropspot-org.apache.solr.cloud.ZkCLITest-1368425088988/velocity/facet_queries.vm
[junit4:junit4]   1> INFO  - 2013-05-13 06:04:49.306; org.apache.solr.cloud.ZkController; Write file /usr/home/hudson/hudson-slave/workspace/Lucene-Solr-Tests-4.x-Java6/solr/build/solr-core/test/J1/./solrtest-confdropspot-org.apache.solr.cloud.ZkCLITest-1368425088988/velocity/query_group.vm
[junit4:junit4]   1> INFO  - 2013-05-13 06:04:49.308; org.apache.solr.cloud.ZkController; Write file /usr/home/hudson/hudson-slave/workspace/Lucene-Solr-Tests-4.x-Java6/solr/build/solr-core/test/J1/./solrtest-confdropspot-org.apache.solr.cloud.ZkCLITest-1368425088988/velocity/main.css
[junit4:junit4]   1> INFO  - 2013-05-13 06:04:49.310; org.apache.solr.cloud.ZkController; Write file /usr/home/hudson/hudson-slave/workspace/Lucene-Solr-Tests-4.x-Java6/solr/build/solr-core/test/J1/./solrtest-confdropspot-org.apache.solr.cloud.ZkCLITest-1368425088988/velocity/VM_global_library.vm
[junit4:junit4]   1> INFO  - 2013-05-13 06:04:49.311; org.apache.solr.cloud.ZkController; Write file /usr/home/hudson/hudson-slave/workspace/Lucene-Solr-Tests-4.x-Java6/solr/build/solr-core/test/J1/./solrtest-confdropspot-org.apache.solr.cloud.ZkCLITest-1368425088988/velocity/pagination_bottom.vm
[junit4:junit4]   1> INFO  - 2013-05-13 06:04:49.313; org.apache.solr.cloud.ZkController; Write file /usr/home/hudson/hudson-slave/workspace/Lucene-Solr-Tests-4.x-Java6/solr/build/solr-core/test/J1/./solrtest-confdropspot-org.apache.solr.cloud.ZkCLITest-1368425088988/velocity/error.vm
[junit4:junit4]   1> INFO  - 2013-05-13 06:04:49.315; org.apache.solr.cloud.ZkController; Write file /usr/home/hudson/hudson-slave/workspace/Lucene-Solr-Tests-4.x-Java6/solr/build/solr-core/test/J1/./solrtest-confdropspot-org.apache.solr.cloud.ZkCLITest-1368425088988/velocity/facets.vm
[junit4:junit4]   1> INFO  - 2013-05-13 06:04:49.316; org.apache.solr.cloud.ZkController; Write file /usr/home/hudson/hudson-slave/workspace/Lucene-Solr-Tests-4.x-Java6/solr/build/solr-core/test/J1/./solrtest-confdropspot-org.apache.solr.cloud.ZkCLITest-1368425088988/velocity/richtext_doc.vm
[junit4:junit4]   1> INFO  - 2013-05-13 06:04:49.318; org.apache.solr.cloud.ZkController; Write file /usr/home/hudson/hudson-slave/workspace/Lucene-Solr-Tests-4.x-Java6/solr/build/solr-core/test/J1/./solrtest-confdropspot-org.apache.solr.cloud.ZkCLITest-1368425088988/velocity/head.vm
[junit4:junit4]   1> INFO  - 2013-05-13 06:04:49.320; org.apache.solr.cloud.ZkController; Write file /usr/home/hudson/hudson-slave/workspace/Lucene-Solr-Tests-4.x-Java6/solr/build/solr-core/test/J1/./solrtest-confdropspot-org.apache.solr.cloud.ZkCLITest-1368425088988/velocity/query_form.vm
[junit4:junit4]   1> INFO  - 2013-05-13 06:04:49.321; org.apache.solr.cloud.ZkController; Write file /usr/home/hudson/hudson-slave/workspace/Lucene-Solr-Tests-4.x-Java6/solr/build/solr-core/test/J1/./solrtest-confdropspot-org.apache.solr.cloud.ZkCLITest-1368425088988/velocity/cluster.vm
[junit4:junit4]   1> INFO  - 2013-05-13 06:04:49.323; org.apache.solr.cloud.ZkController; Write file /usr/home/hudson/hudson-slave/workspace/Lucene-Solr-Tests-4.x-Java6/solr/build/solr-core/test/J1/./solrtest-confdropspot-org.apache.solr.cloud.ZkCLITest-1368425088988/velocity/hit_plain.vm
[junit4:junit4]   1> INFO  - 2013-05-13 06:04:49.325; org.apache.solr.cloud.ZkController; Write file /usr/home/hudson/hudson-slave/workspace/Lucene-Solr-Tests-4.x-Java6/solr/build/solr-core/test/J1/./solrtest-confdropspot-org.apache.solr.cloud.ZkCLITest-1368425088988/velocity/footer.vm
[junit4:junit4]   1> INFO  - 2013-05-13 06:04:49.326; org.apache.solr.cloud.ZkController; Write file /usr/home/hudson/hudson-slave/workspace/Lucene-Solr-Tests-4.x-Java6/solr/build/solr-core/test/J1/./solrtest-confdropspot-org.apache.solr.cloud.ZkCLITest-1368425088988/velocity/jquery.autocomplete.js
[junit4:junit4]   1> INFO  - 2013-05-13 06:04:49.328; org.apache.solr.cloud.ZkController; Write file /usr/home/hudson/hudson-slave/workspace/Lucene-Solr-Tests-4.x-Java6/solr/build/solr-core/test/J1/./solrtest-confdropspot-org.apache.solr.cloud.ZkCLITest-1368425088988/velocity/browse.vm
[junit4:junit4]   1> INFO  - 2013-05-13 06:04:49.330; org.apache.solr.cloud.ZkController; Write file /usr/home/hudson/hudson-slave/workspace/Lucene-Solr-Tests-4.x-Java6/solr/build/solr-core/test/J1/./solrtest-confdropspot-org.apache.solr.cloud.ZkCLITest-1368425088988/velocity/facet_pivot.vm
[junit4:junit4]   1> INFO  - 2013-05-13 06:04:49.331; org.apache.solr.cloud.ZkController; Write file /usr/home/hudson/hudson-slave/workspace/Lucene-Solr-Tests-4.x-Java6/solr/build/solr-core/test/J1/./solrtest-confdropspot-org.apache.solr.cloud.ZkCLITest-1368425088988/velocity/jquery.autocomplete.css
[junit4:junit4]   1> INFO  - 2013-05-13 06:04:49.333; org.apache.solr.cloud.ZkController; Write file /usr/home/hudson/hudson-slave/workspace/Lucene-Solr-Tests-4.x-Java6/solr/build/solr-core/test/J1/./solrtest-confdropspot-org.apache.solr.cloud.ZkCLITest-1368425088988/velocity/README.txt
[junit4:junit4]   1> INFO  - 2013-05-13 06:04:49.335; org.apache.solr.cloud.ZkController; Write file /usr/home/hudson/hudson-slave/workspace/Lucene-Solr-Tests-4.x-Java6/solr/build/solr-core/test/J1/./solrtest-confdropspot-org.apache.solr.cloud.ZkCLITest-1368425088988/velocity/did_you_mean.vm
[junit4:junit4]   1> INFO  - 2013-05-13 06:04:49.336; org.apache.solr.cloud.ZkController; Write file /usr/home/hudson/hudson-slave/workspace/Lucene-Solr-Tests-4.x-Java6/solr/build/solr-core/test/J1/./solrtest-confdropspot-org.apache.solr.cloud.ZkCLITest-1368425088988/velocity/header.vm
[junit4:junit4]   1> INFO  - 2013-05-13 06:04:49.338; org.apache.solr.cloud.ZkController; Write file /usr/home/hudson/hudson-slave/workspace/Lucene-Solr-Tests-4.x-Java6/solr/build/solr-core/test/J1/./solrtest-confdropspot-org.apache.solr.cloud.ZkCLITest-1368425088988/velocity/suggest.vm
[junit4:junit4]   1> INFO  - 2013-05-13 06:04:49.339; org.apache.solr.cloud.ZkController; Write file /usr/home/hudson/hudson-slave/workspace/Lucene-Solr-Tests-4.x-Java6/solr/build/solr-core/test/J1/./solrtest-confdropspot-org.apache.solr.cloud.ZkCLITest-1368425088988/velocity/hit.vm
[junit4:junit4]   1> INFO  - 2013-05-13 06:04:49.341; org.apache.solr.cloud.ZkController; Write file /usr/home/hudson/hudson-slave/workspace/Lucene-Solr-Tests-4.x-Java6/solr/build/solr-core/test/J1/./solrtest-confdropspot-org.apache.solr.cloud.ZkCLITest-1368425088988/velocity/pagination_top.vm
[junit4:junit4]   1> INFO  - 2013-05-13 06:04:49.343; org.apache.solr.cloud.ZkController; Write file /usr/home/hudson/hudson-slave/workspace/Lucene-Solr-Tests-4.x-Java6/solr/build/solr-core/test/J1/./solrtest-confdropspot-org.apache.solr.cloud.ZkCLITest-1368425088988/velocity/query.vm
[junit4:junit4]   1> INFO  - 2013-05-13 06:04:49.344; org.apache.solr.cloud.ZkController; Write file /usr/home/hudson/hudson-slave/workspace/Lucene-Solr-Tests-4.x-Java6/solr/build/solr-core/test/J1/./solrtest-confdropspot-org.apache.solr.cloud.ZkCLITest-1368425088988/velocity/product_doc.vm
[junit4:junit4]   1> INFO  - 2013-05-13 06:04:49.346; org.apache.solr.cloud.ZkController; Write file /usr/home/hudson/hudson-slave/workspace/Lucene-Solr-Tests-4.x-Java6/solr/build/solr-core/test/J1/./solrtest-confdropspot-org.apache.solr.cloud.ZkCLITest-1368425088988/velocity/tabs.vm
[junit4:junit4]   1> INFO  - 2013-05-13 06:04:49.347; org.apache.solr.cloud.ZkController; Write file /usr/home/hudson/hudson-slave/workspace/Lucene-Solr-Tests-4.x-Java6/solr/build/solr-core/test/J1/./solrtest-confdropspot-org.apache.solr.cloud.ZkCLITest-1368425088988/velocity/facet_ranges.vm
[junit4:junit4]   1> INFO  - 2013-05-13 06:04:49.349; org.apache.solr.cloud.ZkController; Write file /usr/home/hudson/hudson-slave/workspace/Lucene-Solr-Tests-4.x-Java6/solr/build/solr-core/test/J1/./solrtest-confdropspot-org.apache.solr.cloud.ZkCLITest-1368425088988/velocity/facet_fields.vm
[junit4:junit4]   1> INFO  - 2013-05-13 06:04:49.351; org.apache.solr.cloud.ZkController; Write file /usr/home/hudson/hudson-slave/workspace/Lucene-Solr-Tests-4.x-Java6/solr/build/solr-core/test/J1/./solrtest-confdropspot-org.apache.solr.cloud.ZkCLITest-1368425088988/elevate.xml
[junit4:junit4]   1> INFO  - 2013-05-13 06:04:49.352; org.apache.solr.cloud.ZkController; Write file /usr/home/hudson/hudson-slave/workspace/Lucene-Solr-Tests-4.x-Java6/solr/build/solr-core/test/J1/./solrtest-confdropspot-org.apache.solr.cloud.ZkCLITest-1368425088988/admin-extra.menu-bottom.html
[junit4:junit4]   1> INFO  - 2013-05-13 06:04:49.354; org.apache.solr.cloud.ZkController; Write file /usr/home/hudson/hudson-slave/workspace/Lucene-Solr-Tests-4.x-Java6/solr/build/solr-core/test/J1/./solrtest-confdropspot-org.apache.solr.cloud.ZkCLITest-1368425088988/schema.xml
[junit4:junit4]   1> WARN  - 2013-05-13 06:04:49.557; org.apache.zookeeper.server.NIOServerCnxn; caught end of stream exception
[junit4:junit4]   1> EndOfStreamException: Unable to read additional data from client sessionid 0x13e9c7dc31d0001, likely client has closed socket
[junit4:junit4]   1> 	at org.apache.zookeeper.server.NIOServerCnxn.doIO(NIOServerCnxn.java:220)
[junit4:junit4]   1> 	at org.apache.zookeeper.server.NIOServerCnxnFactory.run(NIOServerCnxnFactory.java:208)
[junit4:junit4]   1> 	at java.lang.Thread.run(Thread.java:679)
[junit4:junit4]   1> INFO  - 2013-05-13 06:04:49.559; org.apache.solr.cloud.ZkTestServer; connecting to 127.0.0.1:42962 42962
[junit4:junit4]   1> INFO  - 2013-05-13 06:04:49.656; org.apache.solr.SolrTestCaseJ4; ###Ending testUpConfigLinkConfigClearZk
[junit4:junit4]   2> Creating dataDir: /usr/home/hudson/hudson-slave/workspace/Lucene-Solr-Tests-4.x-Java6/solr/build/solr-core/test/J1/./solrtest-ZkCLITest-1368425087766
[junit4:junit4]   2> NOTE: reproduce with: ant test  -Dtestcase=ZkCLITest -Dtests.method=testUpConfigLinkConfigClearZk -Dtests.seed=3376183124A48C01 -Dtests.multiplier=3 -Dtests.slow=true -Dtests.locale=no_NO_NY -Dtests.timezone=Asia/Omsk -Dtests.file.encoding=ISO8859-1
[junit4:junit4] FAILURE 1.91s J1 | ZkCLITest.testUpConfigLinkConfigClearZk <<<
[junit4:junit4]    > Throwable #1: java.lang.AssertionError: Make sure we did download each file in the original configuration
[junit4:junit4]    > 	at __randomizedtesting.SeedInfo.seed([3376183124A48C01:1710B53FAE6B3A67]:0)
[junit4:junit4]    > 	at org.apache.solr.cloud.ZkCLITest.testUpConfigLinkConfigClearZk(ZkCLITest.java:198)
[junit4:junit4]    > 	at java.lang.Thread.run(Thread.java:679)
[junit4:junit4]   1> INFO  - 2013-05-13 06:04:49.677; org.apache.solr.SolrTestCaseJ4; ###Starting testBootstrapWithChroot
[junit4:junit4]   1> INFO  - 2013-05-13 06:04:49.677; org.apache.solr.cloud.ZkCLITest; ####SETUP_START testBootstrapWithChroot
[junit4:junit4]   1> INFO  - 2013-05-13 06:04:49.678; org.apache.solr.cloud.ZkCLITest; ZooKeeper dataDir:/usr/home/hudson/hudson-slave/workspace/Lucene-Solr-Tests-4.x-Java6/solr/build/solr-core/test/J1/./solrtest-ZkCLITest-1368425089677/zookeeper/server1/data
[junit4:junit4]   1> INFO  - 2013-05-13 06:04:49.678; org.apache.solr.cloud.ZkTestServer; STARTING ZK TEST SERVER
[junit4:junit4]   1> client port:0.0.0.0/0.0.0.0:0
[junit4:junit4]   1> INFO  - 2013-05-13 06:04:49.679; org.apache.solr.cloud.ZkTestServer$ZKServerMain; Starting server
[junit4:junit4]   1> INFO  - 2013-05-13 06:04:49.780; org.apache.solr.cloud.ZkTestServer; start zk server on port:42969
[junit4:junit4]   1> INFO  - 2013-05-13 06:04:49.781; org.apache.solr.common.cloud.ConnectionManager; Waiting for client to connect to ZooKeeper
[junit4:junit4]   1> INFO  - 2013-05-13 06:04:49.788; org.apache.solr.common.cloud.ConnectionManager; Watcher org.apache.solr.common.cloud.ConnectionManager@6be9422e name:ZooKeeperConnection Watcher:127.0.0.1:42969 got event WatchedEvent state:SyncConnected type:None path:null path:null type:None
[junit4:junit4]   1> INFO  - 2013-05-13 06:04:49.789; org.apache.solr.common.cloud.ConnectionManager; Client is connected to ZooKeeper
[junit4:junit4]   1> INFO  - 2013-05-13 06:04:49.789; org.apache.solr.common.cloud.SolrZkClient; makePath: /solr
[junit4:junit4]   1> INFO  - 2013-05-13 06:04:49.801; org.apache.solr.common.cloud.ConnectionManager; Waiting for client to connect to ZooKeeper
[junit4:junit4]   1> INFO  - 2013-05-13 06:04:49.803; org.apache.solr.common.cloud.ConnectionManager; Watcher org.apache.solr.common.cloud.ConnectionManager@a67bd23 name:ZooKeeperConnection Watcher:127.0.0.1:42969/solr got event WatchedEvent state:SyncConnected type:None path:null path:null type:None
[junit4:junit4]   1> INFO  - 2013-05-13 06:04:49.803; org.apache.solr.common.cloud.ConnectionManager; Client is connected to ZooKeeper
[junit4:junit4]   1> INFO  - 2013-05-13 06:04:49.804; org.apache.solr.cloud.ZkCLITest; ####SETUP_END testBootstrapWithChroot
[junit4:junit4]   1> INFO  - 2013-05-13 06:04:49.805; org.apache.solr.common.cloud.ConnectionManager; Waiting for client to connect to ZooKeeper
[junit4:junit4]   1> INFO  - 2013-05-13 06:04:49.807; org.apache.solr.common.cloud.ConnectionManager; Watcher org.apache.solr.common.cloud.ConnectionManager@6d21978b name:ZooKeeperConnection Watcher:127.0.0.1:42969/solr/foo/bar got event WatchedEvent state:SyncConnected type:None path:null path:null type:None
[junit4:junit4]   1> INFO  - 2013-05-13 06:04:49.807; org.apache.solr.common.cloud.ConnectionManager; Client is connected to ZooKeeper
[junit4:junit4]   1> INFO  - 2013-05-13 06:04:49.808; org.apache.solr.core.SolrResourceLoader; new SolrResourceLoader for directory: '/usr/home/hudson/hudson-slave/workspace/Lucene-Solr-Tests-4.x-Java6/solr/example/solr/'
[junit4:junit4]   1> INFO  - 2013-05-13 06:04:49.896; org.apache.solr.core.SolrCoreDiscoverer; Looking for cores in /usr/home/hudson/hudson-slave/workspace/Lucene-Solr-Tests-4.x-Java6/solr/example/solr
[junit4:junit4]   1> INFO  - 2013-05-13 06:04:49.897; org.apache.solr.core.SolrCoreDiscoverer; Looking for cores in /usr/home/hudson/hudson-slave/workspace/Lucene-Solr-Tests-4.x-Java6/solr/example/solr/.svn
[junit4:junit4]   1> INFO  - 2013-05-13 06:04:49.899; org.apache.solr.core.SolrCoreDiscoverer; Looking for cores in /usr/home/hudson/hudson-slave/workspace/Lucene-Solr-Tests-4.x-Java6/solr/example/solr/.svn/prop-base
[junit4:junit4]   1> INFO  - 2013-05-13 06:04:49.902; org.apache.solr.core.SolrCoreDiscoverer; Looking for cores in /usr/home/hudson/hudson-slave/workspace/Lucene-Solr-Tests-4.x-Java6/solr/example/solr/.svn/props
[junit4:junit4]   1> INFO  - 2013-05-13 06:04:49.903; org.apache.solr.core.SolrCoreDiscoverer; Looking for cores in /usr/home/hudson/hudson-slave/workspace/Lucene-Solr-Tests-4.x-Java6/solr/example/solr/.svn/tmp
[junit4:junit4]   1> INFO  - 2013-05-13 06:04:49.904; org.apache.solr.core.SolrCoreDiscoverer; Looking for cores in /usr/home/hudson/hudson-slave/workspace/Lucene-Solr-Tests-4.x-Java6/solr/example/solr/.svn/tmp/props
[junit4:junit4]   1> INFO  - 2013-05-13 06:04:49.905; org.apache.solr.core.SolrCoreDiscoverer; Looking for cores in /usr/home/hudson/hudson-slave/workspace/Lucene-Solr-Tests-4.x-Java6/solr/example/solr/.svn/tmp/prop-base
[junit4:junit4]   1> INFO  - 2013-05-13 06:04:49.906; org.apache.solr.core.SolrCoreDiscoverer; Looking for cores in /usr/home/hudson/hudson-slave/workspace/Lucene-Solr-Tests-4.x-Java6/solr/example/solr/.svn/tmp/text-base
[junit4:junit4]   1> INFO  - 2013-05-13 06:04:49.907; org.apache.solr.core.SolrCoreDiscoverer; Looking for cores in /usr/home/hudson/hudson-slave/workspace/Lucene-Solr-Tests-4.x-Java6/solr/example/solr/.svn/text-base
[junit4:junit4]   1> INFO  - 2013-05-13 06:04:49.910; org.apache.solr.core.SolrCoreDiscoverer; Discovered properties file /usr/home/hudson/hudson-slave/workspace/Lucene-Solr-Tests-4.x-Java6/solr/example/solr/collection1/core.properties, adding to cores
[junit4:junit4]   1> INFO  - 2013-05-13 06:04:49.911; org.apache.solr.core.SolrCoreDiscoverer; Looking for cores in /usr/home/hudson/hudson-slave/workspace/Lucene-Solr-Tests-4.x-Java6/solr/example/solr/bin
[junit4:junit4]   1> INFO  - 2013-05-13 06:04:49.912; org.apache.solr.core.SolrCoreDiscoverer; Looking for cores in /usr/home/hudson/hudson-slave/workspace/Lucene-Solr-Tests-4.x-Java6/solr/example/solr/bin/.svn
[junit4:junit4]   1> INFO  - 2013-05-13 06:04:49.913; org.apache.solr.core.SolrCoreDiscoverer; Looking for cores in /usr/home/hudson/hudson-slave/workspace/Lucene-Solr-Tests-4.x-Java6/solr/example/solr/bin/.svn/prop-base
[junit4:junit4]   1> INFO  - 2013-05-13 06:04:49.915; org.apache.solr.core.SolrCoreDiscoverer; Looking for cores in /usr/home/hudson/hudson-slave/workspace/Lucene-Solr-Tests-4.x-Java6/solr/example/solr/bin/.svn/tmp
[junit4:junit4]   1> INFO  - 2013-05-13 06:04:49.916; org.apache.solr.core.SolrCoreDiscoverer; Looking for cores in /usr/home/hudson/hudson-slave/workspace/Lucene-Solr-Tests-4.x-Java6/solr/example/solr/bin/.svn/tmp/props
[junit4:junit4]   1> INFO  - 2013-05-13 06:04:49.917; org.apache.solr.core.SolrCoreDiscoverer; Looking for cores in /usr/home/hudson/hudson-slave/workspace/Lucene-Solr-Tests-4.x-Java6/solr/example/solr/bin/.svn/tmp/text-base
[junit4:junit4]   1> INFO  - 2013-05-13 06:04:49.918; org.apache.solr.core.SolrCoreDiscoverer; Looking for cores in /usr/home/hudson/hudson-slave/workspace/Lucene-Solr-Tests-4.x-Java6/solr/example/solr/bin/.svn/tmp/prop-base
[junit4:junit4]   1> INFO  - 2013-05-13 06:04:49.919; org.apache.solr.core.SolrCoreDiscoverer; Looking for cores in /usr/home/hudson/hudson-slave/workspace/Lucene-Solr-Tests-4.x-Java6/solr/example/solr/bin/.svn/props
[junit4:junit4]   1> INFO  - 2013-05-13 06:04:49.921; org.apache.solr.core.SolrCoreDiscoverer; Looking for cores in /usr/home/hudson/hudson-slave/workspace/Lucene-Solr-Tests-4.x-Java6/solr/example/solr/bin/.svn/text-base
[junit4:junit4]   1> INFO  - 2013-05-13 06:04:49.923; org.apache.solr.cloud.ZkController; zkHost includes chroot
[junit4:junit4]   1> INFO  - 2013-05-13 06:04:49.924; org.apache.solr.common.cloud.ConnectionManager; Waiting for client to connect to ZooKeeper
[junit4:junit4]   1> INFO  - 2013-05-13 06:04:49.927; org.apache.solr.common.cloud.ConnectionManager; Watcher org.apache.solr.common.cloud.ConnectionManager@7185d267 name:ZooKeeperConnection Watcher:127.0.0.1:42969 got event WatchedEvent state:SyncConnected type:None path:null path:null type:None
[junit4:junit4]   1> INFO  - 2013-05-13 06:04:49.927; org.apache.solr.common.cloud.ConnectionManager; Client is connected to ZooKeeper
[junit4:junit4]   1> INFO  - 2013-05-13 06:04:49.928; org.apache.solr.common.cloud.SolrZkClient; makePath: /solr/foo/bar
[junit4:junit4]   1> INFO  - 2013-05-13 06:04:49.939; org.apache.solr.cloud.ZkController; bootstraping config for 1 cores into ZooKeeper using solr.xml from /usr/home/hudson/hudson-slave/workspace/Lucene-Solr-Tests-4.x-Java6/solr/example/solr/
[junit4:junit4]   1> idir:/usr/home/hudson/hudson-slave/workspace/Lucene-Solr-Tests-4.x-Java6/solr/example/solr/collection1
[junit4:junit4]   1> INFO  - 2013-05-13 06:04:49.940; org.apache.solr.cloud.ZkController; Uploading directory /usr/home/hudson/hudson-slave/workspace/Lucene-Solr-Tests-4.x-Java6/solr/example/solr/collection1/conf with name collection1 for SolrCore collection1
[junit4:junit4]   1> INFO  - 2013-05-13 06:04:49.941; org.apache.solr.common.cloud.SolrZkClient; makePath: /configs/collection1/solrconfig.xml
[junit4:junit4]   1> INFO  - 2013-05-13 06:04:50.148; org.apache.solr.common.cloud.SolrZkClient; makePath: /configs/collection1/mapping-FoldToASCII.txt
[junit4:junit4]   1> INFO  - 2013-05-13 06:04:50.154; org.apache.solr.common.cloud.SolrZkClient; makePath: /configs/collection1/lang/stopwords_hi.txt
[junit4:junit4]   1> INFO  - 2013-05-13 06:04:50.168; org.apache.solr.common.cloud.SolrZkClient; makePath: /configs/collection1/lang/stopwords_es.txt
[junit4:junit4]   1> INFO  - 2013-05-13 06:04:50.172; org.apache.solr.common.cloud.SolrZkClient; makePath: /configs/collection1/lang/stopwords_hu.txt
[junit4:junit4]   1> INFO  - 2013-05-13 06:04:50.175; org.apache.solr.common.cloud.SolrZkClient; makePath: /configs/collection1/lang/stopwords_sv.txt
[junit4:junit4]   1> INFO  - 2013-05-13 06:04:50.183; org.apache.solr.common.cloud.SolrZkClient; makePath: /configs/collection1/lang/stopwords_it.txt
[junit4:junit4]   1> INFO  - 2013-05-13 06:04:50.187; org.apache.solr.common.cloud.SolrZkClient; makePath: /configs/collection1/lang/stopwords_gl.txt
[junit4:junit4]   1> INFO  - 2013-05-13 06:04:50.190; org.apache.solr.common.cloud.SolrZkClient; makePath: /configs/collection1/lang/stopwords_th.txt
[junit4:junit4]   1> INFO  - 2013-05-13 06:04:50.194; org.apache.solr.common.cloud.SolrZkClient; makePath: /configs/collection1/lang/stopwords_pt.txt
[junit4:junit4]   1> INFO  - 2013-05-13 06:04:50.197; org.apache.solr.common.cloud.SolrZkClient; makePath: /configs/collection1/lang/stopwords_eu.txt
[junit4:junit4]   1> INFO  - 2013-05-13 06:04:50.205; org.apache.solr.common.cloud.SolrZkClient; makePath: /configs/collection1/lang/contractions_ga.txt
[junit4:junit4]   1> INFO  - 2013-05-13 06:04:50.209; org.apache.solr.common.cloud.SolrZkClient; makePath: /configs/collection1/lang/stopwords_ar.txt
[junit4:junit4]   1> INFO  - 2013-05-13 06:04:50.212; org.apache.solr.common.cloud.SolrZkClient; makePath: /configs/collection1/lang/contractions_ca.txt
[junit4:junit4]   1> INFO  - 2013-05-13 06:04:50.220; org.apache.solr.common.cloud.SolrZkClient; makePath: /configs/collection1/lang/stopwords_en.txt
[junit4:junit4]   1> INFO  - 2013-05-13 06:04:50.223; org.apache.solr.common.cloud.SolrZkClient; makePath: /configs/collection1/lang/hyphenations_ga.txt
[junit4:junit4]   1> INFO  - 2013-05-13 06:04:50.227; org.apache.solr.common.cloud.SolrZkClient; makePath: /configs/collection1/lang/contractions_fr.txt
[junit4:junit4]   1> INFO  - 2013-05-13 06:04:50.230; org.apache.solr.common.cloud.SolrZkClient; makePath: /configs/collection1/lang/stopwords_nl.txt
[junit4:junit4]   1> INFO  - 2013-05-13 06:04:50.234; org.apache.solr.common.cloud.SolrZkClient; makePath: /configs/collection1/lang/stopwords_da.txt
[junit4:junit4]   1> INFO  - 2013-05-13 06:04:50.237; org.apache.solr.common.cloud.SolrZkClient; makePath: /configs/collection1/lang/stopwords_tr.txt
[junit4:junit4]   1> INFO  - 2013-05-13 06:04:50.247; org.apache.solr.common.cloud.SolrZkClient; makePath: /configs/collection1/lang/stopwords_no.txt
[junit4:junit4]   1> INFO  - 2013-05-13 06:04:50.251; org.apache.solr.common.cloud.SolrZkClient; makePath: /configs/collection1/lang/stopwords_de.txt
[junit4:junit4]   1> INFO  - 2013-05-13 06:04:50.255; org.apache.solr.common.cloud.SolrZkClient; makePath: /configs/collection1/lang/stopwords_id.txt
[junit4:junit4]   1> INFO  - 2013-05-13 06:04:50.258; org.apache.solr.common.cloud.SolrZkClient; makePath: /configs/collection1/lang/stopwords_ja.txt
[junit4:junit4]   1> INFO  - 2013-05-13 06:04:50.261; org.apache.solr.common.cloud.SolrZkClient; makePath: /configs/collection1/lang/stemdict_nl.txt
[junit4:junit4]   1> INFO  - 2013-05-13 06:04:50.269; org.apache.solr.common.cloud.SolrZkClient; makePath: /configs/collection1/lang/contractions_it.txt
[junit4:junit4]   1> INFO  - 2013-05-13 06:04:50.272; org.apache.solr.common.cloud.SolrZkClient; makePath: /configs/collection1/lang/stopwords_ru.txt
[junit4:junit4]   1> INFO  - 2013-05-13 06:04:50.276; org.apache.solr.common.cloud.SolrZkClient; makePath: /configs/collection1/lang/stopwords_hy.txt
[junit4:junit4]   1> INFO  - 2013-05-13 06:04:50.279; org.apache.solr.common.cloud.SolrZkClient; makePath: /configs/collection1/lang/stopwords_fa.txt
[junit4:junit4]   1> INFO  - 2013-05-13 06:04:50.287; org.apache.solr.common.cloud.SolrZkClient; makePath: /configs/collection1/lang/userdict_ja.txt
[junit4:junit4]   1> INFO  - 2013-05-13 06:04:50.291; org.apache.solr.common.cloud.SolrZkClient; makePath: /configs/collection1/lang/stoptags_ja.txt
[junit4:junit4]   1> INFO  - 2013-05-13 06:04:50.295; org.apache.solr.common.cloud.SolrZkClient; makePath: /configs/collection1/lang/stopwords_cz.txt
[junit4:junit4]   1> INFO  - 2013-05-13 06:04:50.299; org.apache.solr.common.cloud.SolrZkClient; makePath: /configs/collection1/lang/stopwords_ga.txt
[junit4:junit4]   1> INFO  - 2013-05-13 06:04:50.303; org.apache.solr.common.cloud.SolrZkClient; makePath: /configs/collection1/lang/stopwords_ca.txt
[junit4:junit4]   1> INFO  - 2013-05-13 06:04:50.311; org.apache.solr.common.cloud.SolrZkClient; makePath: /configs/collection1/lang/stopwords_bg.txt
[junit4:junit4]   1> INFO  - 2013-05-13 06:04:50.314; org.apache.solr.common.cloud.SolrZkClient; makePath: /configs/collection1/lang/stopwords_fr.txt
[junit4:junit4]   1> INFO  - 2013-05-13 06:04:50.318; org.apache.solr.common.cloud.SolrZkClient; makePath: /configs/collection1/lang/stopwords_el.txt
[junit4:junit4]   1> INFO  - 2013-05-13 06:04:50.322; org.apache.solr.common.cloud.SolrZkClient; makePath: /configs/collection1/lang/stopwords_ro.txt
[junit4:junit4]   1> INFO  - 2013-05-13 06:04:50.325; org.apache.solr.common.cloud.SolrZkClient; makePath: /configs/collection1/lang/stopwords_lv.txt
[junit4:junit4]   1> INFO  - 2013-05-13 06:04:50.330; org.apache.solr.common.cloud.SolrZkClient; makePath: /configs/collection1/lang/stopwords_fi.txt
[junit4:junit4]   1> INFO  - 2013-05-13 06:04:50.334; org.apache.solr.common.cloud.SolrZkClient; makePath: /configs/collection1/xslt/luke.xsl
[junit4:junit4]   1> INFO  - 2013-05-13 06:04:50.345; org.apache.solr.common.cloud.SolrZkClient; makePath: /configs/collection1/xslt/example_rss.xsl
[junit4:junit4]   1> INFO  - 2013-05-13 06:04:50.348; org.apache.solr.common.cloud.SolrZkClient; makePath: /configs/collection1/xslt/updateXml.xsl
[junit4:junit4]   1> INFO  - 2013-05-13 06:04:50.352; org.apache.solr.common.cloud.SolrZkClient; makePath: /configs/collection1/xslt/example.xsl
[junit4:junit4]   1> INFO  - 2013-05-13 06:04:50.355; org.apache.solr.common.cloud.SolrZkClient; makePath: /configs/collection1/xslt/example_atom.xsl
[junit4:junit4]   1> INFO  - 2013-05-13 06:04:50.359; org.apache.solr.common.cloud.SolrZkClient; makePath: /configs/collection1/synonyms.txt
[junit4:junit4]   1> INFO  - 2013-05-13 06:04:50.367; org.apache.solr.common.cloud.SolrZkClient; makePath: /configs/collection1/elevate.xml
[junit4:junit4]   1> INFO  - 2013-05-13 06:04:50.371; org.apache.solr.common.cloud.SolrZkClient; makePath: /configs/collection1/admin-extra.html
[junit4:junit4]   1> INFO  - 2013-05-13 06:04:50.374; org.apache.solr.common.cloud.SolrZkClient; makePath: /configs/collection1/scripts.conf
[junit4:junit4]   1> INFO  - 2013-05-13 06:04:50.377; org.apache.solr.common.cloud.SolrZkClient; makePath: /configs/collection1/mapping-ISOLatin1Accent.txt
[junit4:junit4]   1> INFO  - 2013-05-13 06:04:50.385; org.apache.solr.common.cloud.SolrZkClient; makePath: /configs/collection1/stopwords.txt
[junit4:junit4]   1> INFO  - 2013-05-13 06:04:50.388; org.apache.solr.common.cloud.SolrZkClient; makePath: /configs/collection1/protwords.txt
[junit4:junit4]   1> INFO  - 2013-05-13 06:04:50.391; org.apache.solr.common.cloud.SolrZkClient; makePath: /configs/collection1/currency.xml
[junit4:junit4]   1> INFO  - 2013-05-13 06:04:50.395; org.apache.solr.common.cloud.SolrZkClient; makePath: /configs/collection1/velocity/hit_plain.vm
[junit4:junit4]   1> INFO  - 2013-05-13 06:04:50.410; org.apache.solr.common.cloud.SolrZkClient; makePath: /configs/collection1/velocity/query.vm
[junit4:junit4]   1> INFO  - 2013-05-13 06:04:50.413; org.apache.solr.common.cloud.SolrZkClient; makePath: /configs/collection1/velocity/browse.vm
[junit4:junit4]   1> INFO  - 2013-05-13 06:04:50.417; org.apache.solr.common.cloud.SolrZkClient; makePath: /configs/collection1/velocity/pagination_top.vm
[junit4:junit4]   1> INFO  - 2013-05-13 06:04:50.421; org.apache.solr.common.cloud.SolrZkClient; makePath: /configs/collection1/velocity/richtext_doc.vm
[junit4:junit4]   1> INFO  - 2013-05-13 06:04:50.424; org.apache.solr.common.cloud.SolrZkClient; makePath: /configs/collection1/velocity/query_spatial.vm
[junit4:junit4]   1> INFO  - 2013-05-13 06:04:50.433; org.apache.solr.common.cloud.SolrZkClient; makePath: /configs/collection1/velocity/facet_pivot.vm
[junit4:junit4]   1> INFO  - 2013-05-13 06:04:50.436; org.apache.solr.common.cloud.SolrZkClient; makePath: /configs/collection1/velocity/pagination_bottom.vm
[junit4:junit4]   1> INFO  - 2013-05-13 06:04:50.439; org.apache.solr.common.cloud.SolrZkClient; makePath: /configs/collection1/velocity/suggest.vm
[junit4:junit4]   1> INFO  - 2013-05-13 06:04:50.447; org.apache.solr.common.cloud.SolrZkClient; makePath: /configs/collection1/velocity/results_list.vm
[junit4:junit4]   1> INFO  - 2013-05-13 06:04:50.450; org.apache.solr.common.cloud.SolrZkClient; makePath: /configs/collection1/velocity/error.vm
[junit4:junit4]   1> INFO  - 2013-05-13 06:04:50.454; org.apache.solr.common.cloud.SolrZkClient; makePath: /configs/collection1/velocity/VM_global_library.vm
[junit4:junit4]   1> INFO  - 2013-05-13 06:04:50.457; org.apache.solr.common.cloud.SolrZkClient; makePath: /configs/collection1/velocity/cluster.vm
[junit4:junit4]   1> INFO  - 2013-05-13 06:04:50.465; org.apache.solr.common.cloud.SolrZkClient; makePath: /configs/collection1/velocity/facet_ranges.vm
[junit4:junit4]   1> INFO  - 2013-05-13 06:04:50.468; org.apache.solr.common.cloud.SolrZkClient; makePath: /configs/collection1/velocity/header.vm
[junit4:junit4]   1> INFO  - 2013-05-13 06:04:50.472; org.apache.solr.common.cloud.SolrZkClient; makePath: /configs/collection1/velocity/cluster_results.vm
[junit4:junit4]   1> INFO  - 2013-05-13 06:04:50.475; org.apache.solr.common.cloud.SolrZkClient; makePath: /configs/collection1/velocity/join_doc.vm
[junit4:junit4]   1> INFO  - 2013-05-13 06:04:50.483; org.apache.solr.common.cloud.SolrZkClient; makePath: /configs/collection1/velocity/head.vm
[junit4:junit4]   1> INFO  - 2013-05-13 06:04:50.486; org.apache.solr.common.cloud.SolrZkClient; makePath: /configs/collection1/velocity/README.txt
[junit4:junit4]   1> INFO  - 2013-05-13 06:04:50.490; org.apache.solr.common.cloud.SolrZkClient; makePath: /configs/collection1/velocity/did_you_mean.vm
[junit4:junit4]   1> INFO  - 2013-05-13 06:04:50.493; org.apache.solr.common.cloud.SolrZkClient; makePath: /configs/collection1/velocity/layout.vm
[junit4:junit4]   1> INFO  - 2013-05-13 06:04:50.496; org.apache.solr.common.cloud.SolrZkClient; makePath: /configs/collection1/velocity/hit.vm
[junit4:junit4]   1> INFO  - 2013-05-13 06:04:50.500; org.apache.solr.common.cloud.SolrZkClient; makePath: /configs/collection1/velocity/query_group.vm
[junit4:junit4]   1> INFO  - 2013-05-13 06:04:50.503; org.apache.solr.common.cloud.SolrZkClient; makePath: /configs/collection1/velocity/hit_grouped.vm
[junit4:junit4]   1> INFO  - 2013-05-13 06:04:50.511; org.apache.solr.common.cloud.SolrZkClient; makePath: /configs/collection1/velocity/main.css
[junit4:junit4]   1> INFO  - 2013-05-13 06:04:50.514; org.apache.solr.common.cloud.SolrZkClient; makePath: /configs/collection1/velocity/facet_queries.vm
[junit4:junit4]   1> INFO  - 2013-05-13 06:04:50.518; org.apache.solr.common.cloud.SolrZkClient; makePath: /configs/collection1/velocity/facets.vm
[junit4:junit4]   1> INFO  - 2013-05-13 06:04:50.521; org.apache.solr.common.cloud.SolrZkClient; makePath: /configs/collection1/velocity/jquery.autocomplete.js
[junit4:junit4]   1> INFO  - 2013-05-13 06:04:50.526; org.apache.solr.common.cloud.SolrZkClient; makePath: /configs/collection1/velocity/facet_fields.vm
[junit4:junit4]   1> INFO  - 2013-05-13 06:04:50.529; org.apache.solr.common.cloud.SolrZkClient; makePath: /configs/collection1/velocity/product_doc.vm
[junit4:junit4]   1> INFO  - 2013-05-13 06:04:50.540; org.apache.solr.common.cloud.SolrZkClient; makePath: /configs/collection1/velocity/query_form.vm
[junit4:junit4]   1> INFO  - 2013-05-13 06:04:50.543; org.apache.solr.common.cloud.SolrZkClient; makePath: /configs/collection1/velocity/footer.vm
[junit4:junit4]   1> INFO  - 2013-05-13 06:04:50.547; org.apache.solr.common.cloud.SolrZkClient; makePath: /configs/collection1/velocity/tabs.vm
[junit4:junit4]   1> INFO  - 2013-05-13 06:04:50.551; org.apache.solr.common.cloud.SolrZkClient; makePath: /configs/collection1/velocity/jquery.autocomplete.css
[junit4:junit4]   1> INFO  - 2013-05-13 06:04:50.554; org.apache.solr.common.cloud.SolrZkClient; makePath: /configs/collection1/velocity/mime_type_lists.vm
[junit4:junit4]   1> INFO  - 2013-05-13 06:04:50.562; org.apache.solr.common.cloud.SolrZkClient; makePath: /configs/collection1/velocity/debug.vm
[junit4:junit4]   1> INFO  - 2013-05-13 06:04:50.565; org.apache.solr.common.cloud.SolrZkClient; makePath: /configs/collection1/admin-extra.menu-bottom.html
[junit4:junit4]   1> INFO  - 2013-05-13 06:04:50.569; org.apache.solr.common.cloud.SolrZkClient; makePath: /configs/collection1/schema.xml
[junit4:junit4]   1> INFO  - 2013-05-13 06:04:50.573; org.apache.solr.common.cloud.SolrZkClient; makePath: /configs/collection1/update-script.js
[junit4:junit4]   1> INFO  - 2013-05-13 06:04:50.583; org.apache.solr.common.cloud.SolrZkClient; makePath: /configs/collection1/spellings.txt
[junit4:junit4]   1> INFO  - 2013-05-13 06:04:50.587; org.apache.solr.common.cloud.SolrZkClient; makePath: /configs/collection1/admin-extra.menu-top.html
[junit4:junit4]   1> INFO  - 2013-05-13 06:04:50.601; org.apache.solr.cloud.ZkTestServer; connecting to 127.0.0.1:42969 42969
[junit4:junit4]   1> INFO  - 2013-05-13 06:04:50.787; org.apache.solr.SolrTestCaseJ4; ###Ending testBootstrapWithChroot
[junit4:junit4]   2> Creating dataDir: /usr/home/hudson/hudson-slave/workspace/Lucene-Solr-Tests-4.x-Java6/solr/build/solr-core/test/J1/./solrtest-ZkCLITest-1368425089677
[junit4:junit4]   1> INFO  - 2013-05-13 06:04:50.793; org.apache.solr.SolrTestCaseJ4; ###Starting testBootstrap
[junit4:junit4]   1> INFO  - 2013-05-13 06:04:50.793; org.apache.solr.cloud.ZkCLITest; ####SETUP_START testBootstrap
[junit4:junit4]   1> INFO  - 2013-05-13 06:04:50.794; org.apache.solr.cloud.ZkCLITest; ZooKeeper dataDir:/usr/home/hudson/hudson-slave/workspace/Lucene-Solr-Tests-4.x-Java6/solr/build/solr-core/test/J1/./solrtest-ZkCLITest-1368425090794/zookeeper/server1/data
[junit4:junit4]   1> INFO  - 2013-05-13 06:04:50.795; org.apache.solr.cloud.ZkTestServer; STARTING ZK TEST SERVER
[junit4:junit4]   1> client port:0.0.0.0/0.0.0.0:0
[junit4:junit4]   1> INFO  - 2013-05-13 06:04:50.795; org.apache.solr.cloud.ZkTestServer$ZKServerMain; Starting server
[junit4:junit4]   1> INFO  - 2013-05-13 06:04:50.896; org.apache.solr.cloud.ZkTestServer; start zk server on port:42974
[junit4:junit4]   1> INFO  - 2013-05-13 06:04:50.897; org.apache.solr.common.cloud.ConnectionManager; Waiting for client to connect to ZooKeeper
[junit4:junit4]   1> INFO  - 2013-05-13 06:04:50.900; org.apache.solr.common.cloud.ConnectionManager; Watcher org.apache.solr.common.cloud.ConnectionManager@c3297b name:ZooKeeperConnection Watcher:127.0.0.1:42974 got event WatchedEvent state:SyncConnected type:None path:null path:null type:None
[junit4:junit4]   1> INFO  - 2013-05-13 06:04:50.901; org.apache.solr.common.cloud.ConnectionManager; Client is connected to ZooKeeper
[junit4:junit4]   1> INFO  - 2013-05-13 06:04:50.901; org.apache.solr.common.cloud.SolrZkClient; makePath: /solr
[junit4:junit4]   1> INFO  - 2013-05-13 06:04:50.914; org.apache.solr.common.cloud.ConnectionManager; Waiting for client to connect to ZooKeeper
[junit4:junit4]   1> INFO  - 2013-05-13 06:04:50.916; org.apache.solr.common.cloud.ConnectionManager; Watcher org.apache.solr.common.cloud.ConnectionManager@cb196dc name:ZooKeeperConnection Watcher:127.0.0.1:42974/solr got event WatchedEvent state:SyncConnected type:None path:null path:null type:None
[junit4:junit4]   1> INFO  - 2013-05-13 06:04:50.916; org.apache.solr.common.cloud.ConnectionManager; Client is connected to ZooKeeper
[junit4:junit4]   1> INFO  - 2013-05-13 06:04:50.917; org.apache.solr.cloud.ZkCLITest; ####SETUP_END testBootstrap
[junit4:junit4]   1> INFO  - 2013-05-13 06:04:50.917; org.apache.solr.common.cloud.ConnectionManager; Waiting for client to connect to ZooKeeper
[junit4:junit4]   1> INFO  - 2013-05-13 06:04:50.919; org.apache.solr.common.cloud.ConnectionManager; Watcher org.apache.solr.common.cloud.ConnectionManager@12ca6c08 name:ZooKeeperConnection Watcher:127.0.0.1:42974/solr got event WatchedEvent state:SyncConnected type:None path:null path:null type:None
[junit4:junit4]   1> INFO  - 2013-05-13 06:04:50.920; org.apache.solr.common.cloud.ConnectionManager; Client is connected to ZooKeeper
[junit4:junit4]   1> INFO  - 2013-05-13 06:04:50.920; org.apache.solr.core.SolrResourceLoader; new SolrResourceLoader for directory: '/usr/home/hudson/hudson-slave/workspace/Lucene-Solr-Tests-4.x-Java6/solr/example/solr/'
[junit4:junit4]   1> INFO  - 2013-05-13 06:04:51.003; org.apache.solr.core.SolrCoreDiscoverer; Looking for cores in /usr/home/hudson/hudson-slave/workspace/Lucene-Solr-Tests-4.x-Java6/solr/example/solr
[junit4:junit4]   1> INFO  - 2013-05-13 06:04:51.004; org.apache.solr.core.SolrCoreDiscoverer; Looking for cores in /usr/home/hudson/hudson-slave/workspace/Lucene-Solr-Tests-4.x-Java6/solr/example/solr/.svn
[junit4:junit4]   1> INFO  - 2013-05-13 06:04:51.006; org.apache.solr.core.SolrCoreDiscoverer; Looking for cores in /usr/home/hudson/hudson-slave/workspace/Lucene-Solr-Tests-4.x-Java6/solr/example/solr/.svn/prop-base
[junit4:junit4]   1> INFO  - 2013-05-13 06:04:51.008; org.apache.solr.core.SolrCoreDiscoverer; Looking for cores in /usr/home/hudson/hudson-slave/workspace/Lucene-Solr-Tests-4.x-Java6/solr/example/solr/.svn/props
[junit4:junit4]   1> INFO  - 2013-05-13 06:04:51.009; org.apache.solr.core.SolrCoreDiscoverer; Looking for cores in /usr/home/hudson/hudson-slave/workspace/Lucene-Solr-Tests-4.x-Java6/solr/example/solr/.svn/tmp
[junit4:junit4]   1> INFO  - 2013-05-13 06:04:51.010; org.apache.solr.core.SolrCoreDiscoverer; Looking for cores in /usr/home/hudson/hudson-slave/workspace/Lucene-Solr-Tests-4.x-Java6/solr/example/solr/.svn/tmp/props
[junit4:junit4]   1> INFO  - 2013-05-13 06:04:51.011; org.apache.solr.core.SolrCoreDiscoverer; Looking for cores in /usr/home/hudson/hudson-slave/workspace/Lucene-Solr-Tests-4.x-Java6/solr/example/solr/.svn/tmp/prop-base
[junit4:junit4]   1> INFO  - 2013-05-13 06:04:51.011; org.apache.solr.core.SolrCoreDiscoverer; Looking for cores in /usr/home/hudson/hudson-slave/workspace/Lucene-Solr-Tests-4.x-Java6/solr/example/solr/.svn/tmp/text-base
[junit4:junit4]   1> INFO  - 2013-05-13 06:04:51.012; org.apache.solr.core.SolrCoreDiscoverer; Looking for cores in /usr/home/hudson/hudson-slave/workspace/Lucene-Solr-Tests-4.x-Java6/solr/example/solr/.svn/text-base
[junit4:junit4]   1> INFO  - 2013-05-13 06:04:51.015; org.apache.solr.core.SolrCoreDiscoverer; Discovered properties file /usr/home/hudson/hudson-slave/workspace/Lucene-Solr-Tests-4.x-Java6/solr/example/solr/collection1/core.properties, adding to cores
[junit4:junit4]   1> INFO  - 2013-05-13 06:04:51.016; org.apache.solr.core.SolrCoreDiscoverer; Looking for cores in /usr/home/hudson/hudson-slave/workspace/Lucene-Solr-Tests-4.x-Java6/solr/example/solr/bin
[junit4:junit4]   1> INFO  - 2013-05-13 06:04:51.017; org.apache.solr.core.SolrCoreDiscoverer; Looking for cores in /usr/home/hudson/hudson-slave/workspace/Lucene-Solr-Tests-4.x-Java6/solr/example/solr/bin/.svn
[junit4:junit4]   1> INFO  - 2013-05-13 06:04:51.018; org.apache.solr.core.SolrCoreDiscoverer; Looking for cores in /usr/home/hudson/hudson-slave/workspace/Lucene-Solr-Tests-4.x-Java6/solr/example/solr/bin/.svn/prop-base
[junit4:junit4]   1> INFO  - 2013-05-13 06:04:51.019; org.apache.solr.core.SolrCoreDiscoverer; Looking for cores in /usr/home/hudson/hudson-slave/workspace/Lucene-Solr-Tests-4.x-Java6/solr/example/solr/bin/.svn/tmp
[junit4:junit4]   1> INFO  - 2013-05-13 06:04:51.020; org.apache.solr.core.SolrCoreDiscoverer; Looking for cores in /usr/home/hudson/hudson-slave/workspace/Lucene-Solr-Tests-4.x-Java6/solr/example/solr/bin/.svn/tmp/props
[junit4:junit4]   1> INFO  - 2013-05-13 06:04:51.021; org.apache.solr.core.SolrCoreDiscoverer; Looking for cores in /usr/home/hudson/hudson-slave/workspace/Lucene-Solr-Tests-4.x-Java6/solr/example/solr/bin/.svn/tmp/text-base
[junit4:junit4]   1> INFO  - 2013-05-13 06:04:51.022; org.apache.solr.core.SolrCoreDiscoverer; Looking for cores in /usr/home/hudson/hudson-slave/workspace/Lucene-Solr-Tests-4.x-Java6/solr/example/solr/bin/.svn/tmp/prop-base
[junit4:junit4]   1> INFO  - 2013-05-13 06:04:51.023; org.apache.solr.core.SolrCoreDiscoverer; Looking for cores in /usr/home/hudson/hudson-slave/workspace/Lucene-Solr-Tests-4.x-Java6/solr/example/solr/bin/.svn/props
[junit4:junit4]   1> INFO  - 2013-05-13 06:04:51.025; org.apache.solr.core.SolrCoreDiscoverer; Looking for cores in /usr/home/hudson/hudson-slave/workspace/Lucene-Solr-Tests-4.x-Java6/solr/example/solr/bin/.svn/text-base
[junit4:junit4]   1> INFO  - 2013-05-13 06:04:51.027; org.apache.solr.cloud.ZkController; zkHost includes chroot
[junit4:junit4]   1> INFO  - 2013-05-13 06:04:51.028; org.apache.solr.common.cloud.ConnectionManager; Waiting for client to connect to ZooKeeper
[junit4:junit4]   1> INFO  - 2013-05-13 06:04:51.030; org.apache.solr.common.cloud.ConnectionManager; Watcher org.apache.solr.common.cloud.ConnectionManager@4f42e2d3 name:ZooKeeperConnection Watcher:127.0.0.1:42974 got event WatchedEvent state:SyncConnected type:None path:null path:null type:None
[junit4:junit4]   1> INFO  - 2013-05-13 06:04:51.030; org.apache.solr.common.cloud.ConnectionManager; Client is connected to ZooKeeper
[junit4:junit4]   1> INFO  - 2013-05-13 06:04:51.033; org.apache.solr.cloud.ZkController; bootstraping config for 1 cores into ZooKeeper using solr.xml from /usr/home/hudson/hudson-slave/workspace/Lucene-Solr-Tests-4.x-Java6/solr/example/solr/
[junit4:junit4]   1> idir:/usr/home/hudson/hudson-slave/workspace/Lucene-Solr-Tests-4.x-Java6/solr/example/solr/collection1
[junit4:junit4]   1> INFO  - 2013-05-13 06:04:51.033; org.apache.solr.cloud.ZkController; Uploading directory /usr/home/hudson/hudson-slave/workspace/Lucene-Solr-Tests-4.x-Java6/solr/example/solr/collection1/conf with name collection1 for SolrCore collection1
[junit4:junit4]   1> INFO  - 2013-05-13 06:04:51.035; org.apache.solr.common.cloud.SolrZkClient; makePath: /configs/collection1/solrconfig.xml
[junit4:junit4]   1> INFO  - 2013-05-13 06:04:51.247; org.apache.solr.common.cloud.SolrZkClient; makePath: /configs/collection1/mapping-FoldToASCII.txt
[junit4:junit4]   1> INFO  - 2013-05-13 06:04:51.252; org.apache.solr.common.cloud.SolrZkClient; makePath: /configs/collection1/lang/stopwords_hi.txt
[junit4:junit4]   1> INFO  - 2013-05-13 06:04:51.266; org.apache.solr.common.cloud.SolrZkClient; makePath: /configs/collection1/lang/stopwords_es.txt
[junit4:junit4]   1> INFO  - 2013-05-13 06:04:51.270; org.apache.solr.common.cloud.SolrZkClient; makePath: /configs/collection1/lang/stopwords_hu.txt
[junit4:junit4]   1> INFO  - 2013-05-13 06:04:51.273; org.apache.solr.common.cloud.SolrZkClient; makePath: /configs/collection1/lang/stopwords_sv.txt
[junit4:junit4]   1> INFO  - 2013-05-13 06:04:51.277; org.apache.solr.common.cloud.SolrZkClient; makePath: /configs/collection1/lang/stopwords_it.txt
[junit4:junit4]   1> INFO  - 2013-05-13 06:04:51.285; org.apache.solr.common.cloud.SolrZkClient; makePath: /configs/collection1/lang/stopwords_gl.txt
[junit4:junit4]   1> INFO  - 2013-05-13 06:04:51.288; org.apache.solr.common.cloud.SolrZkClient; makePath: /configs/collection1/lang/stopwords_th.txt
[junit4:junit4]   1> INFO  - 2013-05-13 06:04:51.292; org.apache.solr.common.cloud.SolrZkClient; makePath: /configs/collection1/lang/stopwords_pt.txt
[junit4:junit4]   1> INFO  - 2013-05-13 06:04:51.296; org.apache.solr.common.cloud.SolrZkClient; makePath: /configs/collection1/lang/stopwords_eu.txt
[junit4:junit4]   1> INFO  - 2013-05-13 06:04:51.299; org.apache.solr.common.cloud.SolrZkClient; makePath: /configs/collection1/lang/contractions_ga.txt
[junit4:junit4]   1> INFO  - 2013-05-13 06:04:51.303; org.apache.solr.common.cloud.SolrZkClient; makePath: /configs/collection1/lang/stopwords_ar.txt
[junit4:junit4]   1> INFO  - 2013-05-13 06:04:51.306; org.apache.solr.common.cloud.SolrZkClient; makePath: /configs/collection1/lang/contractions_ca.txt
[junit4:junit4]   1> INFO  - 2013-05-13 06:04:51.314; org.apache.solr.common.cloud.SolrZkClient; makePath: /configs/collection1/lang/stopwords_en.txt
[junit4:junit4]   1> INFO  - 2013-05-13 06:04:51.318; org.apache.solr.common.cloud.SolrZkClient; makePath: /configs/collection1/lang/hyphenations_ga.txt
[junit4:junit4]   1> INFO  - 2013-05-13 06:04:51.322; org.apache.solr.common.cloud.SolrZkClient; makePath: /configs/collection1/lang/contractions_fr.txt
[junit4:junit4]   1> INFO  - 2013-05-13 06:04:51.325; org.apache.solr.common.cloud.SolrZkClient; makePath: /configs/collection1/lang/stopwords_nl.txt
[junit4:junit4]   1> INFO  - 2013-05-13 06:04:51.328; org.apache.solr.common.cloud.SolrZkClient; makePath: /configs/collection1/lang/stopwords_da.txt
[junit4:junit4]   1> INFO  - 2013-05-13 06:04:51.338; org.apache.solr.common.cloud.SolrZkClient; makePath: /configs/collection1/lang/stopwords_tr.txt
[junit4:junit4]   1> INFO  - 2013-05-13 06:04:51.341; org.apache.solr.common.cloud.SolrZkClient; makePath: /configs/collection1/lang/stopwords_no.txt
[junit4:junit4]   1> INFO  - 2013-05-13 06:04:51.344; org.apache.solr.common.cloud.SolrZkClient; makePath: /configs/collection1/lang/stopwords_de.txt
[junit4:junit4]   1> INFO  - 2013-05-13 06:04:51.352; org.apache.solr.common.cloud.SolrZkClient; makePath: /configs/collection1/lang/stopwords_id.txt
[junit4:junit4]   1> INFO  - 2013-05-13 06:04:51.355; org.apache.solr.common.cloud.SolrZkClient; makePath: /configs/collection1/lang/stopwords_ja.txt
[junit4:junit4]   1> INFO  - 2013-05-13 06:04:51.358; org.apache.solr.common.cloud.SolrZkClient; makePath: /configs/collection1/lang/stemdict_nl.txt
[junit4:junit4]   1> INFO  - 2013-05-13 06:04:51.362; org.apache.solr.common.cloud.SolrZkClient; makePath: /configs/collection1/lang/contractions_it.txt
[junit4:junit4]   1> INFO  - 2013-05-13 06:04:51.365; org.apache.solr.common.cloud.SolrZkClient; makePath: /configs/collection1/lang/stopwords_ru.txt
[junit4:junit4]   1> INFO  - 2013-05-13 06:04:51.372; org.apache.solr.common.cloud.SolrZkClient; makePath: /configs/collection1/lang/stopwords_hy.txt
[junit4:junit4]   1> INFO  - 2013-05-13 06:04:51.376; org.apache.solr.common.cloud.SolrZkClient; makePath: /configs/collection1/lang/stopwords_fa.txt
[junit4:junit4]   1> INFO  - 2013-05-13 06:04:51.379; org.apache.solr.common.cloud.SolrZkClient; makePath: /configs/collection1/lang/userdict_ja.txt
[junit4:junit4]   1> INFO  - 2013-05-13 06:04:51.382; org.apache.solr.common.cloud.SolrZkClient; makePath: /configs/collection1/lang/stoptags_ja.txt
[junit4:junit4]   1> INFO  - 2013-05-13 06:04:51.386; org.apache.solr.common.cloud.SolrZkClient; makePath: /configs/collection1/lang/stopwords_cz.txt
[junit4:junit4]   1> INFO  - 2013-05-13 06:04:51.396; org.apache.solr.common.cloud.SolrZkClient; makePath: /configs/collection1/lang/stopwords_ga.txt
[junit4:junit4]   1> INFO  - 2013-05-13 06:04:51.399; org.apache.solr.common.cloud.SolrZkClient; makePath: /configs/collection1/lang/stopwords_ca.txt
[junit4:junit4]   1> INFO  - 2013-05-13 06:04:51.403; org.apache.solr.common.cloud.SolrZkClient; makePath: /configs/collection1/lang/stopwords_bg.txt
[junit4:junit4]   1> INFO  - 2013-05-13 06:04:51.406; org.apache.solr.common.cloud.SolrZkClient; makePath: /configs/collection1/lang/stopwords_fr.txt
[junit4:junit4]   1> INFO  - 2013-05-13 06:04:51.414; org.apache.solr.common.cloud.SolrZkClient; makePath: /configs/collection1/lang/stopwords_el.txt
[junit4:junit4]   1> INFO  - 2013-05-13 06:04:51.418; org.apache.solr.common.cloud.SolrZkClient; makePath: /configs/collection1/lang/stopwords_ro.txt
[junit4:junit4]   1> INFO  - 2013-05-13 06:04:51.421; org.apache.solr.common.cloud.SolrZkClient; makePath: /configs/collection1/lang/stopwords_lv.txt
[junit4:junit4]   1> INFO  - 2013-05-13 06:04:51.425; org.apache.solr.common.cloud.SolrZkClient; makePath: /configs/collection1/lang/stopwords_fi.txt
[junit4:junit4]   1> INFO  - 2013-05-13 06:04:51.428; org.apache.solr.common.cloud.SolrZkClient; makePath: /configs/collection1/xslt/luke.xsl
[junit4:junit4]   1> INFO  - 2013-05-13 06:04:51.437; org.apache.solr.common.cloud.SolrZkClient; makePath: /configs/collection1/xslt/example_rss.xsl
[junit4:junit4]   1> INFO  - 2013-05-13 06:04:51.441; org.apache.solr.common.cloud.SolrZkClient; makePath: /configs/collection1/xslt/updateXml.xsl
[junit4:junit4]   1> INFO  - 2013-05-13 06:04:51.444; org.apache.solr.common.cloud.SolrZkClient; makePath: /configs/collection1/xslt/example.xsl
[junit4:junit4]   1> INFO  - 2013-05-13 06:04:51.452; org.apache.solr.common.cloud.SolrZkClient; makePath: /configs/collection1/xslt/example_atom.xsl
[junit4:junit4]   1> INFO  - 2013-05-13 06:04:51.455; org.apache.solr.common.cloud.SolrZkClient; makePath: /configs/collection1/synonyms.txt
[junit4:junit4]   1> INFO  - 2013-05-13 06:04:51.458; org.apache.solr.common.cloud.SolrZkClient; makePath: /configs/collection1/elevate.xml
[junit4:junit4]   1> INFO  - 2013-05-13 06:04:51.461; org.apache.solr.common.cloud.SolrZkClient; makePath: /configs/collection1/admin-extra.html
[junit4:junit4]   1> INFO  - 2013-05-13 06:04:51.469; org.apache.solr.common.cloud.SolrZkClient; makePath: /configs/collection1/scripts.conf
[junit4:junit4]   1> INFO  - 2013-05-13 06:04:51.472; org.apache.solr.common.cloud.SolrZkClient; makePath: /configs/collection1/mapping-ISOLatin1Accent.txt
[junit4:junit4]   1> INFO  - 2013-05-13 06:04:51.475; org.apache.solr.common.cloud.SolrZkClient; makePath: /configs/collection1/stopwords.txt
[junit4:junit4]   1> INFO  - 2013-05-13 06:04:51.483; org.apache.solr.common.cloud.SolrZkClient; makePath: /configs/collection1/protwords.txt
[junit4:junit4]   1> INFO  - 2013-05-13 06:04:51.486; org.apache.solr.common.cloud.SolrZkClient; makePath: /configs/collection1/currency.xml
[junit4:junit4]   1> INFO  - 2013-05-13 06:04:51.489; org.apache.solr.common.cloud.SolrZkClient; makePath: /configs/collection1/velocity/hit_plain.vm
[junit4:junit4]   1> INFO  - 2013-05-13 06:04:51.500; org.apache.solr.common.cloud.SolrZkClient; makePath: /configs/collection1/velocity/query.vm
[junit4:junit4]   1> INFO  - 2013-05-13 06:04:51.503; org.apache.solr.common.cloud.SolrZkClient; makePath: /configs/collection1/velocity/browse.vm
[junit4:junit4]   1> INFO  - 2013-05-13 06:04:51.507; org.apache.solr.common.cloud.SolrZkClient; makePath: /configs/collection1/velocity/pagination_top.vm
[junit4:junit4]   1> INFO  - 2013-05-13 06:04:51.510; org.apache.solr.common.cloud.SolrZkClient; makePath: /configs/collection1/velocity/richtext_doc.vm
[junit4:junit4]   1> INFO  - 2013-05-13 06:04:51.513; org.apache.solr.common.cloud.SolrZkClient; makePath: /configs/collection1/velocity/query_spatial.vm
[junit4:junit4]   1> INFO  - 2013-05-13 06:04:51.521; org.apache.solr.common.cloud.SolrZkClient; makePath: /configs/collection1/velocity/facet_pivot.vm
[junit4:junit4]   1> INFO  - 2013-05-13 06:04:51.524; org.apache.solr.common.cloud.SolrZkClient; makePath: /configs/collection1/velocity/pagination_bottom.vm
[junit4:junit4]   1> INFO  - 2013-05-13 06:04:51.528; org.apache.solr.common.cloud.SolrZkClient; makePath: /configs/collection1/velocity/suggest.vm
[junit4:junit4]   1> INFO  - 2013-05-13 06:04:51.535; org.apache.solr.common.cloud.SolrZkClient; makePath: /configs/collection1/velocity/results_list.vm
[junit4:junit4]   1> INFO  - 2013-05-13 06:04:51.539; org.apache.solr.common.cloud.SolrZkClient; makePath: /configs/collection1/velocity/error.vm
[junit4:junit4]   1> INFO  - 2013-05-13 06:04:51.542; org.apache.solr.common.cloud.SolrZkClient; makePath: /configs/collection1/velocity/VM_global_library.vm
[junit4:junit4]   1> INFO  - 2013-05-13 06:04:51.545; org.apache.solr.common.cloud.SolrZkClient; makePath: /configs/collection1/velocity/cluster.vm
[junit4:junit4]   1> INFO  - 2013-05-13 06:04:51.554; org.apache.solr.common.cloud.SolrZkClient; makePath: /configs/collection1/velocity/facet_ranges.vm
[junit4:junit4]   1> INFO  - 2013-05-13 06:04:51.557; org.apache.solr.common.cloud.SolrZkClient; makePath: /configs/collection1/velocity/header.vm
[junit4:junit4]   1> INFO  - 2013-05-13 06:04:51.560; org.apache.solr.common.cloud.SolrZkClient; makePath: /configs/collection1/velocity/cluster_results.vm
[junit4:junit4]   1> INFO  - 2013-05-13 06:04:51.564; org.apache.solr.common.cloud.SolrZkClient; makePath: /configs/collection1/velocity/join_doc.vm
[junit4:junit4]   1> INFO  - 2013-05-13 06:04:51.572; org.apache.solr.common.cloud.SolrZkClient; makePath: /configs/collection1/velocity/head.vm
[junit4:junit4]   1> INFO  - 2013-05-13 06:04:51.582; org.apache.solr.common.cloud.SolrZkClient; makePath: /configs/collection1/velocity/README.txt
[junit4:junit4]   1> INFO  - 2013-05-13 06:04:51.719; org.apache.solr.common.cloud.SolrZkClient; makePath: /configs/collection1/velocity/did_you_mean.vm
[junit4:junit4]   1> INFO  - 2013-05-13 06:04:51.722; org.apache.solr.common.cloud.SolrZkClient; makePath: /configs/collection1/velocity/layout.vm
[junit4:junit4]   1> INFO  - 2013-05-13 06:04:51.726; org.apache.solr.common.cloud.SolrZkClient; makePath: /configs/collection1/velocity/hit.vm
[junit4:junit4]   1> INFO  - 2013-05-13 06:04:51.729; org.apache.solr.common.cloud.SolrZkClient; makePath: /configs/collection1/velocity/query_group.vm
[junit4:junit4]   1> INFO  - 2013-05-13 06:04:51.737; org.apache.solr.common.cloud.SolrZkClient; makePath: /configs/collection1/velocity/hit_grouped.vm
[junit4:junit4]   1> INFO  - 2013-05-13 06:04:51.740; org.apache.solr.common.cloud.SolrZkClient; makePath: /configs/collection1/velocity/main.css
[junit4:junit4]   1> INFO  - 2013-05-13 06:04:51.743; org.apache.solr.common.cloud.SolrZkClient; makePath: /configs/collection1/velocity/facet_queries.vm
[junit4:junit4]   1> INFO  - 2013-05-13 06:04:51.747; org.apache.solr.common.cloud.SolrZkClient; makePath: /configs/collection1/velocity/facets.vm
[junit4:junit4]   1> INFO  - 2013-05-13 06:04:51.755; org.apache.solr.common.cloud.SolrZkClient; makePath: /configs/collection1/velocity/jquery.autocomplete.js
[junit4:junit4]   1> INFO  - 2013-05-13 06:04:51.759; org.apache.solr.common.cloud.SolrZkClient; makePath: /configs/collection1/velocity/facet_fields.vm
[junit4:junit4]   1> INFO  - 2013-05-13 06:04:51.769; org.apache.solr.common.cloud.SolrZkClient; makePath: /configs/collection1/velocity/product_doc.vm
[junit4:junit4]   1> INFO  - 2013-05-13 06:04:51.773; org.apache.solr.common.cloud.SolrZkClient; makePath: /configs/collection1/velocity/query_form.vm
[junit4:junit4]   1> INFO  - 2013-05-13 06:04:51.776; org.apache.solr.common.cloud.SolrZkClient; makePath: /configs/collection1/velocity/footer.vm
[junit4:junit4]   1> INFO  - 2013-05-13 06:04:51.779; org.apache.solr.common.cloud.SolrZkClient; makePath: /configs/collection1/velocity/tabs.vm
[junit4:junit4]   1> INFO  - 2013-05-13 06:04:51.788; org.apache.solr.common.cloud.SolrZkClient; makePath: /configs/collection1/velocity/jquery.autocomplete.css
[junit4:junit4]   1> INFO  - 2013-05-13 06:04:51.791; org.apache.solr.common.cloud.SolrZkClient; makePath: /configs/collection1/velocity/mime_type_lists.vm
[junit4:junit4]   1> INFO  - 2013-05-13 06:04:51.794; org.apache.solr.common.cloud.SolrZkClient; makePath: /configs/collection1/velocity/debug.vm
[junit4:junit4]   1> INFO  - 2013-05-13 06:04:51.797; org.apache.solr.common.cloud.SolrZkClient; makePath: /configs/collection1/admin-extra.menu-bottom.html
[junit4:junit4]   1> INFO  - 2013-05-13 06:04:51.806; org.apache.solr.common.cloud.SolrZkClient; makePath: /configs/collection1/schema.xml
[junit4:junit4]   1> INFO  - 2013-05-13 06:04:51.810; org.apache.solr.common.cloud.SolrZkClient; makePath: /configs/collection1/update-script.js
[junit4:junit4]   1> INFO  - 2013-05-13 06:04:51.820; org.apache.solr.common.cloud.SolrZkClient; makePath: /configs/collection1/spellings.txt
[junit4:junit4]   1> INFO  - 2013-05-13 06:04:51.824; org.apache.solr.common.cloud.SolrZkClient; makePath: /configs/collection1/admin-extra.menu-top.html
[junit4:junit4]   1> INFO  - 2013-05-13 06:04:51.829; org.apache.solr.common.cloud.ConnectionManager; Waiting for client to connect to ZooKeeper
[junit4:junit4]   1> INFO  - 2013-05-13 06:04:51.837; org.apache.solr.common.cloud.ConnectionManager; Watcher org.apache.solr.common.cloud.ConnectionManager@450d1e39 name:ZooKeeperConnection Watcher:127.0.0.1:42974/solr got event WatchedEvent state:SyncConnected type:None path:null path:null type:None
[junit4:junit4]   1> INFO  - 2013-05-13 06:04:51.837; org.apache.solr.common.cloud.ConnectionManager; Client is connected to ZooKeeper
[junit4:junit4]   1> INFO  - 2013-05-13 06:04:51.837; org.apache.solr.core.SolrResourceLoader; new SolrResourceLoader for directory: '/usr/home/hudson/hudson-slave/workspace/Lucene-Solr-Tests-4.x-Java6/solr/example/multicore/'
[junit4:junit4]   1> INFO  - 2013-05-13 06:04:51.930; org.apache.solr.cloud.ZkController; zkHost includes chroot
[junit4:junit4]   1> INFO  - 2013-05-13 06:04:51.931; org.apache.solr.common.cloud.ConnectionManager; Waiting for client to connect to ZooKeeper
[junit4:junit4]   1> INFO  - 2013-05-13 06:04:51.933; org.apache.solr.common.cloud.ConnectionManager; Watcher org.apache.solr.common.cloud.ConnectionManager@3f840be0 name:ZooKeeperConnection Watcher:127.0.0.1:42974 got event WatchedEvent state:SyncConnected type:None path:null path:null type:None
[junit4:junit4]   1> INFO  - 2013-05-13 06:04:51.933; org.apache.solr.common.cloud.ConnectionManager; Client is connected to ZooKeeper
[junit4:junit4]   1> INFO  - 2013-05-13 06:04:51.935; org.apache.solr.cloud.ZkController; bootstraping config for 2 cores into ZooKeeper using solr.xml from /usr/home/hudson/hudson-slave/workspace/Lucene-Solr-Tests-4.x-Java6/solr/example/multicore/
[junit4:junit4]   1> idir:core0
[junit4:junit4]   1> INFO  - 2013-05-13 06:04:51.936; org.apache.solr.cloud.ZkController; Uploading directory /usr/home/hudson/hudson-slave/workspace/Lucene-Solr-Tests-4.x-Java6/solr/example/multicore/core0/conf with name core0 for SolrCore core0
[junit4:junit4]   1> INFO  - 2013-05-13 06:04:51.937; org.apache.solr.common.cloud.SolrZkClient; makePath: /configs/core0/solrconfig.xml
[junit4:junit4]   1> INFO  - 2013-05-13 06:04:51.948; org.apache.solr.common.cloud.SolrZkClient; makePath: /configs/core0/schema.xml
[junit4:junit4]   1> idir:core1
[junit4:junit4]   1> INFO  - 2013-05-13 06:04:51.951; org.apache.solr.cloud.ZkController; Uploading directory /usr/home/hudson/hudson-slave/workspace/Lucene-Solr-Tests-4.x-Java6/solr/example/multicore/core1/conf with name core1 for SolrCore core1
[junit4:junit4]   1> INFO  - 2013-05-13 06:04:51.952; org.apache.solr.common.cloud.SolrZkClient; makePath: /configs/core1/solrconfig.xml
[junit4:junit4]   1> INFO  - 2013-05-13 06:04:51.956; org.apache.solr.common.cloud.SolrZkClient; makePath: /configs/core1/schema.xml
[junit4:junit4]   1> INFO  - 2013-05-13 06:04:51.969; org.apache.solr.cloud.ZkTestServer; connecting to 127.0.0.1:42974 42974
[junit4:junit4]   1> INFO  - 2013-05-13 06:04:52.125; org.apache.solr.SolrTestCaseJ4; ###Ending testBootstrap
[junit4:junit4]   2> Creating dataDir: /usr/home/hudson/hudson-slave/workspace/Lucene-Solr-Tests-4.x-Java6/solr/build/solr-core/test/J1/./solrtest-ZkCLITest-1368425090794
[junit4:junit4]   1> INFO  - 2013-05-13 06:04:52.131; org.apache.solr.SolrTestCaseJ4; ###Starting testMakePath
[junit4:junit4]   1> INFO  - 2013-05-13 06:04:52.131; org.apache.solr.cloud.ZkCLITest; ####SETUP_START testMakePath
[junit4:junit4]   1> INFO  - 2013-05-13 06:04:52.576; org.apache.solr.cloud.ZkCLITest; ZooKeeper dataDir:/usr/home/hudson/hudson-slave/workspace/Lucene-Solr-Tests-4.x-Java6/solr/build/solr-core/test/J1/./solrtest-ZkCLITest-1368425092132/zookeeper/server1/data
[junit4:junit4]   1> INFO  - 2013-05-13 06:04:52.577; org.apache.solr.cloud.ZkTestServer; STARTING ZK TEST SERVER
[junit4:junit4]   1> client port:0.0.0.0/0.0.0.0:0
[junit4:junit4]   1> INFO  - 2013-05-13 06:04:52.577; org.apache.solr.cloud.ZkTestServer$ZKServerMain; Starting server
[junit4:junit4]   1> INFO  - 2013-05-13 06:04:52.678; org.apache.solr.cloud.ZkTestServer; start zk server on port:42985
[junit4:junit4]   1> INFO  - 2013-05-13 06:04:52.679; org.apache.solr.common.cloud.ConnectionManager; Waiting for client to connect to ZooKeeper
[junit4:junit4]   1> INFO  - 2013-05-13 06:04:52.683; org.apache.solr.common.cloud.ConnectionManager; Watcher org.apache.solr.common.cloud.ConnectionManager@691a3ba2 name:ZooKeeperConnection Watcher:127.0.0.1:42985 got event WatchedEvent state:SyncConnected type:None path:null path:null type:None
[junit4:junit4]   1> INFO  - 2013-05-13 06:04:52.683; org.apache.solr.common.cloud.ConnectionManager; Client is connected to ZooKeeper
[junit4:junit4]   1> INFO  - 2013-05-13 06:04:52.684; org.apache.solr.common.cloud.SolrZkClient; makePath: /solr
[junit4:junit4]   1> INFO  - 2013-05-13 06:04:52.709; org.apache.solr.common.cloud.ConnectionManager; Waiting for client to connect to ZooKeeper
[junit4:junit4]   1> INFO  - 2013-05-13 06:04:52.727; org.apache.solr.common.cloud.ConnectionManager; Watcher org.apache.solr.common.cloud.ConnectionManager@67ba2644 name:ZooKeeperConnection Watcher:127.0.0.1:42985/solr got event WatchedEvent state:SyncConnected type:None path:null path:null type:None
[junit4:junit4]   1> INFO  - 2013-05-13 06:04:52.728; org.apache.solr.common.cloud.ConnectionManager; Client is connected to ZooKeeper
[junit4:junit4]   1> INFO  - 2013-05-13 06:04:52.728; org.apache.solr.cloud.ZkCLITest; ####SETUP_END testMakePath
[junit4:junit4]   1> INFO  - 2013-05-13 06:04:52.730; org.apache.solr.common.cloud.ConnectionManager; Waiting for client to connect to ZooKeeper
[junit4:junit4]   1> INFO  - 2013-05-13 06:04:52.732; org.apache.solr.common.cloud.ConnectionManager; Watcher org.apache.solr.common.cloud.ConnectionManager@1c1a8c05 name:ZooKeeperConnection Watcher:127.0.0.1:42985/solr got event WatchedEvent state:SyncConnected type:None path:null path:null type:None
[junit4:junit4]   1> INFO  - 2013-05-13 06:04:52.733; org.apache.solr.common.cloud.ConnectionManager; Client is connected to ZooKeeper
[junit4:junit4]   1> INFO  - 2013-05-13 06:04:52.733; org.apache.solr.common.cloud.SolrZkClient; makePath: /path/mynewpath
[junit4:junit4]   1> INFO  - 2013-05-13 06:04:52.804; org.apache.solr.cloud.ZkTestServer; connecting to 127.0.0.1:42985 42985
[junit4:junit4]   1> INFO  - 2013-05-13 06:04:53.121; org.apache.solr.SolrTestCaseJ4; ###Ending testMakePath
[junit4:junit4]   2> Creating dataDir: /usr/home/hudson/hudson-slave/workspace/Lucene-Solr-Tests-4.x-Java6/solr/build/solr-core/test/J1/./solrtest-ZkCLITest-1368425092132
[junit4:junit4]   1> INFO  - 2013-05-13 06:04:53.126; org.apache.solr.SolrTestCaseJ4; ###Starting testList
[junit4:junit4]   1> INFO  - 2013-05-13 06:04:53.127; org.apache.solr.cloud.ZkCLITest; ####SETUP_START testList
[junit4:junit4]   1> INFO  - 2013-05-13 06:04:53.583; org.apache.solr.cloud.ZkCLITest; ZooKeeper dataDir:/usr/home/hudson/hudson-slave/workspace/Lucene-Solr-Tests-4.x-Java6/solr/build/solr-core/test/J1/./solrtest-ZkCLITest-1368425093127/zookeeper/server1/data
[junit4:junit4]   1> INFO  - 2013-05-13 06:04:53.583; org.apache.solr.cloud.ZkTestServer; STARTING ZK TEST SERVER
[junit4:junit4]   1> client port:0.0.0.0/0.0.0.0:0
[junit4:junit4]   1> INFO  - 2013-05-13 06:04:53.584; org.apache.solr.cloud.ZkTestServer$ZKServerMain; Starting server
[junit4:junit4]   1> INFO  - 2013-05-13 06:04:53.685; org.apache.solr.cloud.ZkTestServer; start zk server on port:42990
[junit4:junit4]   1> INFO  - 2013-05-13 06:04:53.686; org.apache.solr.common.cloud.ConnectionManager; Waiting for client to connect to ZooKeeper
[junit4:junit4]   1> INFO  - 2013-05-13 06:04:53.698; org.apache.solr.common.cloud.ConnectionManager; Watcher org.apache.solr.common.cloud.ConnectionManager@5b1430e9 name:ZooKeeperConnection Watcher:127.0.0.1:42990 got event WatchedEvent state:SyncConnected type:None path:null path:null type:None
[junit4:junit4]   1> INFO  - 2013-05-13 06:04:53.698; org.apache.solr.common.cloud.ConnectionManager; Client is connected to ZooKeeper
[junit4:junit4]   1> INFO  - 2013-05-13 06:04:53.699; org.apache.solr.common.cloud.SolrZkClient; makePath: /solr
[junit4:junit4]   1> INFO  - 2013-05-13 06:04:53.731; org.apache.solr.common.cloud.ConnectionManager; Waiting for client to connect to ZooKeeper
[junit4:junit4]   1> INFO  - 2013-05-13 06:04:53.734; org.apache.solr.common.cloud.ConnectionManager; Watcher org.apache.solr.common.cloud.ConnectionManager@1afceba2 name:ZooKeeperConnection Watcher:127.0.0.1:42990/solr got event WatchedEvent state:SyncConnected type:None path:null path:null type:None
[junit4:junit4]   1> INFO  - 2013-05-13 06:04:53.734; org.apache.solr.common.cloud.ConnectionManager; Client is connected to ZooKeeper
[junit4:junit4]   1> INFO  - 2013-05-13 06:04:53.735; org.apache.solr.cloud.ZkCLITest; ####SETUP_END testList
[junit4:junit4]   1> INFO  - 2013-05-13 06:04:53.735; org.apache.solr.common.cloud.SolrZkClient; makePath: /test
[junit4:junit4]   1> INFO  - 2013-05-13 06:04:53.771; org.apache.solr.common.cloud.ConnectionManager; Waiting for client to connect to ZooKeeper
[junit4:junit4]   1> INFO  - 2013-05-13 06:04:53.773; org.apache.solr.common.cloud.ConnectionManager; Watcher org.apache.solr.common.cloud.ConnectionManager@7e59ae08 name:ZooKeeperConnection Watcher:127.0.0.1:42990/solr got event WatchedEvent state:SyncConnected type:None path:null path:null type:None
[junit4:junit4]   1> INFO  - 2013-05-13 06:04:53.774; org.apache.solr.common.cloud.ConnectionManager; Client is connected to ZooKeeper
[junit4:junit4]   1> / (1)
[junit4:junit4]   1>  /test (0)
[junit4:junit4]   1> 
[junit4:junit4]   1> INFO  - 2013-05-13 06:04:53.779; org.apache.solr.cloud.ZkTestServer; connecting to 127.0.0.1:42990 42990
[junit4:junit4]   1> INFO  - 2013-05-13 06:04:54.927; org.apache.solr.SolrTestCaseJ4; ###Ending testList
[junit4:junit4]   2> Creating dataDir: /usr/home/hudson/hudson-slave/workspace/Lucene-Solr-Tests-4.x-Java6/solr/build/solr-core/test/J1/./solrtest-ZkCLITest-1368425093127
[junit4:junit4]   1> INFO  - 2013-05-13 06:04:54.929; org.apache.solr.SolrTestCaseJ4; ###deleteCore
[junit4:junit4]   2> NOTE: test params are: codec=Lucene42: {}, docValues:{}, sim=DefaultSimilarity, locale=no_NO_NY, timezone=Asia/Omsk
[junit4:junit4]   2> NOTE: FreeBSD 9.0-RELEASE amd64/Sun Microsystems Inc. 1.6.0_32 (64-bit)/cpus=16,threads=1,free=197399064,total=407568384
[junit4:junit4]   2> NOTE: All tests run in this JVM: [NoCacheHeaderTest, DateMathParserTest, HighlighterTest, UniqFieldsUpdateProcessorFactoryTest, EchoParamsTest, CachingDirectoryFactoryTest, TestDistributedSearch, TestCSVLoader, CollectionsAPIDistributedZkTest, OpenExchangeRatesOrgProviderTest, BadIndexSchemaTest, PathHierarchyTokenizerFactoryTest, TestQuerySenderNoQuery, IndexBasedSpellCheckerTest, SignatureUpdateProcessorFactoryTest, TestSuggestSpellingConverter, TestNumberUtils, TimeZoneUtilsTest, TestFastOutputStream, TestSchemaNameResource, HardAutoCommitTest, LeaderElectionIntegrationTest, SolrCoreCheckLockOnStartupTest, TestJmxMonitoredMap, ClusterStateTest, TestDefaultSimilarityFactory, JSONWriterTest, XsltUpdateRequestHandlerTest, TestDynamicFieldCollectionResource, SampleTest, DebugComponentTest, TestRandomFaceting, ConvertedLegacyTest, SpellPossibilityIteratorTest, TestDistributedGrouping, StandardRequestHandlerTest, TestUpdate, TestMaxScoreQueryParser, TestSolr4Spatial, StatsComponentTest, TestCSVResponseWriter, TestPartialUpdateDeduplication, TestLuceneMatchVersion, TestOmitPositions, TestIndexingPerformance, TestDFRSimilarityFactory, TestSchemaSimilarityResource, PreAnalyzedUpdateProcessorTest, TestCopyFieldCollectionResource, SortByFunctionTest, FileUtilsTest, BasicZkTest, TestCodecSupport, SpellCheckCollatorTest, TestZkChroot, XmlUpdateRequestHandlerTest, TestComponentsName, DocumentAnalysisRequestHandlerTest, TestSolrXml, TestUniqueKeyFieldResource, FullSolrCloudDistribCmdsTest, TestHashPartitioner, CopyFieldTest, TestUtils, CurrencyFieldOpenExchangeTest, TestFieldTypeResource, TestElisionMultitermQuery, IndexReaderFactoryTest, TestSolrQueryParserDefaultOperatorResource, TestSolrJ, SolrRequestParserTest, ChaosMonkeySafeLeaderTest, BasicDistributedZk2Test, OpenCloseCoreStressTest, RecoveryZkTest, ZkSolrClientTest, ZkCLITest]
[junit4:junit4] Completed on J1 in 7.38s, 5 tests, 1 failure <<< FAILURES!

[...truncated 126 lines...]
[junit4:junit4] Suite: org.apache.solr.search.QueryEqualityTest
[junit4:junit4]   1> INFO  - 2013-05-13 06:08:58.686; org.apache.solr.SolrTestCaseJ4; ####initCore
[junit4:junit4]   1> INFO  - 2013-05-13 06:08:58.687; org.apache.solr.core.SolrResourceLoader; new SolrResourceLoader for directory: '/usr/home/hudson/hudson-slave/workspace/Lucene-Solr-Tests-4.x-Java6/solr/build/solr-core/test-files/solr/collection1/'
[junit4:junit4]   1> INFO  - 2013-05-13 06:08:58.688; org.apache.solr.core.SolrResourceLoader; Adding 'file:/usr/home/hudson/hudson-slave/workspace/Lucene-Solr-Tests-4.x-Java6/solr/build/solr-core/test-files/solr/collection1/lib/classes/' to classloader
[junit4:junit4]   1> INFO  - 2013-05-13 06:08:58.688; org.apache.solr.core.SolrResourceLoader; Adding 'file:/usr/home/hudson/hudson-slave/workspace/Lucene-Solr-Tests-4.x-Java6/solr/build/solr-core/test-files/solr/collection1/lib/README' to classloader
[junit4:junit4]   1> INFO  - 2013-05-13 06:08:58.741; org.apache.solr.core.SolrConfig; Using Lucene MatchVersion: LUCENE_44
[junit4:junit4]   1> INFO  - 2013-05-13 06:08:58.796; org.apache.solr.core.SolrConfig; Loaded SolrConfig: solrconfig.xml
[junit4:junit4]   1> INFO  - 2013-05-13 06:08:58.797; org.apache.solr.schema.IndexSchema; Reading Solr Schema from schema15.xml
[junit4:junit4]   1> INFO  - 2013-05-13 06:08:58.800; org.apache.solr.schema.IndexSchema; [null] Schema name=test
[junit4:junit4]   1> INFO  - 2013-05-13 06:08:59.337; org.apache.solr.schema.IndexSchema; default search field in schema is text
[junit4:junit4]   1> INFO  - 2013-05-13 06:08:59.340; org.apache.solr.schema.IndexSchema; unique key field: id
[junit4:junit4]   1> INFO  - 2013-05-13 06:08:59.341; org.apache.solr.schema.FileExchangeRateProvider; Reloading exchange rates from file currency.xml
[junit4:junit4]   1> INFO  - 2013-05-13 06:08:59.345; org.apache.solr.schema.FileExchangeRateProvider; Reloading exchange rates from file currency.xml
[junit4:junit4]   1> INFO  - 2013-05-13 06:08:59.353; org.apache.solr.core.SolrResourceLoader; JNDI not configured for solr (NoInitialContextEx)
[junit4:junit4]   1> INFO  - 2013-05-13 06:08:59.353; org.apache.solr.core.SolrResourceLoader; using system property solr.solr.home: /usr/home/hudson/hudson-slave/workspace/Lucene-Solr-Tests-4.x-Java6/solr/build/solr-core/test-files/solr
[junit4:junit4]   1> INFO  - 2013-05-13 06:08:59.353; org.apache.solr.core.SolrResourceLoader; new SolrResourceLoader for directory: '/usr/home/hudson/hudson-slave/workspace/Lucene-Solr-Tests-4.x-Java6/solr/build/solr-core/test-files/solr/'
[junit4:junit4]   1> INFO  - 2013-05-13 06:08:59.364; org.apache.solr.core.CoreContainer; New CoreContainer 805943711
[junit4:junit4]   1> INFO  - 2013-05-13 06:08:59.405; org.apache.solr.core.SolrCore; org.apache.solr.core.MockDirectoryFactory
[junit4:junit4]   1> INFO  - 2013-05-13 06:08:59.405; org.apache.solr.core.SolrCore; [collection1] Opening new SolrCore at /usr/home/hudson/hudson-slave/workspace/Lucene-Solr-Tests-4.x-Java6/solr/build/solr-core/test-files/solr/collection1/, dataDir=/usr/home/hudson/hudson-slave/workspace/Lucene-Solr-Tests-4.x-Java6/solr/build/solr-core/test/J1/./solrtest-QueryEqualityTest-1368425338686/
[junit4:junit4]   1> INFO  - 2013-05-13 06:08:59.406; org.apache.solr.core.JmxMonitoredMap; JMX monitoring is enabled. Adding Solr mbeans to JMX Server: com.sun.jmx.mbeanserver.JmxMBeanServer@4cad4d40
[junit4:junit4]   1> INFO  - 2013-05-13 06:08:59.406; org.apache.solr.core.SolrCore; org.apache.solr.core.MockDirectoryFactory
[junit4:junit4]   1> INFO  - 2013-05-13 06:08:59.407; org.apache.solr.core.CachingDirectoryFactory; return new directory for /usr/home/hudson/hudson-slave/workspace/Lucene-Solr-Tests-4.x-Java6/solr/build/solr-core/test/J1/./solrtest-QueryEqualityTest-1368425338686
[junit4:junit4]   1> INFO  - 2013-05-13 06:08:59.407; org.apache.solr.core.SolrCore; New index directory detected: old=null new=/usr/home/hudson/hudson-slave/workspace/Lucene-Solr-Tests-4.x-Java6/solr/build/solr-core/test/J1/./solrtest-QueryEqualityTest-1368425338686/index/
[junit4:junit4]   1> WARN  - 2013-05-13 06:08:59.407; org.apache.solr.core.SolrCore; [collection1] Solr index directory '/usr/home/hudson/hudson-slave/workspace/Lucene-Solr-Tests-4.x-Java6/solr/build/solr-core/test/J1/./solrtest-QueryEqualityTest-1368425338686/index' doesn't exist. Creating new index...
[junit4:junit4]   1> INFO  - 2013-05-13 06:08:59.408; org.apache.solr.core.CachingDirectoryFactory; return new directory for /usr/home/hudson/hudson-slave/workspace/Lucene-Solr-Tests-4.x-Java6/solr/build/solr-core/test/J1/./solrtest-QueryEqualityTest-1368425338686/index
[junit4:junit4]   1> INFO  - 2013-05-13 06:08:59.409; org.apache.solr.core.SolrDeletionPolicy; SolrDeletionPolicy.onCommit: commits: num=1
[junit4:junit4]   1> 	commit{dir=RateLimitedDirectoryWrapper(MockDirWrapper(org.apache.lucene.store.RAMDirectory@7a874114 lockFactory=org.apache.lucene.store.NativeFSLockFactory@1e40dd98)),segFN=segments_1,generation=1}
[junit4:junit4]   1> INFO  - 2013-05-13 06:08:59.410; org.apache.solr.core.SolrDeletionPolicy; newest commit generation = 1
[junit4:junit4]   1> INFO  - 2013-05-13 06:08:59.410; org.apache.solr.core.SolrCore; created xml: solr.XMLResponseWriter
[junit4:junit4]   1> INFO  - 2013-05-13 06:08:59.412; org.apache.solr.update.processor.UpdateRequestProcessorChain; inserting DistributedUpdateProcessorFactory into updateRequestProcessorChain "dedupe"
[junit4:junit4]   1> INFO  - 2013-05-13 06:08:59.412; org.apache.solr.update.processor.UpdateRequestProcessorChain; inserting DistributedUpdateProcessorFactory into updateRequestProcessorChain "dedupe-allfields"
[junit4:junit4]   1> INFO  - 2013-05-13 06:08:59.412; org.apache.solr.update.processor.UpdateRequestProcessorChain; inserting DistributedUpdateProcessorFactory into updateRequestProcessorChain "stored_sig"
[junit4:junit4]   1> INFO  - 2013-05-13 06:08:59.413; org.apache.solr.update.processor.UpdateRequestProcessorChain; inserting DistributedUpdateProcessorFactory into updateRequestProcessorChain "uniq-fields"
[junit4:junit4]   1> INFO  - 2013-05-13 06:08:59.413; org.apache.solr.update.processor.UpdateRequestProcessorChain; inserting DistributedUpdateProcessorFactory into updateRequestProcessorChain "distrib-dup-test-chain-implicit"
[junit4:junit4]   1> INFO  - 2013-05-13 06:08:59.413; org.apache.solr.core.RequestHandlers; adding lazy requestHandler: solr.ReplicationHandler
[junit4:junit4]   1> INFO  - 2013-05-13 06:08:59.414; org.apache.solr.core.RequestHandlers; created /replication: solr.ReplicationHandler
[junit4:junit4]   1> INFO  - 2013-05-13 06:08:59.414; org.apache.solr.core.RequestHandlers; created standard: solr.StandardRequestHandler
[junit4:junit4]   1> INFO  - 2013-05-13 06:08:59.415; org.apache.solr.core.RequestHandlers; created /get: solr.RealTimeGetHandler
[junit4:junit4]   1> INFO  - 2013-05-13 06:08:59.415; org.apache.solr.core.RequestHandlers; created dismax: solr.SearchHandler
[junit4:junit4]   1> INFO  - 2013-05-13 06:08:59.415; org.apache.solr.core.RequestHandlers; created mock: org.apache.solr.core.MockQuerySenderListenerReqHandler
[junit4:junit4]   1> INFO  - 2013-05-13 06:08:59.416; org.apache.solr.core.RequestHandlers; created /admin/: org.apache.solr.handler.admin.AdminHandlers
[junit4:junit4]   1> INFO  - 2013-05-13 06:08:59.416; org.apache.solr.core.RequestHandlers; created defaults: solr.StandardRequestHandler
[junit4:junit4]   1> INFO  - 2013-05-13 06:08:59.416; org.apache.solr.core.RequestHandlers; adding lazy requestHandler: solr.StandardRequestHandler
[junit4:junit4]   1> INFO  - 2013-05-13 06:08:59.417; org.apache.solr.core.RequestHandlers; created lazy: solr.StandardRequestHandler
[junit4:junit4]   1> INFO  - 2013-05-13 06:08:59.417; org.apache.solr.core.RequestHandlers; created /update: solr.UpdateRequestHandler
[junit4:junit4]   1> INFO  - 2013-05-13 06:08:59.418; org.apache.solr.core.RequestHandlers; created /terms: org.apache.solr.handler.component.SearchHandler
[junit4:junit4]   1> INFO  - 2013-05-13 06:08:59.418; org.apache.solr.core.RequestHandlers; created spellCheckCompRH: org.apache.solr.handler.component.SearchHandler
[junit4:junit4]   1> INFO  - 2013-05-13 06:08:59.418; org.apache.solr.core.RequestHandlers; created spellCheckCompRH_Direct: org.apache.solr.handler.component.SearchHandler
[junit4:junit4]   1> INFO  - 2013-05-13 06:08:59.419; org.apache.solr.core.RequestHandlers; created spellCheckWithWordbreak: org.apache.solr.handler.component.SearchHandler
[junit4:junit4]   1> INFO  - 2013-05-13 06:08:59.419; org.apache.solr.core.RequestHandlers; created spellCheckWithWordbreak_Direct: org.apache.solr.handler.component.SearchHandler
[junit4:junit4]   1> INFO  - 2013-05-13 06:08:59.419; org.apache.solr.core.RequestHandlers; created spellCheckCompRH1: org.apache.solr.handler.component.SearchHandler
[junit4:junit4]   1> INFO  - 2013-05-13 06:08:59.420; org.apache.solr.core.RequestHandlers; created mltrh: org.apache.solr.handler.component.SearchHandler
[junit4:junit4]   1> INFO  - 2013-05-13 06:08:59.420; org.apache.solr.core.RequestHandlers; created tvrh: org.apache.solr.handler.component.SearchHandler
[junit4:junit4]   1> INFO  - 2013-05-13 06:08:59.421; org.apache.solr.core.RequestHandlers; created /mlt: solr.MoreLikeThisHandler
[junit4:junit4]   1> INFO  - 2013-05-13 06:08:59.421; org.apache.solr.core.RequestHandlers; created /debug/dump: solr.DumpRequestHandler
[junit4:junit4]   1> INFO  - 2013-05-13 06:08:59.426; org.apache.solr.handler.loader.XMLLoader; xsltCacheLifetimeSeconds=60
[junit4:junit4]   1> WARN  - 2013-05-13 06:08:59.429; org.apache.solr.core.SolrCore; solrconfig.xml uses deprecated <admin/gettableFiles>, Please update your config to use the ShowFileRequestHandler.
[junit4:junit4]   1> WARN  - 2013-05-13 06:08:59.430; org.apache.solr.core.SolrCore; adding ShowFileRequestHandler with hidden files: [THROW.ERROR.ON.ADD.UPDATEPROCESSOR.JS, SOLRCONFIG-HIGHLIGHT.XML, SCHEMA-REQUIRED-FIELDS.XML, SCHEMA-MINIMAL.XML, BAD-SCHEMA-DOCVALUES-NOT-REQUIRED-NO-DEFAULT.XML, BAD-SCHEMA-DUP-DYNAMICFIELD.XML, TRIVIAL.UPDATEPROCESSOR1.JS, SCHEMA-REPLICATION2.XML, SOLRCONFIG-CACHING.XML, BAD-SOLRCONFIG-UNEXPECTED-SCHEMA-ATTRIBUTE.XML, SCHEMA-POSTINGSHIGHLIGHT.XML, SOLRCONFIG-REPEATER.XML, REGEX-BOOST-PROCESSOR-TEST.TXT, BAD-SCHEMA-CURRENCY-FT-BOGUS-CODE-IN-XML.XML, SOLRCONFIG-MERGEPOLICY.XML, CURRENCY.XML, BAD-SCHEMA-NONTEXT-ANALYZER.XML, SOLRCONFIG-TLOG.XML, SOLRCONFIG-MASTER.XML, SOLRCONFIG-COMPONENTS-NAME.XML, BAD-SCHEMA-UNIQUEKEY-MULTIVALUED.XML, SCHEMA11.XML, SOLRCONFIG-BASIC.XML, DA_COMPOUNDDICTIONARY.TXT, MISSLEADING.EXTENSION.UPDATEPROCESSOR.JS.TXT, SCHEMA-COPYFIELD-TEST.XML, SOLRCONFIG-SLAVE.XML, SOLRCONFIG-PROPINJECT-INDEXDEFAULT.XML, ELEVATE.XML, TRIVIAL.UPDATEPROCESSOR0.JS, SCHEMA-SWEETSPOT.XML, BAD-SOLRCONFIG-BOGUS-SCRIPTENGINE-NAME.XML, SCHEMA-CHARFILTERS.XML, SCHEMA-IB.XML, BAD-SCHEMA-MISPLACED-ASTERISK-COPYFIELD-SOURCE-SHOULD-FAIL-TEST.XML, SOLRCONFIG-QUERYSENDER.XML, SOLRCONFIG-SNIPPET-PROCESSOR.XML, DA_UTF8.XML, SCHEMA-REPLICATION1.XML, BAD-SCHEMA-NON-GLOB-COPYFIELD-SOURCE-MATCHING-NOTHING-SHOULD-FAIL-TEST.XML, CONDITIONAL.UPDATEPROCESSOR.JS, SCHEMA-TINY.XML, MISSING.FUNCTIONS.UPDATEPROCESSOR.JS, SOLRCONFIG-ENABLEPLUGIN.XML, HYPHENATION.DTD, BAD-SOLRCONFIG-SCHEMA-MUTABLE-BUT-NOT-MANAGED.XML, SCHEMA-PHRASESUGGEST.XML, STEMDICT.TXT, SCHEMA-ID-AND-VERSION-FIELDS-ONLY.XML, HUNSPELL-TEST.AFF, BAD-SCHEMA-CURRENCY-FT-OER-NORATES.XML, SCHEMA-SNIPPET-TYPE.XML, STOPTYPES-1.TXT, STOPWORDSWRONGENCODING.TXT, SCHEMA-NUMERIC.XML, SOLRCONFIG-TRANSFORMERS.XML, SOLRCONFIG-PROPINJECT.XML, BAD-SCHEMA-NOT-INDEXED-BUT-TF.XML, SOLRCONFIG-SIMPLELOCK.XML, SOLRCONFIG-TLOG-MUTABLE-MANAGED-SCHEMA.XML, SCHEMA-DOCVALUES.XML, WDFTYPES.TXT, STOPTYPES-2.TXT, SCHEMA-REVERSED.XML, BAD-SCHEMA-BOGUS-ANALYSIS-PARAMETERS.XML, BAD-SCHEMA-CURRENCY-FT-MULTIVALUED.XML, SOLRCONFIG-SPELLCHECKCOMPONENT.XML, BAD-SCHEMA-CURRENCY-MULTIVALUED.XML, SOLRCONFIG-PHRASESUGGEST.XML, SCHEMA-DFR.XML, BAD-SCHEMA-NOT-INDEXED-BUT-POS.XML, KEEP-1.TXT, SCHEMA-SPATIAL.XML, OPEN-EXCHANGE-RATES.JSON, STOPWITHBOM.TXT, SOLRCONFIG-POSTINGSHIGHLIGHT.XML, SCHEMA-BINARYFIELD.XML, SOLRCONFIG-SPELLCHECKER.XML, SOLRCONFIG-UPDATE-PROCESSOR-CHAINS.XML, SOLRCONFIG-WARMER.XML, BAD-SCHEMA-OMIT-TF-BUT-NOT-POS.XML, SCHEMA-XINCLUDE.XML, BAD-SCHEMA-DUP-FIELDTYPE.XML, SOLRCONFIG-MASTER1.XML, BAD-SCHEMA-MULTIPLE-ASTERISK-COPYFIELD-SOURCE-SHOULD-FAIL-TEST.XML, SCHEMA-BEHAVIOR.XML, SYNONYMS.TXT, SOLRCONFIG-MINIMAL.XML, SCHEMA-DOCVALUESMULTI.XML, BAD-SCHEMA-CURRENCY-DYNAMIC-MULTIVALUED.XML, BAD-SCHEMA-UNSUPPORTED-DOCVALUES.XML, SCHEMA_CODEC.XML, BAD-SCHEMA-SWEETSPOT-PARTIAL-HYPERBOLIC.XML, SOLRCONFIG-SOLR-749.XML, SOLRCONFIG-MASTER1-KEEPONEBACKUP.XML, SCHEMA-EFF.XML, STOP-2.TXT, SOLRCONFIG-FUNCTIONQUERY.XML, SOLRCONFIG-TERMINDEX.XML, SCHEMA-LMDIRICHLET.XML, SCHEMA-ONE-FIELD-NO-DYNAMIC-FIELD.XML, SOLRCONFIG-ELEVATE.XML, BAD-SCHEMA-SWEETSPOT-PARTIAL-NORMS.XML, BAD-SCHEMA-SWEETSPOT-PARTIAL-BASELINE.XML, STOPWORDS.TXT, SCHEMA-FOLDING.XML, SCHEMA-STOP-KEEP.XML, BAD-SCHEMA-BOGUS-FIELD-PARAMETERS.XML, FUZZYSUGGEST.TXT, BAD-SOLRCONFIG-MANAGED-SCHEMA-NAMED-SCHEMA.XML.XML, BAD-SCHEMA-NOT-INDEXED-BUT-NORMS.XML, SCHEMA-REST.XML, SOLRCONFIG-SOLCOREPROPERTIES.XML, SOLRCONFIG-TLOG-MANAGED-SCHEMA.XML, STOP-1.TXT, SOLRCONFIG-MASTER2.XML, SOLRCONFIG-MANAGED-SCHEMA.XML, SCHEMA-SPELLCHECKER.XML, SOLRCONFIG-RESPONSE-LOG-COMPONENT.XML, SOLRCONFIG-LAZYWRITER.XML, BAD-SCHEMA-MISPLACED-ASTERISK-COPYFIELD-DEST-SHOULD-FAIL-TEST.XML, SCHEMA-LUCENEMATCHVERSION.XML, SCHEMA-CLASS-NAME-SHORTENING-ON-SERIALIZATION.XML, FRENCHARTICLES.TXT, BAD-MP-SOLRCONFIG.XML, SCHEMA15.XML, SOLRCONFIG-REQHANDLER.INCL, SCHEMASURROUND.XML, SCHEMA-COLLATEFILTER.XML, SOLRCONFIG-MASTER3.XML, BAD-SCHEMA-MULTIPLE-ASTERISK-COPYFIELD-DEST-SHOULD-FAIL-TEST.XML, HUNSPELL-TEST.DIC, BAD-SCHEMA-CODEC-GLOBAL-VS-FT-MISMATCH.XML, SOLRCONFIG-XINCLUDE.XML, SOLRCONFIG-SLAVE1.XML, SOLRCONFIG-DELPOLICY1.XML, SCHEMA-SIM.XML, SCHEMA-SNIPPET-FIELD.XML, SCHEMA-COLLATE.XML, STOP-SNOWBALL.TXT, BAD-SCHEMA-SIM-GLOBAL-VS-FT-MISMATCH.XML, PROTWORDS.TXT, SCHEMA-TRIE.XML, SOLRCONFIG_CODEC.XML, SCHEMA-SYNONYM-TOKENIZER.XML, BAD-SOLRCONFIG-INVALID-SCRIPTFILE.XML, JASUGGEST.TXT, SCHEMA-REST-LUCENE-MATCH-VERSION.XML, SCHEMA-DOCVALUESFACETING.XML, SCHEMA-TFIDF.XML, SOLRCONFIG-SCRIPT-UPDATEPROCESSOR.XML, SCHEMA-LMJELINEKMERCER.XML, PHRASESUGGEST.TXT, BAD-SOLRCONFIG-MISSING-SCRIPTFILE.XML, SOLRCONFIG-BASIC-LUCENEVERSION31.XML, BAD-SCHEMA-UNIQUEKEY-USES-DEFAULT.XML, OLD_SYNONYMS.TXT, SOLRCONFIG-DELPOLICY2.XML, SOLRCONFIG-NATIVELOCK.XML, XSLT, SOLRCONFIG-MUTABLE-MANAGED-SCHEMA.XML, BAD-SCHEMA-DUP-FIELD.XML, SOLRCONFIG-NOCACHE.XML, BAD-SCHEMA-SWEETSPOT-BOTH-TF.XML, SCHEMA-BM25.XML, ADDFIELDS.UPDATEPROCESSOR.JS, SOLRCONFIG-ALTDIRECTORY.XML, SOLRCONFIG-QUERYSENDER-NOQUERY.XML, COMPOUNDDICTIONARY.TXT, SOLRCONFIG-INDEXCONFIG.XML, SOLRCONFIG_PERF.XML, BAD-CURRENCY.XML, BAD-SCHEMA-CURRENCY-FT-BOGUS-DEFAULT-CODE.XML, SCHEMA-NOT-REQUIRED-UNIQUE-KEY.XML, BAD-SCHEMA-ANALYZER-CLASS-AND-NESTED.XML, KEEP-2.TXT, BAD-SCHEMA-UNIQUEKEY-IS-COPYFIELD-DEST.XML, SCHEMA12.XML, MAPPING-ISOLATIN1ACCENT.TXT, BAD_SOLRCONFIG.XML, BAD-SCHEMA-EXTERNAL-FILEFIELD.XML]
[junit4:junit4]   1> INFO  - 2013-05-13 06:08:59.432; org.apache.solr.search.SolrIndexSearcher; Opening Searcher@3ae2e7a5 main
[junit4:junit4]   1> INFO  - 2013-05-13 06:08:59.433; org.apache.solr.update.CommitTracker; Hard AutoCommit: disabled
[junit4:junit4]   1> INFO  - 2013-05-13 06:08:59.433; org.apache.solr.update.CommitTracker; Soft AutoCommit: disabled
[junit4:junit4]   1> INFO  - 2013-05-13 06:08:59.433; org.apache.solr.handler.component.SpellCheckComponent; Initializing spell checkers
[junit4:junit4]   1> INFO  - 2013-05-13 06:08:59.439; org.apache.solr.spelling.DirectSolrSpellChecker; init: {name=direct,classname=DirectSolrSpellChecker,field=lowerfilt,minQueryLength=3}
[junit4:junit4]   1> INFO  - 2013-05-13 06:08:59.526; org.apache.solr.core.SolrCore; [collection1] Registered new searcher Searcher@3ae2e7a5 main{StandardDirectoryReader(segments_1:1)}
[junit4:junit4]   1> INFO  - 2013-05-13 06:08:59.529; org.apache.solr.core.CoreContainer; registering core: collection1
[junit4:junit4]   1> INFO  - 2013-05-13 06:08:59.535; org.apache.solr.SolrTestCaseJ4; ####initCore end
[junit4:junit4]   2> Creating dataDir: /usr/home/hudson/hudson-slave/workspace/Lucene-Solr-Tests-4.x-Java6/solr/build/solr-core/test/J1/./solrtest-QueryEqualityTest-1368425338686
[junit4:junit4]   1> INFO  - 2013-05-13 06:08:59.538; org.apache.solr.SolrTestCaseJ4; ###Starting testFuncNumdocs
[junit4:junit4]   1> INFO  - 2013-05-13 06:08:59.557; org.apache.solr.SolrTestCaseJ4; ###Ending testFuncNumdocs
[junit4:junit4]   1> INFO  - 2013-05-13 06:08:59.560; org.apache.solr.SolrTestCaseJ4; ###Starting testFuncRord
[junit4:junit4]   1> INFO  - 2013-05-13 06:08:59.561; org.apache.solr.SolrTestCaseJ4; ###Ending testFuncRord
[junit4:junit4]   1> INFO  - 2013-05-13 06:08:59.563; org.apache.solr.SolrTestCaseJ4; ###Starting testFuncMax
[junit4:junit4]   1> INFO  - 2013-05-13 06:08:59.564; org.apache.solr.SolrTestCaseJ4; ###Ending testFuncMax
[junit4:junit4]   1> INFO  - 2013-05-13 06:08:59.567; org.apache.solr.SolrTestCaseJ4; ###Starting testTestFuncs
[junit4:junit4]   1> INFO  - 2013-05-13 06:08:59.571; org.apache.solr.SolrTestCaseJ4; ###Ending testTestFuncs
[junit4:junit4]   1> INFO  - 2013-05-13 06:08:59.574; org.apache.solr.SolrTestCaseJ4; ###Starting testFuncDef
[junit4:junit4]   1> INFO  - 2013-05-13 06:08:59.584; org.apache.solr.SolrTestCaseJ4; ###Ending testFuncDef
[junit4:junit4]   1> INFO  - 2013-05-13 06:08:59.587; org.apache.solr.SolrTestCaseJ4; ###Starting testFuncRecip
[junit4:junit4]   1> INFO  - 2013-05-13 06:08:59.588; org.apache.solr.SolrTestCaseJ4; ###Ending testFuncRecip
[junit4:junit4]   1> INFO  - 2013-05-13 06:08:59.590; org.apache.solr.SolrTestCaseJ4; ###Starting testQueryLucene
[junit4:junit4]   1> INFO  - 2013-05-13 06:08:59.592; org.apache.solr.SolrTestCaseJ4; ###Ending testQueryLucene
[junit4:junit4]   1> INFO  - 2013-05-13 06:08:59.595; org.apache.solr.SolrTestCaseJ4; ###Starting testQueryGeofilt
[junit4:junit4]   1> INFO  - 2013-05-13 06:08:59.610; org.apache.solr.SolrTestCaseJ4; ###Ending testQueryGeofilt
[junit4:junit4]   1> INFO  - 2013-05-13 06:08:59.614; org.apache.solr.SolrTestCaseJ4; ###Starting testFuncSingleValueMathFuncs
[junit4:junit4]   1> INFO  - 2013-05-13 06:08:59.617; org.apache.solr.SolrTestCaseJ4; ###Ending testFuncSingleValueMathFuncs
[junit4:junit4]   1> INFO  - 2013-05-13 06:08:59.620; org.apache.solr.SolrTestCaseJ4; ###Starting testFuncMod
[junit4:junit4]   1> INFO  - 2013-05-13 06:08:59.621; org.apache.solr.SolrTestCaseJ4; ###Ending testFuncMod
[junit4:junit4]   1> INFO  - 2013-05-13 06:08:59.623; org.apache.solr.SolrTestCaseJ4; ###Starting testQueryPrefix
[junit4:junit4]   1> INFO  - 2013-05-13 06:08:59.624; org.apache.solr.SolrTestCaseJ4; ###Ending testQueryPrefix
[junit4:junit4]   1> INFO  - 2013-05-13 06:08:59.627; org.apache.solr.SolrTestCaseJ4; ###Starting testFuncField
[junit4:junit4]   1> INFO  - 2013-05-13 06:08:59.627; org.apache.solr.SolrTestCaseJ4; ###Ending testFuncField
[junit4:junit4]   1> INFO  - 2013-05-13 06:08:59.630; org.apache.solr.SolrTestCaseJ4; ###Starting testFuncQuery
[junit4:junit4]   1> INFO  - 2013-05-13 06:08:59.631; org.apache.solr.SolrTestCaseJ4; ###Ending testFuncQuery
[junit4:junit4]   1> INFO  - 2013-05-13 06:08:59.634; org.apache.solr.SolrTestCaseJ4; ###Starting testFuncStrdist
[junit4:junit4]   1> INFO  - 2013-05-13 06:08:59.638; org.apache.solr.SolrTestCaseJ4; ###Ending testFuncStrdist
[junit4:junit4]   1> INFO  - 2013-05-13 06:08:59.641; org.apache.solr.SolrTestCaseJ4; ###Starting testFuncGeohash
[junit4:junit4]   1> INFO  - 2013-05-13 06:08:59.654; org.apache.solr.SolrTestCaseJ4; ###Ending testFuncGeohash
[junit4:junit4]   1> INFO  - 2013-05-13 06:08:59.661; org.apache.solr.SolrTestCaseJ4; ###Starting testField
[junit4:junit4]   1> INFO  - 2013-05-13 06:08:59.661; org.apache.solr.SolrTestCaseJ4; ###Ending testField
[junit4:junit4]   1> INFO  - 2013-05-13 06:08:59.664; org.apache.solr.SolrTestCaseJ4; ###Starting testQueryDismax
[junit4:junit4]   1> INFO  - 2013-05-13 06:08:59.668; org.apache.solr.SolrTestCaseJ4; ###Ending testQueryDismax
[junit4:junit4]   1> INFO  - 2013-05-13 06:08:59.671; org.apache.solr.SolrTestCaseJ4; ###Starting testFuncDoubleValueMathFuncs
[junit4:junit4]   1> INFO  - 2013-05-13 06:08:59.675; org.apache.solr.SolrTestCaseJ4; ###Ending testFuncDoubleValueMathFuncs
[junit4:junit4]   1> INFO  - 2013-05-13 06:08:59.678; org.apache.solr.SolrTestCaseJ4; ###Starting testFuncTerms
[junit4:junit4]   1> INFO  - 2013-05-13 06:08:59.699; org.apache.solr.SolrTestCaseJ4; ###Ending testFuncTerms
[junit4:junit4]   1> INFO  - 2013-05-13 06:08:59.702; org.apache.solr.SolrTestCaseJ4; ###Starting testFuncCurrency
[junit4:junit4]   1> INFO  - 2013-05-13 06:08:59.703; org.apache.solr.SolrTestCaseJ4; ###Ending testFuncCurrency
[junit4:junit4]   1> INFO  - 2013-05-13 06:08:59.707; org.apache.solr.SolrTestCaseJ4; ###Starting testFuncTop
[junit4:junit4]   1> INFO  - 2013-05-13 06:08:59.707; org.apache.solr.SolrTestCaseJ4; ###Ending testFuncTop
[junit4:junit4]   1> INFO  - 2013-05-13 06:08:59.710; org.apache.solr.SolrTestCaseJ4; ###Starting testFuncTestfunc
[junit4:junit4]   1> INFO  - 2013-05-13 06:08:59.711; org.apache.solr.SolrTestCaseJ4; ###Ending testFuncTestfunc
[junit4:junit4]   1> INFO  - 2013-05-13 06:08:59.713; org.apache.solr.SolrTestCaseJ4; ###Starting testFuncLiteral
[junit4:junit4]   1> INFO  - 2013-05-13 06:08:59.714; org.apache.solr.SolrTestCaseJ4; ###Ending testFuncLiteral
[junit4:junit4]   1> INFO  - 2013-05-13 06:08:59.717; org.apache.solr.SolrTestCaseJ4; ###Starting testFuncDiv
[junit4:junit4]   1> INFO  - 2013-05-13 06:08:59.717; org.apache.solr.SolrTestCaseJ4; ###Ending testFuncDiv
[junit4:junit4]   1> INFO  - 2013-05-13 06:08:59.720; org.apache.solr.SolrTestCaseJ4; ###Starting testFuncGeodist
[junit4:junit4]   1> INFO  - 2013-05-13 06:08:59.721; org.apache.solr.SolrTestCaseJ4; ###Ending testFuncGeodist
[junit4:junit4]   1> INFO  - 2013-05-13 06:08:59.724; org.apache.solr.SolrTestCaseJ4; ###Starting testFuncIf
[junit4:junit4]   1> INFO  - 2013-05-13 06:08:59.740; org.apache.solr.SolrTestCaseJ4; ###Ending testFuncIf
[junit4:junit4]   1> INFO  - 2013-05-13 06:08:59.742; org.apache.solr.SolrTestCaseJ4; ###Starting testFuncHsin
[junit4:junit4]   1> INFO  - 2013-05-13 06:08:59.754; org.apache.solr.SolrTestCaseJ4; ###Ending testFuncHsin
[junit4:junit4]   1> INFO  - 2013-05-13 06:08:59.757; org.apache.solr.SolrTestCaseJ4; ###Starting testFuncNot
[junit4:junit4]   1> INFO  - 2013-05-13 06:08:59.762; org.apache.solr.SolrTestCaseJ4; ###Ending testFuncNot
[junit4:junit4]   1> INFO  - 2013-05-13 06:08:59.765; org.apache.solr.SolrTestCaseJ4; ###Starting testFuncVector
[junit4:junit4]   1> INFO  - 2013-05-13 06:08:59.766; org.apache.solr.SolrTestCaseJ4; ###Ending testFuncVector
[junit4:junit4]   1> INFO  - 2013-05-13 06:08:59.769; org.apache.solr.SolrTestCaseJ4; ###Starting testFuncJoindf
[junit4:junit4]   1> INFO  - 2013-05-13 06:08:59.769; org.apache.solr.SolrTestCaseJ4; ###Ending testFuncJoindf
[junit4:junit4]   1> INFO  - 2013-05-13 06:08:59.772; org.apache.solr.SolrTestCaseJ4; ###Starting testFuncSum
[junit4:junit4]   1> INFO  - 2013-05-13 06:08:59.773; org.apache.solr.SolrTestCaseJ4; ###Ending testFuncSum
[junit4:junit4]   1> INFO  - 2013-05-13 06:08:59.775; org.apache.solr.SolrTestCaseJ4; ###Starting testFuncBools
[junit4:junit4]   1> INFO  - 2013-05-13 06:08:59.776; org.apache.solr.SolrTestCaseJ4; ###Ending testFuncBools
[junit4:junit4]   1> INFO  - 2013-05-13 06:08:59.779; org.apache.solr.SolrTestCaseJ4; ###Starting testQueryFrange
[junit4:junit4]   1> INFO  - 2013-05-13 06:08:59.779; org.apache.solr.SolrTestCaseJ4; ###Ending testQueryFrange
[junit4:junit4]   1> INFO  - 2013-05-13 06:08:59.782; org.apache.solr.SolrTestCaseJ4; ###Starting testFuncGhhsin
[junit4:junit4]   1> INFO  - 2013-05-13 06:08:59.783; org.apache.solr.SolrTestCaseJ4; ###Ending testFuncGhhsin
[junit4:junit4]   1> INFO  - 2013-05-13 06:08:59.785; org.apache.solr.SolrTestCaseJ4; ###Starting testFuncProduct
[junit4:junit4]   1> INFO  - 2013-05-13 06:08:59.786; org.apache.solr.SolrTestCaseJ4; ###Ending testFuncProduct
[junit4:junit4]   1> INFO  - 2013-05-13 06:08:59.789; org.apache.solr.SolrTestCaseJ4; ###Starting testQueryJoin
[junit4:junit4]   1> INFO  - 2013-05-13 06:08:59.796; org.apache.solr.SolrTestCaseJ4; ###Ending testQueryJoin
[junit4:junit4]   1> INFO  - 2013-05-13 06:08:59.799; org.apache.solr.SolrTestCaseJ4; ###Starting testFuncExists
[junit4:junit4]   1> INFO  - 2013-05-13 06:08:59.800; org.apache.solr.SolrTestCaseJ4; ###Ending testFuncExists
[junit4:junit4]   1> INFO  - 2013-05-13 06:08:59.803; org.apache.solr.SolrTestCaseJ4; ###Starting testQueryLucenePlusSort
[junit4:junit4]   1> INFO  - 2013-05-13 06:08:59.804; org.apache.solr.SolrTestCaseJ4; ###Ending testQueryLucenePlusSort
[junit4:junit4]   1> INFO  - 2013-05-13 06:08:59.807; org.apache.solr.SolrTestCaseJ4; ###Starting testQueryTerm
[junit4:junit4]   1> INFO  - 2013-05-13 06:08:59.807; org.apache.solr.SolrTestCaseJ4; ###Ending testQueryTerm
[junit4:junit4]   1> INFO  - 2013-05-13 06:08:59.810; org.apache.solr.SolrTestCaseJ4; ###Starting testFuncScale
[junit4:junit4]   1> INFO  - 2013-05-13 06:08:59.816; org.apache.solr.SolrTestCaseJ4; ###Ending testFuncScale
[junit4:junit4]   1> INFO  - 2013-05-13 06:08:59.818; org.apache.solr.SolrTestCaseJ4; ###Starting testQueryRaw
[junit4:junit4]   1> INFO  - 2013-05-13 06:08:59.819; org.apache.solr.SolrTestCaseJ4; ###Ending testQueryRaw
[junit4:junit4]   1> INFO  - 2013-05-13 06:08:59.822; org.apache.solr.SolrTestCaseJ4; ###Starting testQuerySwitch
[junit4:junit4]   1> INFO  - 2013-05-13 06:08:59.823; org.apache.solr.SolrTestCaseJ4; ###Ending testQuerySwitch
[junit4:junit4]   1> INFO  - 2013-05-13 06:08:59.826; org.apache.solr.SolrTestCaseJ4; ###Starting testFuncSub
[junit4:junit4]   1> INFO  - 2013-05-13 06:08:59.827; org.apache.solr.SolrTestCaseJ4; ###Ending testFuncSub
[junit4:junit4]   1> INFO  - 2013-05-13 06:08:59.830; org.apache.solr.SolrTestCaseJ4; ###Starting testFuncDist
[junit4:junit4]   1> INFO  - 2013-05-13 06:08:59.830; org.apache.solr.SolrTestCaseJ4; ###Ending testFuncDist
[junit4:junit4]   1> INFO  - 2013-05-13 06:08:59.833; org.apache.solr.SolrTestCaseJ4; ###Starting testFuncSqedist
[junit4:junit4]   1> INFO  - 2013-05-13 06:08:59.834; org.apache.solr.SolrTestCaseJ4; ###Ending testFuncSqedist
[junit4:junit4]   1> INFO  - 2013-05-13 06:08:59.836; org.apache.solr.SolrTestCaseJ4; ###Starting testFuncBoost
[junit4:junit4]   1> INFO  - 2013-05-13 06:08:59.841; org.apache.solr.SolrTestCaseJ4; ###Ending testFuncBoost
[junit4:junit4]   1> INFO  - 2013-05-13 06:08:59.844; org.apache.solr.SolrTestCaseJ4; ###Starting testFuncMaxdoc
[junit4:junit4]   1> INFO  - 2013-05-13 06:08:59.844; org.apache.solr.SolrTestCaseJ4; ###Ending testFuncMaxdoc
[junit4:junit4]   1> INFO  - 2013-05-13 06:08:59.847; org.apache.solr.SolrTestCaseJ4; ###Starting testFuncMap
[junit4:junit4]   1> INFO  - 2013-05-13 06:08:59.852; org.apache.solr.SolrTestCaseJ4; ###Ending testFuncMap
[junit4:junit4]   1> INFO  - 2013-05-13 06:08:59.855; org.apache.solr.SolrTestCaseJ4; ###Starting testDateMathParsingEquality
[junit4:junit4]   1> INFO  - 2013-05-13 06:08:59.856; org.apache.solr.SolrTestCaseJ4; ###Ending testDateMathParsingEquality
[junit4:junit4]   1> INFO  - 2013-05-13 06:08:59.859; org.apache.solr.SolrTestCaseJ4; ###Starting testFuncNorm
[junit4:junit4]   1> INFO  - 2013-05-13 06:08:59.864; org.apache.solr.SolrTestCaseJ4; ###Ending testFuncNorm
[junit4:junit4]   1> INFO  - 2013-05-13 06:08:59.867; org.apache.solr.SolrTestCaseJ4; ###Starting testFuncMathConsts
[junit4:junit4]   1> INFO  - 2013-05-13 06:08:59.867; org.apache.solr.SolrTestCaseJ4; ###Ending testFuncMathConsts
[junit4:junit4]   1> INFO  - 2013-05-13 06:08:59.870; org.apache.solr.SolrTestCaseJ4; ###Starting testQueryFunc
[junit4:junit4]   1> INFO  - 2013-05-13 06:08:59.871; org.apache.solr.SolrTestCaseJ4; ###Ending testQueryFunc
[junit4:junit4]   1> INFO  - 2013-05-13 06:08:59.874; org.apache.solr.SolrTestCaseJ4; ###Starting testFuncSttf
[junit4:junit4]   1> INFO  - 2013-05-13 06:08:59.875; org.apache.solr.SolrTestCaseJ4; ###Ending testFuncSttf
[junit4:junit4]   1> INFO  - 2013-05-13 06:08:59.878; org.apache.solr.SolrTestCaseJ4; ###Starting testQueryBbox
[junit4:junit4]   1> INFO  - 2013-05-13 06:08:59.879; org.apache.solr.SolrTestCaseJ4; ###Ending testQueryBbox
[junit4:junit4]   1> INFO  - 2013-05-13 06:08:59.890; org.apache.solr.SolrTestCaseJ4; ###Starting testQueryBoost
[junit4:junit4]   1> INFO  - 2013-05-13 06:08:59.891; org.apache.solr.SolrTestCaseJ4; ###Ending testQueryBoost
[junit4:junit4]   1> INFO  - 2013-05-13 06:08:59.894; org.apache.solr.SolrTestCaseJ4; ###Starting testFuncLinear
[junit4:junit4]   1> INFO  - 2013-05-13 06:08:59.899; org.apache.solr.SolrTestCaseJ4; ###Ending testFuncLinear
[junit4:junit4]   1> INFO  - 2013-05-13 06:08:59.902; org.apache.solr.SolrTestCaseJ4; ###Starting testParserCoverage
[junit4:junit4]   1> INFO  - 2013-05-13 06:08:59.902; org.apache.solr.SolrTestCaseJ4; ###Ending testParserCoverage
[junit4:junit4]   1> INFO  - 2013-05-13 06:08:59.905; org.apache.solr.SolrTestCaseJ4; ###Starting testQuerySurround
[junit4:junit4]   1> INFO  - 2013-05-13 06:09:00.042; org.apache.solr.SolrTestCaseJ4; ###Ending testQuerySurround
[junit4:junit4]   1> INFO  - 2013-05-13 06:09:00.046; org.apache.solr.SolrTestCaseJ4; ###Starting testFuncOrd
[junit4:junit4]   1> INFO  - 2013-05-13 06:09:00.047; org.apache.solr.SolrTestCaseJ4; ###Ending testFuncOrd
[junit4:junit4]   1> INFO  - 2013-05-13 06:09:00.050; org.apache.solr.SolrTestCaseJ4; ###Starting testFuncDoubleValueBools
[junit4:junit4]   1> INFO  - 2013-05-13 06:09:00.056; org.apache.solr.SolrTestCaseJ4; ###Ending testFuncDoubleValueBools
[junit4:junit4]   1> INFO  - 2013-05-13 06:09:00.079; org.apache.solr.SolrTestCaseJ4; ###Starting testFuncMin
[junit4:junit4]   1> INFO  - 2013-05-13 06:09:00.080; org.apache.solr.SolrTestCaseJ4; ###Ending testFuncMin
[junit4:junit4]   1> INFO  - 2013-05-13 06:09:00.082; org.apache.solr.SolrTestCaseJ4; ###Starting testFuncMs
[junit4:junit4]   1> INFO  - 2013-05-13 06:09:00.083; org.apache.solr.SolrTestCaseJ4; ###Ending testFuncMs
[junit4:junit4]   1> INFO  - 2013-05-13 06:09:00.087; org.apache.solr.SolrTestCaseJ4; ###Starting testQueryNested
[junit4:junit4]   1> INFO  - 2013-05-13 06:09:00.087; org.apache.solr.SolrTestCaseJ4; ###Ending testQueryNested
[junit4:junit4]   1> INFO  - 2013-05-13 06:09:00.088; org.apache.solr.SolrTestCaseJ4; ###deleteCore
[junit4:junit4]   1> INFO  - 2013-05-13 06:09:00.089; org.apache.solr.core.CoreContainer; Shutting down CoreContainer instance=805943711
[junit4:junit4]   1> INFO  - 2013-05-13 06:09:00.089; org.apache.solr.core.SolrCore; [collection1]  CLOSING SolrCore org.apache.solr.core.SolrCore@71e0be5
[junit4:junit4]   1> INFO  - 2013-05-13 06:09:00.095; org.apache.solr.update.DirectUpdateHandler2; closing DirectUpdateHandler2{commits=0,autocommits=0,soft autocommits=0,optimizes=0,rollbacks=0,expungeDeletes=0,docsPending=0,adds=0,deletesById=0,deletesByQuery=0,errors=0,cumulative_adds=0,cumulative_deletesById=0,cumulative_deletesByQuery=0,cumulative_errors=0}
[junit4:junit4]   1> INFO  - 2013-05-13 06:09:00.095; org.apache.solr.update.SolrCoreState; Closing SolrCoreState
[junit4:junit4]   1> INFO  - 2013-05-13 06:09:00.095; org.apache.solr.update.DefaultSolrCoreState; SolrCoreState ref count has reached 0 - closing IndexWriter
[junit4:junit4]   1> INFO  - 2013-05-13 06:09:00.096; org.apache.solr.update.DefaultSolrCoreState; closing IndexWriter with IndexWriterCloser
[junit4:junit4]   1> INFO  - 2013-05-13 06:09:00.096; org.apache.solr.core.SolrCore; [collection1] Closing main searcher on request.
[junit4:junit4]   1> INFO  - 2013-05-13 06:09:00.096; org.apache.solr.core.CachingDirectoryFactory; Closing MockDirectoryFactory - 2 directories currently being tracked
[junit4:junit4]   1> INFO  - 2013-05-13 06:09:00.097; org.apache.solr.core.CachingDirectoryFactory; looking to close /usr/home/hudson/hudson-slave/workspace/Lucene-Solr-Tests-4.x-Java6/solr/build/solr-core/test/J1/./solrtest-QueryEqualityTest-1368425338686/index [CachedDir<<refCount=0;path=/usr/home/hudson/hudson-slave/workspace/Lucene-Solr-Tests-4.x-Java6/solr/build/solr-core/test/J1/./solrtest-QueryEqualityTest-1368425338686/index;done=false>>]
[junit4:junit4]   1> INFO  - 2013-05-13 06:09:00.097; org.apache.solr.core.CachingDirectoryFactory; Closing directory: /usr/home/hudson/hudson-slave/workspace/Lucene-Solr-Tests-4.x-Java6/solr/build/solr-core/test/J1/./solrtest-QueryEqualityTest-1368425338686/index
[junit4:junit4]   1> INFO  - 2013-05-13 06:09:00.097; org.apache.solr.core.CachingDirectoryFactory; looking to close /usr/home/hudson/hudson-slave/workspace/Lucene-Solr-Tests-4.x-Java6/solr/build/solr-core/test/J1/./solrtest-QueryEqualityTest-1368425338686 [CachedDir<<refCount=0;path=/usr/home/hudson/hudson-slave/workspace/Lucene-Solr-Tests-4.x-Java6/solr/build/solr-core/test/J1/./solrtest-QueryEqualityTest-1368425338686;done=false>>]
[junit4:junit4]   1> INFO  - 2013-05-13 06:09:00.098; org.apache.solr.core.CachingDirectoryFactory; Closing directory: /usr/home/hudson/hudson-slave/workspace/Lucene-Solr-Tests-4.x-Java6/solr/build/solr-core/test/J1/./solrtest-QueryEqualityTest-1368425338686
[junit4:junit4]   2> NOTE: test params are: codec=Lucene42: {}, docValues:{}, sim=RandomSimilarityProvider(queryNorm=true,coord=crazy): {}, locale=ar_BH, timezone=America/Indianapolis
[junit4:junit4]   2> NOTE: FreeBSD 9.0-RELEASE amd64/Sun Microsystems Inc. 1.6.0_32 (64-bit)/cpus=16,threads=1,free=171369112,total=477102080
[junit4:junit4]   2> NOTE: All tests run in this JVM: [NoCacheHeaderTest, DateMathParserTest, HighlighterTest, UniqFieldsUpdateProcessorFactoryTest, EchoParamsTest, CachingDirectoryFactoryTest, TestDistributedSearch, TestCSVLoader, CollectionsAPIDistributedZkTest, OpenExchangeRatesOrgProviderTest, BadIndexSchemaTest, PathHierarchyTokenizerFactoryTest, TestQuerySenderNoQuery, IndexBasedSpellCheckerTest, SignatureUpdateProcessorFactoryTest, TestSuggestSpellingConverter, TestNumberUtils, TimeZoneUtilsTest, TestFastOutputStream, TestSchemaNameResource, HardAutoCommitTest, LeaderElectionIntegrationTest, SolrCoreCheckLockOnStartupTest, TestJmxMonitoredMap, ClusterStateTest, TestDefaultSimilarityFactory, JSONWriterTest, XsltUpdateRequestHandlerTest, TestDynamicFieldCollectionResource, SampleTest, DebugComponentTest, TestRandomFaceting, ConvertedLegacyTest, SpellPossibilityIteratorTest, TestDistributedGrouping, StandardRequestHandlerTest, TestUpdate, TestMaxScoreQueryParser, TestSolr4Spatial, StatsComponentTest, TestCSVResponseWriter, TestPartialUpdateDeduplication, TestLuceneMatchVersion, TestOmitPositions, TestIndexingPerformance, TestDFRSimilarityFactory, TestSchemaSimilarityResource, PreAnalyzedUpdateProcessorTest, TestCopyFieldCollectionResource, SortByFunctionTest, FileUtilsTest, BasicZkTest, TestCodecSupport, SpellCheckCollatorTest, TestZkChroot, XmlUpdateRequestHandlerTest, TestComponentsName, DocumentAnalysisRequestHandlerTest, TestSolrXml, TestUniqueKeyFieldResource, FullSolrCloudDistribCmdsTest, TestHashPartitioner, CopyFieldTest, TestUtils, CurrencyFieldOpenExchangeTest, TestFieldTypeResource, TestElisionMultitermQuery, IndexReaderFactoryTest, TestSolrQueryParserDefaultOperatorResource, TestSolrJ, SolrRequestParserTest, ChaosMonkeySafeLeaderTest, BasicDistributedZk2Test, OpenCloseCoreStressTest, RecoveryZkTest, ZkSolrClientTest, ZkCLITest, ShardRoutingCustomTest, TestRecovery, TermVectorComponentDistributedTest, ZkControllerTest, TestStressReorder, TestMultiCoreConfBootstrap, TestReload, DistributedTermsComponentTest, TestRangeQuery, SolrCoreTest, SpellCheckComponentTest, TestGroupingSearch, SolrCmdDistributorTest, QueryElevationComponentTest, TestFiltering, BasicFunctionalityTest, TestLazyCores, DirectUpdateHandlerTest, TestBadConfig, OverseerCollectionProcessorTest, TestIndexSearcher, SoftAutoCommitTest, ShowFileRequestHandlerTest, DistributedQueryElevationComponentTest, CurrencyFieldXmlFileTest, SimplePostToolTest, TestCoreDiscovery, TestExtendedDismaxParser, TestFoldingMultitermQuery, DocValuesTest, SuggesterTSTTest, SuggesterTest, TestStressLucene, SuggesterWFSTTest, PolyFieldTest, SchemaVersionSpecificBehaviorTest, TestPseudoReturnFields, TestAtomicUpdateErrorCases, TestWordDelimiterFilterFactory, QueryEqualityTest]
[junit4:junit4]   2> NOTE: reproduce with: ant test  -Dtestcase=QueryEqualityTest -Dtests.seed=3376183124A48C01 -Dtests.multiplier=3 -Dtests.slow=true -Dtests.locale=ar_BH -Dtests.timezone=America/Indianapolis -Dtests.file.encoding=ISO8859-1
[junit4:junit4] ERROR   0.00s J1 | QueryEqualityTest (suite) <<<
[junit4:junit4]    > Throwable #1: java.lang.AssertionError: testParserCoverage was run w/o any other method explicitly testing qparser: maxscore
[junit4:junit4]    > 	at __randomizedtesting.SeedInfo.seed([3376183124A48C01]:0)
[junit4:junit4]    > 	at org.apache.solr.search.QueryEqualityTest.afterClassParserCoverageTest(QueryEqualityTest.java:61)
[junit4:junit4]    > 	at java.lang.Thread.run(Thread.java:679)
[junit4:junit4] Completed on J1 in 1.48s, 63 tests, 1 failure <<< FAILURES!

[...truncated 327 lines...]
BUILD FAILED
/usr/home/hudson/hudson-slave/workspace/Lucene-Solr-Tests-4.x-Java6/build.xml:383: The following error occurred while executing this line:
/usr/home/hudson/hudson-slave/workspace/Lucene-Solr-Tests-4.x-Java6/build.xml:363: The following error occurred while executing this line:
/usr/home/hudson/hudson-slave/workspace/Lucene-Solr-Tests-4.x-Java6/build.xml:39: The following error occurred while executing this line:
/usr/home/hudson/hudson-slave/workspace/Lucene-Solr-Tests-4.x-Java6/solr/build.xml:181: The following error occurred while executing this line:
/usr/home/hudson/hudson-slave/workspace/Lucene-Solr-Tests-4.x-Java6/solr/common-build.xml:437: The following error occurred while executing this line:
/usr/home/hudson/hudson-slave/workspace/Lucene-Solr-Tests-4.x-Java6/lucene/common-build.xml:1243: The following error occurred while executing this line:
/usr/home/hudson/hudson-slave/workspace/Lucene-Solr-Tests-4.x-Java6/lucene/common-build.xml:887: There were test failures: 296 suites, 1233 tests, 1 suite-level error, 1 failure, 27 ignored (8 assumptions)

Total time: 51 minutes 13 seconds
Build step 'Invoke Ant' marked build as failure
Archiving artifacts
Recording test results
Email was triggered for: Failure
Sending email for trigger: Failure



Mime
View raw message