lucene-dev mailing list archives

Site index · List index
Message view « Date » · « Thread »
Top « Date » · « Thread »
From Policeman Jenkins Server <jenk...@thetaphi.de>
Subject [JENKINS] Lucene-Solr-4.x-Linux (64bit/jdk1.8.0-ea-b89) - Build # 5762 - Failure!
Date Sat, 25 May 2013 13:04:39 GMT
Build: http://jenkins.thetaphi.de/job/Lucene-Solr-4.x-Linux/5762/
Java: 64bit/jdk1.8.0-ea-b89 -XX:+UseCompressedOops -XX:+UseParallelGC

1 tests failed.
REGRESSION:  org.apache.lucene.analysis.core.TestRandomChains.testRandomChains

Error Message:
startOffset must be non-negative, and endOffset must be >= startOffset, startOffset=7,endOffset=5

Stack Trace:
java.lang.IllegalArgumentException: startOffset must be non-negative, and endOffset must be
>= startOffset, startOffset=7,endOffset=5
	at __randomizedtesting.SeedInfo.seed([D4934909C41A2CCE:E97260688308310E]:0)
	at org.apache.lucene.analysis.tokenattributes.OffsetAttributeImpl.setOffset(OffsetAttributeImpl.java:45)
	at org.apache.lucene.analysis.shingle.ShingleFilter.incrementToken(ShingleFilter.java:323)
	at org.apache.lucene.analysis.ValidatingTokenFilter.incrementToken(ValidatingTokenFilter.java:78)
	at org.apache.lucene.analysis.gl.GalicianMinimalStemFilter.incrementToken(GalicianMinimalStemFilter.java:48)
	at org.apache.lucene.analysis.ValidatingTokenFilter.incrementToken(ValidatingTokenFilter.java:78)
	at org.apache.lucene.analysis.miscellaneous.RemoveDuplicatesTokenFilter.incrementToken(RemoveDuplicatesTokenFilter.java:54)
	at org.apache.lucene.analysis.ValidatingTokenFilter.incrementToken(ValidatingTokenFilter.java:78)
	at org.apache.lucene.analysis.BaseTokenStreamTestCase.checkAnalysisConsistency(BaseTokenStreamTestCase.java:635)
	at org.apache.lucene.analysis.BaseTokenStreamTestCase.checkRandomData(BaseTokenStreamTestCase.java:546)
	at org.apache.lucene.analysis.BaseTokenStreamTestCase.checkRandomData(BaseTokenStreamTestCase.java:447)
	at org.apache.lucene.analysis.core.TestRandomChains.testRandomChains(TestRandomChains.java:933)
	at sun.reflect.NativeMethodAccessorImpl.invoke0(Native Method)
	at sun.reflect.NativeMethodAccessorImpl.invoke(NativeMethodAccessorImpl.java:57)
	at sun.reflect.DelegatingMethodAccessorImpl.invoke(DelegatingMethodAccessorImpl.java:43)
	at java.lang.reflect.Method.invoke(Method.java:491)
	at com.carrotsearch.randomizedtesting.RandomizedRunner.invoke(RandomizedRunner.java:1559)
	at com.carrotsearch.randomizedtesting.RandomizedRunner.access$600(RandomizedRunner.java:79)
	at com.carrotsearch.randomizedtesting.RandomizedRunner$6.evaluate(RandomizedRunner.java:737)
	at com.carrotsearch.randomizedtesting.RandomizedRunner$7.evaluate(RandomizedRunner.java:773)
	at com.carrotsearch.randomizedtesting.RandomizedRunner$8.evaluate(RandomizedRunner.java:787)
	at org.apache.lucene.util.TestRuleSetupTeardownChained$1.evaluate(TestRuleSetupTeardownChained.java:50)
	at org.apache.lucene.util.TestRuleFieldCacheSanity$1.evaluate(TestRuleFieldCacheSanity.java:51)
	at org.apache.lucene.util.AbstractBeforeAfterRule$1.evaluate(AbstractBeforeAfterRule.java:46)
	at com.carrotsearch.randomizedtesting.rules.SystemPropertiesInvariantRule$1.evaluate(SystemPropertiesInvariantRule.java:55)
	at org.apache.lucene.util.TestRuleThreadAndTestName$1.evaluate(TestRuleThreadAndTestName.java:49)
	at org.apache.lucene.util.TestRuleIgnoreAfterMaxFailures$1.evaluate(TestRuleIgnoreAfterMaxFailures.java:70)
	at org.apache.lucene.util.TestRuleMarkFailure$1.evaluate(TestRuleMarkFailure.java:48)
	at com.carrotsearch.randomizedtesting.rules.StatementAdapter.evaluate(StatementAdapter.java:36)
	at com.carrotsearch.randomizedtesting.ThreadLeakControl$StatementRunner.run(ThreadLeakControl.java:358)
	at com.carrotsearch.randomizedtesting.ThreadLeakControl.forkTimeoutingTask(ThreadLeakControl.java:782)
	at com.carrotsearch.randomizedtesting.ThreadLeakControl$3.evaluate(ThreadLeakControl.java:442)
	at com.carrotsearch.randomizedtesting.RandomizedRunner.runSingleTest(RandomizedRunner.java:746)
	at com.carrotsearch.randomizedtesting.RandomizedRunner$3.evaluate(RandomizedRunner.java:648)
	at com.carrotsearch.randomizedtesting.RandomizedRunner$4.evaluate(RandomizedRunner.java:682)
	at com.carrotsearch.randomizedtesting.RandomizedRunner$5.evaluate(RandomizedRunner.java:693)
	at org.apache.lucene.util.AbstractBeforeAfterRule$1.evaluate(AbstractBeforeAfterRule.java:46)
	at org.apache.lucene.util.TestRuleStoreClassName$1.evaluate(TestRuleStoreClassName.java:42)
	at com.carrotsearch.randomizedtesting.rules.SystemPropertiesInvariantRule$1.evaluate(SystemPropertiesInvariantRule.java:55)
	at com.carrotsearch.randomizedtesting.rules.NoShadowingOrOverridesOnMethodsRule$1.evaluate(NoShadowingOrOverridesOnMethodsRule.java:39)
	at com.carrotsearch.randomizedtesting.rules.NoShadowingOrOverridesOnMethodsRule$1.evaluate(NoShadowingOrOverridesOnMethodsRule.java:39)
	at com.carrotsearch.randomizedtesting.rules.StatementAdapter.evaluate(StatementAdapter.java:36)
	at org.apache.lucene.util.TestRuleAssertionsRequired$1.evaluate(TestRuleAssertionsRequired.java:43)
	at org.apache.lucene.util.TestRuleMarkFailure$1.evaluate(TestRuleMarkFailure.java:48)
	at org.apache.lucene.util.TestRuleIgnoreAfterMaxFailures$1.evaluate(TestRuleIgnoreAfterMaxFailures.java:70)
	at org.apache.lucene.util.TestRuleIgnoreTestSuites$1.evaluate(TestRuleIgnoreTestSuites.java:55)
	at com.carrotsearch.randomizedtesting.rules.StatementAdapter.evaluate(StatementAdapter.java:36)
	at com.carrotsearch.randomizedtesting.ThreadLeakControl$StatementRunner.run(ThreadLeakControl.java:358)
	at java.lang.Thread.run(Thread.java:724)




Build Log:
[...truncated 4820 lines...]
[junit4:junit4] Suite: org.apache.lucene.analysis.core.TestRandomChains
[junit4:junit4]   2> TEST FAIL: useCharFilter=true text='domhxmoeqqoc '
[junit4:junit4]   2> Exception from random analyzer: 
[junit4:junit4]   2> charfilters=
[junit4:junit4]   2>   org.apache.lucene.analysis.charfilter.MappingCharFilter(org.apache.lucene.analysis.charfilter.NormalizeCharMap@6c91050a,
java.io.StringReader@66b95c03)
[junit4:junit4]   2>   org.apache.lucene.analysis.charfilter.HTMLStripCharFilter(org.apache.lucene.analysis.charfilter.MappingCharFilter@311a5112)
[junit4:junit4]   2> tokenizer=
[junit4:junit4]   2>   org.apache.lucene.analysis.ngram.NGramTokenizer(LUCENE_44, org.apache.lucene.util.AttributeSource$AttributeFactory$DefaultAttributeFactory@64b4007f,
org.apache.lucene.analysis.core.TestRandomChains$CheckThatYouDidntReadAnythingReaderWrapper@51935e9d,
11, 54)
[junit4:junit4]   2> filters=
[junit4:junit4]   2>   org.apache.lucene.analysis.compound.HyphenationCompoundWordTokenFilter(LUCENE_44,
org.apache.lucene.analysis.ValidatingTokenFilter@3e0, org.apache.lucene.analysis.compound.hyphenation.HyphenationTree@35cea8f0)
[junit4:junit4]   2>   org.apache.lucene.analysis.shingle.ShingleFilter(org.apache.lucene.analysis.ValidatingTokenFilter@383f2a,
66, 87)
[junit4:junit4]   2>   org.apache.lucene.analysis.gl.GalicianMinimalStemFilter(org.apache.lucene.analysis.ValidatingTokenFilter@6cfa63b)
[junit4:junit4]   2>   org.apache.lucene.analysis.miscellaneous.RemoveDuplicatesTokenFilter(org.apache.lucene.analysis.ValidatingTokenFilter@6cfa63b)
[junit4:junit4]   2> offsetsAreCorrect=false
[junit4:junit4]   2> NOTE: reproduce with: ant test  -Dtestcase=TestRandomChains -Dtests.method=testRandomChains
-Dtests.seed=D4934909C41A2CCE -Dtests.multiplier=3 -Dtests.slow=true -Dtests.locale=sk -Dtests.timezone=Canada/Saskatchewan
-Dtests.file.encoding=ISO-8859-1
[junit4:junit4] ERROR   0.99s J1 | TestRandomChains.testRandomChains <<<
[junit4:junit4]    > Throwable #1: java.lang.IllegalArgumentException: startOffset must
be non-negative, and endOffset must be >= startOffset, startOffset=7,endOffset=5
[junit4:junit4]    > 	at __randomizedtesting.SeedInfo.seed([D4934909C41A2CCE:E97260688308310E]:0)
[junit4:junit4]    > 	at org.apache.lucene.analysis.tokenattributes.OffsetAttributeImpl.setOffset(OffsetAttributeImpl.java:45)
[junit4:junit4]    > 	at org.apache.lucene.analysis.shingle.ShingleFilter.incrementToken(ShingleFilter.java:323)
[junit4:junit4]    > 	at org.apache.lucene.analysis.ValidatingTokenFilter.incrementToken(ValidatingTokenFilter.java:78)
[junit4:junit4]    > 	at org.apache.lucene.analysis.gl.GalicianMinimalStemFilter.incrementToken(GalicianMinimalStemFilter.java:48)
[junit4:junit4]    > 	at org.apache.lucene.analysis.ValidatingTokenFilter.incrementToken(ValidatingTokenFilter.java:78)
[junit4:junit4]    > 	at org.apache.lucene.analysis.miscellaneous.RemoveDuplicatesTokenFilter.incrementToken(RemoveDuplicatesTokenFilter.java:54)
[junit4:junit4]    > 	at org.apache.lucene.analysis.ValidatingTokenFilter.incrementToken(ValidatingTokenFilter.java:78)
[junit4:junit4]    > 	at org.apache.lucene.analysis.BaseTokenStreamTestCase.checkAnalysisConsistency(BaseTokenStreamTestCase.java:635)
[junit4:junit4]    > 	at org.apache.lucene.analysis.BaseTokenStreamTestCase.checkRandomData(BaseTokenStreamTestCase.java:546)
[junit4:junit4]    > 	at org.apache.lucene.analysis.BaseTokenStreamTestCase.checkRandomData(BaseTokenStreamTestCase.java:447)
[junit4:junit4]    > 	at org.apache.lucene.analysis.core.TestRandomChains.testRandomChains(TestRandomChains.java:933)
[junit4:junit4]    > 	at java.lang.Thread.run(Thread.java:724)
[junit4:junit4]   2> NOTE: test params are: codec=Asserting, sim=RandomSimilarityProvider(queryNorm=true,coord=crazy):
{}, locale=sk, timezone=Canada/Saskatchewan
[junit4:junit4]   2> NOTE: Linux 3.2.0-41-generic amd64/Oracle Corporation 1.8.0-ea (64-bit)/cpus=8,threads=1,free=111426160,total=256573440
[junit4:junit4]   2> NOTE: All tests run in this JVM: [TestCollationKeyAnalyzer, TestWordnetSynonymParser,
TestPrefixAndSuffixAwareTokenFilter, NumericPayloadTokenFilterTest, TokenOffsetPayloadTokenFilterTest,
TestCatalanAnalyzer, TestDutchStemmer, TestEnglishMinimalStemFilterFactory, TestDanishAnalyzer,
TestCJKTokenizer, TestGermanLightStemFilter, TestHungarianLightStemFilter, TestDictionaryCompoundWordTokenFilterFactory,
TestEnglishMinimalStemFilter, TestHTMLStripCharFilterFactory, TestStopAnalyzer, TestChineseFilterFactory,
TestEmptyTokenStream, TestCapitalizationFilterFactory, TestPortugueseLightStemFilterFactory,
TestSingleTokenTokenFilter, TestAnalysisSPILoader, TestArabicAnalyzer, TestPatternTokenizerFactory,
TestPatternCaptureGroupTokenFilter, TestFrenchAnalyzer, TestHungarianLightStemFilterFactory,
TestBrazilianStemFilterFactory, TestSnowball, TestArmenianAnalyzer, EdgeNGramTokenizerTest,
TestGermanStemFilter, TestPersianNormalizationFilterFactory, EdgeNGramTokenFilterTest, TestNGramFilters,
TestPortugueseStemFilterFactory, TestTypeTokenFilterFactory, TestSwedishLightStemFilter, TestStandardFactories,
TestNorwegianMinimalStemFilterFactory, QueryAutoStopWordAnalyzerTest, TestTeeSinkTokenFilter,
TestGalicianMinimalStemFilter, TestBasqueAnalyzer, ShingleAnalyzerWrapperTest, TestPortugueseLightStemFilter,
HunspellDictionaryTest, TestUAX29URLEmailAnalyzer, TestPortugueseStemFilter, TestCharArrayMap,
TestAnalyzers, TestCompoundWordTokenFilter, TestRussianLetterTokenizer, TestBulgarianAnalyzer,
TestUAX29URLEmailTokenizer, PositionFilterTest, TestCharArrayIterator, TestChineseTokenizer,
TestRandomChains]
[junit4:junit4] Completed on J1 in 1.52s, 1 test, 1 error <<< FAILURES!

[...truncated 451 lines...]
BUILD FAILED
/mnt/ssd/jenkins/workspace/Lucene-Solr-4.x-Linux/build.xml:386: The following error occurred
while executing this line:
/mnt/ssd/jenkins/workspace/Lucene-Solr-4.x-Linux/build.xml:366: The following error occurred
while executing this line:
/mnt/ssd/jenkins/workspace/Lucene-Solr-4.x-Linux/build.xml:39: The following error occurred
while executing this line:
/mnt/ssd/jenkins/workspace/Lucene-Solr-4.x-Linux/lucene/build.xml:554: The following error
occurred while executing this line:
/mnt/ssd/jenkins/workspace/Lucene-Solr-4.x-Linux/lucene/common-build.xml:1827: The following
error occurred while executing this line:
/mnt/ssd/jenkins/workspace/Lucene-Solr-4.x-Linux/lucene/analysis/build.xml:105: The following
error occurred while executing this line:
/mnt/ssd/jenkins/workspace/Lucene-Solr-4.x-Linux/lucene/analysis/build.xml:38: The following
error occurred while executing this line:
/mnt/ssd/jenkins/workspace/Lucene-Solr-4.x-Linux/lucene/module-build.xml:61: The following
error occurred while executing this line:
/mnt/ssd/jenkins/workspace/Lucene-Solr-4.x-Linux/lucene/common-build.xml:1243: The following
error occurred while executing this line:
/mnt/ssd/jenkins/workspace/Lucene-Solr-4.x-Linux/lucene/common-build.xml:887: There were test
failures: 230 suites, 1299 tests, 1 error, 1 ignored

Total time: 10 minutes 31 seconds
Build step 'Invoke Ant' marked build as failure
Description set: Java: 64bit/jdk1.8.0-ea-b89 -XX:+UseCompressedOops -XX:+UseParallelGC
Archiving artifacts
Recording test results
Email was triggered for: Failure
Sending email for trigger: Failure



Mime
View raw message