lucene-dev mailing list archives

Site index · List index
Message view « Date » · « Thread »
Top « Date » · « Thread »
From Chris Hostetter <hossman_luc...@fucit.org>
Subject RE: [JENKINS] Lucene-Solr-Tests-4.x-Java6 - Build # 1520 - Still Failing
Date Tue, 16 Apr 2013 22:50:46 GMT

: This is not the only problem: ChaosMonkeySafeLeader tests hangs endless 
: and the JVM gets unresponsive. In both Windows and Linux.

I'm seeing hte same problem locally on trunk -- ChaosMonkeySafeLeader 
hangs, and TestDistributedGrouping gets NPE.

Ryan: are you still online?

: The 2 Ryan commits have caused this (4.x, same in trunk): 

Pretty sure it's just SOLR-4358 ... not much chance SOLR-4671 has anything 
to do with these problems.

: Revision 1468572 by ryan: 
: Merged revision(s) 1468571 from lucene/dev/trunk:
: SOLR-4358: HttpSolrServer sends the stream name and exposes useMultiPartPost
: 
: Revision 1468550 by ryan: 
: Merged revision(s) 1468549 from lucene/dev/trunk:
: SOLR-4671: CSV writer now supports pseudo fields
: 
: -----
: Uwe Schindler
: H.-H.-Meier-Allee 63, D-28213 Bremen
: http://www.thetaphi.de
: eMail: uwe@thetaphi.de
: 
: 
: > -----Original Message-----
: > From: Apache Jenkins Server [mailto:jenkins@builds.apache.org]
: > Sent: Wednesday, April 17, 2013 12:21 AM
: > To: dev@lucene.apache.org
: > Subject: [JENKINS] Lucene-Solr-Tests-4.x-Java6 - Build # 1520 - Still Failing
: > 
: > Build: https://builds.apache.org/job/Lucene-Solr-Tests-4.x-Java6/1520/
: > 
: > 40 tests failed.
: > REGRESSION:  org.apache.solr.TestDistributedGrouping.testDistribSearch
: > 
: > Error Message:
: > 
: > 
: > Stack Trace:
: > java.lang.NullPointerException
: > 	at
: > __randomizedtesting.SeedInfo.seed([687EE273825E73E2:E9986C6BF50113DE
: > ]:0)
: > 	at
: > org.apache.solr.client.solrj.impl.HttpSolrServer.request(HttpSolrServer.java:
: > 269)
: > 	at
: > org.apache.solr.client.solrj.impl.HttpSolrServer.request(HttpSolrServer.java:
: > 182)
: > 	at
: > org.apache.solr.client.solrj.request.AbstractUpdateRequest.process(Abstrac
: > tUpdateRequest.java:117)
: > 	at org.apache.solr.client.solrj.SolrServer.commit(SolrServer.java:168)
: > 	at org.apache.solr.client.solrj.SolrServer.commit(SolrServer.java:146)
: > 	at
: > org.apache.solr.BaseDistributedSearchTestCase.commit(BaseDistributedSear
: > chTestCase.java:472)
: > 	at
: > org.apache.solr.TestDistributedGrouping.doTest(TestDistributedGrouping.ja
: > va:49)
: > 	at
: > org.apache.solr.BaseDistributedSearchTestCase.testDistribSearch(BaseDistri
: > butedSearchTestCase.java:812)
: > 	at sun.reflect.NativeMethodAccessorImpl.invoke0(Native Method)
: > 	at
: > sun.reflect.NativeMethodAccessorImpl.invoke(NativeMethodAccessorImpl.j
: > ava:57)
: > 	at
: > sun.reflect.DelegatingMethodAccessorImpl.invoke(DelegatingMethodAcces
: > sorImpl.java:43)
: > 	at java.lang.reflect.Method.invoke(Method.java:616)
: > 	at
: > com.carrotsearch.randomizedtesting.RandomizedRunner.invoke(Randomize
: > dRunner.java:1559)
: > 	at
: > com.carrotsearch.randomizedtesting.RandomizedRunner.access$600(Rando
: > mizedRunner.java:79)
: > 	at
: > com.carrotsearch.randomizedtesting.RandomizedRunner$6.evaluate(Rando
: > mizedRunner.java:737)
: > 	at
: > com.carrotsearch.randomizedtesting.RandomizedRunner$7.evaluate(Rando
: > mizedRunner.java:773)
: > 	at
: > com.carrotsearch.randomizedtesting.RandomizedRunner$8.evaluate(Rando
: > mizedRunner.java:787)
: > 	at
: > com.carrotsearch.randomizedtesting.rules.SystemPropertiesRestoreRule$1.
: > evaluate(SystemPropertiesRestoreRule.java:53)
: > 	at
: > org.apache.lucene.util.TestRuleSetupTeardownChained$1.evaluate(TestRule
: > SetupTeardownChained.java:50)
: > 	at
: > org.apache.lucene.util.TestRuleFieldCacheSanity$1.evaluate(TestRuleFieldCa
: > cheSanity.java:51)
: > 	at
: > org.apache.lucene.util.AbstractBeforeAfterRule$1.evaluate(AbstractBeforeA
: > fterRule.java:46)
: > 	at
: > com.carrotsearch.randomizedtesting.rules.SystemPropertiesInvariantRule$1
: > .evaluate(SystemPropertiesInvariantRule.java:55)
: > 	at
: > org.apache.lucene.util.TestRuleThreadAndTestName$1.evaluate(TestRuleTh
: > readAndTestName.java:49)
: > 	at
: > org.apache.lucene.util.TestRuleIgnoreAfterMaxFailures$1.evaluate(TestRule
: > IgnoreAfterMaxFailures.java:70)
: > 	at
: > org.apache.lucene.util.TestRuleMarkFailure$1.evaluate(TestRuleMarkFailure
: > .java:48)
: > 	at
: > com.carrotsearch.randomizedtesting.rules.StatementAdapter.evaluate(Stat
: > ementAdapter.java:36)
: > 	at
: > com.carrotsearch.randomizedtesting.ThreadLeakControl$StatementRunner.
: > run(ThreadLeakControl.java:358)
: > 	at
: > com.carrotsearch.randomizedtesting.ThreadLeakControl.forkTimeoutingTask
: > (ThreadLeakControl.java:782)
: > 	at
: > com.carrotsearch.randomizedtesting.ThreadLeakControl$3.evaluate(ThreadL
: > eakControl.java:442)
: > 	at
: > com.carrotsearch.randomizedtesting.RandomizedRunner.runSingleTest(Ran
: > domizedRunner.java:746)
: > 	at
: > com.carrotsearch.randomizedtesting.RandomizedRunner$3.evaluate(Rando
: > mizedRunner.java:648)
: > 	at
: > com.carrotsearch.randomizedtesting.RandomizedRunner$4.evaluate(Rando
: > mizedRunner.java:682)
: > 	at
: > com.carrotsearch.randomizedtesting.RandomizedRunner$5.evaluate(Rando
: > mizedRunner.java:693)
: > 	at
: > com.carrotsearch.randomizedtesting.rules.StatementAdapter.evaluate(Stat
: > ementAdapter.java:36)
: > 	at
: > com.carrotsearch.randomizedtesting.rules.SystemPropertiesRestoreRule$1.
: > evaluate(SystemPropertiesRestoreRule.java:53)
: > 	at
: > org.apache.lucene.util.AbstractBeforeAfterRule$1.evaluate(AbstractBeforeA
: > fterRule.java:46)
: > 	at
: > org.apache.lucene.util.TestRuleStoreClassName$1.evaluate(TestRuleStoreCl
: > assName.java:42)
: > 	at
: > com.carrotsearch.randomizedtesting.rules.SystemPropertiesInvariantRule$1
: > .evaluate(SystemPropertiesInvariantRule.java:55)
: > 	at
: > com.carrotsearch.randomizedtesting.rules.NoShadowingOrOverridesOnMet
: > hodsRule$1.evaluate(NoShadowingOrOverridesOnMethodsRule.java:39)
: > 	at
: > com.carrotsearch.randomizedtesting.rules.NoShadowingOrOverridesOnMet
: > hodsRule$1.evaluate(NoShadowingOrOverridesOnMethodsRule.java:39)
: > 	at
: > com.carrotsearch.randomizedtesting.rules.StatementAdapter.evaluate(Stat
: > ementAdapter.java:36)
: > 	at
: > org.apache.lucene.util.TestRuleAssertionsRequired$1.evaluate(TestRuleAss
: > ertionsRequired.java:43)
: > 	at
: > org.apache.lucene.util.TestRuleMarkFailure$1.evaluate(TestRuleMarkFailure
: > .java:48)
: > 	at
: > org.apache.lucene.util.TestRuleIgnoreAfterMaxFailures$1.evaluate(TestRule
: > IgnoreAfterMaxFailures.java:70)
: > 	at
: > org.apache.lucene.util.TestRuleIgnoreTestSuites$1.evaluate(TestRuleIgnore
: > TestSuites.java:55)
: > 	at
: > com.carrotsearch.randomizedtesting.rules.StatementAdapter.evaluate(Stat
: > ementAdapter.java:36)
: > 	at
: > com.carrotsearch.randomizedtesting.ThreadLeakControl$StatementRunner.
: > run(ThreadLeakControl.java:358)
: > 	at java.lang.Thread.run(Thread.java:679)
: > 
: > 
: > REGRESSION:  org.apache.solr.TestDistributedSearch.testDistribSearch
: > 
: > Error Message:
: > 
: > 
: > Stack Trace:
: > java.lang.NullPointerException
: > 	at
: > __randomizedtesting.SeedInfo.seed([687EE273825E73E2:E9986C6BF50113DE
: > ]:0)
: > 	at
: > org.apache.solr.client.solrj.impl.HttpSolrServer.request(HttpSolrServer.java:
: > 269)
: > 	at
: > org.apache.solr.client.solrj.impl.HttpSolrServer.request(HttpSolrServer.java:
: > 182)
: > 	at
: > org.apache.solr.client.solrj.request.AbstractUpdateRequest.process(Abstrac
: > tUpdateRequest.java:117)
: > 	at org.apache.solr.client.solrj.SolrServer.commit(SolrServer.java:168)
: > 	at org.apache.solr.client.solrj.SolrServer.commit(SolrServer.java:146)
: > 	at
: > org.apache.solr.BaseDistributedSearchTestCase.commit(BaseDistributedSear
: > chTestCase.java:472)
: > 	at
: > org.apache.solr.TestDistributedSearch.doTest(TestDistributedSearch.java:97
: > )
: > 	at
: > org.apache.solr.BaseDistributedSearchTestCase.testDistribSearch(BaseDistri
: > butedSearchTestCase.java:812)
: > 	at sun.reflect.NativeMethodAccessorImpl.invoke0(Native Method)
: > 	at
: > sun.reflect.NativeMethodAccessorImpl.invoke(NativeMethodAccessorImpl.j
: > ava:57)
: > 	at
: > sun.reflect.DelegatingMethodAccessorImpl.invoke(DelegatingMethodAcces
: > sorImpl.java:43)
: > 	at java.lang.reflect.Method.invoke(Method.java:616)
: > 	at
: > com.carrotsearch.randomizedtesting.RandomizedRunner.invoke(Randomize
: > dRunner.java:1559)
: > 	at
: > com.carrotsearch.randomizedtesting.RandomizedRunner.access$600(Rando
: > mizedRunner.java:79)
: > 	at
: > com.carrotsearch.randomizedtesting.RandomizedRunner$6.evaluate(Rando
: > mizedRunner.java:737)
: > 	at
: > com.carrotsearch.randomizedtesting.RandomizedRunner$7.evaluate(Rando
: > mizedRunner.java:773)
: > 	at
: > com.carrotsearch.randomizedtesting.RandomizedRunner$8.evaluate(Rando
: > mizedRunner.java:787)
: > 	at
: > com.carrotsearch.randomizedtesting.rules.SystemPropertiesRestoreRule$1.
: > evaluate(SystemPropertiesRestoreRule.java:53)
: > 	at
: > org.apache.lucene.util.TestRuleSetupTeardownChained$1.evaluate(TestRule
: > SetupTeardownChained.java:50)
: > 	at
: > org.apache.lucene.util.TestRuleFieldCacheSanity$1.evaluate(TestRuleFieldCa
: > cheSanity.java:51)
: > 	at
: > org.apache.lucene.util.AbstractBeforeAfterRule$1.evaluate(AbstractBeforeA
: > fterRule.java:46)
: > 	at
: > com.carrotsearch.randomizedtesting.rules.SystemPropertiesInvariantRule$1
: > .evaluate(SystemPropertiesInvariantRule.java:55)
: > 	at
: > org.apache.lucene.util.TestRuleThreadAndTestName$1.evaluate(TestRuleTh
: > readAndTestName.java:49)
: > 	at
: > org.apache.lucene.util.TestRuleIgnoreAfterMaxFailures$1.evaluate(TestRule
: > IgnoreAfterMaxFailures.java:70)
: > 	at
: > org.apache.lucene.util.TestRuleMarkFailure$1.evaluate(TestRuleMarkFailure
: > .java:48)
: > 	at
: > com.carrotsearch.randomizedtesting.rules.StatementAdapter.evaluate(Stat
: > ementAdapter.java:36)
: > 	at
: > com.carrotsearch.randomizedtesting.ThreadLeakControl$StatementRunner.
: > run(ThreadLeakControl.java:358)
: > 	at
: > com.carrotsearch.randomizedtesting.ThreadLeakControl.forkTimeoutingTask
: > (ThreadLeakControl.java:782)
: > 	at
: > com.carrotsearch.randomizedtesting.ThreadLeakControl$3.evaluate(ThreadL
: > eakControl.java:442)
: > 	at
: > com.carrotsearch.randomizedtesting.RandomizedRunner.runSingleTest(Ran
: > domizedRunner.java:746)
: > 	at
: > com.carrotsearch.randomizedtesting.RandomizedRunner$3.evaluate(Rando
: > mizedRunner.java:648)
: > 	at
: > com.carrotsearch.randomizedtesting.RandomizedRunner$4.evaluate(Rando
: > mizedRunner.java:682)
: > 	at
: > com.carrotsearch.randomizedtesting.RandomizedRunner$5.evaluate(Rando
: > mizedRunner.java:693)
: > 	at
: > com.carrotsearch.randomizedtesting.rules.StatementAdapter.evaluate(Stat
: > ementAdapter.java:36)
: > 	at
: > com.carrotsearch.randomizedtesting.rules.SystemPropertiesRestoreRule$1.
: > evaluate(SystemPropertiesRestoreRule.java:53)
: > 	at
: > org.apache.lucene.util.AbstractBeforeAfterRule$1.evaluate(AbstractBeforeA
: > fterRule.java:46)
: > 	at
: > org.apache.lucene.util.TestRuleStoreClassName$1.evaluate(TestRuleStoreCl
: > assName.java:42)
: > 	at
: > com.carrotsearch.randomizedtesting.rules.SystemPropertiesInvariantRule$1
: > .evaluate(SystemPropertiesInvariantRule.java:55)
: > 	at
: > com.carrotsearch.randomizedtesting.rules.NoShadowingOrOverridesOnMet
: > hodsRule$1.evaluate(NoShadowingOrOverridesOnMethodsRule.java:39)
: > 	at
: > com.carrotsearch.randomizedtesting.rules.NoShadowingOrOverridesOnMet
: > hodsRule$1.evaluate(NoShadowingOrOverridesOnMethodsRule.java:39)
: > 	at
: > com.carrotsearch.randomizedtesting.rules.StatementAdapter.evaluate(Stat
: > ementAdapter.java:36)
: > 	at
: > org.apache.lucene.util.TestRuleAssertionsRequired$1.evaluate(TestRuleAss
: > ertionsRequired.java:43)
: > 	at
: > org.apache.lucene.util.TestRuleMarkFailure$1.evaluate(TestRuleMarkFailure
: > .java:48)
: > 	at
: > org.apache.lucene.util.TestRuleIgnoreAfterMaxFailures$1.evaluate(TestRule
: > IgnoreAfterMaxFailures.java:70)
: > 	at
: > org.apache.lucene.util.TestRuleIgnoreTestSuites$1.evaluate(TestRuleIgnore
: > TestSuites.java:55)
: > 	at
: > com.carrotsearch.randomizedtesting.rules.StatementAdapter.evaluate(Stat
: > ementAdapter.java:36)
: > 	at
: > com.carrotsearch.randomizedtesting.ThreadLeakControl$StatementRunner.
: > run(ThreadLeakControl.java:358)
: > 	at java.lang.Thread.run(Thread.java:679)
: > 
: > 
: > REGRESSION:  org.apache.solr.cloud.AliasIntegrationTest.testDistribSearch
: > 
: > Error Message:
: > There are still nodes recoverying - waited for 15 seconds
: > 
: > Stack Trace:
: > java.lang.AssertionError: There are still nodes recoverying - waited for 15
: > seconds
: > 	at
: > __randomizedtesting.SeedInfo.seed([687EE273825E73E2:E9986C6BF50113DE
: > ]:0)
: > 	at org.junit.Assert.fail(Assert.java:93)
: > 	at
: > org.apache.solr.cloud.AbstractDistribZkTestBase.waitForRecoveriesToFinish(
: > AbstractDistribZkTestBase.java:173)
: > 	at
: > org.apache.solr.cloud.AbstractFullDistribZkTestBase.waitForRecoveriesToFini
: > sh(AbstractFullDistribZkTestBase.java:627)
: > 	at
: > org.apache.solr.cloud.AbstractFullDistribZkTestBase.waitForThingsToLevelOu
: > t(AbstractFullDistribZkTestBase.java:1298)
: > 	at
: > org.apache.solr.cloud.AliasIntegrationTest.doTest(AliasIntegrationTest.java:8
: > 6)
: > 	at
: > org.apache.solr.BaseDistributedSearchTestCase.testDistribSearch(BaseDistri
: > butedSearchTestCase.java:806)
: > 	at sun.reflect.NativeMethodAccessorImpl.invoke0(Native Method)
: > 	at
: > sun.reflect.NativeMethodAccessorImpl.invoke(NativeMethodAccessorImpl.j
: > ava:57)
: > 	at
: > sun.reflect.DelegatingMethodAccessorImpl.invoke(DelegatingMethodAcces
: > sorImpl.java:43)
: > 	at java.lang.reflect.Method.invoke(Method.java:616)
: > 	at
: > com.carrotsearch.randomizedtesting.RandomizedRunner.invoke(Randomize
: > dRunner.java:1559)
: > 	at
: > com.carrotsearch.randomizedtesting.RandomizedRunner.access$600(Rando
: > mizedRunner.java:79)
: > 	at
: > com.carrotsearch.randomizedtesting.RandomizedRunner$6.evaluate(Rando
: > mizedRunner.java:737)
: > 	at
: > com.carrotsearch.randomizedtesting.RandomizedRunner$7.evaluate(Rando
: > mizedRunner.java:773)
: > 	at
: > com.carrotsearch.randomizedtesting.RandomizedRunner$8.evaluate(Rando
: > mizedRunner.java:787)
: > 	at
: > com.carrotsearch.randomizedtesting.rules.SystemPropertiesRestoreRule$1.
: > evaluate(SystemPropertiesRestoreRule.java:53)
: > 	at
: > org.apache.lucene.util.TestRuleSetupTeardownChained$1.evaluate(TestRule
: > SetupTeardownChained.java:50)
: > 	at
: > org.apache.lucene.util.TestRuleFieldCacheSanity$1.evaluate(TestRuleFieldCa
: > cheSanity.java:51)
: > 	at
: > org.apache.lucene.util.AbstractBeforeAfterRule$1.evaluate(AbstractBeforeA
: > fterRule.java:46)
: > 	at
: > com.carrotsearch.randomizedtesting.rules.SystemPropertiesInvariantRule$1
: > .evaluate(SystemPropertiesInvariantRule.java:55)
: > 	at
: > org.apache.lucene.util.TestRuleThreadAndTestName$1.evaluate(TestRuleTh
: > readAndTestName.java:49)
: > 	at
: > org.apache.lucene.util.TestRuleIgnoreAfterMaxFailures$1.evaluate(TestRule
: > IgnoreAfterMaxFailures.java:70)
: > 	at
: > org.apache.lucene.util.TestRuleMarkFailure$1.evaluate(TestRuleMarkFailure
: > .java:48)
: > 	at
: > com.carrotsearch.randomizedtesting.rules.StatementAdapter.evaluate(Stat
: > ementAdapter.java:36)
: > 	at
: > com.carrotsearch.randomizedtesting.ThreadLeakControl$StatementRunner.
: > run(ThreadLeakControl.java:358)
: > 	at
: > com.carrotsearch.randomizedtesting.ThreadLeakControl.forkTimeoutingTask
: > (ThreadLeakControl.java:782)
: > 	at
: > com.carrotsearch.randomizedtesting.ThreadLeakControl$3.evaluate(ThreadL
: > eakControl.java:442)
: > 	at
: > com.carrotsearch.randomizedtesting.RandomizedRunner.runSingleTest(Ran
: > domizedRunner.java:746)
: > 	at
: > com.carrotsearch.randomizedtesting.RandomizedRunner$3.evaluate(Rando
: > mizedRunner.java:648)
: > 	at
: > com.carrotsearch.randomizedtesting.RandomizedRunner$4.evaluate(Rando
: > mizedRunner.java:682)
: > 	at
: > com.carrotsearch.randomizedtesting.RandomizedRunner$5.evaluate(Rando
: > mizedRunner.java:693)
: > 	at
: > com.carrotsearch.randomizedtesting.rules.StatementAdapter.evaluate(Stat
: > ementAdapter.java:36)
: > 	at
: > com.carrotsearch.randomizedtesting.rules.SystemPropertiesRestoreRule$1.
: > evaluate(SystemPropertiesRestoreRule.java:53)
: > 	at
: > org.apache.lucene.util.AbstractBeforeAfterRule$1.evaluate(AbstractBeforeA
: > fterRule.java:46)
: > 	at
: > org.apache.lucene.util.TestRuleStoreClassName$1.evaluate(TestRuleStoreCl
: > assName.java:42)
: > 	at
: > com.carrotsearch.randomizedtesting.rules.SystemPropertiesInvariantRule$1
: > .evaluate(SystemPropertiesInvariantRule.java:55)
: > 	at
: > com.carrotsearch.randomizedtesting.rules.NoShadowingOrOverridesOnMet
: > hodsRule$1.evaluate(NoShadowingOrOverridesOnMethodsRule.java:39)
: > 	at
: > com.carrotsearch.randomizedtesting.rules.NoShadowingOrOverridesOnMet
: > hodsRule$1.evaluate(NoShadowingOrOverridesOnMethodsRule.java:39)
: > 	at
: > com.carrotsearch.randomizedtesting.rules.StatementAdapter.evaluate(Stat
: > ementAdapter.java:36)
: > 	at
: > org.apache.lucene.util.TestRuleAssertionsRequired$1.evaluate(TestRuleAss
: > ertionsRequired.java:43)
: > 	at
: > org.apache.lucene.util.TestRuleMarkFailure$1.evaluate(TestRuleMarkFailure
: > .java:48)
: > 	at
: > org.apache.lucene.util.TestRuleIgnoreAfterMaxFailures$1.evaluate(TestRule
: > IgnoreAfterMaxFailures.java:70)
: > 	at
: > org.apache.lucene.util.TestRuleIgnoreTestSuites$1.evaluate(TestRuleIgnore
: > TestSuites.java:55)
: > 	at
: > com.carrotsearch.randomizedtesting.rules.StatementAdapter.evaluate(Stat
: > ementAdapter.java:36)
: > 	at
: > com.carrotsearch.randomizedtesting.ThreadLeakControl$StatementRunner.
: > run(ThreadLeakControl.java:358)
: > 	at java.lang.Thread.run(Thread.java:679)
: > 
: > 
: > REGRESSION:
: > org.apache.solr.cloud.BasicDistributedZk2Test.testDistribSearch
: > 
: > Error Message:
: > 
: > 
: > Stack Trace:
: > java.lang.NullPointerException
: > 	at
: > __randomizedtesting.SeedInfo.seed([687EE273825E73E2:E9986C6BF50113DE
: > ]:0)
: > 	at
: > org.apache.solr.client.solrj.impl.HttpSolrServer.request(HttpSolrServer.java:
: > 269)
: > 	at
: > org.apache.solr.client.solrj.impl.HttpSolrServer.request(HttpSolrServer.java:
: > 182)
: > 	at
: > org.apache.solr.client.solrj.request.AbstractUpdateRequest.process(Abstrac
: > tUpdateRequest.java:117)
: > 	at org.apache.solr.client.solrj.SolrServer.commit(SolrServer.java:168)
: > 	at org.apache.solr.client.solrj.SolrServer.commit(SolrServer.java:146)
: > 	at
: > org.apache.solr.cloud.BasicDistributedZk2Test.testNodeWithoutCollectionFo
: > rwarding(BasicDistributedZk2Test.java:198)
: > 	at
: > org.apache.solr.cloud.BasicDistributedZk2Test.doTest(BasicDistributedZk2Te
: > st.java:89)
: > 	at
: > org.apache.solr.BaseDistributedSearchTestCase.testDistribSearch(BaseDistri
: > butedSearchTestCase.java:806)
: > 	at sun.reflect.NativeMethodAccessorImpl.invoke0(Native Method)
: > 	at
: > sun.reflect.NativeMethodAccessorImpl.invoke(NativeMethodAccessorImpl.j
: > ava:57)
: > 	at
: > sun.reflect.DelegatingMethodAccessorImpl.invoke(DelegatingMethodAcces
: > sorImpl.java:43)
: > 	at java.lang.reflect.Method.invoke(Method.java:616)
: > 	at
: > com.carrotsearch.randomizedtesting.RandomizedRunner.invoke(Randomize
: > dRunner.java:1559)
: > 	at
: > com.carrotsearch.randomizedtesting.RandomizedRunner.access$600(Rando
: > mizedRunner.java:79)
: > 	at
: > com.carrotsearch.randomizedtesting.RandomizedRunner$6.evaluate(Rando
: > mizedRunner.java:737)
: > 	at
: > com.carrotsearch.randomizedtesting.RandomizedRunner$7.evaluate(Rando
: > mizedRunner.java:773)
: > 	at
: > com.carrotsearch.randomizedtesting.RandomizedRunner$8.evaluate(Rando
: > mizedRunner.java:787)
: > 	at
: > com.carrotsearch.randomizedtesting.rules.SystemPropertiesRestoreRule$1.
: > evaluate(SystemPropertiesRestoreRule.java:53)
: > 	at
: > org.apache.lucene.util.TestRuleSetupTeardownChained$1.evaluate(TestRule
: > SetupTeardownChained.java:50)
: > 	at
: > org.apache.lucene.util.TestRuleFieldCacheSanity$1.evaluate(TestRuleFieldCa
: > cheSanity.java:51)
: > 	at
: > org.apache.lucene.util.AbstractBeforeAfterRule$1.evaluate(AbstractBeforeA
: > fterRule.java:46)
: > 	at
: > com.carrotsearch.randomizedtesting.rules.SystemPropertiesInvariantRule$1
: > .evaluate(SystemPropertiesInvariantRule.java:55)
: > 	at
: > org.apache.lucene.util.TestRuleThreadAndTestName$1.evaluate(TestRuleTh
: > readAndTestName.java:49)
: > 	at
: > org.apache.lucene.util.TestRuleIgnoreAfterMaxFailures$1.evaluate(TestRule
: > IgnoreAfterMaxFailures.java:70)
: > 	at
: > org.apache.lucene.util.TestRuleMarkFailure$1.evaluate(TestRuleMarkFailure
: > .java:48)
: > 	at
: > com.carrotsearch.randomizedtesting.rules.StatementAdapter.evaluate(Stat
: > ementAdapter.java:36)
: > 	at
: > com.carrotsearch.randomizedtesting.ThreadLeakControl$StatementRunner.
: > run(ThreadLeakControl.java:358)
: > 	at
: > com.carrotsearch.randomizedtesting.ThreadLeakControl.forkTimeoutingTask
: > (ThreadLeakControl.java:782)
: > 	at
: > com.carrotsearch.randomizedtesting.ThreadLeakControl$3.evaluate(ThreadL
: > eakControl.java:442)
: > 	at
: > com.carrotsearch.randomizedtesting.RandomizedRunner.runSingleTest(Ran
: > domizedRunner.java:746)
: > 	at
: > com.carrotsearch.randomizedtesting.RandomizedRunner$3.evaluate(Rando
: > mizedRunner.java:648)
: > 	at
: > com.carrotsearch.randomizedtesting.RandomizedRunner$4.evaluate(Rando
: > mizedRunner.java:682)
: > 	at
: > com.carrotsearch.randomizedtesting.RandomizedRunner$5.evaluate(Rando
: > mizedRunner.java:693)
: > 	at
: > com.carrotsearch.randomizedtesting.rules.StatementAdapter.evaluate(Stat
: > ementAdapter.java:36)
: > 	at
: > com.carrotsearch.randomizedtesting.rules.SystemPropertiesRestoreRule$1.
: > evaluate(SystemPropertiesRestoreRule.java:53)
: > 	at
: > org.apache.lucene.util.AbstractBeforeAfterRule$1.evaluate(AbstractBeforeA
: > fterRule.java:46)
: > 	at
: > org.apache.lucene.util.TestRuleStoreClassName$1.evaluate(TestRuleStoreCl
: > assName.java:42)
: > 	at
: > com.carrotsearch.randomizedtesting.rules.SystemPropertiesInvariantRule$1
: > .evaluate(SystemPropertiesInvariantRule.java:55)
: > 	at
: > com.carrotsearch.randomizedtesting.rules.NoShadowingOrOverridesOnMet
: > hodsRule$1.evaluate(NoShadowingOrOverridesOnMethodsRule.java:39)
: > 	at
: > com.carrotsearch.randomizedtesting.rules.NoShadowingOrOverridesOnMet
: > hodsRule$1.evaluate(NoShadowingOrOverridesOnMethodsRule.java:39)
: > 	at
: > com.carrotsearch.randomizedtesting.rules.StatementAdapter.evaluate(Stat
: > ementAdapter.java:36)
: > 	at
: > org.apache.lucene.util.TestRuleAssertionsRequired$1.evaluate(TestRuleAss
: > ertionsRequired.java:43)
: > 	at
: > org.apache.lucene.util.TestRuleMarkFailure$1.evaluate(TestRuleMarkFailure
: > .java:48)
: > 	at
: > org.apache.lucene.util.TestRuleIgnoreAfterMaxFailures$1.evaluate(TestRule
: > IgnoreAfterMaxFailures.java:70)
: > 	at
: > org.apache.lucene.util.TestRuleIgnoreTestSuites$1.evaluate(TestRuleIgnore
: > TestSuites.java:55)
: > 	at
: > com.carrotsearch.randomizedtesting.rules.StatementAdapter.evaluate(Stat
: > ementAdapter.java:36)
: > 	at
: > com.carrotsearch.randomizedtesting.ThreadLeakControl$StatementRunner.
: > run(ThreadLeakControl.java:358)
: > 	at java.lang.Thread.run(Thread.java:679)
: > 
: > 
: > REGRESSION:  org.apache.solr.cloud.BasicDistributedZkTest.testDistribSearch
: > 
: > Error Message:
: > There are still nodes recoverying - waited for 230 seconds
: > 
: > Stack Trace:
: > java.lang.AssertionError: There are still nodes recoverying - waited for 230
: > seconds
: > 	at
: > __randomizedtesting.SeedInfo.seed([687EE273825E73E2:E9986C6BF50113DE
: > ]:0)
: > 	at org.junit.Assert.fail(Assert.java:93)
: > 	at
: > org.apache.solr.cloud.AbstractDistribZkTestBase.waitForRecoveriesToFinish(
: > AbstractDistribZkTestBase.java:173)
: > 	at
: > org.apache.solr.cloud.AbstractDistribZkTestBase.waitForRecoveriesToFinish(
: > AbstractDistribZkTestBase.java:131)
: > 	at
: > org.apache.solr.cloud.AbstractDistribZkTestBase.waitForRecoveriesToFinish(
: > AbstractDistribZkTestBase.java:126)
: > 	at
: > org.apache.solr.cloud.AbstractFullDistribZkTestBase.waitForRecoveriesToFini
: > sh(AbstractFullDistribZkTestBase.java:615)
: > 	at
: > org.apache.solr.cloud.BasicDistributedZkTest.doTest(BasicDistributedZkTest.j
: > ava:159)
: > 	at
: > org.apache.solr.BaseDistributedSearchTestCase.testDistribSearch(BaseDistri
: > butedSearchTestCase.java:806)
: > 	at sun.reflect.NativeMethodAccessorImpl.invoke0(Native Method)
: > 	at
: > sun.reflect.NativeMethodAccessorImpl.invoke(NativeMethodAccessorImpl.j
: > ava:57)
: > 	at
: > sun.reflect.DelegatingMethodAccessorImpl.invoke(DelegatingMethodAcces
: > sorImpl.java:43)
: > 	at java.lang.reflect.Method.invoke(Method.java:616)
: > 	at
: > com.carrotsearch.randomizedtesting.RandomizedRunner.invoke(Randomize
: > dRunner.java:1559)
: > 	at
: > com.carrotsearch.randomizedtesting.RandomizedRunner.access$600(Rando
: > mizedRunner.java:79)
: > 	at
: > com.carrotsearch.randomizedtesting.RandomizedRunner$6.evaluate(Rando
: > mizedRunner.java:737)
: > 	at
: > com.carrotsearch.randomizedtesting.RandomizedRunner$7.evaluate(Rando
: > mizedRunner.java:773)
: > 	at
: > com.carrotsearch.randomizedtesting.RandomizedRunner$8.evaluate(Rando
: > mizedRunner.java:787)
: > 	at
: > com.carrotsearch.randomizedtesting.rules.SystemPropertiesRestoreRule$1.
: > evaluate(SystemPropertiesRestoreRule.java:53)
: > 	at
: > org.apache.lucene.util.TestRuleSetupTeardownChained$1.evaluate(TestRule
: > SetupTeardownChained.java:50)
: > 	at
: > org.apache.lucene.util.TestRuleFieldCacheSanity$1.evaluate(TestRuleFieldCa
: > cheSanity.java:51)
: > 	at
: > org.apache.lucene.util.AbstractBeforeAfterRule$1.evaluate(AbstractBeforeA
: > fterRule.java:46)
: > 	at
: > com.carrotsearch.randomizedtesting.rules.SystemPropertiesInvariantRule$1
: > .evaluate(SystemPropertiesInvariantRule.java:55)
: > 	at
: > org.apache.lucene.util.TestRuleThreadAndTestName$1.evaluate(TestRuleTh
: > readAndTestName.java:49)
: > 	at
: > org.apache.lucene.util.TestRuleIgnoreAfterMaxFailures$1.evaluate(TestRule
: > IgnoreAfterMaxFailures.java:70)
: > 	at
: > org.apache.lucene.util.TestRuleMarkFailure$1.evaluate(TestRuleMarkFailure
: > .java:48)
: > 	at
: > com.carrotsearch.randomizedtesting.rules.StatementAdapter.evaluate(Stat
: > ementAdapter.java:36)
: > 	at
: > com.carrotsearch.randomizedtesting.ThreadLeakControl$StatementRunner.
: > run(ThreadLeakControl.java:358)
: > 	at
: > com.carrotsearch.randomizedtesting.ThreadLeakControl.forkTimeoutingTask
: > (ThreadLeakControl.java:782)
: > 	at
: > com.carrotsearch.randomizedtesting.ThreadLeakControl$3.evaluate(ThreadL
: > eakControl.java:442)
: > 	at
: > com.carrotsearch.randomizedtesting.RandomizedRunner.runSingleTest(Ran
: > domizedRunner.java:746)
: > 	at
: > com.carrotsearch.randomizedtesting.RandomizedRunner$3.evaluate(Rando
: > mizedRunner.java:648)
: > 	at
: > com.carrotsearch.randomizedtesting.RandomizedRunner$4.evaluate(Rando
: > mizedRunner.java:682)
: > 	at
: > com.carrotsearch.randomizedtesting.RandomizedRunner$5.evaluate(Rando
: > mizedRunner.java:693)
: > 	at
: > com.carrotsearch.randomizedtesting.rules.StatementAdapter.evaluate(Stat
: > ementAdapter.java:36)
: > 	at
: > com.carrotsearch.randomizedtesting.rules.SystemPropertiesRestoreRule$1.
: > evaluate(SystemPropertiesRestoreRule.java:53)
: > 	at
: > org.apache.lucene.util.AbstractBeforeAfterRule$1.evaluate(AbstractBeforeA
: > fterRule.java:46)
: > 	at
: > org.apache.lucene.util.TestRuleStoreClassName$1.evaluate(TestRuleStoreCl
: > assName.java:42)
: > 	at
: > com.carrotsearch.randomizedtesting.rules.SystemPropertiesInvariantRule$1
: > .evaluate(SystemPropertiesInvariantRule.java:55)
: > 	at
: > com.carrotsearch.randomizedtesting.rules.NoShadowingOrOverridesOnMet
: > hodsRule$1.evaluate(NoShadowingOrOverridesOnMethodsRule.java:39)
: > 	at
: > com.carrotsearch.randomizedtesting.rules.NoShadowingOrOverridesOnMet
: > hodsRule$1.evaluate(NoShadowingOrOverridesOnMethodsRule.java:39)
: > 	at
: > com.carrotsearch.randomizedtesting.rules.StatementAdapter.evaluate(Stat
: > ementAdapter.java:36)
: > 	at
: > org.apache.lucene.util.TestRuleAssertionsRequired$1.evaluate(TestRuleAss
: > ertionsRequired.java:43)
: > 	at
: > org.apache.lucene.util.TestRuleMarkFailure$1.evaluate(TestRuleMarkFailure
: > .java:48)
: > 	at
: > org.apache.lucene.util.TestRuleIgnoreAfterMaxFailures$1.evaluate(TestRule
: > IgnoreAfterMaxFailures.java:70)
: > 	at
: > org.apache.lucene.util.TestRuleIgnoreTestSuites$1.evaluate(TestRuleIgnore
: > TestSuites.java:55)
: > 	at
: > com.carrotsearch.randomizedtesting.rules.StatementAdapter.evaluate(Stat
: > ementAdapter.java:36)
: > 	at
: > com.carrotsearch.randomizedtesting.ThreadLeakControl$StatementRunner.
: > run(ThreadLeakControl.java:358)
: > 	at java.lang.Thread.run(Thread.java:679)
: > 
: > 
: > REGRESSION:
: > org.apache.solr.cloud.ChaosMonkeySafeLeaderTest.testDistribSearch
: > 
: > Error Message:
: > Test abandoned because suite timeout was reached.
: > 
: > Stack Trace:
: > java.lang.Exception: Test abandoned because suite timeout was reached.
: > 	at __randomizedtesting.SeedInfo.seed([687EE273825E73E2]:0)
: > 
: > 
: > FAILED:
: > junit.framework.TestSuite.org.apache.solr.cloud.ChaosMonkeySafeLeaderT
: > est
: > 
: > Error Message:
: > Suite timeout exceeded (>= 7200000 msec).
: > 
: > Stack Trace:
: > java.lang.Exception: Suite timeout exceeded (>= 7200000 msec).
: > 	at __randomizedtesting.SeedInfo.seed([687EE273825E73E2]:0)
: > 
: > 
: > REGRESSION:
: > org.apache.solr.cloud.ChaosMonkeyShardSplitTest.testDistribSearch
: > 
: > Error Message:
: > There are still nodes recoverying - waited for 15 seconds
: > 
: > Stack Trace:
: > java.lang.AssertionError: There are still nodes recoverying - waited for 15
: > seconds
: > 	at
: > __randomizedtesting.SeedInfo.seed([687EE273825E73E2:E9986C6BF50113DE
: > ]:0)
: > 	at org.junit.Assert.fail(Assert.java:93)
: > 	at
: > org.apache.solr.cloud.AbstractDistribZkTestBase.waitForRecoveriesToFinish(
: > AbstractDistribZkTestBase.java:173)
: > 	at
: > org.apache.solr.cloud.AbstractFullDistribZkTestBase.waitForRecoveriesToFini
: > sh(AbstractFullDistribZkTestBase.java:627)
: > 	at
: > org.apache.solr.cloud.AbstractFullDistribZkTestBase.waitForThingsToLevelOu
: > t(AbstractFullDistribZkTestBase.java:1298)
: > 	at
: > org.apache.solr.cloud.ChaosMonkeyShardSplitTest.doTest(ChaosMonkeySh
: > ardSplitTest.java:63)
: > 	at
: > org.apache.solr.BaseDistributedSearchTestCase.testDistribSearch(BaseDistri
: > butedSearchTestCase.java:806)
: > 	at sun.reflect.NativeMethodAccessorImpl.invoke0(Native Method)
: > 	at
: > sun.reflect.NativeMethodAccessorImpl.invoke(NativeMethodAccessorImpl.j
: > ava:57)
: > 	at
: > sun.reflect.DelegatingMethodAccessorImpl.invoke(DelegatingMethodAcces
: > sorImpl.java:43)
: > 	at java.lang.reflect.Method.invoke(Method.java:616)
: > 	at
: > com.carrotsearch.randomizedtesting.RandomizedRunner.invoke(Randomize
: > dRunner.java:1559)
: > 	at
: > com.carrotsearch.randomizedtesting.RandomizedRunner.access$600(Rando
: > mizedRunner.java:79)
: > 	at
: > com.carrotsearch.randomizedtesting.RandomizedRunner$6.evaluate(Rando
: > mizedRunner.java:737)
: > 	at
: > com.carrotsearch.randomizedtesting.RandomizedRunner$7.evaluate(Rando
: > mizedRunner.java:773)
: > 	at
: > com.carrotsearch.randomizedtesting.RandomizedRunner$8.evaluate(Rando
: > mizedRunner.java:787)
: > 	at
: > com.carrotsearch.randomizedtesting.rules.SystemPropertiesRestoreRule$1.
: > evaluate(SystemPropertiesRestoreRule.java:53)
: > 	at
: > org.apache.lucene.util.TestRuleSetupTeardownChained$1.evaluate(TestRule
: > SetupTeardownChained.java:50)
: > 	at
: > org.apache.lucene.util.TestRuleFieldCacheSanity$1.evaluate(TestRuleFieldCa
: > cheSanity.java:51)
: > 	at
: > org.apache.lucene.util.AbstractBeforeAfterRule$1.evaluate(AbstractBeforeA
: > fterRule.java:46)
: > 	at
: > com.carrotsearch.randomizedtesting.rules.SystemPropertiesInvariantRule$1
: > .evaluate(SystemPropertiesInvariantRule.java:55)
: > 	at
: > org.apache.lucene.util.TestRuleThreadAndTestName$1.evaluate(TestRuleTh
: > readAndTestName.java:49)
: > 	at
: > org.apache.lucene.util.TestRuleIgnoreAfterMaxFailures$1.evaluate(TestRule
: > IgnoreAfterMaxFailures.java:70)
: > 	at
: > org.apache.lucene.util.TestRuleMarkFailure$1.evaluate(TestRuleMarkFailure
: > .java:48)
: > 	at
: > com.carrotsearch.randomizedtesting.rules.StatementAdapter.evaluate(Stat
: > ementAdapter.java:36)
: > 	at
: > com.carrotsearch.randomizedtesting.ThreadLeakControl$StatementRunner.
: > run(ThreadLeakControl.java:358)
: > 	at
: > com.carrotsearch.randomizedtesting.ThreadLeakControl.forkTimeoutingTask
: > (ThreadLeakControl.java:782)
: > 	at
: > com.carrotsearch.randomizedtesting.ThreadLeakControl$3.evaluate(ThreadL
: > eakControl.java:442)
: > 	at
: > com.carrotsearch.randomizedtesting.RandomizedRunner.runSingleTest(Ran
: > domizedRunner.java:746)
: > 	at
: > com.carrotsearch.randomizedtesting.RandomizedRunner$3.evaluate(Rando
: > mizedRunner.java:648)
: > 	at
: > com.carrotsearch.randomizedtesting.RandomizedRunner$4.evaluate(Rando
: > mizedRunner.java:682)
: > 	at
: > com.carrotsearch.randomizedtesting.RandomizedRunner$5.evaluate(Rando
: > mizedRunner.java:693)
: > 	at
: > com.carrotsearch.randomizedtesting.rules.StatementAdapter.evaluate(Stat
: > ementAdapter.java:36)
: > 	at
: > com.carrotsearch.randomizedtesting.rules.SystemPropertiesRestoreRule$1.
: > evaluate(SystemPropertiesRestoreRule.java:53)
: > 	at
: > org.apache.lucene.util.AbstractBeforeAfterRule$1.evaluate(AbstractBeforeA
: > fterRule.java:46)
: > 	at
: > org.apache.lucene.util.TestRuleStoreClassName$1.evaluate(TestRuleStoreCl
: > assName.java:42)
: > 	at
: > com.carrotsearch.randomizedtesting.rules.SystemPropertiesInvariantRule$1
: > .evaluate(SystemPropertiesInvariantRule.java:55)
: > 	at
: > com.carrotsearch.randomizedtesting.rules.NoShadowingOrOverridesOnMet
: > hodsRule$1.evaluate(NoShadowingOrOverridesOnMethodsRule.java:39)
: > 	at
: > com.carrotsearch.randomizedtesting.rules.NoShadowingOrOverridesOnMet
: > hodsRule$1.evaluate(NoShadowingOrOverridesOnMethodsRule.java:39)
: > 	at
: > com.carrotsearch.randomizedtesting.rules.StatementAdapter.evaluate(Stat
: > ementAdapter.java:36)
: > 	at
: > org.apache.lucene.util.TestRuleAssertionsRequired$1.evaluate(TestRuleAss
: > ertionsRequired.java:43)
: > 	at
: > org.apache.lucene.util.TestRuleMarkFailure$1.evaluate(TestRuleMarkFailure
: > .java:48)
: > 	at
: > org.apache.lucene.util.TestRuleIgnoreAfterMaxFailures$1.evaluate(TestRule
: > IgnoreAfterMaxFailures.java:70)
: > 	at
: > org.apache.lucene.util.TestRuleIgnoreTestSuites$1.evaluate(TestRuleIgnore
: > TestSuites.java:55)
: > 	at
: > com.carrotsearch.randomizedtesting.rules.StatementAdapter.evaluate(Stat
: > ementAdapter.java:36)
: > 	at
: > com.carrotsearch.randomizedtesting.ThreadLeakControl$StatementRunner.
: > run(ThreadLeakControl.java:358)
: > 	at java.lang.Thread.run(Thread.java:679)
: > 
: > 
: > REGRESSION:
: > org.apache.solr.cloud.FullSolrCloudDistribCmdsTest.testDistribSearch
: > 
: > Error Message:
: > There are still nodes recoverying - waited for 230 seconds
: > 
: > Stack Trace:
: > java.lang.AssertionError: There are still nodes recoverying - waited for 230
: > seconds
: > 	at
: > __randomizedtesting.SeedInfo.seed([687EE273825E73E2:E9986C6BF50113DE
: > ]:0)
: > 	at org.junit.Assert.fail(Assert.java:93)
: > 	at
: > org.apache.solr.cloud.AbstractDistribZkTestBase.waitForRecoveriesToFinish(
: > AbstractDistribZkTestBase.java:173)
: > 	at
: > org.apache.solr.cloud.AbstractDistribZkTestBase.waitForRecoveriesToFinish(
: > AbstractDistribZkTestBase.java:131)
: > 	at
: > org.apache.solr.cloud.AbstractDistribZkTestBase.waitForRecoveriesToFinish(
: > AbstractDistribZkTestBase.java:126)
: > 	at
: > org.apache.solr.cloud.AbstractFullDistribZkTestBase.waitForRecoveriesToFini
: > sh(AbstractFullDistribZkTestBase.java:615)
: > 	at
: > org.apache.solr.cloud.FullSolrCloudDistribCmdsTest.doTest(FullSolrCloudDist
: > ribCmdsTest.java:65)
: > 	at
: > org.apache.solr.BaseDistributedSearchTestCase.testDistribSearch(BaseDistri
: > butedSearchTestCase.java:806)
: > 	at sun.reflect.NativeMethodAccessorImpl.invoke0(Native Method)
: > 	at
: > sun.reflect.NativeMethodAccessorImpl.invoke(NativeMethodAccessorImpl.j
: > ava:57)
: > 	at
: > sun.reflect.DelegatingMethodAccessorImpl.invoke(DelegatingMethodAcces
: > sorImpl.java:43)
: > 	at java.lang.reflect.Method.invoke(Method.java:616)
: > 	at
: > com.carrotsearch.randomizedtesting.RandomizedRunner.invoke(Randomize
: > dRunner.java:1559)
: > 	at
: > com.carrotsearch.randomizedtesting.RandomizedRunner.access$600(Rando
: > mizedRunner.java:79)
: > 	at
: > com.carrotsearch.randomizedtesting.RandomizedRunner$6.evaluate(Rando
: > mizedRunner.java:737)
: > 	at
: > com.carrotsearch.randomizedtesting.RandomizedRunner$7.evaluate(Rando
: > mizedRunner.java:773)
: > 	at
: > com.carrotsearch.randomizedtesting.RandomizedRunner$8.evaluate(Rando
: > mizedRunner.java:787)
: > 	at
: > com.carrotsearch.randomizedtesting.rules.SystemPropertiesRestoreRule$1.
: > evaluate(SystemPropertiesRestoreRule.java:53)
: > 	at
: > org.apache.lucene.util.TestRuleSetupTeardownChained$1.evaluate(TestRule
: > SetupTeardownChained.java:50)
: > 	at
: > org.apache.lucene.util.TestRuleFieldCacheSanity$1.evaluate(TestRuleFieldCa
: > cheSanity.java:51)
: > 	at
: > org.apache.lucene.util.AbstractBeforeAfterRule$1.evaluate(AbstractBeforeA
: > fterRule.java:46)
: > 	at
: > com.carrotsearch.randomizedtesting.rules.SystemPropertiesInvariantRule$1
: > .evaluate(SystemPropertiesInvariantRule.java:55)
: > 	at
: > org.apache.lucene.util.TestRuleThreadAndTestName$1.evaluate(TestRuleTh
: > readAndTestName.java:49)
: > 	at
: > org.apache.lucene.util.TestRuleIgnoreAfterMaxFailures$1.evaluate(TestRule
: > IgnoreAfterMaxFailures.java:70)
: > 	at
: > org.apache.lucene.util.TestRuleMarkFailure$1.evaluate(TestRuleMarkFailure
: > .java:48)
: > 	at
: > com.carrotsearch.randomizedtesting.rules.StatementAdapter.evaluate(Stat
: > ementAdapter.java:36)
: > 	at
: > com.carrotsearch.randomizedtesting.ThreadLeakControl$StatementRunner.
: > run(ThreadLeakControl.java:358)
: > 	at
: > com.carrotsearch.randomizedtesting.ThreadLeakControl.forkTimeoutingTask
: > (ThreadLeakControl.java:782)
: > 	at
: > com.carrotsearch.randomizedtesting.ThreadLeakControl$3.evaluate(ThreadL
: > eakControl.java:442)
: > 	at
: > com.carrotsearch.randomizedtesting.RandomizedRunner.runSingleTest(Ran
: > domizedRunner.java:746)
: > 	at
: > com.carrotsearch.randomizedtesting.RandomizedRunner$3.evaluate(Rando
: > mizedRunner.java:648)
: > 	at
: > com.carrotsearch.randomizedtesting.RandomizedRunner$4.evaluate(Rando
: > mizedRunner.java:682)
: > 	at
: > com.carrotsearch.randomizedtesting.RandomizedRunner$5.evaluate(Rando
: > mizedRunner.java:693)
: > 	at
: > com.carrotsearch.randomizedtesting.rules.StatementAdapter.evaluate(Stat
: > ementAdapter.java:36)
: > 	at
: > com.carrotsearch.randomizedtesting.rules.SystemPropertiesRestoreRule$1.
: > evaluate(SystemPropertiesRestoreRule.java:53)
: > 	at
: > org.apache.lucene.util.AbstractBeforeAfterRule$1.evaluate(AbstractBeforeA
: > fterRule.java:46)
: > 	at
: > org.apache.lucene.util.TestRuleStoreClassName$1.evaluate(TestRuleStoreCl
: > assName.java:42)
: > 	at
: > com.carrotsearch.randomizedtesting.rules.SystemPropertiesInvariantRule$1
: > .evaluate(SystemPropertiesInvariantRule.java:55)
: > 	at
: > com.carrotsearch.randomizedtesting.rules.NoShadowingOrOverridesOnMet
: > hodsRule$1.evaluate(NoShadowingOrOverridesOnMethodsRule.java:39)
: > 	at
: > com.carrotsearch.randomizedtesting.rules.NoShadowingOrOverridesOnMet
: > hodsRule$1.evaluate(NoShadowingOrOverridesOnMethodsRule.java:39)
: > 	at
: > com.carrotsearch.randomizedtesting.rules.StatementAdapter.evaluate(Stat
: > ementAdapter.java:36)
: > 	at
: > org.apache.lucene.util.TestRuleAssertionsRequired$1.evaluate(TestRuleAss
: > ertionsRequired.java:43)
: > 	at
: > org.apache.lucene.util.TestRuleMarkFailure$1.evaluate(TestRuleMarkFailure
: > .java:48)
: > 	at
: > org.apache.lucene.util.TestRuleIgnoreAfterMaxFailures$1.evaluate(TestRule
: > IgnoreAfterMaxFailures.java:70)
: > 	at
: > org.apache.lucene.util.TestRuleIgnoreTestSuites$1.evaluate(TestRuleIgnore
: > TestSuites.java:55)
: > 	at
: > com.carrotsearch.randomizedtesting.rules.StatementAdapter.evaluate(Stat
: > ementAdapter.java:36)
: > 	at
: > com.carrotsearch.randomizedtesting.ThreadLeakControl$StatementRunner.
: > run(ThreadLeakControl.java:358)
: > 	at java.lang.Thread.run(Thread.java:679)
: > 
: > 
: > REGRESSION:  org.apache.solr.cloud.RecoveryZkTest.testDistribSearch
: > 
: > Error Message:
: > There are still nodes recoverying - waited for 30 seconds
: > 
: > Stack Trace:
: > java.lang.AssertionError: There are still nodes recoverying - waited for 30
: > seconds
: > 	at
: > __randomizedtesting.SeedInfo.seed([687EE273825E73E2:E9986C6BF50113DE
: > ]:0)
: > 	at org.junit.Assert.fail(Assert.java:93)
: > 	at
: > org.apache.solr.cloud.AbstractDistribZkTestBase.waitForRecoveriesToFinish(
: > AbstractDistribZkTestBase.java:173)
: > 	at
: > org.apache.solr.cloud.AbstractFullDistribZkTestBase.waitForRecoveriesToFini
: > sh(AbstractFullDistribZkTestBase.java:627)
: > 	at
: > org.apache.solr.cloud.AbstractFullDistribZkTestBase.waitForThingsToLevelOu
: > t(AbstractFullDistribZkTestBase.java:1298)
: > 	at
: > org.apache.solr.cloud.RecoveryZkTest.doTest(RecoveryZkTest.java:91)
: > 	at
: > org.apache.solr.BaseDistributedSearchTestCase.testDistribSearch(BaseDistri
: > butedSearchTestCase.java:806)
: > 	at sun.reflect.NativeMethodAccessorImpl.invoke0(Native Method)
: > 	at
: > sun.reflect.NativeMethodAccessorImpl.invoke(NativeMethodAccessorImpl.j
: > ava:57)
: > 	at
: > sun.reflect.DelegatingMethodAccessorImpl.invoke(DelegatingMethodAcces
: > sorImpl.java:43)
: > 	at java.lang.reflect.Method.invoke(Method.java:616)
: > 	at
: > com.carrotsearch.randomizedtesting.RandomizedRunner.invoke(Randomize
: > dRunner.java:1559)
: > 	at
: > com.carrotsearch.randomizedtesting.RandomizedRunner.access$600(Rando
: > mizedRunner.java:79)
: > 	at
: > com.carrotsearch.randomizedtesting.RandomizedRunner$6.evaluate(Rando
: > mizedRunner.java:737)
: > 	at
: > com.carrotsearch.randomizedtesting.RandomizedRunner$7.evaluate(Rando
: > mizedRunner.java:773)
: > 	at
: > com.carrotsearch.randomizedtesting.RandomizedRunner$8.evaluate(Rando
: > mizedRunner.java:787)
: > 	at
: > com.carrotsearch.randomizedtesting.rules.SystemPropertiesRestoreRule$1.
: > evaluate(SystemPropertiesRestoreRule.java:53)
: > 	at
: > org.apache.lucene.util.TestRuleSetupTeardownChained$1.evaluate(TestRule
: > SetupTeardownChained.java:50)
: > 	at
: > org.apache.lucene.util.TestRuleFieldCacheSanity$1.evaluate(TestRuleFieldCa
: > cheSanity.java:51)
: > 	at
: > org.apache.lucene.util.AbstractBeforeAfterRule$1.evaluate(AbstractBeforeA
: > fterRule.java:46)
: > 	at
: > com.carrotsearch.randomizedtesting.rules.SystemPropertiesInvariantRule$1
: > .evaluate(SystemPropertiesInvariantRule.java:55)
: > 	at
: > org.apache.lucene.util.TestRuleThreadAndTestName$1.evaluate(TestRuleTh
: > readAndTestName.java:49)
: > 	at
: > org.apache.lucene.util.TestRuleIgnoreAfterMaxFailures$1.evaluate(TestRule
: > IgnoreAfterMaxFailures.java:70)
: > 	at
: > org.apache.lucene.util.TestRuleMarkFailure$1.evaluate(TestRuleMarkFailure
: > .java:48)
: > 	at
: > com.carrotsearch.randomizedtesting.rules.StatementAdapter.evaluate(Stat
: > ementAdapter.java:36)
: > 	at
: > com.carrotsearch.randomizedtesting.ThreadLeakControl$StatementRunner.
: > run(ThreadLeakControl.java:358)
: > 	at
: > com.carrotsearch.randomizedtesting.ThreadLeakControl.forkTimeoutingTask
: > (ThreadLeakControl.java:782)
: > 	at
: > com.carrotsearch.randomizedtesting.ThreadLeakControl$3.evaluate(ThreadL
: > eakControl.java:442)
: > 	at
: > com.carrotsearch.randomizedtesting.RandomizedRunner.runSingleTest(Ran
: > domizedRunner.java:746)
: > 	at
: > com.carrotsearch.randomizedtesting.RandomizedRunner$3.evaluate(Rando
: > mizedRunner.java:648)
: > 	at
: > com.carrotsearch.randomizedtesting.RandomizedRunner$4.evaluate(Rando
: > mizedRunner.java:682)
: > 	at
: > com.carrotsearch.randomizedtesting.RandomizedRunner$5.evaluate(Rando
: > mizedRunner.java:693)
: > 	at
: > com.carrotsearch.randomizedtesting.rules.StatementAdapter.evaluate(Stat
: > ementAdapter.java:36)
: > 	at
: > com.carrotsearch.randomizedtesting.rules.SystemPropertiesRestoreRule$1.
: > evaluate(SystemPropertiesRestoreRule.java:53)
: > 	at
: > org.apache.lucene.util.AbstractBeforeAfterRule$1.evaluate(AbstractBeforeA
: > fterRule.java:46)
: > 	at
: > org.apache.lucene.util.TestRuleStoreClassName$1.evaluate(TestRuleStoreCl
: > assName.java:42)
: > 	at
: > com.carrotsearch.randomizedtesting.rules.SystemPropertiesInvariantRule$1
: > .evaluate(SystemPropertiesInvariantRule.java:55)
: > 	at
: > com.carrotsearch.randomizedtesting.rules.NoShadowingOrOverridesOnMet
: > hodsRule$1.evaluate(NoShadowingOrOverridesOnMethodsRule.java:39)
: > 	at
: > com.carrotsearch.randomizedtesting.rules.NoShadowingOrOverridesOnMet
: > hodsRule$1.evaluate(NoShadowingOrOverridesOnMethodsRule.java:39)
: > 	at
: > com.carrotsearch.randomizedtesting.rules.StatementAdapter.evaluate(Stat
: > ementAdapter.java:36)
: > 	at
: > org.apache.lucene.util.TestRuleAssertionsRequired$1.evaluate(TestRuleAss
: > ertionsRequired.java:43)
: > 	at
: > org.apache.lucene.util.TestRuleMarkFailure$1.evaluate(TestRuleMarkFailure
: > .java:48)
: > 	at
: > org.apache.lucene.util.TestRuleIgnoreAfterMaxFailures$1.evaluate(TestRule
: > IgnoreAfterMaxFailures.java:70)
: > 	at
: > org.apache.lucene.util.TestRuleIgnoreTestSuites$1.evaluate(TestRuleIgnore
: > TestSuites.java:55)
: > 	at
: > com.carrotsearch.randomizedtesting.rules.StatementAdapter.evaluate(Stat
: > ementAdapter.java:36)
: > 	at
: > com.carrotsearch.randomizedtesting.ThreadLeakControl$StatementRunner.
: > run(ThreadLeakControl.java:358)
: > 	at java.lang.Thread.run(Thread.java:679)
: > 
: > 
: > REGRESSION:  org.apache.solr.cloud.ShardRoutingTest.testDistribSearch
: > 
: > Error Message:
: > There are still nodes recoverying - waited for 230 seconds
: > 
: > Stack Trace:
: > java.lang.AssertionError: There are still nodes recoverying - waited for 230
: > seconds
: > 	at
: > __randomizedtesting.SeedInfo.seed([687EE273825E73E2:E9986C6BF50113DE
: > ]:0)
: > 	at org.junit.Assert.fail(Assert.java:93)
: > 	at
: > org.apache.solr.cloud.AbstractDistribZkTestBase.waitForRecoveriesToFinish(
: > AbstractDistribZkTestBase.java:173)
: > 	at
: > org.apache.solr.cloud.AbstractDistribZkTestBase.waitForRecoveriesToFinish(
: > AbstractDistribZkTestBase.java:131)
: > 	at
: > org.apache.solr.cloud.AbstractDistribZkTestBase.waitForRecoveriesToFinish(
: > AbstractDistribZkTestBase.java:126)
: > 	at
: > org.apache.solr.cloud.AbstractFullDistribZkTestBase.waitForRecoveriesToFini
: > sh(AbstractFullDistribZkTestBase.java:615)
: > 	at
: > org.apache.solr.cloud.ShardRoutingTest.doTest(ShardRoutingTest.java:117)
: > 	at
: > org.apache.solr.BaseDistributedSearchTestCase.testDistribSearch(BaseDistri
: > butedSearchTestCase.java:806)
: > 	at sun.reflect.NativeMethodAccessorImpl.invoke0(Native Method)
: > 	at
: > sun.reflect.NativeMethodAccessorImpl.invoke(NativeMethodAccessorImpl.j
: > ava:57)
: > 	at
: > sun.reflect.DelegatingMethodAccessorImpl.invoke(DelegatingMethodAcces
: > sorImpl.java:43)
: > 	at java.lang.reflect.Method.invoke(Method.java:616)
: > 	at
: > com.carrotsearch.randomizedtesting.RandomizedRunner.invoke(Randomize
: > dRunner.java:1559)
: > 	at
: > com.carrotsearch.randomizedtesting.RandomizedRunner.access$600(Rando
: > mizedRunner.java:79)
: > 	at
: > com.carrotsearch.randomizedtesting.RandomizedRunner$6.evaluate(Rando
: > mizedRunner.java:737)
: > 	at
: > com.carrotsearch.randomizedtesting.RandomizedRunner$7.evaluate(Rando
: > mizedRunner.java:773)
: > 	at
: > com.carrotsearch.randomizedtesting.RandomizedRunner$8.evaluate(Rando
: > mizedRunner.java:787)
: > 	at
: > com.carrotsearch.randomizedtesting.rules.SystemPropertiesRestoreRule$1.
: > evaluate(SystemPropertiesRestoreRule.java:53)
: > 	at
: > org.apache.lucene.util.TestRuleSetupTeardownChained$1.evaluate(TestRule
: > SetupTeardownChained.java:50)
: > 	at
: > org.apache.lucene.util.TestRuleFieldCacheSanity$1.evaluate(TestRuleFieldCa
: > cheSanity.java:51)
: > 	at
: > org.apache.lucene.util.AbstractBeforeAfterRule$1.evaluate(AbstractBeforeA
: > fterRule.java:46)
: > 	at
: > com.carrotsearch.randomizedtesting.rules.SystemPropertiesInvariantRule$1
: > .evaluate(SystemPropertiesInvariantRule.java:55)
: > 	at
: > org.apache.lucene.util.TestRuleThreadAndTestName$1.evaluate(TestRuleTh
: > readAndTestName.java:49)
: > 	at
: > org.apache.lucene.util.TestRuleIgnoreAfterMaxFailures$1.evaluate(TestRule
: > IgnoreAfterMaxFailures.java:70)
: > 	at
: > org.apache.lucene.util.TestRuleMarkFailure$1.evaluate(TestRuleMarkFailure
: > .java:48)
: > 	at
: > com.carrotsearch.randomizedtesting.rules.StatementAdapter.evaluate(Stat
: > ementAdapter.java:36)
: > 	at
: > com.carrotsearch.randomizedtesting.ThreadLeakControl$StatementRunner.
: > run(ThreadLeakControl.java:358)
: > 	at
: > com.carrotsearch.randomizedtesting.ThreadLeakControl.forkTimeoutingTask
: > (ThreadLeakControl.java:782)
: > 	at
: > com.carrotsearch.randomizedtesting.ThreadLeakControl$3.evaluate(ThreadL
: > eakControl.java:442)
: > 	at
: > com.carrotsearch.randomizedtesting.RandomizedRunner.runSingleTest(Ran
: > domizedRunner.java:746)
: > 	at
: > com.carrotsearch.randomizedtesting.RandomizedRunner$3.evaluate(Rando
: > mizedRunner.java:648)
: > 	at
: > com.carrotsearch.randomizedtesting.RandomizedRunner$4.evaluate(Rando
: > mizedRunner.java:682)
: > 	at
: > com.carrotsearch.randomizedtesting.RandomizedRunner$5.evaluate(Rando
: > mizedRunner.java:693)
: > 	at
: > com.carrotsearch.randomizedtesting.rules.StatementAdapter.evaluate(Stat
: > ementAdapter.java:36)
: > 	at
: > com.carrotsearch.randomizedtesting.rules.SystemPropertiesRestoreRule$1.
: > evaluate(SystemPropertiesRestoreRule.java:53)
: > 	at
: > org.apache.lucene.util.AbstractBeforeAfterRule$1.evaluate(AbstractBeforeA
: > fterRule.java:46)
: > 	at
: > org.apache.lucene.util.TestRuleStoreClassName$1.evaluate(TestRuleStoreCl
: > assName.java:42)
: > 	at
: > com.carrotsearch.randomizedtesting.rules.SystemPropertiesInvariantRule$1
: > .evaluate(SystemPropertiesInvariantRule.java:55)
: > 	at
: > com.carrotsearch.randomizedtesting.rules.NoShadowingOrOverridesOnMet
: > hodsRule$1.evaluate(NoShadowingOrOverridesOnMethodsRule.java:39)
: > 	at
: > com.carrotsearch.randomizedtesting.rules.NoShadowingOrOverridesOnMet
: > hodsRule$1.evaluate(NoShadowingOrOverridesOnMethodsRule.java:39)
: > 	at
: > com.carrotsearch.randomizedtesting.rules.StatementAdapter.evaluate(Stat
: > ementAdapter.java:36)
: > 	at
: > org.apache.lucene.util.TestRuleAssertionsRequired$1.evaluate(TestRuleAss
: > ertionsRequired.java:43)
: > 	at
: > org.apache.lucene.util.TestRuleMarkFailure$1.evaluate(TestRuleMarkFailure
: > .java:48)
: > 	at
: > org.apache.lucene.util.TestRuleIgnoreAfterMaxFailures$1.evaluate(TestRule
: > IgnoreAfterMaxFailures.java:70)
: > 	at
: > org.apache.lucene.util.TestRuleIgnoreTestSuites$1.evaluate(TestRuleIgnore
: > TestSuites.java:55)
: > 	at
: > com.carrotsearch.randomizedtesting.rules.StatementAdapter.evaluate(Stat
: > ementAdapter.java:36)
: > 	at
: > com.carrotsearch.randomizedtesting.ThreadLeakControl$StatementRunner.
: > run(ThreadLeakControl.java:358)
: > 	at java.lang.Thread.run(Thread.java:679)
: > 
: > 
: > REGRESSION:  org.apache.solr.cloud.ShardSplitTest.testDistribSearch
: > 
: > Error Message:
: > There are still nodes recoverying - waited for 15 seconds
: > 
: > Stack Trace:
: > java.lang.AssertionError: There are still nodes recoverying - waited for 15
: > seconds
: > 	at
: > __randomizedtesting.SeedInfo.seed([687EE273825E73E2:E9986C6BF50113DE
: > ]:0)
: > 	at org.junit.Assert.fail(Assert.java:93)
: > 	at
: > org.apache.solr.cloud.AbstractDistribZkTestBase.waitForRecoveriesToFinish(
: > AbstractDistribZkTestBase.java:173)
: > 	at
: > org.apache.solr.cloud.AbstractFullDistribZkTestBase.waitForRecoveriesToFini
: > sh(AbstractFullDistribZkTestBase.java:627)
: > 	at
: > org.apache.solr.cloud.AbstractFullDistribZkTestBase.waitForThingsToLevelOu
: > t(AbstractFullDistribZkTestBase.java:1298)
: > 	at
: > org.apache.solr.cloud.ShardSplitTest.doTest(ShardSplitTest.java:94)
: > 	at
: > org.apache.solr.BaseDistributedSearchTestCase.testDistribSearch(BaseDistri
: > butedSearchTestCase.java:806)
: > 	at sun.reflect.NativeMethodAccessorImpl.invoke0(Native Method)
: > 	at
: > sun.reflect.NativeMethodAccessorImpl.invoke(NativeMethodAccessorImpl.j
: > ava:57)
: > 	at
: > sun.reflect.DelegatingMethodAccessorImpl.invoke(DelegatingMethodAcces
: > sorImpl.java:43)
: > 	at java.lang.reflect.Method.invoke(Method.java:616)
: > 	at
: > com.carrotsearch.randomizedtesting.RandomizedRunner.invoke(Randomize
: > dRunner.java:1559)
: > 	at
: > com.carrotsearch.randomizedtesting.RandomizedRunner.access$600(Rando
: > mizedRunner.java:79)
: > 	at
: > com.carrotsearch.randomizedtesting.RandomizedRunner$6.evaluate(Rando
: > mizedRunner.java:737)
: > 	at
: > com.carrotsearch.randomizedtesting.RandomizedRunner$7.evaluate(Rando
: > mizedRunner.java:773)
: > 	at
: > com.carrotsearch.randomizedtesting.RandomizedRunner$8.evaluate(Rando
: > mizedRunner.java:787)
: > 	at
: > com.carrotsearch.randomizedtesting.rules.SystemPropertiesRestoreRule$1.
: > evaluate(SystemPropertiesRestoreRule.java:53)
: > 	at
: > org.apache.lucene.util.TestRuleSetupTeardownChained$1.evaluate(TestRule
: > SetupTeardownChained.java:50)
: > 	at
: > org.apache.lucene.util.TestRuleFieldCacheSanity$1.evaluate(TestRuleFieldCa
: > cheSanity.java:51)
: > 	at
: > org.apache.lucene.util.AbstractBeforeAfterRule$1.evaluate(AbstractBeforeA
: > fterRule.java:46)
: > 	at
: > com.carrotsearch.randomizedtesting.rules.SystemPropertiesInvariantRule$1
: > .evaluate(SystemPropertiesInvariantRule.java:55)
: > 	at
: > org.apache.lucene.util.TestRuleThreadAndTestName$1.evaluate(TestRuleTh
: > readAndTestName.java:49)
: > 	at
: > org.apache.lucene.util.TestRuleIgnoreAfterMaxFailures$1.evaluate(TestRule
: > IgnoreAfterMaxFailures.java:70)
: > 	at
: > org.apache.lucene.util.TestRuleMarkFailure$1.evaluate(TestRuleMarkFailure
: > .java:48)
: > 	at
: > com.carrotsearch.randomizedtesting.rules.StatementAdapter.evaluate(Stat
: > ementAdapter.java:36)
: > 	at
: > com.carrotsearch.randomizedtesting.ThreadLeakControl$StatementRunner.
: > run(ThreadLeakControl.java:358)
: > 	at
: > com.carrotsearch.randomizedtesting.ThreadLeakControl.forkTimeoutingTask
: > (ThreadLeakControl.java:782)
: > 	at
: > com.carrotsearch.randomizedtesting.ThreadLeakControl$3.evaluate(ThreadL
: > eakControl.java:442)
: > 	at
: > com.carrotsearch.randomizedtesting.RandomizedRunner.runSingleTest(Ran
: > domizedRunner.java:746)
: > 	at
: > com.carrotsearch.randomizedtesting.RandomizedRunner$3.evaluate(Rando
: > mizedRunner.java:648)
: > 	at
: > com.carrotsearch.randomizedtesting.RandomizedRunner$4.evaluate(Rando
: > mizedRunner.java:682)
: > 	at
: > com.carrotsearch.randomizedtesting.RandomizedRunner$5.evaluate(Rando
: > mizedRunner.java:693)
: > 	at
: > com.carrotsearch.randomizedtesting.rules.StatementAdapter.evaluate(Stat
: > ementAdapter.java:36)
: > 	at
: > com.carrotsearch.randomizedtesting.rules.SystemPropertiesRestoreRule$1.
: > evaluate(SystemPropertiesRestoreRule.java:53)
: > 	at
: > org.apache.lucene.util.AbstractBeforeAfterRule$1.evaluate(AbstractBeforeA
: > fterRule.java:46)
: > 	at
: > org.apache.lucene.util.TestRuleStoreClassName$1.evaluate(TestRuleStoreCl
: > assName.java:42)
: > 	at
: > com.carrotsearch.randomizedtesting.rules.SystemPropertiesInvariantRule$1
: > .evaluate(SystemPropertiesInvariantRule.java:55)
: > 	at
: > com.carrotsearch.randomizedtesting.rules.NoShadowingOrOverridesOnMet
: > hodsRule$1.evaluate(NoShadowingOrOverridesOnMethodsRule.java:39)
: > 	at
: > com.carrotsearch.randomizedtesting.rules.NoShadowingOrOverridesOnMet
: > hodsRule$1.evaluate(NoShadowingOrOverridesOnMethodsRule.java:39)
: > 	at
: > com.carrotsearch.randomizedtesting.rules.StatementAdapter.evaluate(Stat
: > ementAdapter.java:36)
: > 	at
: > org.apache.lucene.util.TestRuleAssertionsRequired$1.evaluate(TestRuleAss
: > ertionsRequired.java:43)
: > 	at
: > org.apache.lucene.util.TestRuleMarkFailure$1.evaluate(TestRuleMarkFailure
: > .java:48)
: > 	at
: > org.apache.lucene.util.TestRuleIgnoreAfterMaxFailures$1.evaluate(TestRule
: > IgnoreAfterMaxFailures.java:70)
: > 	at
: > org.apache.lucene.util.TestRuleIgnoreTestSuites$1.evaluate(TestRuleIgnore
: > TestSuites.java:55)
: > 	at
: > com.carrotsearch.randomizedtesting.rules.StatementAdapter.evaluate(Stat
: > ementAdapter.java:36)
: > 	at
: > com.carrotsearch.randomizedtesting.ThreadLeakControl$StatementRunner.
: > run(ThreadLeakControl.java:358)
: > 	at java.lang.Thread.run(Thread.java:679)
: > 
: > 
: > REGRESSION:  org.apache.solr.cloud.SyncSliceTest.testDistribSearch
: > 
: > Error Message:
: > There are still nodes recoverying - waited for 15 seconds
: > 
: > Stack Trace:
: > java.lang.AssertionError: There are still nodes recoverying - waited for 15
: > seconds
: > 	at
: > __randomizedtesting.SeedInfo.seed([687EE273825E73E2:E9986C6BF50113DE
: > ]:0)
: > 	at org.junit.Assert.fail(Assert.java:93)
: > 	at
: > org.apache.solr.cloud.AbstractDistribZkTestBase.waitForRecoveriesToFinish(
: > AbstractDistribZkTestBase.java:173)
: > 	at
: > org.apache.solr.cloud.AbstractFullDistribZkTestBase.waitForRecoveriesToFini
: > sh(AbstractFullDistribZkTestBase.java:627)
: > 	at
: > org.apache.solr.cloud.AbstractFullDistribZkTestBase.waitForThingsToLevelOu
: > t(AbstractFullDistribZkTestBase.java:1298)
: > 	at org.apache.solr.cloud.SyncSliceTest.doTest(SyncSliceTest.java:97)
: > 	at
: > org.apache.solr.BaseDistributedSearchTestCase.testDistribSearch(BaseDistri
: > butedSearchTestCase.java:806)
: > 	at sun.reflect.NativeMethodAccessorImpl.invoke0(Native Method)
: > 	at
: > sun.reflect.NativeMethodAccessorImpl.invoke(NativeMethodAccessorImpl.j
: > ava:57)
: > 	at
: > sun.reflect.DelegatingMethodAccessorImpl.invoke(DelegatingMethodAcces
: > sorImpl.java:43)
: > 	at java.lang.reflect.Method.invoke(Method.java:616)
: > 	at
: > com.carrotsearch.randomizedtesting.RandomizedRunner.invoke(Randomize
: > dRunner.java:1559)
: > 	at
: > com.carrotsearch.randomizedtesting.RandomizedRunner.access$600(Rando
: > mizedRunner.java:79)
: > 	at
: > com.carrotsearch.randomizedtesting.RandomizedRunner$6.evaluate(Rando
: > mizedRunner.java:737)
: > 	at
: > com.carrotsearch.randomizedtesting.RandomizedRunner$7.evaluate(Rando
: > mizedRunner.java:773)
: > 	at
: > com.carrotsearch.randomizedtesting.RandomizedRunner$8.evaluate(Rando
: > mizedRunner.java:787)
: > 	at
: > com.carrotsearch.randomizedtesting.rules.SystemPropertiesRestoreRule$1.
: > evaluate(SystemPropertiesRestoreRule.java:53)
: > 	at
: > org.apache.lucene.util.TestRuleSetupTeardownChained$1.evaluate(TestRule
: > SetupTeardownChained.java:50)
: > 	at
: > org.apache.lucene.util.TestRuleFieldCacheSanity$1.evaluate(TestRuleFieldCa
: > cheSanity.java:51)
: > 	at
: > org.apache.lucene.util.AbstractBeforeAfterRule$1.evaluate(AbstractBeforeA
: > fterRule.java:46)
: > 	at
: > com.carrotsearch.randomizedtesting.rules.SystemPropertiesInvariantRule$1
: > .evaluate(SystemPropertiesInvariantRule.java:55)
: > 	at
: > org.apache.lucene.util.TestRuleThreadAndTestName$1.evaluate(TestRuleTh
: > readAndTestName.java:49)
: > 	at
: > org.apache.lucene.util.TestRuleIgnoreAfterMaxFailures$1.evaluate(TestRule
: > IgnoreAfterMaxFailures.java:70)
: > 	at
: > org.apache.lucene.util.TestRuleMarkFailure$1.evaluate(TestRuleMarkFailure
: > .java:48)
: > 	at
: > com.carrotsearch.randomizedtesting.rules.StatementAdapter.evaluate(Stat
: > ementAdapter.java:36)
: > 	at
: > com.carrotsearch.randomizedtesting.ThreadLeakControl$StatementRunner.
: > run(ThreadLeakControl.java:358)
: > 	at
: > com.carrotsearch.randomizedtesting.ThreadLeakControl.forkTimeoutingTask
: > (ThreadLeakControl.java:782)
: > 	at
: > com.carrotsearch.randomizedtesting.ThreadLeakControl$3.evaluate(ThreadL
: > eakControl.java:442)
: > 	at
: > com.carrotsearch.randomizedtesting.RandomizedRunner.runSingleTest(Ran
: > domizedRunner.java:746)
: > 	at
: > com.carrotsearch.randomizedtesting.RandomizedRunner$3.evaluate(Rando
: > mizedRunner.java:648)
: > 	at
: > com.carrotsearch.randomizedtesting.RandomizedRunner$4.evaluate(Rando
: > mizedRunner.java:682)
: > 	at
: > com.carrotsearch.randomizedtesting.RandomizedRunner$5.evaluate(Rando
: > mizedRunner.java:693)
: > 	at
: > com.carrotsearch.randomizedtesting.rules.StatementAdapter.evaluate(Stat
: > ementAdapter.java:36)
: > 	at
: > com.carrotsearch.randomizedtesting.rules.SystemPropertiesRestoreRule$1.
: > evaluate(SystemPropertiesRestoreRule.java:53)
: > 	at
: > org.apache.lucene.util.AbstractBeforeAfterRule$1.evaluate(AbstractBeforeA
: > fterRule.java:46)
: > 	at
: > org.apache.lucene.util.TestRuleStoreClassName$1.evaluate(TestRuleStoreCl
: > assName.java:42)
: > 	at
: > com.carrotsearch.randomizedtesting.rules.SystemPropertiesInvariantRule$1
: > .evaluate(SystemPropertiesInvariantRule.java:55)
: > 	at
: > com.carrotsearch.randomizedtesting.rules.NoShadowingOrOverridesOnMet
: > hodsRule$1.evaluate(NoShadowingOrOverridesOnMethodsRule.java:39)
: > 	at
: > com.carrotsearch.randomizedtesting.rules.NoShadowingOrOverridesOnMet
: > hodsRule$1.evaluate(NoShadowingOrOverridesOnMethodsRule.java:39)
: > 	at
: > com.carrotsearch.randomizedtesting.rules.StatementAdapter.evaluate(Stat
: > ementAdapter.java:36)
: > 	at
: > org.apache.lucene.util.TestRuleAssertionsRequired$1.evaluate(TestRuleAss
: > ertionsRequired.java:43)
: > 	at
: > org.apache.lucene.util.TestRuleMarkFailure$1.evaluate(TestRuleMarkFailure
: > .java:48)
: > 	at
: > org.apache.lucene.util.TestRuleIgnoreAfterMaxFailures$1.evaluate(TestRule
: > IgnoreAfterMaxFailures.java:70)
: > 	at
: > org.apache.lucene.util.TestRuleIgnoreTestSuites$1.evaluate(TestRuleIgnore
: > TestSuites.java:55)
: > 	at
: > com.carrotsearch.randomizedtesting.rules.StatementAdapter.evaluate(Stat
: > ementAdapter.java:36)
: > 	at
: > com.carrotsearch.randomizedtesting.ThreadLeakControl$StatementRunner.
: > run(ThreadLeakControl.java:358)
: > 	at java.lang.Thread.run(Thread.java:679)
: > 
: > 
: > REGRESSION:
: > org.apache.solr.cloud.UnloadDistributedZkTest.testDistribSearch
: > 
: > Error Message:
: > There are still nodes recoverying - waited for 230 seconds
: > 
: > Stack Trace:
: > java.lang.AssertionError: There are still nodes recoverying - waited for 230
: > seconds
: > 	at
: > __randomizedtesting.SeedInfo.seed([687EE273825E73E2:E9986C6BF50113DE
: > ]:0)
: > 	at org.junit.Assert.fail(Assert.java:93)
: > 	at
: > org.apache.solr.cloud.AbstractDistribZkTestBase.waitForRecoveriesToFinish(
: > AbstractDistribZkTestBase.java:173)
: > 	at
: > org.apache.solr.cloud.AbstractDistribZkTestBase.waitForRecoveriesToFinish(
: > AbstractDistribZkTestBase.java:131)
: > 	at
: > org.apache.solr.cloud.AbstractDistribZkTestBase.waitForRecoveriesToFinish(
: > AbstractDistribZkTestBase.java:126)
: > 	at
: > org.apache.solr.cloud.UnloadDistributedZkTest.testCoreUnloadAndLeaders(
: > UnloadDistributedZkTest.java:198)
: > 	at
: > org.apache.solr.cloud.UnloadDistributedZkTest.doTest(UnloadDistributedZk
: > Test.java:74)
: > 	at
: > org.apache.solr.BaseDistributedSearchTestCase.testDistribSearch(BaseDistri
: > butedSearchTestCase.java:806)
: > 	at sun.reflect.NativeMethodAccessorImpl.invoke0(Native Method)
: > 	at
: > sun.reflect.NativeMethodAccessorImpl.invoke(NativeMethodAccessorImpl.j
: > ava:57)
: > 	at
: > sun.reflect.DelegatingMethodAccessorImpl.invoke(DelegatingMethodAcces
: > sorImpl.java:43)
: > 	at java.lang.reflect.Method.invoke(Method.java:616)
: > 	at
: > com.carrotsearch.randomizedtesting.RandomizedRunner.invoke(Randomize
: > dRunner.java:1559)
: > 	at
: > com.carrotsearch.randomizedtesting.RandomizedRunner.access$600(Rando
: > mizedRunner.java:79)
: > 	at
: > com.carrotsearch.randomizedtesting.RandomizedRunner$6.evaluate(Rando
: > mizedRunner.java:737)
: > 	at
: > com.carrotsearch.randomizedtesting.RandomizedRunner$7.evaluate(Rando
: > mizedRunner.java:773)
: > 	at
: > com.carrotsearch.randomizedtesting.RandomizedRunner$8.evaluate(Rando
: > mizedRunner.java:787)
: > 	at
: > com.carrotsearch.randomizedtesting.rules.SystemPropertiesRestoreRule$1.
: > evaluate(SystemPropertiesRestoreRule.java:53)
: > 	at
: > org.apache.lucene.util.TestRuleSetupTeardownChained$1.evaluate(TestRule
: > SetupTeardownChained.java:50)
: > 	at
: > org.apache.lucene.util.TestRuleFieldCacheSanity$1.evaluate(TestRuleFieldCa
: > cheSanity.java:51)
: > 	at
: > org.apache.lucene.util.AbstractBeforeAfterRule$1.evaluate(AbstractBeforeA
: > fterRule.java:46)
: > 	at
: > com.carrotsearch.randomizedtesting.rules.SystemPropertiesInvariantRule$1
: > .evaluate(SystemPropertiesInvariantRule.java:55)
: > 	at
: > org.apache.lucene.util.TestRuleThreadAndTestName$1.evaluate(TestRuleTh
: > readAndTestName.java:49)
: > 	at
: > org.apache.lucene.util.TestRuleIgnoreAfterMaxFailures$1.evaluate(TestRule
: > IgnoreAfterMaxFailures.java:70)
: > 	at
: > org.apache.lucene.util.TestRuleMarkFailure$1.evaluate(TestRuleMarkFailure
: > .java:48)
: > 	at
: > com.carrotsearch.randomizedtesting.rules.StatementAdapter.evaluate(Stat
: > ementAdapter.java:36)
: > 	at
: > com.carrotsearch.randomizedtesting.ThreadLeakControl$StatementRunner.
: > run(ThreadLeakControl.java:358)
: > 	at
: > com.carrotsearch.randomizedtesting.ThreadLeakControl.forkTimeoutingTask
: > (ThreadLeakControl.java:782)
: > 	at
: > com.carrotsearch.randomizedtesting.ThreadLeakControl$3.evaluate(ThreadL
: > eakControl.java:442)
: > 	at
: > com.carrotsearch.randomizedtesting.RandomizedRunner.runSingleTest(Ran
: > domizedRunner.java:746)
: > 	at
: > com.carrotsearch.randomizedtesting.RandomizedRunner$3.evaluate(Rando
: > mizedRunner.java:648)
: > 	at
: > com.carrotsearch.randomizedtesting.RandomizedRunner$4.evaluate(Rando
: > mizedRunner.java:682)
: > 	at
: > com.carrotsearch.randomizedtesting.RandomizedRunner$5.evaluate(Rando
: > mizedRunner.java:693)
: > 	at
: > com.carrotsearch.randomizedtesting.rules.StatementAdapter.evaluate(Stat
: > ementAdapter.java:36)
: > 	at
: > com.carrotsearch.randomizedtesting.rules.SystemPropertiesRestoreRule$1.
: > evaluate(SystemPropertiesRestoreRule.java:53)
: > 	at
: > org.apache.lucene.util.AbstractBeforeAfterRule$1.evaluate(AbstractBeforeA
: > fterRule.java:46)
: > 	at
: > org.apache.lucene.util.TestRuleStoreClassName$1.evaluate(TestRuleStoreCl
: > assName.java:42)
: > 	at
: > com.carrotsearch.randomizedtesting.rules.SystemPropertiesInvariantRule$1
: > .evaluate(SystemPropertiesInvariantRule.java:55)
: > 	at
: > com.carrotsearch.randomizedtesting.rules.NoShadowingOrOverridesOnMet
: > hodsRule$1.evaluate(NoShadowingOrOverridesOnMethodsRule.java:39)
: > 	at
: > com.carrotsearch.randomizedtesting.rules.NoShadowingOrOverridesOnMet
: > hodsRule$1.evaluate(NoShadowingOrOverridesOnMethodsRule.java:39)
: > 	at
: > com.carrotsearch.randomizedtesting.rules.StatementAdapter.evaluate(Stat
: > ementAdapter.java:36)
: > 	at
: > org.apache.lucene.util.TestRuleAssertionsRequired$1.evaluate(TestRuleAss
: > ertionsRequired.java:43)
: > 	at
: > org.apache.lucene.util.TestRuleMarkFailure$1.evaluate(TestRuleMarkFailure
: > .java:48)
: > 	at
: > org.apache.lucene.util.TestRuleIgnoreAfterMaxFailures$1.evaluate(TestRule
: > IgnoreAfterMaxFailures.java:70)
: > 	at
: > org.apache.lucene.util.TestRuleIgnoreTestSuites$1.evaluate(TestRuleIgnore
: > TestSuites.java:55)
: > 	at
: > com.carrotsearch.randomizedtesting.rules.StatementAdapter.evaluate(Stat
: > ementAdapter.java:36)
: > 	at
: > com.carrotsearch.randomizedtesting.ThreadLeakControl$StatementRunner.
: > run(ThreadLeakControl.java:358)
: > 	at java.lang.Thread.run(Thread.java:679)
: > 
: > 
: > REGRESSION:
: > org.apache.solr.core.OpenCloseCoreStressTest.test30SecondsOld
: > 
: > Error Message:
: > Core 00000_core bad! expected:<3569> but was:<3057>
: > 
: > Stack Trace:
: > java.lang.AssertionError: Core 00000_core bad! expected:<3569> but
: > was:<3057>
: > 	at
: > __randomizedtesting.SeedInfo.seed([687EE273825E73E2:444F682D1EBE5E81
: > ]:0)
: > 	at org.junit.Assert.fail(Assert.java:93)
: > 	at org.junit.Assert.failNotEquals(Assert.java:647)
: > 	at org.junit.Assert.assertEquals(Assert.java:128)
: > 	at org.junit.Assert.assertEquals(Assert.java:472)
: > 	at
: > org.apache.solr.core.OpenCloseCoreStressTest.checkResults(OpenCloseCor
: > eStressTest.java:300)
: > 	at
: > org.apache.solr.core.OpenCloseCoreStressTest.doStress(OpenCloseCoreStr
: > essTest.java:200)
: > 	at
: > org.apache.solr.core.OpenCloseCoreStressTest.test30SecondsOld(OpenClos
: > eCoreStressTest.java:114)
: > 	at sun.reflect.NativeMethodAccessorImpl.invoke0(Native Method)
: > 	at
: > sun.reflect.NativeMethodAccessorImpl.invoke(NativeMethodAccessorImpl.j
: > ava:57)
: > 	at
: > sun.reflect.DelegatingMethodAccessorImpl.invoke(DelegatingMethodAcces
: > sorImpl.java:43)
: > 	at java.lang.reflect.Method.invoke(Method.java:616)
: > 	at
: > com.carrotsearch.randomizedtesting.RandomizedRunner.invoke(Randomize
: > dRunner.java:1559)
: > 	at
: > com.carrotsearch.randomizedtesting.RandomizedRunner.access$600(Rando
: > mizedRunner.java:79)
: > 	at
: > com.carrotsearch.randomizedtesting.RandomizedRunner$6.evaluate(Rando
: > mizedRunner.java:737)
: > 	at
: > com.carrotsearch.randomizedtesting.RandomizedRunner$7.evaluate(Rando
: > mizedRunner.java:773)
: > 	at
: > com.carrotsearch.randomizedtesting.RandomizedRunner$8.evaluate(Rando
: > mizedRunner.java:787)
: > 	at
: > com.carrotsearch.randomizedtesting.rules.SystemPropertiesRestoreRule$1.
: > evaluate(SystemPropertiesRestoreRule.java:53)
: > 	at
: > org.apache.lucene.util.TestRuleSetupTeardownChained$1.evaluate(TestRule
: > SetupTeardownChained.java:50)
: > 	at
: > org.apache.lucene.util.TestRuleFieldCacheSanity$1.evaluate(TestRuleFieldCa
: > cheSanity.java:51)
: > 	at
: > org.apache.lucene.util.AbstractBeforeAfterRule$1.evaluate(AbstractBeforeA
: > fterRule.java:46)
: > 	at
: > com.carrotsearch.randomizedtesting.rules.SystemPropertiesInvariantRule$1
: > .evaluate(SystemPropertiesInvariantRule.java:55)
: > 	at
: > org.apache.lucene.util.TestRuleThreadAndTestName$1.evaluate(TestRuleTh
: > readAndTestName.java:49)
: > 	at
: > org.apache.lucene.util.TestRuleIgnoreAfterMaxFailures$1.evaluate(TestRule
: > IgnoreAfterMaxFailures.java:70)
: > 	at
: > org.apache.lucene.util.TestRuleMarkFailure$1.evaluate(TestRuleMarkFailure
: > .java:48)
: > 	at
: > com.carrotsearch.randomizedtesting.rules.StatementAdapter.evaluate(Stat
: > ementAdapter.java:36)
: > 	at
: > com.carrotsearch.randomizedtesting.ThreadLeakControl$StatementRunner.
: > run(ThreadLeakControl.java:358)
: > 	at
: > com.carrotsearch.randomizedtesting.ThreadLeakControl.forkTimeoutingTask
: > (ThreadLeakControl.java:782)
: > 	at
: > com.carrotsearch.randomizedtesting.ThreadLeakControl$3.evaluate(ThreadL
: > eakControl.java:442)
: > 	at
: > com.carrotsearch.randomizedtesting.RandomizedRunner.runSingleTest(Ran
: > domizedRunner.java:746)
: > 	at
: > com.carrotsearch.randomizedtesting.RandomizedRunner$3.evaluate(Rando
: > mizedRunner.java:648)
: > 	at
: > com.carrotsearch.randomizedtesting.RandomizedRunner$4.evaluate(Rando
: > mizedRunner.java:682)
: > 	at
: > com.carrotsearch.randomizedtesting.RandomizedRunner$5.evaluate(Rando
: > mizedRunner.java:693)
: > 	at
: > com.carrotsearch.randomizedtesting.rules.StatementAdapter.evaluate(Stat
: > ementAdapter.java:36)
: > 	at
: > com.carrotsearch.randomizedtesting.rules.SystemPropertiesRestoreRule$1.
: > evaluate(SystemPropertiesRestoreRule.java:53)
: > 	at
: > org.apache.lucene.util.AbstractBeforeAfterRule$1.evaluate(AbstractBeforeA
: > fterRule.java:46)
: > 	at
: > org.apache.lucene.util.TestRuleStoreClassName$1.evaluate(TestRuleStoreCl
: > assName.java:42)
: > 	at
: > com.carrotsearch.randomizedtesting.rules.SystemPropertiesInvariantRule$1
: > .evaluate(SystemPropertiesInvariantRule.java:55)
: > 	at
: > com.carrotsearch.randomizedtesting.rules.NoShadowingOrOverridesOnMet
: > hodsRule$1.evaluate(NoShadowingOrOverridesOnMethodsRule.java:39)
: > 	at
: > com.carrotsearch.randomizedtesting.rules.NoShadowingOrOverridesOnMet
: > hodsRule$1.evaluate(NoShadowingOrOverridesOnMethodsRule.java:39)
: > 	at
: > com.carrotsearch.randomizedtesting.rules.StatementAdapter.evaluate(Stat
: > ementAdapter.java:36)
: > 	at
: > org.apache.lucene.util.TestRuleAssertionsRequired$1.evaluate(TestRuleAss
: > ertionsRequired.java:43)
: > 	at
: > org.apache.lucene.util.TestRuleMarkFailure$1.evaluate(TestRuleMarkFailure
: > .java:48)
: > 	at
: > org.apache.lucene.util.TestRuleIgnoreAfterMaxFailures$1.evaluate(TestRule
: > IgnoreAfterMaxFailures.java:70)
: > 	at
: > org.apache.lucene.util.TestRuleIgnoreTestSuites$1.evaluate(TestRuleIgnore
: > TestSuites.java:55)
: > 	at
: > com.carrotsearch.randomizedtesting.rules.StatementAdapter.evaluate(Stat
: > ementAdapter.java:36)
: > 	at
: > com.carrotsearch.randomizedtesting.ThreadLeakControl$StatementRunner.
: > run(ThreadLeakControl.java:358)
: > 	at java.lang.Thread.run(Thread.java:679)
: > 
: > 
: > REGRESSION:
: > org.apache.solr.handler.TestReplicationHandler.doTestReplicateAfterStartup
: > 
: > Error Message:
: > 
: > 
: > Stack Trace:
: > java.lang.NullPointerException
: > 	at
: > __randomizedtesting.SeedInfo.seed([687EE273825E73E2:5C914A3C7665E81D
: > ]:0)
: > 	at
: > org.apache.solr.client.solrj.impl.HttpSolrServer.request(HttpSolrServer.java:
: > 269)
: > 	at
: > org.apache.solr.client.solrj.impl.HttpSolrServer.request(HttpSolrServer.java:
: > 182)
: > 	at
: > org.apache.solr.client.solrj.request.AbstractUpdateRequest.process(Abstrac
: > tUpdateRequest.java:117)
: > 	at org.apache.solr.client.solrj.SolrServer.commit(SolrServer.java:168)
: > 	at org.apache.solr.client.solrj.SolrServer.commit(SolrServer.java:146)
: > 	at
: > org.apache.solr.handler.TestReplicationHandler.doTestReplicateAfterStartup
: > (TestReplicationHandler.java:984)
: > 	at sun.reflect.NativeMethodAccessorImpl.invoke0(Native Method)
: > 	at
: > sun.reflect.NativeMethodAccessorImpl.invoke(NativeMethodAccessorImpl.j
: > ava:57)
: > 	at
: > sun.reflect.DelegatingMethodAccessorImpl.invoke(DelegatingMethodAcces
: > sorImpl.java:43)
: > 	at java.lang.reflect.Method.invoke(Method.java:616)
: > 	at
: > com.carrotsearch.randomizedtesting.RandomizedRunner.invoke(Randomize
: > dRunner.java:1559)
: > 	at
: > com.carrotsearch.randomizedtesting.RandomizedRunner.access$600(Rando
: > mizedRunner.java:79)
: > 	at
: > com.carrotsearch.randomizedtesting.RandomizedRunner$6.evaluate(Rando
: > mizedRunner.java:737)
: > 	at
: > com.carrotsearch.randomizedtesting.RandomizedRunner$7.evaluate(Rando
: > mizedRunner.java:773)
: > 	at
: > com.carrotsearch.randomizedtesting.RandomizedRunner$8.evaluate(Rando
: > mizedRunner.java:787)
: > 	at
: > com.carrotsearch.randomizedtesting.rules.SystemPropertiesRestoreRule$1.
: > evaluate(SystemPropertiesRestoreRule.java:53)
: > 	at
: > org.apache.lucene.util.TestRuleSetupTeardownChained$1.evaluate(TestRule
: > SetupTeardownChained.java:50)
: > 	at
: > org.apache.lucene.util.TestRuleFieldCacheSanity$1.evaluate(TestRuleFieldCa
: > cheSanity.java:51)
: > 	at
: > org.apache.lucene.util.AbstractBeforeAfterRule$1.evaluate(AbstractBeforeA
: > fterRule.java:46)
: > 	at
: > com.carrotsearch.randomizedtesting.rules.SystemPropertiesInvariantRule$1
: > .evaluate(SystemPropertiesInvariantRule.java:55)
: > 	at
: > org.apache.lucene.util.TestRuleThreadAndTestName$1.evaluate(TestRuleTh
: > readAndTestName.java:49)
: > 	at
: > org.apache.lucene.util.TestRuleIgnoreAfterMaxFailures$1.evaluate(TestRule
: > IgnoreAfterMaxFailures.java:70)
: > 	at
: > org.apache.lucene.util.TestRuleMarkFailure$1.evaluate(TestRuleMarkFailure
: > .java:48)
: > 	at
: > com.carrotsearch.randomizedtesting.rules.StatementAdapter.evaluate(Stat
: > ementAdapter.java:36)
: > 	at
: > com.carrotsearch.randomizedtesting.ThreadLeakControl$StatementRunner.
: > run(ThreadLeakControl.java:358)
: > 	at
: > com.carrotsearch.randomizedtesting.ThreadLeakControl.forkTimeoutingTask
: > (ThreadLeakControl.java:782)
: > 	at
: > com.carrotsearch.randomizedtesting.ThreadLeakControl$3.evaluate(ThreadL
: > eakControl.java:442)
: > 	at
: > com.carrotsearch.randomizedtesting.RandomizedRunner.runSingleTest(Ran
: > domizedRunner.java:746)
: > 	at
: > com.carrotsearch.randomizedtesting.RandomizedRunner$3.evaluate(Rando
: > mizedRunner.java:648)
: > 	at
: > com.carrotsearch.randomizedtesting.RandomizedRunner$4.evaluate(Rando
: > mizedRunner.java:682)
: > 	at
: > com.carrotsearch.randomizedtesting.RandomizedRunner$5.evaluate(Rando
: > mizedRunner.java:693)
: > 	at
: > com.carrotsearch.randomizedtesting.rules.StatementAdapter.evaluate(Stat
: > ementAdapter.java:36)
: > 	at
: > com.carrotsearch.randomizedtesting.rules.SystemPropertiesRestoreRule$1.
: > evaluate(SystemPropertiesRestoreRule.java:53)
: > 	at
: > org.apache.lucene.util.AbstractBeforeAfterRule$1.evaluate(AbstractBeforeA
: > fterRule.java:46)
: > 	at
: > org.apache.lucene.util.TestRuleStoreClassName$1.evaluate(TestRuleStoreCl
: > assName.java:42)
: > 	at
: > com.carrotsearch.randomizedtesting.rules.SystemPropertiesInvariantRule$1
: > .evaluate(SystemPropertiesInvariantRule.java:55)
: > 	at
: > com.carrotsearch.randomizedtesting.rules.NoShadowingOrOverridesOnMet
: > hodsRule$1.evaluate(NoShadowingOrOverridesOnMethodsRule.java:39)
: > 	at
: > com.carrotsearch.randomizedtesting.rules.NoShadowingOrOverridesOnMet
: > hodsRule$1.evaluate(NoShadowingOrOverridesOnMethodsRule.java:39)
: > 	at
: > com.carrotsearch.randomizedtesting.rules.StatementAdapter.evaluate(Stat
: > ementAdapter.java:36)
: > 	at
: > org.apache.lucene.util.TestRuleAssertionsRequired$1.evaluate(TestRuleAss
: > ertionsRequired.java:43)
: > 	at
: > org.apache.lucene.util.TestRuleMarkFailure$1.evaluate(TestRuleMarkFailure
: > .java:48)
: > 	at
: > org.apache.lucene.util.TestRuleIgnoreAfterMaxFailures$1.evaluate(TestRule
: > IgnoreAfterMaxFailures.java:70)
: > 	at
: > org.apache.lucene.util.TestRuleIgnoreTestSuites$1.evaluate(TestRuleIgnore
: > TestSuites.java:55)
: > 	at
: > com.carrotsearch.randomizedtesting.rules.StatementAdapter.evaluate(Stat
: > ementAdapter.java:36)
: > 	at
: > com.carrotsearch.randomizedtesting.ThreadLeakControl$StatementRunner.
: > run(ThreadLeakControl.java:358)
: > 	at java.lang.Thread.run(Thread.java:679)
: > 
: > 
: > REGRESSION:
: > org.apache.solr.handler.TestReplicationHandler.doTestIndexAndConfigAlias
: > Replication
: > 
: > Error Message:
: > 
: > 
: > Stack Trace:
: > java.lang.NullPointerException
: > 	at
: > __randomizedtesting.SeedInfo.seed([687EE273825E73E2:9F0D0C2B44B6DC0
: > 4]:0)
: > 	at
: > org.apache.solr.client.solrj.impl.HttpSolrServer.request(HttpSolrServer.java:
: > 269)
: > 	at
: > org.apache.solr.client.solrj.impl.HttpSolrServer.request(HttpSolrServer.java:
: > 182)
: > 	at
: > org.apache.solr.client.solrj.request.AbstractUpdateRequest.process(Abstrac
: > tUpdateRequest.java:117)
: > 	at org.apache.solr.client.solrj.SolrServer.commit(SolrServer.java:168)
: > 	at org.apache.solr.client.solrj.SolrServer.commit(SolrServer.java:146)
: > 	at
: > org.apache.solr.handler.TestReplicationHandler.doTestIndexAndConfigAlias
: > Replication(TestReplicationHandler.java:1163)
: > 	at sun.reflect.NativeMethodAccessorImpl.invoke0(Native Method)
: > 	at
: > sun.reflect.NativeMethodAccessorImpl.invoke(NativeMethodAccessorImpl.j
: > ava:57)
: > 	at
: > sun.reflect.DelegatingMethodAccessorImpl.invoke(DelegatingMethodAcces
: > sorImpl.java:43)
: > 	at java.lang.reflect.Method.invoke(Method.java:616)
: > 	at
: > com.carrotsearch.randomizedtesting.RandomizedRunner.invoke(Randomize
: > dRunner.java:1559)
: > 	at
: > com.carrotsearch.randomizedtesting.RandomizedRunner.access$600(Rando
: > mizedRunner.java:79)
: > 	at
: > com.carrotsearch.randomizedtesting.RandomizedRunner$6.evaluate(Rando
: > mizedRunner.java:737)
: > 	at
: > com.carrotsearch.randomizedtesting.RandomizedRunner$7.evaluate(Rando
: > mizedRunner.java:773)
: > 	at
: > com.carrotsearch.randomizedtesting.RandomizedRunner$8.evaluate(Rando
: > mizedRunner.java:787)
: > 	at
: > com.carrotsearch.randomizedtesting.rules.SystemPropertiesRestoreRule$1.
: > evaluate(SystemPropertiesRestoreRule.java:53)
: > 	at
: > org.apache.lucene.util.TestRuleSetupTeardownChained$1.evaluate(TestRule
: > SetupTeardownChained.java:50)
: > 	at
: > org.apache.lucene.util.TestRuleFieldCacheSanity$1.evaluate(TestRuleFieldCa
: > cheSanity.java:51)
: > 	at
: > org.apache.lucene.util.AbstractBeforeAfterRule$1.evaluate(AbstractBeforeA
: > fterRule.java:46)
: > 	at
: > com.carrotsearch.randomizedtesting.rules.SystemPropertiesInvariantRule$1
: > .evaluate(SystemPropertiesInvariantRule.java:55)
: > 	at
: > org.apache.lucene.util.TestRuleThreadAndTestName$1.evaluate(TestRuleTh
: > readAndTestName.java:49)
: > 	at
: > org.apache.lucene.util.TestRuleIgnoreAfterMaxFailures$1.evaluate(TestRule
: > IgnoreAfterMaxFailures.java:70)
: > 	at
: > org.apache.lucene.util.TestRuleMarkFailure$1.evaluate(TestRuleMarkFailure
: > .java:48)
: > 	at
: > com.carrotsearch.randomizedtesting.rules.StatementAdapter.evaluate(Stat
: > ementAdapter.java:36)
: > 	at
: > com.carrotsearch.randomizedtesting.ThreadLeakControl$StatementRunner.
: > run(ThreadLeakControl.java:358)
: > 	at
: > com.carrotsearch.randomizedtesting.ThreadLeakControl.forkTimeoutingTask
: > (ThreadLeakControl.java:782)
: > 	at
: > com.carrotsearch.randomizedtesting.ThreadLeakControl$3.evaluate(ThreadL
: > eakControl.java:442)
: > 	at
: > com.carrotsearch.randomizedtesting.RandomizedRunner.runSingleTest(Ran
: > domizedRunner.java:746)
: > 	at
: > com.carrotsearch.randomizedtesting.RandomizedRunner$3.evaluate(Rando
: > mizedRunner.java:648)
: > 	at
: > com.carrotsearch.randomizedtesting.RandomizedRunner$4.evaluate(Rando
: > mizedRunner.java:682)
: > 	at
: > com.carrotsearch.randomizedtesting.RandomizedRunner$5.evaluate(Rando
: > mizedRunner.java:693)
: > 	at
: > com.carrotsearch.randomizedtesting.rules.StatementAdapter.evaluate(Stat
: > ementAdapter.java:36)
: > 	at
: > com.carrotsearch.randomizedtesting.rules.SystemPropertiesRestoreRule$1.
: > evaluate(SystemPropertiesRestoreRule.java:53)
: > 	at
: > org.apache.lucene.util.AbstractBeforeAfterRule$1.evaluate(AbstractBeforeA
: > fterRule.java:46)
: > 	at
: > org.apache.lucene.util.TestRuleStoreClassName$1.evaluate(TestRuleStoreCl
: > assName.java:42)
: > 	at
: > com.carrotsearch.randomizedtesting.rules.SystemPropertiesInvariantRule$1
: > .evaluate(SystemPropertiesInvariantRule.java:55)
: > 	at
: > com.carrotsearch.randomizedtesting.rules.NoShadowingOrOverridesOnMet
: > hodsRule$1.evaluate(NoShadowingOrOverridesOnMethodsRule.java:39)
: > 	at
: > com.carrotsearch.randomizedtesting.rules.NoShadowingOrOverridesOnMet
: > hodsRule$1.evaluate(NoShadowingOrOverridesOnMethodsRule.java:39)
: > 	at
: > com.carrotsearch.randomizedtesting.rules.StatementAdapter.evaluate(Stat
: > ementAdapter.java:36)
: > 	at
: > org.apache.lucene.util.TestRuleAssertionsRequired$1.evaluate(TestRuleAss
: > ertionsRequired.java:43)
: > 	at
: > org.apache.lucene.util.TestRuleMarkFailure$1.evaluate(TestRuleMarkFailure
: > .java:48)
: > 	at
: > org.apache.lucene.util.TestRuleIgnoreAfterMaxFailures$1.evaluate(TestRule
: > IgnoreAfterMaxFailures.java:70)
: > 	at
: > org.apache.lucene.util.TestRuleIgnoreTestSuites$1.evaluate(TestRuleIgnore
: > TestSuites.java:55)
: > 	at
: > com.carrotsearch.randomizedtesting.rules.StatementAdapter.evaluate(Stat
: > ementAdapter.java:36)
: > 	at
: > com.carrotsearch.randomizedtesting.ThreadLeakControl$StatementRunner.
: > run(ThreadLeakControl.java:358)
: > 	at java.lang.Thread.run(Thread.java:679)
: > 
: > 
: > REGRESSION:  org.apache.solr.handler.TestReplicationHandler.doTestDetails
: > 
: > Error Message:
: > 
: > 
: > Stack Trace:
: > java.lang.NullPointerException
: > 	at
: > __randomizedtesting.SeedInfo.seed([687EE273825E73E2:1223C10614065A6A
: > ]:0)
: > 	at
: > org.apache.solr.client.solrj.impl.HttpSolrServer.request(HttpSolrServer.java:
: > 269)
: > 	at
: > org.apache.solr.client.solrj.impl.HttpSolrServer.request(HttpSolrServer.java:
: > 182)
: > 	at
: > org.apache.solr.client.solrj.request.AbstractUpdateRequest.process(Abstrac
: > tUpdateRequest.java:117)
: > 	at org.apache.solr.client.solrj.SolrServer.commit(SolrServer.java:168)
: > 	at org.apache.solr.client.solrj.SolrServer.commit(SolrServer.java:146)
: > 	at
: > org.apache.solr.handler.TestReplicationHandler.doTestDetails(TestReplicatio
: > nHandler.java:306)
: > 	at sun.reflect.NativeMethodAccessorImpl.invoke0(Native Method)
: > 	at
: > sun.reflect.NativeMethodAccessorImpl.invoke(NativeMethodAccessorImpl.j
: > ava:57)
: > 	at
: > sun.reflect.DelegatingMethodAccessorImpl.invoke(DelegatingMethodAcces
: > sorImpl.java:43)
: > 	at java.lang.reflect.Method.invoke(Method.java:616)
: > 	at
: > com.carrotsearch.randomizedtesting.RandomizedRunner.invoke(Randomize
: > dRunner.java:1559)
: > 	at
: > com.carrotsearch.randomizedtesting.RandomizedRunner.access$600(Rando
: > mizedRunner.java:79)
: > 	at
: > com.carrotsearch.randomizedtesting.RandomizedRunner$6.evaluate(Rando
: > mizedRunner.java:737)
: > 	at
: > com.carrotsearch.randomizedtesting.RandomizedRunner$7.evaluate(Rando
: > mizedRunner.java:773)
: > 	at
: > com.carrotsearch.randomizedtesting.RandomizedRunner$8.evaluate(Rando
: > mizedRunner.java:787)
: > 	at
: > com.carrotsearch.randomizedtesting.rules.SystemPropertiesRestoreRule$1.
: > evaluate(SystemPropertiesRestoreRule.java:53)
: > 	at
: > org.apache.lucene.util.TestRuleSetupTeardownChained$1.evaluate(TestRule
: > SetupTeardownChained.java:50)
: > 	at
: > org.apache.lucene.util.TestRuleFieldCacheSanity$1.evaluate(TestRuleFieldCa
: > cheSanity.java:51)
: > 	at
: > org.apache.lucene.util.AbstractBeforeAfterRule$1.evaluate(AbstractBeforeA
: > fterRule.java:46)
: > 	at
: > com.carrotsearch.randomizedtesting.rules.SystemPropertiesInvariantRule$1
: > .evaluate(SystemPropertiesInvariantRule.java:55)
: > 	at
: > org.apache.lucene.util.TestRuleThreadAndTestName$1.evaluate(TestRuleTh
: > readAndTestName.java:49)
: > 	at
: > org.apache.lucene.util.TestRuleIgnoreAfterMaxFailures$1.evaluate(TestRule
: > IgnoreAfterMaxFailures.java:70)
: > 	at
: > org.apache.lucene.util.TestRuleMarkFailure$1.evaluate(TestRuleMarkFailure
: > .java:48)
: > 	at
: > com.carrotsearch.randomizedtesting.rules.StatementAdapter.evaluate(Stat
: > ementAdapter.java:36)
: > 	at
: > com.carrotsearch.randomizedtesting.ThreadLeakControl$StatementRunner.
: > run(ThreadLeakControl.java:358)
: > 	at
: > com.carrotsearch.randomizedtesting.ThreadLeakControl.forkTimeoutingTask
: > (ThreadLeakControl.java:782)
: > 	at
: > com.carrotsearch.randomizedtesting.ThreadLeakControl$3.evaluate(ThreadL
: > eakControl.java:442)
: > 	at
: > com.carrotsearch.randomizedtesting.RandomizedRunner.runSingleTest(Ran
: > domizedRunner.java:746)
: > 	at
: > com.carrotsearch.randomizedtesting.RandomizedRunner$3.evaluate(Rando
: > mizedRunner.java:648)
: > 	at
: > com.carrotsearch.randomizedtesting.RandomizedRunner$4.evaluate(Rando
: > mizedRunner.java:682)
: > 	at
: > com.carrotsearch.randomizedtesting.RandomizedRunner$5.evaluate(Rando
: > mizedRunner.java:693)
: > 	at
: > com.carrotsearch.randomizedtesting.rules.StatementAdapter.evaluate(Stat
: > ementAdapter.java:36)
: > 	at
: > com.carrotsearch.randomizedtesting.rules.SystemPropertiesRestoreRule$1.
: > evaluate(SystemPropertiesRestoreRule.java:53)
: > 	at
: > org.apache.lucene.util.AbstractBeforeAfterRule$1.evaluate(AbstractBeforeA
: > fterRule.java:46)
: > 	at
: > org.apache.lucene.util.TestRuleStoreClassName$1.evaluate(TestRuleStoreCl
: > assName.java:42)
: > 	at
: > com.carrotsearch.randomizedtesting.rules.SystemPropertiesInvariantRule$1
: > .evaluate(SystemPropertiesInvariantRule.java:55)
: > 	at
: > com.carrotsearch.randomizedtesting.rules.NoShadowingOrOverridesOnMet
: > hodsRule$1.evaluate(NoShadowingOrOverridesOnMethodsRule.java:39)
: > 	at
: > com.carrotsearch.randomizedtesting.rules.NoShadowingOrOverridesOnMet
: > hodsRule$1.evaluate(NoShadowingOrOverridesOnMethodsRule.java:39)
: > 	at
: > com.carrotsearch.randomizedtesting.rules.StatementAdapter.evaluate(Stat
: > ementAdapter.java:36)
: > 	at
: > org.apache.lucene.util.TestRuleAssertionsRequired$1.evaluate(TestRuleAss
: > ertionsRequired.java:43)
: > 	at
: > org.apache.lucene.util.TestRuleMarkFailure$1.evaluate(TestRuleMarkFailure
: > .java:48)
: > 	at
: > org.apache.lucene.util.TestRuleIgnoreAfterMaxFailures$1.evaluate(TestRule
: > IgnoreAfterMaxFailures.java:70)
: > 	at
: > org.apache.lucene.util.TestRuleIgnoreTestSuites$1.evaluate(TestRuleIgnore
: > TestSuites.java:55)
: > 	at
: > com.carrotsearch.randomizedtesting.rules.StatementAdapter.evaluate(Stat
: > ementAdapter.java:36)
: > 	at
: > com.carrotsearch.randomizedtesting.ThreadLeakControl$StatementRunner.
: > run(ThreadLeakControl.java:358)
: > 	at java.lang.Thread.run(Thread.java:679)
: > 
: > 
: > REGRESSION:
: > org.apache.solr.handler.TestReplicationHandler.testEmptyCommits
: > 
: > Error Message:
: > 
: > 
: > Stack Trace:
: > java.lang.NullPointerException
: > 	at
: > __randomizedtesting.SeedInfo.seed([687EE273825E73E2:4F1E7AC4C9757797
: > ]:0)
: > 	at
: > org.apache.solr.client.solrj.impl.HttpSolrServer.request(HttpSolrServer.java:
: > 269)
: > 	at
: > org.apache.solr.client.solrj.impl.HttpSolrServer.request(HttpSolrServer.java:
: > 182)
: > 	at
: > org.apache.solr.client.solrj.request.AbstractUpdateRequest.process(Abstrac
: > tUpdateRequest.java:117)
: > 	at
: > org.apache.solr.handler.TestReplicationHandler.emptyUpdate(TestReplicatio
: > nHandler.java:1429)
: > 	at
: > org.apache.solr.handler.TestReplicationHandler.testEmptyCommits(TestRepl
: > icationHandler.java:351)
: > 	at sun.reflect.NativeMethodAccessorImpl.invoke0(Native Method)
: > 	at
: > sun.reflect.NativeMethodAccessorImpl.invoke(NativeMethodAccessorImpl.j
: > ava:57)
: > 	at
: > sun.reflect.DelegatingMethodAccessorImpl.invoke(DelegatingMethodAcces
: > sorImpl.java:43)
: > 	at java.lang.reflect.Method.invoke(Method.java:616)
: > 	at
: > com.carrotsearch.randomizedtesting.RandomizedRunner.invoke(Randomize
: > dRunner.java:1559)
: > 	at
: > com.carrotsearch.randomizedtesting.RandomizedRunner.access$600(Rando
: > mizedRunner.java:79)
: > 	at
: > com.carrotsearch.randomizedtesting.RandomizedRunner$6.evaluate(Rando
: > mizedRunner.java:737)
: > 	at
: > com.carrotsearch.randomizedtesting.RandomizedRunner$7.evaluate(Rando
: > mizedRunner.java:773)
: > 	at
: > com.carrotsearch.randomizedtesting.RandomizedRunner$8.evaluate(Rando
: > mizedRunner.java:787)
: > 	at
: > com.carrotsearch.randomizedtesting.rules.SystemPropertiesRestoreRule$1.
: > evaluate(SystemPropertiesRestoreRule.java:53)
: > 	at
: > org.apache.lucene.util.TestRuleSetupTeardownChained$1.evaluate(TestRule
: > SetupTeardownChained.java:50)
: > 	at
: > org.apache.lucene.util.TestRuleFieldCacheSanity$1.evaluate(TestRuleFieldCa
: > cheSanity.java:51)
: > 	at
: > org.apache.lucene.util.AbstractBeforeAfterRule$1.evaluate(AbstractBeforeA
: > fterRule.java:46)
: > 	at
: > com.carrotsearch.randomizedtesting.rules.SystemPropertiesInvariantRule$1
: > .evaluate(SystemPropertiesInvariantRule.java:55)
: > 	at
: > org.apache.lucene.util.TestRuleThreadAndTestName$1.evaluate(TestRuleTh
: > readAndTestName.java:49)
: > 	at
: > org.apache.lucene.util.TestRuleIgnoreAfterMaxFailures$1.evaluate(TestRule
: > IgnoreAfterMaxFailures.java:70)
: > 	at
: > org.apache.lucene.util.TestRuleMarkFailure$1.evaluate(TestRuleMarkFailure
: > .java:48)
: > 	at
: > com.carrotsearch.randomizedtesting.rules.StatementAdapter.evaluate(Stat
: > ementAdapter.java:36)
: > 	at
: > com.carrotsearch.randomizedtesting.ThreadLeakControl$StatementRunner.
: > run(ThreadLeakControl.java:358)
: > 	at
: > com.carrotsearch.randomizedtesting.ThreadLeakControl.forkTimeoutingTask
: > (ThreadLeakControl.java:782)
: > 	at
: > com.carrotsearch.randomizedtesting.ThreadLeakControl$3.evaluate(ThreadL
: > eakControl.java:442)
: > 	at
: > com.carrotsearch.randomizedtesting.RandomizedRunner.runSingleTest(Ran
: > domizedRunner.java:746)
: > 	at
: > com.carrotsearch.randomizedtesting.RandomizedRunner$3.evaluate(Rando
: > mizedRunner.java:648)
: > 	at
: > com.carrotsearch.randomizedtesting.RandomizedRunner$4.evaluate(Rando
: > mizedRunner.java:682)
: > 	at
: > com.carrotsearch.randomizedtesting.RandomizedRunner$5.evaluate(Rando
: > mizedRunner.java:693)
: > 	at
: > com.carrotsearch.randomizedtesting.rules.StatementAdapter.evaluate(Stat
: > ementAdapter.java:36)
: > 	at
: > com.carrotsearch.randomizedtesting.rules.SystemPropertiesRestoreRule$1.
: > evaluate(SystemPropertiesRestoreRule.java:53)
: > 	at
: > org.apache.lucene.util.AbstractBeforeAfterRule$1.evaluate(AbstractBeforeA
: > fterRule.java:46)
: > 	at
: > org.apache.lucene.util.TestRuleStoreClassName$1.evaluate(TestRuleStoreCl
: > assName.java:42)
: > 	at
: > com.carrotsearch.randomizedtesting.rules.SystemPropertiesInvariantRule$1
: > .evaluate(SystemPropertiesInvariantRule.java:55)
: > 	at
: > com.carrotsearch.randomizedtesting.rules.NoShadowingOrOverridesOnMet
: > hodsRule$1.evaluate(NoShadowingOrOverridesOnMethodsRule.java:39)
: > 	at
: > com.carrotsearch.randomizedtesting.rules.NoShadowingOrOverridesOnMet
: > hodsRule$1.evaluate(NoShadowingOrOverridesOnMethodsRule.java:39)
: > 	at
: > com.carrotsearch.randomizedtesting.rules.StatementAdapter.evaluate(Stat
: > ementAdapter.java:36)
: > 	at
: > org.apache.lucene.util.TestRuleAssertionsRequired$1.evaluate(TestRuleAss
: > ertionsRequired.java:43)
: > 	at
: > org.apache.lucene.util.TestRuleMarkFailure$1.evaluate(TestRuleMarkFailure
: > .java:48)
: > 	at
: > org.apache.lucene.util.TestRuleIgnoreAfterMaxFailures$1.evaluate(TestRule
: > IgnoreAfterMaxFailures.java:70)
: > 	at
: > org.apache.lucene.util.TestRuleIgnoreTestSuites$1.evaluate(TestRuleIgnore
: > TestSuites.java:55)
: > 	at
: > com.carrotsearch.randomizedtesting.rules.StatementAdapter.evaluate(Stat
: > ementAdapter.java:36)
: > 	at
: > com.carrotsearch.randomizedtesting.ThreadLeakControl$StatementRunner.
: > run(ThreadLeakControl.java:358)
: > 	at java.lang.Thread.run(Thread.java:679)
: > 
: > 
: > REGRESSION:
: > org.apache.solr.handler.TestReplicationHandler.doTestIndexAndConfigRepli
: > cation
: > 
: > Error Message:
: > 
: > 
: > Stack Trace:
: > java.lang.NullPointerException
: > 	at
: > __randomizedtesting.SeedInfo.seed([687EE273825E73E2:7C36B926A159CEFC
: > ]:0)
: > 	at
: > org.apache.solr.client.solrj.impl.HttpSolrServer.request(HttpSolrServer.java:
: > 269)
: > 	at
: > org.apache.solr.client.solrj.impl.HttpSolrServer.request(HttpSolrServer.java:
: > 182)
: > 	at
: > org.apache.solr.client.solrj.request.AbstractUpdateRequest.process(Abstrac
: > tUpdateRequest.java:117)
: > 	at org.apache.solr.client.solrj.SolrServer.commit(SolrServer.java:168)
: > 	at org.apache.solr.client.solrj.SolrServer.commit(SolrServer.java:146)
: > 	at
: > org.apache.solr.handler.TestReplicationHandler.doTestIndexAndConfigRepli
: > cation(TestReplicationHandler.java:464)
: > 	at sun.reflect.NativeMethodAccessorImpl.invoke0(Native Method)
: > 	at
: > sun.reflect.NativeMethodAccessorImpl.invoke(NativeMethodAccessorImpl.j
: > ava:57)
: > 	at
: > sun.reflect.DelegatingMethodAccessorImpl.invoke(DelegatingMethodAcces
: > sorImpl.java:43)
: > 	at java.lang.reflect.Method.invoke(Method.java:616)
: > 	at
: > com.carrotsearch.randomizedtesting.RandomizedRunner.invoke(Randomize
: > dRunner.java:1559)
: > 	at
: > com.carrotsearch.randomizedtesting.RandomizedRunner.access$600(Rando
: > mizedRunner.java:79)
: > 	at
: > com.carrotsearch.randomizedtesting.RandomizedRunner$6.evaluate(Rando
: > mizedRunner.java:737)
: > 	at
: > com.carrotsearch.randomizedtesting.RandomizedRunner$7.evaluate(Rando
: > mizedRunner.java:773)
: > 	at
: > com.carrotsearch.randomizedtesting.RandomizedRunner$8.evaluate(Rando
: > mizedRunner.java:787)
: > 	at
: > com.carrotsearch.randomizedtesting.rules.SystemPropertiesRestoreRule$1.
: > evaluate(SystemPropertiesRestoreRule.java:53)
: > 	at
: > org.apache.lucene.util.TestRuleSetupTeardownChained$1.evaluate(TestRule
: > SetupTeardownChained.java:50)
: > 	at
: > org.apache.lucene.util.TestRuleFieldCacheSanity$1.evaluate(TestRuleFieldCa
: > cheSanity.java:51)
: > 	at
: > org.apache.lucene.util.AbstractBeforeAfterRule$1.evaluate(AbstractBeforeA
: > fterRule.java:46)
: > 	at
: > com.carrotsearch.randomizedtesting.rules.SystemPropertiesInvariantRule$1
: > .evaluate(SystemPropertiesInvariantRule.java:55)
: > 	at
: > org.apache.lucene.util.TestRuleThreadAndTestName$1.evaluate(TestRuleTh
: > readAndTestName.java:49)
: > 	at
: > org.apache.lucene.util.TestRuleIgnoreAfterMaxFailures$1.evaluate(TestRule
: > IgnoreAfterMaxFailures.java:70)
: > 	at
: > org.apache.lucene.util.TestRuleMarkFailure$1.evaluate(TestRuleMarkFailure
: > .java:48)
: > 	at
: > com.carrotsearch.randomizedtesting.rules.StatementAdapter.evaluate(Stat
: > ementAdapter.java:36)
: > 	at
: > com.carrotsearch.randomizedtesting.ThreadLeakControl$StatementRunner.
: > run(ThreadLeakControl.java:358)
: > 	at
: > com.carrotsearch.randomizedtesting.ThreadLeakControl.forkTimeoutingTask
: > (ThreadLeakControl.java:782)
: > 	at
: > com.carrotsearch.randomizedtesting.ThreadLeakControl$3.evaluate(ThreadL
: > eakControl.java:442)
: > 	at
: > com.carrotsearch.randomizedtesting.RandomizedRunner.runSingleTest(Ran
: > domizedRunner.java:746)
: > 	at
: > com.carrotsearch.randomizedtesting.RandomizedRunner$3.evaluate(Rando
: > mizedRunner.java:648)
: > 	at
: > com.carrotsearch.randomizedtesting.RandomizedRunner$4.evaluate(Rando
: > mizedRunner.java:682)
: > 	at
: > com.carrotsearch.randomizedtesting.RandomizedRunner$5.evaluate(Rando
: > mizedRunner.java:693)
: > 	at
: > com.carrotsearch.randomizedtesting.rules.StatementAdapter.evaluate(Stat
: > ementAdapter.java:36)
: > 	at
: > com.carrotsearch.randomizedtesting.rules.SystemPropertiesRestoreRule$1.
: > evaluate(SystemPropertiesRestoreRule.java:53)
: > 	at
: > org.apache.lucene.util.AbstractBeforeAfterRule$1.evaluate(AbstractBeforeA
: > fterRule.java:46)
: > 	at
: > org.apache.lucene.util.TestRuleStoreClassName$1.evaluate(TestRuleStoreCl
: > assName.java:42)
: > 	at
: > com.carrotsearch.randomizedtesting.rules.SystemPropertiesInvariantRule$1
: > .evaluate(SystemPropertiesInvariantRule.java:55)
: > 	at
: > com.carrotsearch.randomizedtesting.rules.NoShadowingOrOverridesOnMet
: > hodsRule$1.evaluate(NoShadowingOrOverridesOnMethodsRule.java:39)
: > 	at
: > com.carrotsearch.randomizedtesting.rules.NoShadowingOrOverridesOnMet
: > hodsRule$1.evaluate(NoShadowingOrOverridesOnMethodsRule.java:39)
: > 	at
: > com.carrotsearch.randomizedtesting.rules.StatementAdapter.evaluate(Stat
: > ementAdapter.java:36)
: > 	at
: > org.apache.lucene.util.TestRuleAssertionsRequired$1.evaluate(TestRuleAss
: > ertionsRequired.java:43)
: > 	at
: > org.apache.lucene.util.TestRuleMarkFailure$1.evaluate(TestRuleMarkFailure
: > .java:48)
: > 	at
: > org.apache.lucene.util.TestRuleIgnoreAfterMaxFailures$1.evaluate(TestRule
: > IgnoreAfterMaxFailures.java:70)
: > 	at
: > org.apache.lucene.util.TestRuleIgnoreTestSuites$1.evaluate(TestRuleIgnore
: > TestSuites.java:55)
: > 	at
: > com.carrotsearch.randomizedtesting.rules.StatementAdapter.evaluate(Stat
: > ementAdapter.java:36)
: > 	at
: > com.carrotsearch.randomizedtesting.ThreadLeakControl$StatementRunner.
: > run(ThreadLeakControl.java:358)
: > 	at java.lang.Thread.run(Thread.java:679)
: > 
: > 
: > REGRESSION:
: > org.apache.solr.handler.TestReplicationHandler.doTestReplicateAfterCoreRe
: > load
: > 
: > Error Message:
: > 
: > 
: > Stack Trace:
: > java.lang.NullPointerException
: > 	at
: > __randomizedtesting.SeedInfo.seed([687EE273825E73E2:4DA9F943F2167DE1
: > ]:0)
: > 	at
: > org.apache.solr.client.solrj.impl.HttpSolrServer.request(HttpSolrServer.java:
: > 269)
: > 	at
: > org.apache.solr.client.solrj.impl.HttpSolrServer.request(HttpSolrServer.java:
: > 182)
: > 	at
: > org.apache.solr.client.solrj.request.AbstractUpdateRequest.process(Abstrac
: > tUpdateRequest.java:117)
: > 	at org.apache.solr.client.solrj.SolrServer.commit(SolrServer.java:168)
: > 	at org.apache.solr.client.solrj.SolrServer.commit(SolrServer.java:146)
: > 	at
: > org.apache.solr.handler.TestReplicationHandler.doTestReplicateAfterCoreRe
: > load(TestReplicationHandler.java:1109)
: > 	at sun.reflect.NativeMethodAccessorImpl.invoke0(Native Method)
: > 	at
: > sun.reflect.NativeMethodAccessorImpl.invoke(NativeMethodAccessorImpl.j
: > ava:57)
: > 	at
: > sun.reflect.DelegatingMethodAccessorImpl.invoke(DelegatingMethodAcces
: > sorImpl.java:43)
: > 	at java.lang.reflect.Method.invoke(Method.java:616)
: > 	at
: > com.carrotsearch.randomizedtesting.RandomizedRunner.invoke(Randomize
: > dRunner.java:1559)
: > 	at
: > com.carrotsearch.randomizedtesting.RandomizedRunner.access$600(Rando
: > mizedRunner.java:79)
: > 	at
: > com.carrotsearch.randomizedtesting.RandomizedRunner$6.evaluate(Rando
: > mizedRunner.java:737)
: > 	at
: > com.carrotsearch.randomizedtesting.RandomizedRunner$7.evaluate(Rando
: > mizedRunner.java:773)
: > 	at
: > com.carrotsearch.randomizedtesting.RandomizedRunner$8.evaluate(Rando
: > mizedRunner.java:787)
: > 	at
: > com.carrotsearch.randomizedtesting.rules.SystemPropertiesRestoreRule$1.
: > evaluate(SystemPropertiesRestoreRule.java:53)
: > 	at
: > org.apache.lucene.util.TestRuleSetupTeardownChained$1.evaluate(TestRule
: > SetupTeardownChained.java:50)
: > 	at
: > org.apache.lucene.util.TestRuleFieldCacheSanity$1.evaluate(TestRuleFieldCa
: > cheSanity.java:51)
: > 	at
: > org.apache.lucene.util.AbstractBeforeAfterRule$1.evaluate(AbstractBeforeA
: > fterRule.java:46)
: > 	at
: > com.carrotsearch.randomizedtesting.rules.SystemPropertiesInvariantRule$1
: > .evaluate(SystemPropertiesInvariantRule.java:55)
: > 	at
: > org.apache.lucene.util.TestRuleThreadAndTestName$1.evaluate(TestRuleTh
: > readAndTestName.java:49)
: > 	at
: > org.apache.lucene.util.TestRuleIgnoreAfterMaxFailures$1.evaluate(TestRule
: > IgnoreAfterMaxFailures.java:70)
: > 	at
: > org.apache.lucene.util.TestRuleMarkFailure$1.evaluate(TestRuleMarkFailure
: > .java:48)
: > 	at
: > com.carrotsearch.randomizedtesting.rules.StatementAdapter.evaluate(Stat
: > ementAdapter.java:36)
: > 	at
: > com.carrotsearch.randomizedtesting.ThreadLeakControl$StatementRunner.
: > run(ThreadLeakControl.java:358)
: > 	at
: > com.carrotsearch.randomizedtesting.ThreadLeakControl.forkTimeoutingTask
: > (ThreadLeakControl.java:782)
: > 	at
: > com.carrotsearch.randomizedtesting.ThreadLeakControl$3.evaluate(ThreadL
: > eakControl.java:442)
: > 	at
: > com.carrotsearch.randomizedtesting.RandomizedRunner.runSingleTest(Ran
: > domizedRunner.java:746)
: > 	at
: > com.carrotsearch.randomizedtesting.RandomizedRunner$3.evaluate(Rando
: > mizedRunner.java:648)
: > 	at
: > com.carrotsearch.randomizedtesting.RandomizedRunner$4.evaluate(Rando
: > mizedRunner.java:682)
: > 	at
: > com.carrotsearch.randomizedtesting.RandomizedRunner$5.evaluate(Rando
: > mizedRunner.java:693)
: > 	at
: > com.carrotsearch.randomizedtesting.rules.StatementAdapter.evaluate(Stat
: > ementAdapter.java:36)
: > 	at
: > com.carrotsearch.randomizedtesting.rules.SystemPropertiesRestoreRule$1.
: > evaluate(SystemPropertiesRestoreRule.java:53)
: > 	at
: > org.apache.lucene.util.AbstractBeforeAfterRule$1.evaluate(AbstractBeforeA
: > fterRule.java:46)
: > 	at
: > org.apache.lucene.util.TestRuleStoreClassName$1.evaluate(TestRuleStoreCl
: > assName.java:42)
: > 	at
: > com.carrotsearch.randomizedtesting.rules.SystemPropertiesInvariantRule$1
: > .evaluate(SystemPropertiesInvariantRule.java:55)
: > 	at
: > com.carrotsearch.randomizedtesting.rules.NoShadowingOrOverridesOnMet
: > hodsRule$1.evaluate(NoShadowingOrOverridesOnMethodsRule.java:39)
: > 	at
: > com.carrotsearch.randomizedtesting.rules.NoShadowingOrOverridesOnMet
: > hodsRule$1.evaluate(NoShadowingOrOverridesOnMethodsRule.java:39)
: > 	at
: > com.carrotsearch.randomizedtesting.rules.StatementAdapter.evaluate(Stat
: > ementAdapter.java:36)
: > 	at
: > org.apache.lucene.util.TestRuleAssertionsRequired$1.evaluate(TestRuleAss
: > ertionsRequired.java:43)
: > 	at
: > org.apache.lucene.util.TestRuleMarkFailure$1.evaluate(TestRuleMarkFailure
: > .java:48)
: > 	at
: > org.apache.lucene.util.TestRuleIgnoreAfterMaxFailures$1.evaluate(TestRule
: > IgnoreAfterMaxFailures.java:70)
: > 	at
: > org.apache.lucene.util.TestRuleIgnoreTestSuites$1.evaluate(TestRuleIgnore
: > TestSuites.java:55)
: > 	at
: > com.carrotsearch.randomizedtesting.rules.StatementAdapter.evaluate(Stat
: > ementAdapter.java:36)
: > 	at
: > com.carrotsearch.randomizedtesting.ThreadLeakControl$StatementRunner.
: > run(ThreadLeakControl.java:358)
: > 	at java.lang.Thread.run(Thread.java:679)
: > 
: > 
: > REGRESSION:
: > org.apache.solr.handler.TestReplicationHandler.doTestReplicateAfterWrite2
: > Slave
: > 
: > Error Message:
: > 
: > 
: > Stack Trace:
: > java.lang.NullPointerException
: > 	at
: > __randomizedtesting.SeedInfo.seed([687EE273825E73E2:E3866B5F7891A6AA
: > ]:0)
: > 	at
: > org.apache.solr.client.solrj.impl.HttpSolrServer.request(HttpSolrServer.java:
: > 269)
: > 	at
: > org.apache.solr.client.solrj.impl.HttpSolrServer.request(HttpSolrServer.java:
: > 182)
: > 	at
: > org.apache.solr.client.solrj.request.AbstractUpdateRequest.process(Abstrac
: > tUpdateRequest.java:117)
: > 	at org.apache.solr.client.solrj.SolrServer.commit(SolrServer.java:168)
: > 	at org.apache.solr.client.solrj.SolrServer.commit(SolrServer.java:146)
: > 	at
: > org.apache.solr.handler.TestReplicationHandler.doTestReplicateAfterWrite2
: > Slave(TestReplicationHandler.java:403)
: > 	at sun.reflect.NativeMethodAccessorImpl.invoke0(Native Method)
: > 	at
: > sun.reflect.NativeMethodAccessorImpl.invoke(NativeMethodAccessorImpl.j
: > ava:57)
: > 	at
: > sun.reflect.DelegatingMethodAccessorImpl.invoke(DelegatingMethodAcces
: > sorImpl.java:43)
: > 	at java.lang.reflect.Method.invoke(Method.java:616)
: > 	at
: > com.carrotsearch.randomizedtesting.RandomizedRunner.invoke(Randomize
: > dRunner.java:1559)
: > 	at
: > com.carrotsearch.randomizedtesting.RandomizedRunner.access$600(Rando
: > mizedRunner.java:79)
: > 	at
: > com.carrotsearch.randomizedtesting.RandomizedRunner$6.evaluate(Rando
: > mizedRunner.java:737)
: > 	at
: > com.carrotsearch.randomizedtesting.RandomizedRunner$7.evaluate(Rando
: > mizedRunner.java:773)
: > 	at
: > com.carrotsearch.randomizedtesting.RandomizedRunner$8.evaluate(Rando
: > mizedRunner.java:787)
: > 	at
: > com.carrotsearch.randomizedtesting.rules.SystemPropertiesRestoreRule$1.
: > evaluate(SystemPropertiesRestoreRule.java:53)
: > 	at
: > org.apache.lucene.util.TestRuleSetupTeardownChained$1.evaluate(TestRule
: > SetupTeardownChained.java:50)
: > 	at
: > org.apache.lucene.util.TestRuleFieldCacheSanity$1.evaluate(TestRuleFieldCa
: > cheSanity.java:51)
: > 	at
: > org.apache.lucene.util.AbstractBeforeAfterRule$1.evaluate(AbstractBeforeA
: > fterRule.java:46)
: > 	at
: > com.carrotsearch.randomizedtesting.rules.SystemPropertiesInvariantRule$1
: > .evaluate(SystemPropertiesInvariantRule.java:55)
: > 	at
: > org.apache.lucene.util.TestRuleThreadAndTestName$1.evaluate(TestRuleTh
: > readAndTestName.java:49)
: > 	at
: > org.apache.lucene.util.TestRuleIgnoreAfterMaxFailures$1.evaluate(TestRule
: > IgnoreAfterMaxFailures.java:70)
: > 	at
: > org.apache.lucene.util.TestRuleMarkFailure$1.evaluate(TestRuleMarkFailure
: > .java:48)
: > 	at
: > com.carrotsearch.randomizedtesting.rules.StatementAdapter.evaluate(Stat
: > ementAdapter.java:36)
: > 	at
: > com.carrotsearch.randomizedtesting.ThreadLeakControl$StatementRunner.
: > run(ThreadLeakControl.java:358)
: > 	at
: > com.carrotsearch.randomizedtesting.ThreadLeakControl.forkTimeoutingTask
: > (ThreadLeakControl.java:782)
: > 	at
: > com.carrotsearch.randomizedtesting.ThreadLeakControl$3.evaluate(ThreadL
: > eakControl.java:442)
: > 	at
: > com.carrotsearch.randomizedtesting.RandomizedRunner.runSingleTest(Ran
: > domizedRunner.java:746)
: > 	at
: > com.carrotsearch.randomizedtesting.RandomizedRunner$3.evaluate(Rando
: > mizedRunner.java:648)
: > 	at
: > com.carrotsearch.randomizedtesting.RandomizedRunner$4.evaluate(Rando
: > mizedRunner.java:682)
: > 	at
: > com.carrotsearch.randomizedtesting.RandomizedRunner$5.evaluate(Rando
: > mizedRunner.java:693)
: > 	at
: > com.carrotsearch.randomizedtesting.rules.StatementAdapter.evaluate(Stat
: > ementAdapter.java:36)
: > 	at
: > com.carrotsearch.randomizedtesting.rules.SystemPropertiesRestoreRule$1.
: > evaluate(SystemPropertiesRestoreRule.java:53)
: > 	at
: > org.apache.lucene.util.AbstractBeforeAfterRule$1.evaluate(AbstractBeforeA
: > fterRule.java:46)
: > 	at
: > org.apache.lucene.util.TestRuleStoreClassName$1.evaluate(TestRuleStoreCl
: > assName.java:42)
: > 	at
: > com.carrotsearch.randomizedtesting.rules.SystemPropertiesInvariantRule$1
: > .evaluate(SystemPropertiesInvariantRule.java:55)
: > 	at
: > com.carrotsearch.randomizedtesting.rules.NoShadowingOrOverridesOnMet
: > hodsRule$1.evaluate(NoShadowingOrOverridesOnMethodsRule.java:39)
: > 	at
: > com.carrotsearch.randomizedtesting.rules.NoShadowingOrOverridesOnMet
: > hodsRule$1.evaluate(NoShadowingOrOverridesOnMethodsRule.java:39)
: > 	at
: > com.carrotsearch.randomizedtesting.rules.StatementAdapter.evaluate(Stat
: > ementAdapter.java:36)
: > 	at
: > org.apache.lucene.util.TestRuleAssertionsRequired$1.evaluate(TestRuleAss
: > ertionsRequired.java:43)
: > 	at
: > org.apache.lucene.util.TestRuleMarkFailure$1.evaluate(TestRuleMarkFailure
: > .java:48)
: > 	at
: > org.apache.lucene.util.TestRuleIgnoreAfterMaxFailures$1.evaluate(TestRule
: > IgnoreAfterMaxFailures.java:70)
: > 	at
: > org.apache.lucene.util.TestRuleIgnoreTestSuites$1.evaluate(TestRuleIgnore
: > TestSuites.java:55)
: > 	at
: > com.carrotsearch.randomizedtesting.rules.StatementAdapter.evaluate(Stat
: > ementAdapter.java:36)
: > 	at
: > com.carrotsearch.randomizedtesting.ThreadLeakControl$StatementRunner.
: > run(ThreadLeakControl.java:358)
: > 	at java.lang.Thread.run(Thread.java:679)
: > 
: > 
: > REGRESSION:
: > org.apache.solr.handler.TestReplicationHandler.doTestStressReplication
: > 
: > Error Message:
: > 
: > 
: > Stack Trace:
: > java.lang.NullPointerException
: > 	at
: > __randomizedtesting.SeedInfo.seed([687EE273825E73E2:B3D5E2B587761A51
: > ]:0)
: > 	at
: > org.apache.solr.client.solrj.impl.HttpSolrServer.request(HttpSolrServer.java:
: > 269)
: > 	at
: > org.apache.solr.client.solrj.impl.HttpSolrServer.request(HttpSolrServer.java:
: > 182)
: > 	at
: > org.apache.solr.client.solrj.request.AbstractUpdateRequest.process(Abstrac
: > tUpdateRequest.java:117)
: > 	at org.apache.solr.client.solrj.SolrServer.commit(SolrServer.java:168)
: > 	at org.apache.solr.client.solrj.SolrServer.commit(SolrServer.java:146)
: > 	at
: > org.apache.solr.handler.TestReplicationHandler.doTestStressReplication(Tes
: > tReplicationHandler.java:743)
: > 	at sun.reflect.NativeMethodAccessorImpl.invoke0(Native Method)
: > 	at
: > sun.reflect.NativeMethodAccessorImpl.invoke(NativeMethodAccessorImpl.j
: > ava:57)
: > 	at
: > sun.reflect.DelegatingMethodAccessorImpl.invoke(DelegatingMethodAcces
: > sorImpl.java:43)
: > 	at java.lang.reflect.Method.invoke(Method.java:616)
: > 	at
: > com.carrotsearch.randomizedtesting.RandomizedRunner.invoke(Randomize
: > dRunner.java:1559)
: > 	at
: > com.carrotsearch.randomizedtesting.RandomizedRunner.access$600(Rando
: > mizedRunner.java:79)
: > 	at
: > com.carrotsearch.randomizedtesting.RandomizedRunner$6.evaluate(Rando
: > mizedRunner.java:737)
: > 	at
: > com.carrotsearch.randomizedtesting.RandomizedRunner$7.evaluate(Rando
: > mizedRunner.java:773)
: > 	at
: > com.carrotsearch.randomizedtesting.RandomizedRunner$8.evaluate(Rando
: > mizedRunner.java:787)
: > 	at
: > com.carrotsearch.randomizedtesting.rules.SystemPropertiesRestoreRule$1.
: > evaluate(SystemPropertiesRestoreRule.java:53)
: > 	at
: > org.apache.lucene.util.TestRuleSetupTeardownChained$1.evaluate(TestRule
: > SetupTeardownChained.java:50)
: > 	at
: > org.apache.lucene.util.TestRuleFieldCacheSanity$1.evaluate(TestRuleFieldCa
: > cheSanity.java:51)
: > 	at
: > org.apache.lucene.util.AbstractBeforeAfterRule$1.evaluate(AbstractBeforeA
: > fterRule.java:46)
: > 	at
: > com.carrotsearch.randomizedtesting.rules.SystemPropertiesInvariantRule$1
: > .evaluate(SystemPropertiesInvariantRule.java:55)
: > 	at
: > org.apache.lucene.util.TestRuleThreadAndTestName$1.evaluate(TestRuleTh
: > readAndTestName.java:49)
: > 	at
: > org.apache.lucene.util.TestRuleIgnoreAfterMaxFailures$1.evaluate(TestRule
: > IgnoreAfterMaxFailures.java:70)
: > 	at
: > org.apache.lucene.util.TestRuleMarkFailure$1.evaluate(TestRuleMarkFailure
: > .java:48)
: > 	at
: > com.carrotsearch.randomizedtesting.rules.StatementAdapter.evaluate(Stat
: > ementAdapter.java:36)
: > 	at
: > com.carrotsearch.randomizedtesting.ThreadLeakControl$StatementRunner.
: > run(ThreadLeakControl.java:358)
: > 	at
: > com.carrotsearch.randomizedtesting.ThreadLeakControl.forkTimeoutingTask
: > (ThreadLeakControl.java:782)
: > 	at
: > com.carrotsearch.randomizedtesting.ThreadLeakControl$3.evaluate(ThreadL
: > eakControl.java:442)
: > 	at
: > com.carrotsearch.randomizedtesting.RandomizedRunner.runSingleTest(Ran
: > domizedRunner.java:746)
: > 	at
: > com.carrotsearch.randomizedtesting.RandomizedRunner$3.evaluate(Rando
: > mizedRunner.java:648)
: > 	at
: > com.carrotsearch.randomizedtesting.RandomizedRunner$4.evaluate(Rando
: > mizedRunner.java:682)
: > 	at
: > com.carrotsearch.randomizedtesting.RandomizedRunner$5.evaluate(Rando
: > mizedRunner.java:693)
: > 	at
: > com.carrotsearch.randomizedtesting.rules.StatementAdapter.evaluate(Stat
: > ementAdapter.java:36)
: > 	at
: > com.carrotsearch.randomizedtesting.rules.SystemPropertiesRestoreRule$1.
: > evaluate(SystemPropertiesRestoreRule.java:53)
: > 	at
: > org.apache.lucene.util.AbstractBeforeAfterRule$1.evaluate(AbstractBeforeA
: > fterRule.java:46)
: > 	at
: > org.apache.lucene.util.TestRuleStoreClassName$1.evaluate(TestRuleStoreCl
: > assName.java:42)
: > 	at
: > com.carrotsearch.randomizedtesting.rules.SystemPropertiesInvariantRule$1
: > .evaluate(SystemPropertiesInvariantRule.java:55)
: > 	at
: > com.carrotsearch.randomizedtesting.rules.NoShadowingOrOverridesOnMet
: > hodsRule$1.evaluate(NoShadowingOrOverridesOnMethodsRule.java:39)
: > 	at
: > com.carrotsearch.randomizedtesting.rules.NoShadowingOrOverridesOnMet
: > hodsRule$1.evaluate(NoShadowingOrOverridesOnMethodsRule.java:39)
: > 	at
: > com.carrotsearch.randomizedtesting.rules.StatementAdapter.evaluate(Stat
: > ementAdapter.java:36)
: > 	at
: > org.apache.lucene.util.TestRuleAssertionsRequired$1.evaluate(TestRuleAss
: > ertionsRequired.java:43)
: > 	at
: > org.apache.lucene.util.TestRuleMarkFailure$1.evaluate(TestRuleMarkFailure
: > .java:48)
: > 	at
: > org.apache.lucene.util.TestRuleIgnoreAfterMaxFailures$1.evaluate(TestRule
: > IgnoreAfterMaxFailures.java:70)
: > 	at
: > org.apache.lucene.util.TestRuleIgnoreTestSuites$1.evaluate(TestRuleIgnore
: > TestSuites.java:55)
: > 	at
: > com.carrotsearch.randomizedtesting.rules.StatementAdapter.evaluate(Stat
: > ementAdapter.java:36)
: > 	at
: > com.carrotsearch.randomizedtesting.ThreadLeakControl$StatementRunner.
: > run(ThreadLeakControl.java:358)
: > 	at java.lang.Thread.run(Thread.java:679)
: > 
: > 
: > REGRESSION:
: > org.apache.solr.handler.TestReplicationHandler.doTestReplicateAfterStartup
: > WithNoActivity
: > 
: > Error Message:
: > 
: > 
: > Stack Trace:
: > java.lang.NullPointerException
: > 	at
: > __randomizedtesting.SeedInfo.seed([687EE273825E73E2:C4612C69ADDB9E3
: > A]:0)
: > 	at
: > org.apache.solr.client.solrj.impl.HttpSolrServer.request(HttpSolrServer.java:
: > 269)
: > 	at
: > org.apache.solr.client.solrj.impl.HttpSolrServer.request(HttpSolrServer.java:
: > 182)
: > 	at
: > org.apache.solr.client.solrj.request.AbstractUpdateRequest.process(Abstrac
: > tUpdateRequest.java:117)
: > 	at org.apache.solr.client.solrj.SolrServer.commit(SolrServer.java:168)
: > 	at org.apache.solr.client.solrj.SolrServer.commit(SolrServer.java:146)
: > 	at
: > org.apache.solr.handler.TestReplicationHandler.doTestReplicateAfterStartup
: > WithNoActivity(TestReplicationHandler.java:1036)
: > 	at sun.reflect.NativeMethodAccessorImpl.invoke0(Native Method)
: > 	at
: > sun.reflect.NativeMethodAccessorImpl.invoke(NativeMethodAccessorImpl.j
: > ava:57)
: > 	at
: > sun.reflect.DelegatingMethodAccessorImpl.invoke(DelegatingMethodAcces
: > sorImpl.java:43)
: > 	at java.lang.reflect.Method.invoke(Method.java:616)
: > 	at
: > com.carrotsearch.randomizedtesting.RandomizedRunner.invoke(Randomize
: > dRunner.java:1559)
: > 	at
: > com.carrotsearch.randomizedtesting.RandomizedRunner.access$600(Rando
: > mizedRunner.java:79)
: > 	at
: > com.carrotsearch.randomizedtesting.RandomizedRunner$6.evaluate(Rando
: > mizedRunner.java:737)
: > 	at
: > com.carrotsearch.randomizedtesting.RandomizedRunner$7.evaluate(Rando
: > mizedRunner.java:773)
: > 	at
: > com.carrotsearch.randomizedtesting.RandomizedRunner$8.evaluate(Rando
: > mizedRunner.java:787)
: > 	at
: > com.carrotsearch.randomizedtesting.rules.SystemPropertiesRestoreRule$1.
: > evaluate(SystemPropertiesRestoreRule.java:53)
: > 	at
: > org.apache.lucene.util.TestRuleSetupTeardownChained$1.evaluate(TestRule
: > SetupTeardownChained.java:50)
: > 	at
: > org.apache.lucene.util.TestRuleFieldCacheSanity$1.evaluate(TestRuleFieldCa
: > cheSanity.java:51)
: > 	at
: > org.apache.lucene.util.AbstractBeforeAfterRule$1.evaluate(AbstractBeforeA
: > fterRule.java:46)
: > 	at
: > com.carrotsearch.randomizedtesting.rules.SystemPropertiesInvariantRule$1
: > .evaluate(SystemPropertiesInvariantRule.java:55)
: > 	at
: > org.apache.lucene.util.TestRuleThreadAndTestName$1.evaluate(TestRuleTh
: > readAndTestName.java:49)
: > 	at
: > org.apache.lucene.util.TestRuleIgnoreAfterMaxFailures$1.evaluate(TestRule
: > IgnoreAfterMaxFailures.java:70)
: > 	at
: > org.apache.lucene.util.TestRuleMarkFailure$1.evaluate(TestRuleMarkFailure
: > .java:48)
: > 	at
: > com.carrotsearch.randomizedtesting.rules.StatementAdapter.evaluate(Stat
: > ementAdapter.java:36)
: > 	at
: > com.carrotsearch.randomizedtesting.ThreadLeakControl$StatementRunner.
: > run(ThreadLeakControl.java:358)
: > 	at
: > com.carrotsearch.randomizedtesting.ThreadLeakControl.forkTimeoutingTask
: > (ThreadLeakControl.java:782)
: > 	at
: > com.carrotsearch.randomizedtesting.ThreadLeakControl$3.evaluate(ThreadL
: > eakControl.java:442)
: > 	at
: > com.carrotsearch.randomizedtesting.RandomizedRunner.runSingleTest(Ran
: > domizedRunner.java:746)
: > 	at
: > com.carrotsearch.randomizedtesting.RandomizedRunner$3.evaluate(Rando
: > mizedRunner.java:648)
: > 	at
: > com.carrotsearch.randomizedtesting.RandomizedRunner$4.evaluate(Rando
: > mizedRunner.java:682)
: > 	at
: > com.carrotsearch.randomizedtesting.RandomizedRunner$5.evaluate(Rando
: > mizedRunner.java:693)
: > 	at
: > com.carrotsearch.randomizedtesting.rules.StatementAdapter.evaluate(Stat
: > ementAdapter.java:36)
: > 	at
: > com.carrotsearch.randomizedtesting.rules.SystemPropertiesRestoreRule$1.
: > evaluate(SystemPropertiesRestoreRule.java:53)
: > 	at
: > org.apache.lucene.util.AbstractBeforeAfterRule$1.evaluate(AbstractBeforeA
: > fterRule.java:46)
: > 	at
: > org.apache.lucene.util.TestRuleStoreClassName$1.evaluate(TestRuleStoreCl
: > assName.java:42)
: > 	at
: > com.carrotsearch.randomizedtesting.rules.SystemPropertiesInvariantRule$1
: > .evaluate(SystemPropertiesInvariantRule.java:55)
: > 	at
: > com.carrotsearch.randomizedtesting.rules.NoShadowingOrOverridesOnMet
: > hodsRule$1.evaluate(NoShadowingOrOverridesOnMethodsRule.java:39)
: > 	at
: > com.carrotsearch.randomizedtesting.rules.NoShadowingOrOverridesOnMet
: > hodsRule$1.evaluate(NoShadowingOrOverridesOnMethodsRule.java:39)
: > 	at
: > com.carrotsearch.randomizedtesting.rules.StatementAdapter.evaluate(Stat
: > ementAdapter.java:36)
: > 	at
: > org.apache.lucene.util.TestRuleAssertionsRequired$1.evaluate(TestRuleAss
: > ertionsRequired.java:43)
: > 	at
: > org.apache.lucene.util.TestRuleMarkFailure$1.evaluate(TestRuleMarkFailure
: > .java:48)
: > 	at
: > org.apache.lucene.util.TestRuleIgnoreAfterMaxFailures$1.evaluate(TestRule
: > IgnoreAfterMaxFailures.java:70)
: > 	at
: > org.apache.lucene.util.TestRuleIgnoreTestSuites$1.evaluate(TestRuleIgnore
: > TestSuites.java:55)
: > 	at
: > com.carrotsearch.randomizedtesting.rules.StatementAdapter.evaluate(Stat
: > ementAdapter.java:36)
: > 	at
: > com.carrotsearch.randomizedtesting.ThreadLeakControl$StatementRunner.
: > run(ThreadLeakControl.java:358)
: > 	at java.lang.Thread.run(Thread.java:679)
: > 
: > 
: > REGRESSION:
: > org.apache.solr.handler.TestReplicationHandler.doTestRepeater
: > 
: > Error Message:
: > 
: > 
: > Stack Trace:
: > java.lang.NullPointerException
: > 	at
: > __randomizedtesting.SeedInfo.seed([687EE273825E73E2:D67300B56C042269
: > ]:0)
: > 	at
: > org.apache.solr.client.solrj.impl.HttpSolrServer.request(HttpSolrServer.java:
: > 269)
: > 	at
: > org.apache.solr.client.solrj.impl.HttpSolrServer.request(HttpSolrServer.java:
: > 182)
: > 	at
: > org.apache.solr.client.solrj.request.AbstractUpdateRequest.process(Abstrac
: > tUpdateRequest.java:117)
: > 	at org.apache.solr.client.solrj.SolrServer.commit(SolrServer.java:168)
: > 	at org.apache.solr.client.solrj.SolrServer.commit(SolrServer.java:146)
: > 	at
: > org.apache.solr.handler.TestReplicationHandler.doTestRepeater(TestReplica
: > tionHandler.java:866)
: > 	at sun.reflect.NativeMethodAccessorImpl.invoke0(Native Method)
: > 	at
: > sun.reflect.NativeMethodAccessorImpl.invoke(NativeMethodAccessorImpl.j
: > ava:57)
: > 	at
: > sun.reflect.DelegatingMethodAccessorImpl.invoke(DelegatingMethodAcces
: > sorImpl.java:43)
: > 	at java.lang.reflect.Method.invoke(Method.java:616)
: > 	at
: > com.carrotsearch.randomizedtesting.RandomizedRunner.invoke(Randomize
: > dRunner.java:1559)
: > 	at
: > com.carrotsearch.randomizedtesting.RandomizedRunner.access$600(Rando
: > mizedRunner.java:79)
: > 	at
: > com.carrotsearch.randomizedtesting.RandomizedRunner$6.evaluate(Rando
: > mizedRunner.java:737)
: > 	at
: > com.carrotsearch.randomizedtesting.RandomizedRunner$7.evaluate(Rando
: > mizedRunner.java:773)
: > 	at
: > com.carrotsearch.randomizedtesting.RandomizedRunner$8.evaluate(Rando
: > mizedRunner.java:787)
: > 	at
: > com.carrotsearch.randomizedtesting.rules.SystemPropertiesRestoreRule$1.
: > evaluate(SystemPropertiesRestoreRule.java:53)
: > 	at
: > org.apache.lucene.util.TestRuleSetupTeardownChained$1.evaluate(TestRule
: > SetupTeardownChained.java:50)
: > 	at
: > org.apache.lucene.util.TestRuleFieldCacheSanity$1.evaluate(TestRuleFieldCa
: > cheSanity.java:51)
: > 	at
: > org.apache.lucene.util.AbstractBeforeAfterRule$1.evaluate(AbstractBeforeA
: > fterRule.java:46)
: > 	at
: > com.carrotsearch.randomizedtesting.rules.SystemPropertiesInvariantRule$1
: > .evaluate(SystemPropertiesInvariantRule.java:55)
: > 	at
: > org.apache.lucene.util.TestRuleThreadAndTestName$1.evaluate(TestRuleTh
: > readAndTestName.java:49)
: > 	at
: > org.apache.lucene.util.TestRuleIgnoreAfterMaxFailures$1.evaluate(TestRule
: > IgnoreAfterMaxFailures.java:70)
: > 	at
: > org.apache.lucene.util.TestRuleMarkFailure$1.evaluate(TestRuleMarkFailure
: > .java:48)
: > 	at
: > com.carrotsearch.randomizedtesting.rules.StatementAdapter.evaluate(Stat
: > ementAdapter.java:36)
: > 	at
: > com.carrotsearch.randomizedtesting.ThreadLeakControl$StatementRunner.
: > run(ThreadLeakControl.java:358)
: > 	at
: > com.carrotsearch.randomizedtesting.ThreadLeakControl.forkTimeoutingTask
: > (ThreadLeakControl.java:782)
: > 	at
: > com.carrotsearch.randomizedtesting.ThreadLeakControl$3.evaluate(ThreadL
: > eakControl.java:442)
: > 	at
: > com.carrotsearch.randomizedtesting.RandomizedRunner.runSingleTest(Ran
: > domizedRunner.java:746)
: > 	at
: > com.carrotsearch.randomizedtesting.RandomizedRunner$3.evaluate(Rando
: > mizedRunner.java:648)
: > 	at
: > com.carrotsearch.randomizedtesting.RandomizedRunner$4.evaluate(Rando
: > mizedRunner.java:682)
: > 	at
: > com.carrotsearch.randomizedtesting.RandomizedRunner$5.evaluate(Rando
: > mizedRunner.java:693)
: > 	at
: > com.carrotsearch.randomizedtesting.rules.StatementAdapter.evaluate(Stat
: > ementAdapter.java:36)
: > 	at
: > com.carrotsearch.randomizedtesting.rules.SystemPropertiesRestoreRule$1.
: > evaluate(SystemPropertiesRestoreRule.java:53)
: > 	at
: > org.apache.lucene.util.AbstractBeforeAfterRule$1.evaluate(AbstractBeforeA
: > fterRule.java:46)
: > 	at
: > org.apache.lucene.util.TestRuleStoreClassName$1.evaluate(TestRuleStoreCl
: > assName.java:42)
: > 	at
: > com.carrotsearch.randomizedtesting.rules.SystemPropertiesInvariantRule$1
: > .evaluate(SystemPropertiesInvariantRule.java:55)
: > 	at
: > com.carrotsearch.randomizedtesting.rules.NoShadowingOrOverridesOnMet
: > hodsRule$1.evaluate(NoShadowingOrOverridesOnMethodsRule.java:39)
: > 	at
: > com.carrotsearch.randomizedtesting.rules.NoShadowingOrOverridesOnMet
: > hodsRule$1.evaluate(NoShadowingOrOverridesOnMethodsRule.java:39)
: > 	at
: > com.carrotsearch.randomizedtesting.rules.StatementAdapter.evaluate(Stat
: > ementAdapter.java:36)
: > 	at
: > org.apache.lucene.util.TestRuleAssertionsRequired$1.evaluate(TestRuleAss
: > ertionsRequired.java:43)
: > 	at
: > org.apache.lucene.util.TestRuleMarkFailure$1.evaluate(TestRuleMarkFailure
: > .java:48)
: > 	at
: > org.apache.lucene.util.TestRuleIgnoreAfterMaxFailures$1.evaluate(TestRule
: > IgnoreAfterMaxFailures.java:70)
: > 	at
: > org.apache.lucene.util.TestRuleIgnoreTestSuites$1.evaluate(TestRuleIgnore
: > TestSuites.java:55)
: > 	at
: > com.carrotsearch.randomizedtesting.rules.StatementAdapter.evaluate(Stat
: > ementAdapter.java:36)
: > 	at
: > com.carrotsearch.randomizedtesting.ThreadLeakControl$StatementRunner.
: > run(ThreadLeakControl.java:358)
: > 	at java.lang.Thread.run(Thread.java:679)
: > 
: > 
: > REGRESSION:
: > org.apache.solr.handler.TestReplicationHandler.doTestSnapPullWithMaster
: > Url
: > 
: > Error Message:
: > 
: > 
: > Stack Trace:
: > java.lang.NullPointerException
: > 	at
: > __randomizedtesting.SeedInfo.seed([687EE273825E73E2:F3384402912E26AC
: > ]:0)
: > 	at
: > org.apache.solr.client.solrj.impl.HttpSolrServer.request(HttpSolrServer.java:
: > 269)
: > 	at
: > org.apache.solr.client.solrj.impl.HttpSolrServer.request(HttpSolrServer.java:
: > 182)
: > 	at
: > org.apache.solr.client.solrj.request.AbstractUpdateRequest.process(Abstrac
: > tUpdateRequest.java:117)
: > 	at org.apache.solr.client.solrj.SolrServer.commit(SolrServer.java:168)
: > 	at org.apache.solr.client.solrj.SolrServer.commit(SolrServer.java:146)
: > 	at
: > org.apache.solr.handler.TestReplicationHandler.doTestSnapPullWithMaster
: > Url(TestReplicationHandler.java:590)
: > 	at sun.reflect.NativeMethodAccessorImpl.invoke0(Native Method)
: > 	at
: > sun.reflect.NativeMethodAccessorImpl.invoke(NativeMethodAccessorImpl.j
: > ava:57)
: > 	at
: > sun.reflect.DelegatingMethodAccessorImpl.invoke(DelegatingMethodAcces
: > sorImpl.java:43)
: > 	at java.lang.reflect.Method.invoke(Method.java:616)
: > 	at
: > com.carrotsearch.randomizedtesting.RandomizedRunner.invoke(Randomize
: > dRunner.java:1559)
: > 	at
: > com.carrotsearch.randomizedtesting.RandomizedRunner.access$600(Rando
: > mizedRunner.java:79)
: > 	at
: > com.carrotsearch.randomizedtesting.RandomizedRunner$6.evaluate(Rando
: > mizedRunner.java:737)
: > 	at
: > com.carrotsearch.randomizedtesting.RandomizedRunner$7.evaluate(Rando
: > mizedRunner.java:773)
: > 	at
: > com.carrotsearch.randomizedtesting.RandomizedRunner$8.evaluate(Rando
: > mizedRunner.java:787)
: > 	at
: > com.carrotsearch.randomizedtesting.rules.SystemPropertiesRestoreRule$1.
: > evaluate(SystemPropertiesRestoreRule.java:53)
: > 	at
: > org.apache.lucene.util.TestRuleSetupTeardownChained$1.evaluate(TestRule
: > SetupTeardownChained.java:50)
: > 	at
: > org.apache.lucene.util.TestRuleFieldCacheSanity$1.evaluate(TestRuleFieldCa
: > cheSanity.java:51)
: > 	at
: > org.apache.lucene.util.AbstractBeforeAfterRule$1.evaluate(AbstractBeforeA
: > fterRule.java:46)
: > 	at
: > com.carrotsearch.randomizedtesting.rules.SystemPropertiesInvariantRule$1
: > .evaluate(SystemPropertiesInvariantRule.java:55)
: > 	at
: > org.apache.lucene.util.TestRuleThreadAndTestName$1.evaluate(TestRuleTh
: > readAndTestName.java:49)
: > 	at
: > org.apache.lucene.util.TestRuleIgnoreAfterMaxFailures$1.evaluate(TestRule
: > IgnoreAfterMaxFailures.java:70)
: > 	at
: > org.apache.lucene.util.TestRuleMarkFailure$1.evaluate(TestRuleMarkFailure
: > .java:48)
: > 	at
: > com.carrotsearch.randomizedtesting.rules.StatementAdapter.evaluate(Stat
: > ementAdapter.java:36)
: > 	at
: > com.carrotsearch.randomizedtesting.ThreadLeakControl$StatementRunner.
: > run(ThreadLeakControl.java:358)
: > 	at
: > com.carrotsearch.randomizedtesting.ThreadLeakControl.forkTimeoutingTask
: > (ThreadLeakControl.java:782)
: > 	at
: > com.carrotsearch.randomizedtesting.ThreadLeakControl$3.evaluate(ThreadL
: > eakControl.java:442)
: > 	at
: > com.carrotsearch.randomizedtesting.RandomizedRunner.runSingleTest(Ran
: > domizedRunner.java:746)
: > 	at
: > com.carrotsearch.randomizedtesting.RandomizedRunner$3.evaluate(Rando
: > mizedRunner.java:648)
: > 	at
: > com.carrotsearch.randomizedtesting.RandomizedRunner$4.evaluate(Rando
: > mizedRunner.java:682)
: > 	at
: > com.carrotsearch.randomizedtesting.RandomizedRunner$5.evaluate(Rando
: > mizedRunner.java:693)
: > 	at
: > com.carrotsearch.randomizedtesting.rules.StatementAdapter.evaluate(Stat
: > ementAdapter.java:36)
: > 	at
: > com.carrotsearch.randomizedtesting.rules.SystemPropertiesRestoreRule$1.
: > evaluate(SystemPropertiesRestoreRule.java:53)
: > 	at
: > org.apache.lucene.util.AbstractBeforeAfterRule$1.evaluate(AbstractBeforeA
: > fterRule.java:46)
: > 	at
: > org.apache.lucene.util.TestRuleStoreClassName$1.evaluate(TestRuleStoreCl
: > assName.java:42)
: > 	at
: > com.carrotsearch.randomizedtesting.rules.SystemPropertiesInvariantRule$1
: > .evaluate(SystemPropertiesInvariantRule.java:55)
: > 	at
: > com.carrotsearch.randomizedtesting.rules.NoShadowingOrOverridesOnMet
: > hodsRule$1.evaluate(NoShadowingOrOverridesOnMethodsRule.java:39)
: > 	at
: > com.carrotsearch.randomizedtesting.rules.NoShadowingOrOverridesOnMet
: > hodsRule$1.evaluate(NoShadowingOrOverridesOnMethodsRule.java:39)
: > 	at
: > com.carrotsearch.randomizedtesting.rules.StatementAdapter.evaluate(Stat
: > ementAdapter.java:36)
: > 	at
: > org.apache.lucene.util.TestRuleAssertionsRequired$1.evaluate(TestRuleAss
: > ertionsRequired.java:43)
: > 	at
: > org.apache.lucene.util.TestRuleMarkFailure$1.evaluate(TestRuleMarkFailure
: > .java:48)
: > 	at
: > org.apache.lucene.util.TestRuleIgnoreAfterMaxFailures$1.evaluate(TestRule
: > IgnoreAfterMaxFailures.java:70)
: > 	at
: > org.apache.lucene.util.TestRuleIgnoreTestSuites$1.evaluate(TestRuleIgnore
: > TestSuites.java:55)
: > 	at
: > com.carrotsearch.randomizedtesting.rules.StatementAdapter.evaluate(Stat
: > ementAdapter.java:36)
: > 	at
: > com.carrotsearch.randomizedtesting.ThreadLeakControl$StatementRunner.
: > run(ThreadLeakControl.java:358)
: > 	at java.lang.Thread.run(Thread.java:679)
: > 
: > 
: > REGRESSION:
: > org.apache.solr.handler.TestReplicationHandler.doTestStopPoll
: > 
: > Error Message:
: > 
: > 
: > Stack Trace:
: > java.lang.NullPointerException
: > 	at
: > __randomizedtesting.SeedInfo.seed([687EE273825E73E2:7B5D9C7F54B7B4D
: > 7]:0)
: > 	at
: > org.apache.solr.client.solrj.impl.HttpSolrServer.request(HttpSolrServer.java:
: > 269)
: > 	at
: > org.apache.solr.client.solrj.impl.HttpSolrServer.request(HttpSolrServer.java:
: > 182)
: > 	at
: > org.apache.solr.client.solrj.request.AbstractUpdateRequest.process(Abstrac
: > tUpdateRequest.java:117)
: > 	at org.apache.solr.client.solrj.SolrServer.commit(SolrServer.java:168)
: > 	at org.apache.solr.client.solrj.SolrServer.commit(SolrServer.java:146)
: > 	at
: > org.apache.solr.handler.TestReplicationHandler.doTestStopPoll(TestReplicati
: > onHandler.java:542)
: > 	at sun.reflect.NativeMethodAccessorImpl.invoke0(Native Method)
: > 	at
: > sun.reflect.NativeMethodAccessorImpl.invoke(NativeMethodAccessorImpl.j
: > ava:57)
: > 	at
: > sun.reflect.DelegatingMethodAccessorImpl.invoke(DelegatingMethodAcces
: > sorImpl.java:43)
: > 	at java.lang.reflect.Method.invoke(Method.java:616)
: > 	at
: > com.carrotsearch.randomizedtesting.RandomizedRunner.invoke(Randomize
: > dRunner.java:1559)
: > 	at
: > com.carrotsearch.randomizedtesting.RandomizedRunner.access$600(Rando
: > mizedRunner.java:79)
: > 	at
: > com.carrotsearch.randomizedtesting.RandomizedRunner$6.evaluate(Rando
: > mizedRunner.java:737)
: > 	at
: > com.carrotsearch.randomizedtesting.RandomizedRunner$7.evaluate(Rando
: > mizedRunner.java:773)
: > 	at
: > com.carrotsearch.randomizedtesting.RandomizedRunner$8.evaluate(Rando
: > mizedRunner.java:787)
: > 	at
: > com.carrotsearch.randomizedtesting.rules.SystemPropertiesRestoreRule$1.
: > evaluate(SystemPropertiesRestoreRule.java:53)
: > 	at
: > org.apache.lucene.util.TestRuleSetupTeardownChained$1.evaluate(TestRule
: > SetupTeardownChained.java:50)
: > 	at
: > org.apache.lucene.util.TestRuleFieldCacheSanity$1.evaluate(TestRuleFieldCa
: > cheSanity.java:51)
: > 	at
: > org.apache.lucene.util.AbstractBeforeAfterRule$1.evaluate(AbstractBeforeA
: > fterRule.java:46)
: > 	at
: > com.carrotsearch.randomizedtesting.rules.SystemPropertiesInvariantRule$1
: > .evaluate(SystemPropertiesInvariantRule.java:55)
: > 	at
: > org.apache.lucene.util.TestRuleThreadAndTestName$1.evaluate(TestRuleTh
: > readAndTestName.java:49)
: > 	at
: > org.apache.lucene.util.TestRuleIgnoreAfterMaxFailures$1.evaluate(TestRule
: > IgnoreAfterMaxFailures.java:70)
: > 	at
: > org.apache.lucene.util.TestRuleMarkFailure$1.evaluate(TestRuleMarkFailure
: > .java:48)
: > 	at
: > com.carrotsearch.randomizedtesting.rules.StatementAdapter.evaluate(Stat
: > ementAdapter.java:36)
: > 	at
: > com.carrotsearch.randomizedtesting.ThreadLeakControl$StatementRunner.
: > run(ThreadLeakControl.java:358)
: > 	at
: > com.carrotsearch.randomizedtesting.ThreadLeakControl.forkTimeoutingTask
: > (ThreadLeakControl.java:782)
: > 	at
: > com.carrotsearch.randomizedtesting.ThreadLeakControl$3.evaluate(ThreadL
: > eakControl.java:442)
: > 	at
: > com.carrotsearch.randomizedtesting.RandomizedRunner.runSingleTest(Ran
: > domizedRunner.java:746)
: > 	at
: > com.carrotsearch.randomizedtesting.RandomizedRunner$3.evaluate(Rando
: > mizedRunner.java:648)
: > 	at
: > com.carrotsearch.randomizedtesting.RandomizedRunner$4.evaluate(Rando
: > mizedRunner.java:682)
: > 	at
: > com.carrotsearch.randomizedtesting.RandomizedRunner$5.evaluate(Rando
: > mizedRunner.java:693)
: > 	at
: > com.carrotsearch.randomizedtesting.rules.StatementAdapter.evaluate(Stat
: > ementAdapter.java:36)
: > 	at
: > com.carrotsearch.randomizedtesting.rules.SystemPropertiesRestoreRule$1.
: > evaluate(SystemPropertiesRestoreRule.java:53)
: > 	at
: > org.apache.lucene.util.AbstractBeforeAfterRule$1.evaluate(AbstractBeforeA
: > fterRule.java:46)
: > 	at
: > org.apache.lucene.util.TestRuleStoreClassName$1.evaluate(TestRuleStoreCl
: > assName.java:42)
: > 	at
: > com.carrotsearch.randomizedtesting.rules.SystemPropertiesInvariantRule$1
: > .evaluate(SystemPropertiesInvariantRule.java:55)
: > 	at
: > com.carrotsearch.randomizedtesting.rules.NoShadowingOrOverridesOnMet
: > hodsRule$1.evaluate(NoShadowingOrOverridesOnMethodsRule.java:39)
: > 	at
: > com.carrotsearch.randomizedtesting.rules.NoShadowingOrOverridesOnMet
: > hodsRule$1.evaluate(NoShadowingOrOverridesOnMethodsRule.java:39)
: > 	at
: > com.carrotsearch.randomizedtesting.rules.StatementAdapter.evaluate(Stat
: > ementAdapter.java:36)
: > 	at
: > org.apache.lucene.util.TestRuleAssertionsRequired$1.evaluate(TestRuleAss
: > ertionsRequired.java:43)
: > 	at
: > org.apache.lucene.util.TestRuleMarkFailure$1.evaluate(TestRuleMarkFailure
: > .java:48)
: > 	at
: > org.apache.lucene.util.TestRuleIgnoreAfterMaxFailures$1.evaluate(TestRule
: > IgnoreAfterMaxFailures.java:70)
: > 	at
: > org.apache.lucene.util.TestRuleIgnoreTestSuites$1.evaluate(TestRuleIgnore
: > TestSuites.java:55)
: > 	at
: > com.carrotsearch.randomizedtesting.rules.StatementAdapter.evaluate(Stat
: > ementAdapter.java:36)
: > 	at
: > com.carrotsearch.randomizedtesting.ThreadLeakControl$StatementRunner.
: > run(ThreadLeakControl.java:358)
: > 	at java.lang.Thread.run(Thread.java:679)
: > 
: > 
: > REGRESSION:  org.apache.solr.handler.TestReplicationHandler.doTestBackup
: > 
: > Error Message:
: > 
: > 
: > Stack Trace:
: > java.lang.NullPointerException
: > 	at
: > __randomizedtesting.SeedInfo.seed([687EE273825E73E2:29F5C216A5E080AD
: > ]:0)
: > 	at
: > org.apache.solr.client.solrj.impl.HttpSolrServer.request(HttpSolrServer.java:
: > 269)
: > 	at
: > org.apache.solr.client.solrj.impl.HttpSolrServer.request(HttpSolrServer.java:
: > 182)
: > 	at
: > org.apache.solr.client.solrj.request.AbstractUpdateRequest.process(Abstrac
: > tUpdateRequest.java:117)
: > 	at org.apache.solr.client.solrj.SolrServer.commit(SolrServer.java:168)
: > 	at org.apache.solr.client.solrj.SolrServer.commit(SolrServer.java:146)
: > 	at
: > org.apache.solr.handler.TestReplicationHandler.doTestBackup(TestReplicatio
: > nHandler.java:1267)
: > 	at sun.reflect.NativeMethodAccessorImpl.invoke0(Native Method)
: > 	at
: > sun.reflect.NativeMethodAccessorImpl.invoke(NativeMethodAccessorImpl.j
: > ava:57)
: > 	at
: > sun.reflect.DelegatingMethodAccessorImpl.invoke(DelegatingMethodAcces
: > sorImpl.java:43)
: > 	at java.lang.reflect.Method.invoke(Method.java:616)
: > 	at
: > com.carrotsearch.randomizedtesting.RandomizedRunner.invoke(Randomize
: > dRunner.java:1559)
: > 	at
: > com.carrotsearch.randomizedtesting.RandomizedRunner.access$600(Rando
: > mizedRunner.java:79)
: > 	at
: > com.carrotsearch.randomizedtesting.RandomizedRunner$6.evaluate(Rando
: > mizedRunner.java:737)
: > 	at
: > com.carrotsearch.randomizedtesting.RandomizedRunner$7.evaluate(Rando
: > mizedRunner.java:773)
: > 	at
: > com.carrotsearch.randomizedtesting.RandomizedRunner$8.evaluate(Rando
: > mizedRunner.java:787)
: > 	at
: > com.carrotsearch.randomizedtesting.rules.SystemPropertiesRestoreRule$1.
: > evaluate(SystemPropertiesRestoreRule.java:53)
: > 	at
: > org.apache.lucene.util.TestRuleSetupTeardownChained$1.evaluate(TestRule
: > SetupTeardownChained.java:50)
: > 	at
: > org.apache.lucene.util.TestRuleFieldCacheSanity$1.evaluate(TestRuleFieldCa
: > cheSanity.java:51)
: > 	at
: > org.apache.lucene.util.AbstractBeforeAfterRule$1.evaluate(AbstractBeforeA
: > fterRule.java:46)
: > 	at
: > com.carrotsearch.randomizedtesting.rules.SystemPropertiesInvariantRule$1
: > .evaluate(SystemPropertiesInvariantRule.java:55)
: > 	at
: > org.apache.lucene.util.TestRuleThreadAndTestName$1.evaluate(TestRuleTh
: > readAndTestName.java:49)
: > 	at
: > org.apache.lucene.util.TestRuleIgnoreAfterMaxFailures$1.evaluate(TestRule
: > IgnoreAfterMaxFailures.java:70)
: > 	at
: > org.apache.lucene.util.TestRuleMarkFailure$1.evaluate(TestRuleMarkFailure
: > .java:48)
: > 	at
: > com.carrotsearch.randomizedtesting.rules.StatementAdapter.evaluate(Stat
: > ementAdapter.java:36)
: > 	at
: > com.carrotsearch.randomizedtesting.ThreadLeakControl$StatementRunner.
: > run(ThreadLeakControl.java:358)
: > 	at
: > com.carrotsearch.randomizedtesting.ThreadLeakControl.forkTimeoutingTask
: > (ThreadLeakControl.java:782)
: > 	at
: > com.carrotsearch.randomizedtesting.ThreadLeakControl$3.evaluate(ThreadL
: > eakControl.java:442)
: > 	at
: > com.carrotsearch.randomizedtesting.RandomizedRunner.runSingleTest(Ran
: > domizedRunner.java:746)
: > 	at
: > com.carrotsearch.randomizedtesting.RandomizedRunner$3.evaluate(Rando
: > mizedRunner.java:648)
: > 	at
: > com.carrotsearch.randomizedtesting.RandomizedRunner$4.evaluate(Rando
: > mizedRunner.java:682)
: > 	at
: > com.carrotsearch.randomizedtesting.RandomizedRunner$5.evaluate(Rando
: > mizedRunner.java:693)
: > 	at
: > com.carrotsearch.randomizedtesting.rules.StatementAdapter.evaluate(Stat
: > ementAdapter.java:36)
: > 	at
: > com.carrotsearch.randomizedtesting.rules.SystemPropertiesRestoreRule$1.
: > evaluate(SystemPropertiesRestoreRule.java:53)
: > 	at
: > org.apache.lucene.util.AbstractBeforeAfterRule$1.evaluate(AbstractBeforeA
: > fterRule.java:46)
: > 	at
: > org.apache.lucene.util.TestRuleStoreClassName$1.evaluate(TestRuleStoreCl
: > assName.java:42)
: > 	at
: > com.carrotsearch.randomizedtesting.rules.SystemPropertiesInvariantRule$1
: > .evaluate(SystemPropertiesInvariantRule.java:55)
: > 	at
: > com.carrotsearch.randomizedtesting.rules.NoShadowingOrOverridesOnMet
: > hodsRule$1.evaluate(NoShadowingOrOverridesOnMethodsRule.java:39)
: > 	at
: > com.carrotsearch.randomizedtesting.rules.NoShadowingOrOverridesOnMet
: > hodsRule$1.evaluate(NoShadowingOrOverridesOnMethodsRule.java:39)
: > 	at
: > com.carrotsearch.randomizedtesting.rules.StatementAdapter.evaluate(Stat
: > ementAdapter.java:36)
: > 	at
: > org.apache.lucene.util.TestRuleAssertionsRequired$1.evaluate(TestRuleAss
: > ertionsRequired.java:43)
: > 	at
: > org.apache.lucene.util.TestRuleMarkFailure$1.evaluate(TestRuleMarkFailure
: > .java:48)
: > 	at
: > org.apache.lucene.util.TestRuleIgnoreAfterMaxFailures$1.evaluate(TestRule
: > IgnoreAfterMaxFailures.java:70)
: > 	at
: > org.apache.lucene.util.TestRuleIgnoreTestSuites$1.evaluate(TestRuleIgnore
: > TestSuites.java:55)
: > 	at
: > com.carrotsearch.randomizedtesting.rules.StatementAdapter.evaluate(Stat
: > ementAdapter.java:36)
: > 	at
: > com.carrotsearch.randomizedtesting.ThreadLeakControl$StatementRunner.
: > run(ThreadLeakControl.java:358)
: > 	at java.lang.Thread.run(Thread.java:679)
: > 
: > 
: > REGRESSION:
: > org.apache.solr.handler.component.DistributedQueryElevationComponentT
: > est.testDistribSearch
: > 
: > Error Message:
: > 
: > 
: > Stack Trace:
: > java.lang.NullPointerException
: > 	at
: > __randomizedtesting.SeedInfo.seed([687EE273825E73E2:E9986C6BF50113DE
: > ]:0)
: > 	at
: > org.apache.solr.client.solrj.impl.HttpSolrServer.request(HttpSolrServer.java:
: > 269)
: > 	at
: > org.apache.solr.client.solrj.impl.HttpSolrServer.request(HttpSolrServer.java:
: > 182)
: > 	at
: > org.apache.solr.client.solrj.request.AbstractUpdateRequest.process(Abstrac
: > tUpdateRequest.java:117)
: > 	at org.apache.solr.client.solrj.SolrServer.commit(SolrServer.java:168)
: > 	at org.apache.solr.client.solrj.SolrServer.commit(SolrServer.java:146)
: > 	at
: > org.apache.solr.BaseDistributedSearchTestCase.commit(BaseDistributedSear
: > chTestCase.java:472)
: > 	at
: > org.apache.solr.handler.component.DistributedQueryElevationComponentT
: > est.doTest(DistributedQueryElevationComponentTest.java:67)
: > 	at
: > org.apache.solr.BaseDistributedSearchTestCase.testDistribSearch(BaseDistri
: > butedSearchTestCase.java:806)
: > 	at sun.reflect.NativeMethodAccessorImpl.invoke0(Native Method)
: > 	at
: > sun.reflect.NativeMethodAccessorImpl.invoke(NativeMethodAccessorImpl.j
: > ava:57)
: > 	at
: > sun.reflect.DelegatingMethodAccessorImpl.invoke(DelegatingMethodAcces
: > sorImpl.java:43)
: > 	at java.lang.reflect.Method.invoke(Method.java:616)
: > 	at
: > com.carrotsearch.randomizedtesting.RandomizedRunner.invoke(Randomize
: > dRunner.java:1559)
: > 	at
: > com.carrotsearch.randomizedtesting.RandomizedRunner.access$600(Rando
: > mizedRunner.java:79)
: > 	at
: > com.carrotsearch.randomizedtesting.RandomizedRunner$6.evaluate(Rando
: > mizedRunner.java:737)
: > 	at
: > com.carrotsearch.randomizedtesting.RandomizedRunner$7.evaluate(Rando
: > mizedRunner.java:773)
: > 	at
: > com.carrotsearch.randomizedtesting.RandomizedRunner$8.evaluate(Rando
: > mizedRunner.java:787)
: > 	at
: > com.carrotsearch.randomizedtesting.rules.SystemPropertiesRestoreRule$1.
: > evaluate(SystemPropertiesRestoreRule.java:53)
: > 	at
: > org.apache.lucene.util.TestRuleSetupTeardownChained$1.evaluate(TestRule
: > SetupTeardownChained.java:50)
: > 	at
: > org.apache.lucene.util.TestRuleFieldCacheSanity$1.evaluate(TestRuleFieldCa
: > cheSanity.java:51)
: > 	at
: > org.apache.lucene.util.AbstractBeforeAfterRule$1.evaluate(AbstractBeforeA
: > fterRule.java:46)
: > 	at
: > com.carrotsearch.randomizedtesting.rules.SystemPropertiesInvariantRule$1
: > .evaluate(SystemPropertiesInvariantRule.java:55)
: > 	at
: > org.apache.lucene.util.TestRuleThreadAndTestName$1.evaluate(TestRuleTh
: > readAndTestName.java:49)
: > 	at
: > org.apache.lucene.util.TestRuleIgnoreAfterMaxFailures$1.evaluate(TestRule
: > IgnoreAfterMaxFailures.java:70)
: > 	at
: > org.apache.lucene.util.TestRuleMarkFailure$1.evaluate(TestRuleMarkFailure
: > .java:48)
: > 	at
: > com.carrotsearch.randomizedtesting.rules.StatementAdapter.evaluate(Stat
: > ementAdapter.java:36)
: > 	at
: > com.carrotsearch.randomizedtesting.ThreadLeakControl$StatementRunner.
: > run(ThreadLeakControl.java:358)
: > 	at
: > com.carrotsearch.randomizedtesting.ThreadLeakControl.forkTimeoutingTask
: > (ThreadLeakControl.java:782)
: > 	at
: > com.carrotsearch.randomizedtesting.ThreadLeakControl$3.evaluate(ThreadL
: > eakControl.java:442)
: > 	at
: > com.carrotsearch.randomizedtesting.RandomizedRunner.runSingleTest(Ran
: > domizedRunner.java:746)
: > 	at
: > com.carrotsearch.randomizedtesting.RandomizedRunner$3.evaluate(Rando
: > mizedRunner.java:648)
: > 	at
: > com.carrotsearch.randomizedtesting.RandomizedRunner$4.evaluate(Rando
: > mizedRunner.java:682)
: > 	at
: > com.carrotsearch.randomizedtesting.RandomizedRunner$5.evaluate(Rando
: > mizedRunner.java:693)
: > 	at
: > com.carrotsearch.randomizedtesting.rules.StatementAdapter.evaluate(Stat
: > ementAdapter.java:36)
: > 	at
: > com.carrotsearch.randomizedtesting.rules.SystemPropertiesRestoreRule$1.
: > evaluate(SystemPropertiesRestoreRule.java:53)
: > 	at
: > org.apache.lucene.util.AbstractBeforeAfterRule$1.evaluate(AbstractBeforeA
: > fterRule.java:46)
: > 	at
: > org.apache.lucene.util.TestRuleStoreClassName$1.evaluate(TestRuleStoreCl
: > assName.java:42)
: > 	at
: > com.carrotsearch.randomizedtesting.rules.SystemPropertiesInvariantRule$1
: > .evaluate(SystemPropertiesInvariantRule.java:55)
: > 	at
: > com.carrotsearch.randomizedtesting.rules.NoShadowingOrOverridesOnMet
: > hodsRule$1.evaluate(NoShadowingOrOverridesOnMethodsRule.java:39)
: > 	at
: > com.carrotsearch.randomizedtesting.rules.NoShadowingOrOverridesOnMet
: > hodsRule$1.evaluate(NoShadowingOrOverridesOnMethodsRule.java:39)
: > 	at
: > com.carrotsearch.randomizedtesting.rules.StatementAdapter.evaluate(Stat
: > ementAdapter.java:36)
: > 	at
: > org.apache.lucene.util.TestRuleAssertionsRequired$1.evaluate(TestRuleAss
: > ertionsRequired.java:43)
: > 	at
: > org.apache.lucene.util.TestRuleMarkFailure$1.evaluate(TestRuleMarkFailure
: > .java:48)
: > 	at
: > org.apache.lucene.util.TestRuleIgnoreAfterMaxFailures$1.evaluate(TestRule
: > IgnoreAfterMaxFailures.java:70)
: > 	at
: > org.apache.lucene.util.TestRuleIgnoreTestSuites$1.evaluate(TestRuleIgnore
: > TestSuites.java:55)
: > 	at
: > com.carrotsearch.randomizedtesting.rules.StatementAdapter.evaluate(Stat
: > ementAdapter.java:36)
: > 	at
: > com.carrotsearch.randomizedtesting.ThreadLeakControl$StatementRunner.
: > run(ThreadLeakControl.java:358)
: > 	at java.lang.Thread.run(Thread.java:679)
: > 
: > 
: > REGRESSION:
: > org.apache.solr.handler.component.DistributedSpellCheckComponentTest.t
: > estDistribSearch
: > 
: > Error Message:
: > 
: > 
: > Stack Trace:
: > java.lang.NullPointerException
: > 	at
: > __randomizedtesting.SeedInfo.seed([687EE273825E73E2:E9986C6BF50113DE
: > ]:0)
: > 	at
: > org.apache.solr.client.solrj.impl.HttpSolrServer.request(HttpSolrServer.java:
: > 269)
: > 	at
: > org.apache.solr.client.solrj.impl.HttpSolrServer.request(HttpSolrServer.java:
: > 182)
: > 	at
: > org.apache.solr.client.solrj.request.AbstractUpdateRequest.process(Abstrac
: > tUpdateRequest.java:117)
: > 	at org.apache.solr.client.solrj.SolrServer.commit(SolrServer.java:168)
: > 	at org.apache.solr.client.solrj.SolrServer.commit(SolrServer.java:146)
: > 	at
: > org.apache.solr.BaseDistributedSearchTestCase.commit(BaseDistributedSear
: > chTestCase.java:472)
: > 	at
: > org.apache.solr.handler.component.DistributedSpellCheckComponentTest.d
: > oTest(DistributedSpellCheckComponentTest.java:124)
: > 	at
: > org.apache.solr.BaseDistributedSearchTestCase.testDistribSearch(BaseDistri
: > butedSearchTestCase.java:812)
: > 	at sun.reflect.NativeMethodAccessorImpl.invoke0(Native Method)
: > 	at
: > sun.reflect.NativeMethodAccessorImpl.invoke(NativeMethodAccessorImpl.j
: > ava:57)
: > 	at
: > sun.reflect.DelegatingMethodAccessorImpl.invoke(DelegatingMethodAcces
: > sorImpl.java:43)
: > 	at java.lang.reflect.Method.invoke(Method.java:616)
: > 	at
: > com.carrotsearch.randomizedtesting.RandomizedRunner.invoke(Randomize
: > dRunner.java:1559)
: > 	at
: > com.carrotsearch.randomizedtesting.RandomizedRunner.access$600(Rando
: > mizedRunner.java:79)
: > 	at
: > com.carrotsearch.randomizedtesting.RandomizedRunner$6.evaluate(Rando
: > mizedRunner.java:737)
: > 	at
: > com.carrotsearch.randomizedtesting.RandomizedRunner$7.evaluate(Rando
: > mizedRunner.java:773)
: > 	at
: > com.carrotsearch.randomizedtesting.RandomizedRunner$8.evaluate(Rando
: > mizedRunner.java:787)
: > 	at
: > com.carrotsearch.randomizedtesting.rules.SystemPropertiesRestoreRule$1.
: > evaluate(SystemPropertiesRestoreRule.java:53)
: > 	at
: > org.apache.lucene.util.TestRuleSetupTeardownChained$1.evaluate(TestRule
: > SetupTeardownChained.java:50)
: > 	at
: > org.apache.lucene.util.TestRuleFieldCacheSanity$1.evaluate(TestRuleFieldCa
: > cheSanity.java:51)
: > 	at
: > org.apache.lucene.util.AbstractBeforeAfterRule$1.evaluate(AbstractBeforeA
: > fterRule.java:46)
: > 	at
: > com.carrotsearch.randomizedtesting.rules.SystemPropertiesInvariantRule$1
: > .evaluate(SystemPropertiesInvariantRule.java:55)
: > 	at
: > org.apache.lucene.util.TestRuleThreadAndTestName$1.evaluate(TestRuleTh
: > readAndTestName.java:49)
: > 	at
: > org.apache.lucene.util.TestRuleIgnoreAfterMaxFailures$1.evaluate(TestRule
: > IgnoreAfterMaxFailures.java:70)
: > 	at
: > org.apache.lucene.util.TestRuleMarkFailure$1.evaluate(TestRuleMarkFailure
: > .java:48)
: > 	at
: > com.carrotsearch.randomizedtesting.rules.StatementAdapter.evaluate(Stat
: > ementAdapter.java:36)
: > 	at
: > com.carrotsearch.randomizedtesting.ThreadLeakControl$StatementRunner.
: > run(ThreadLeakControl.java:358)
: > 	at
: > com.carrotsearch.randomizedtesting.ThreadLeakControl.forkTimeoutingTask
: > (ThreadLeakControl.java:782)
: > 	at
: > com.carrotsearch.randomizedtesting.ThreadLeakControl$3.evaluate(ThreadL
: > eakControl.java:442)
: > 	at
: > com.carrotsearch.randomizedtesting.RandomizedRunner.runSingleTest(Ran
: > domizedRunner.java:746)
: > 	at
: > com.carrotsearch.randomizedtesting.RandomizedRunner$3.evaluate(Rando
: > mizedRunner.java:648)
: > 	at
: > com.carrotsearch.randomizedtesting.RandomizedRunner$4.evaluate(Rando
: > mizedRunner.java:682)
: > 	at
: > com.carrotsearch.randomizedtesting.RandomizedRunner$5.evaluate(Rando
: > mizedRunner.java:693)
: > 	at
: > com.carrotsearch.randomizedtesting.rules.StatementAdapter.evaluate(Stat
: > ementAdapter.java:36)
: > 	at
: > com.carrotsearch.randomizedtesting.rules.SystemPropertiesRestoreRule$1.
: > evaluate(SystemPropertiesRestoreRule.java:53)
: > 	at
: > org.apache.lucene.util.AbstractBeforeAfterRule$1.evaluate(AbstractBeforeA
: > fterRule.java:46)
: > 	at
: > org.apache.lucene.util.TestRuleStoreClassName$1.evaluate(TestRuleStoreCl
: > assName.java:42)
: > 	at
: > com.carrotsearch.randomizedtesting.rules.SystemPropertiesInvariantRule$1
: > .evaluate(SystemPropertiesInvariantRule.java:55)
: > 	at
: > com.carrotsearch.randomizedtesting.rules.NoShadowingOrOverridesOnMet
: > hodsRule$1.evaluate(NoShadowingOrOverridesOnMethodsRule.java:39)
: > 	at
: > com.carrotsearch.randomizedtesting.rules.NoShadowingOrOverridesOnMet
: > hodsRule$1.evaluate(NoShadowingOrOverridesOnMethodsRule.java:39)
: > 	at
: > com.carrotsearch.randomizedtesting.rules.StatementAdapter.evaluate(Stat
: > ementAdapter.java:36)
: > 	at
: > org.apache.lucene.util.TestRuleAssertionsRequired$1.evaluate(TestRuleAss
: > ertionsRequired.java:43)
: > 	at
: > org.apache.lucene.util.TestRuleMarkFailure$1.evaluate(TestRuleMarkFailure
: > .java:48)
: > 	at
: > org.apache.lucene.util.TestRuleIgnoreAfterMaxFailures$1.evaluate(TestRule
: > IgnoreAfterMaxFailures.java:70)
: > 	at
: > org.apache.lucene.util.TestRuleIgnoreTestSuites$1.evaluate(TestRuleIgnore
: > TestSuites.java:55)
: > 	at
: > com.carrotsearch.randomizedtesting.rules.StatementAdapter.evaluate(Stat
: > ementAdapter.java:36)
: > 	at
: > com.carrotsearch.randomizedtesting.ThreadLeakControl$StatementRunner.
: > run(ThreadLeakControl.java:358)
: > 	at java.lang.Thread.run(Thread.java:679)
: > 
: > 
: > REGRESSION:
: > org.apache.solr.handler.component.DistributedTermsComponentTest.testDi
: > stribSearch
: > 
: > Error Message:
: > 
: > 
: > Stack Trace:
: > java.lang.NullPointerException
: > 	at
: > __randomizedtesting.SeedInfo.seed([687EE273825E73E2:E9986C6BF50113DE
: > ]:0)
: > 	at
: > org.apache.solr.client.solrj.impl.HttpSolrServer.request(HttpSolrServer.java:
: > 269)
: > 	at
: > org.apache.solr.client.solrj.impl.HttpSolrServer.request(HttpSolrServer.java:
: > 182)
: > 	at
: > org.apache.solr.client.solrj.request.AbstractUpdateRequest.process(Abstrac
: > tUpdateRequest.java:117)
: > 	at org.apache.solr.client.solrj.SolrServer.commit(SolrServer.java:168)
: > 	at org.apache.solr.client.solrj.SolrServer.commit(SolrServer.java:146)
: > 	at
: > org.apache.solr.BaseDistributedSearchTestCase.commit(BaseDistributedSear
: > chTestCase.java:472)
: > 	at
: > org.apache.solr.handler.component.DistributedTermsComponentTest.doTes
: > t(DistributedTermsComponentTest.java:41)
: > 	at
: > org.apache.solr.BaseDistributedSearchTestCase.testDistribSearch(BaseDistri
: > butedSearchTestCase.java:812)
: > 	at sun.reflect.NativeMethodAccessorImpl.invoke0(Native Method)
: > 	at
: > sun.reflect.NativeMethodAccessorImpl.invoke(NativeMethodAccessorImpl.j
: > ava:57)
: > 	at
: > sun.reflect.DelegatingMethodAccessorImpl.invoke(DelegatingMethodAcces
: > sorImpl.java:43)
: > 	at java.lang.reflect.Method.invoke(Method.java:616)
: > 	at
: > com.carrotsearch.randomizedtesting.RandomizedRunner.invoke(Randomize
: > dRunner.java:1559)
: > 	at
: > com.carrotsearch.randomizedtesting.RandomizedRunner.access$600(Rando
: > mizedRunner.java:79)
: > 	at
: > com.carrotsearch.randomizedtesting.RandomizedRunner$6.evaluate(Rando
: > mizedRunner.java:737)
: > 	at
: > com.carrotsearch.randomizedtesting.RandomizedRunner$7.evaluate(Rando
: > mizedRunner.java:773)
: > 	at
: > com.carrotsearch.randomizedtesting.RandomizedRunner$8.evaluate(Rando
: > mizedRunner.java:787)
: > 	at
: > com.carrotsearch.randomizedtesting.rules.SystemPropertiesRestoreRule$1.
: > evaluate(SystemPropertiesRestoreRule.java:53)
: > 	at
: > org.apache.lucene.util.TestRuleSetupTeardownChained$1.evaluate(TestRule
: > SetupTeardownChained.java:50)
: > 	at
: > org.apache.lucene.util.TestRuleFieldCacheSanity$1.evaluate(TestRuleFieldCa
: > cheSanity.java:51)
: > 	at
: > org.apache.lucene.util.AbstractBeforeAfterRule$1.evaluate(AbstractBeforeA
: > fterRule.java:46)
: > 	at
: > com.carrotsearch.randomizedtesting.rules.SystemPropertiesInvariantRule$1
: > .evaluate(SystemPropertiesInvariantRule.java:55)
: > 	at
: > org.apache.lucene.util.TestRuleThreadAndTestName$1.evaluate(TestRuleTh
: > readAndTestName.java:49)
: > 	at
: > org.apache.lucene.util.TestRuleIgnoreAfterMaxFailures$1.evaluate(TestRule
: > IgnoreAfterMaxFailures.java:70)
: > 	at
: > org.apache.lucene.util.TestRuleMarkFailure$1.evaluate(TestRuleMarkFailure
: > .java:48)
: > 	at
: > com.carrotsearch.randomizedtesting.rules.StatementAdapter.evaluate(Stat
: > ementAdapter.java:36)
: > 	at
: > com.carrotsearch.randomizedtesting.ThreadLeakControl$StatementRunner.
: > run(ThreadLeakControl.java:358)
: > 	at
: > com.carrotsearch.randomizedtesting.ThreadLeakControl.forkTimeoutingTask
: > (ThreadLeakControl.java:782)
: > 	at
: > com.carrotsearch.randomizedtesting.ThreadLeakControl$3.evaluate(ThreadL
: > eakControl.java:442)
: > 	at
: > com.carrotsearch.randomizedtesting.RandomizedRunner.runSingleTest(Ran
: > domizedRunner.java:746)
: > 	at
: > com.carrotsearch.randomizedtesting.RandomizedRunner$3.evaluate(Rando
: > mizedRunner.java:648)
: > 	at
: > com.carrotsearch.randomizedtesting.RandomizedRunner$4.evaluate(Rando
: > mizedRunner.java:682)
: > 	at
: > com.carrotsearch.randomizedtesting.RandomizedRunner$5.evaluate(Rando
: > mizedRunner.java:693)
: > 	at
: > com.carrotsearch.randomizedtesting.rules.StatementAdapter.evaluate(Stat
: > ementAdapter.java:36)
: > 	at
: > com.carrotsearch.randomizedtesting.rules.SystemPropertiesRestoreRule$1.
: > evaluate(SystemPropertiesRestoreRule.java:53)
: > 	at
: > org.apache.lucene.util.AbstractBeforeAfterRule$1.evaluate(AbstractBeforeA
: > fterRule.java:46)
: > 	at
: > org.apache.lucene.util.TestRuleStoreClassName$1.evaluate(TestRuleStoreCl
: > assName.java:42)
: > 	at
: > com.carrotsearch.randomizedtesting.rules.SystemPropertiesInvariantRule$1
: > .evaluate(SystemPropertiesInvariantRule.java:55)
: > 	at
: > com.carrotsearch.randomizedtesting.rules.NoShadowingOrOverridesOnMet
: > hodsRule$1.evaluate(NoShadowingOrOverridesOnMethodsRule.java:39)
: > 	at
: > com.carrotsearch.randomizedtesting.rules.NoShadowingOrOverridesOnMet
: > hodsRule$1.evaluate(NoShadowingOrOverridesOnMethodsRule.java:39)
: > 	at
: > com.carrotsearch.randomizedtesting.rules.StatementAdapter.evaluate(Stat
: > ementAdapter.java:36)
: > 	at
: > org.apache.lucene.util.TestRuleAssertionsRequired$1.evaluate(TestRuleAss
: > ertionsRequired.java:43)
: > 	at
: > org.apache.lucene.util.TestRuleMarkFailure$1.evaluate(TestRuleMarkFailure
: > .java:48)
: > 	at
: > org.apache.lucene.util.TestRuleIgnoreAfterMaxFailures$1.evaluate(TestRule
: > IgnoreAfterMaxFailures.java:70)
: > 	at
: > org.apache.lucene.util.TestRuleIgnoreTestSuites$1.evaluate(TestRuleIgnore
: > TestSuites.java:55)
: > 	at
: > com.carrotsearch.randomizedtesting.rules.StatementAdapter.evaluate(Stat
: > ementAdapter.java:36)
: > 	at
: > com.carrotsearch.randomizedtesting.ThreadLeakControl$StatementRunner.
: > run(ThreadLeakControl.java:358)
: > 	at java.lang.Thread.run(Thread.java:679)
: > 
: > 
: > REGRESSION:
: > org.apache.solr.handler.component.TermVectorComponentDistributedTest.
: > testDistribSearch
: > 
: > Error Message:
: > 
: > 
: > Stack Trace:
: > java.lang.NullPointerException
: > 	at
: > __randomizedtesting.SeedInfo.seed([687EE273825E73E2:E9986C6BF50113DE
: > ]:0)
: > 	at
: > org.apache.solr.client.solrj.impl.HttpSolrServer.request(HttpSolrServer.java:
: > 269)
: > 	at
: > org.apache.solr.client.solrj.impl.HttpSolrServer.request(HttpSolrServer.java:
: > 182)
: > 	at
: > org.apache.solr.client.solrj.request.AbstractUpdateRequest.process(Abstrac
: > tUpdateRequest.java:117)
: > 	at org.apache.solr.client.solrj.SolrServer.commit(SolrServer.java:168)
: > 	at org.apache.solr.client.solrj.SolrServer.commit(SolrServer.java:146)
: > 	at
: > org.apache.solr.BaseDistributedSearchTestCase.commit(BaseDistributedSear
: > chTestCase.java:472)
: > 	at
: > org.apache.solr.handler.component.TermVectorComponentDistributedTest.
: > doTest(TermVectorComponentDistributedTest.java:112)
: > 	at
: > org.apache.solr.BaseDistributedSearchTestCase.testDistribSearch(BaseDistri
: > butedSearchTestCase.java:812)
: > 	at sun.reflect.NativeMethodAccessorImpl.invoke0(Native Method)
: > 	at
: > sun.reflect.NativeMethodAccessorImpl.invoke(NativeMethodAccessorImpl.j
: > ava:57)
: > 	at
: > sun.reflect.DelegatingMethodAccessorImpl.invoke(DelegatingMethodAcces
: > sorImpl.java:43)
: > 	at java.lang.reflect.Method.invoke(Method.java:616)
: > 	at
: > com.carrotsearch.randomizedtesting.RandomizedRunner.invoke(Randomize
: > dRunner.java:1559)
: > 	at
: > com.carrotsearch.randomizedtesting.RandomizedRunner.access$600(Rando
: > mizedRunner.java:79)
: > 	at
: > com.carrotsearch.randomizedtesting.RandomizedRunner$6.evaluate(Rando
: > mizedRunner.java:737)
: > 	at
: > com.carrotsearch.randomizedtesting.RandomizedRunner$7.evaluate(Rando
: > mizedRunner.java:773)
: > 	at
: > com.carrotsearch.randomizedtesting.RandomizedRunner$8.evaluate(Rando
: > mizedRunner.java:787)
: > 	at
: > com.carrotsearch.randomizedtesting.rules.SystemPropertiesRestoreRule$1.
: > evaluate(SystemPropertiesRestoreRule.java:53)
: > 	at
: > org.apache.lucene.util.TestRuleSetupTeardownChained$1.evaluate(TestRule
: > SetupTeardownChained.java:50)
: > 	at
: > org.apache.lucene.util.TestRuleFieldCacheSanity$1.evaluate(TestRuleFieldCa
: > cheSanity.java:51)
: > 	at
: > org.apache.lucene.util.AbstractBeforeAfterRule$1.evaluate(AbstractBeforeA
: > fterRule.java:46)
: > 	at
: > com.carrotsearch.randomizedtesting.rules.SystemPropertiesInvariantRule$1
: > .evaluate(SystemPropertiesInvariantRule.java:55)
: > 	at
: > org.apache.lucene.util.TestRuleThreadAndTestName$1.evaluate(TestRuleTh
: > readAndTestName.java:49)
: > 	at
: > org.apache.lucene.util.TestRuleIgnoreAfterMaxFailures$1.evaluate(TestRule
: > IgnoreAfterMaxFailures.java:70)
: > 	at
: > org.apache.lucene.util.TestRuleMarkFailure$1.evaluate(TestRuleMarkFailure
: > .java:48)
: > 	at
: > com.carrotsearch.randomizedtesting.rules.StatementAdapter.evaluate(Stat
: > ementAdapter.java:36)
: > 	at
: > com.carrotsearch.randomizedtesting.ThreadLeakControl$StatementRunner.
: > run(ThreadLeakControl.java:358)
: > 	at
: > com.carrotsearch.randomizedtesting.ThreadLeakControl.forkTimeoutingTask
: > (ThreadLeakControl.java:782)
: > 	at
: > com.carrotsearch.randomizedtesting.ThreadLeakControl$3.evaluate(ThreadL
: > eakControl.java:442)
: > 	at
: > com.carrotsearch.randomizedtesting.RandomizedRunner.runSingleTest(Ran
: > domizedRunner.java:746)
: > 	at
: > com.carrotsearch.randomizedtesting.RandomizedRunner$3.evaluate(Rando
: > mizedRunner.java:648)
: > 	at
: > com.carrotsearch.randomizedtesting.RandomizedRunner$4.evaluate(Rando
: > mizedRunner.java:682)
: > 	at
: > com.carrotsearch.randomizedtesting.RandomizedRunner$5.evaluate(Rando
: > mizedRunner.java:693)
: > 	at
: > com.carrotsearch.randomizedtesting.rules.StatementAdapter.evaluate(Stat
: > ementAdapter.java:36)
: > 	at
: > com.carrotsearch.randomizedtesting.rules.SystemPropertiesRestoreRule$1.
: > evaluate(SystemPropertiesRestoreRule.java:53)
: > 	at
: > org.apache.lucene.util.AbstractBeforeAfterRule$1.evaluate(AbstractBeforeA
: > fterRule.java:46)
: > 	at
: > org.apache.lucene.util.TestRuleStoreClassName$1.evaluate(TestRuleStoreCl
: > assName.java:42)
: > 	at
: > com.carrotsearch.randomizedtesting.rules.SystemPropertiesInvariantRule$1
: > .evaluate(SystemPropertiesInvariantRule.java:55)
: > 	at
: > com.carrotsearch.randomizedtesting.rules.NoShadowingOrOverridesOnMet
: > hodsRule$1.evaluate(NoShadowingOrOverridesOnMethodsRule.java:39)
: > 	at
: > com.carrotsearch.randomizedtesting.rules.NoShadowingOrOverridesOnMet
: > hodsRule$1.evaluate(NoShadowingOrOverridesOnMethodsRule.java:39)
: > 	at
: > com.carrotsearch.randomizedtesting.rules.StatementAdapter.evaluate(Stat
: > ementAdapter.java:36)
: > 	at
: > org.apache.lucene.util.TestRuleAssertionsRequired$1.evaluate(TestRuleAss
: > ertionsRequired.java:43)
: > 	at
: > org.apache.lucene.util.TestRuleMarkFailure$1.evaluate(TestRuleMarkFailure
: > .java:48)
: > 	at
: > org.apache.lucene.util.TestRuleIgnoreAfterMaxFailures$1.evaluate(TestRule
: > IgnoreAfterMaxFailures.java:70)
: > 	at
: > org.apache.lucene.util.TestRuleIgnoreTestSuites$1.evaluate(TestRuleIgnore
: > TestSuites.java:55)
: > 	at
: > com.carrotsearch.randomizedtesting.rules.StatementAdapter.evaluate(Stat
: > ementAdapter.java:36)
: > 	at
: > com.carrotsearch.randomizedtesting.ThreadLeakControl$StatementRunner.
: > run(ThreadLeakControl.java:358)
: > 	at java.lang.Thread.run(Thread.java:679)
: > 
: > 
: > REGRESSION:
: > org.apache.solr.request.TestRemoteStreaming.testQtUpdateFails
: > 
: > Error Message:
: > 
: > 
: > Stack Trace:
: > java.lang.NullPointerException
: > 	at
: > __randomizedtesting.SeedInfo.seed([687EE273825E73E2:3C7CF6964E6EF6B8
: > ]:0)
: > 	at
: > org.apache.solr.client.solrj.impl.HttpSolrServer.request(HttpSolrServer.java:
: > 269)
: > 	at
: > org.apache.solr.client.solrj.impl.HttpSolrServer.request(HttpSolrServer.java:
: > 182)
: > 	at
: > org.apache.solr.client.solrj.request.AbstractUpdateRequest.process(Abstrac
: > tUpdateRequest.java:117)
: > 	at org.apache.solr.client.solrj.SolrServer.commit(SolrServer.java:168)
: > 	at org.apache.solr.client.solrj.SolrServer.commit(SolrServer.java:146)
: > 	at
: > org.apache.solr.request.TestRemoteStreaming.doBefore(TestRemoteStrea
: > ming.java:60)
: > 	at sun.reflect.NativeMethodAccessorImpl.invoke0(Native Method)
: > 	at
: > sun.reflect.NativeMethodAccessorImpl.invoke(NativeMethodAccessorImpl.j
: > ava:57)
: > 	at
: > sun.reflect.DelegatingMethodAccessorImpl.invoke(DelegatingMethodAcces
: > sorImpl.java:43)
: > 	at java.lang.reflect.Method.invoke(Method.java:616)
: > 	at
: > com.carrotsearch.randomizedtesting.RandomizedRunner.invoke(Randomize
: > dRunner.java:1559)
: > 	at
: > com.carrotsearch.randomizedtesting.RandomizedRunner.access$600(Rando
: > mizedRunner.java:79)
: > 	at
: > com.carrotsearch.randomizedtesting.RandomizedRunner$7.evaluate(Rando
: > mizedRunner.java:771)
: > 	at
: > com.carrotsearch.randomizedtesting.RandomizedRunner$8.evaluate(Rando
: > mizedRunner.java:787)
: > 	at
: > com.carrotsearch.randomizedtesting.rules.SystemPropertiesRestoreRule$1.
: > evaluate(SystemPropertiesRestoreRule.java:53)
: > 	at
: > org.apache.lucene.util.TestRuleSetupTeardownChained$1.evaluate(TestRule
: > SetupTeardownChained.java:50)
: > 	at
: > org.apache.lucene.util.TestRuleFieldCacheSanity$1.evaluate(TestRuleFieldCa
: > cheSanity.java:51)
: > 	at
: > org.apache.lucene.util.AbstractBeforeAfterRule$1.evaluate(AbstractBeforeA
: > fterRule.java:46)
: > 	at
: > com.carrotsearch.randomizedtesting.rules.SystemPropertiesInvariantRule$1
: > .evaluate(SystemPropertiesInvariantRule.java:55)
: > 	at
: > org.apache.lucene.util.TestRuleThreadAndTestName$1.evaluate(TestRuleTh
: > readAndTestName.java:49)
: > 	at
: > org.apache.lucene.util.TestRuleIgnoreAfterMaxFailures$1.evaluate(TestRule
: > IgnoreAfterMaxFailures.java:70)
: > 	at
: > org.apache.lucene.util.TestRuleMarkFailure$1.evaluate(TestRuleMarkFailure
: > .java:48)
: > 	at
: > com.carrotsearch.randomizedtesting.rules.StatementAdapter.evaluate(Stat
: > ementAdapter.java:36)
: > 	at
: > com.carrotsearch.randomizedtesting.ThreadLeakControl$StatementRunner.
: > run(ThreadLeakControl.java:358)
: > 	at
: > com.carrotsearch.randomizedtesting.ThreadLeakControl.forkTimeoutingTask
: > (ThreadLeakControl.java:782)
: > 	at
: > com.carrotsearch.randomizedtesting.ThreadLeakControl$3.evaluate(ThreadL
: > eakControl.java:442)
: > 	at
: > com.carrotsearch.randomizedtesting.RandomizedRunner.runSingleTest(Ran
: > domizedRunner.java:746)
: > 	at
: > com.carrotsearch.randomizedtesting.RandomizedRunner$3.evaluate(Rando
: > mizedRunner.java:648)
: > 	at
: > com.carrotsearch.randomizedtesting.RandomizedRunner$4.evaluate(Rando
: > mizedRunner.java:682)
: > 	at
: > com.carrotsearch.randomizedtesting.RandomizedRunner$5.evaluate(Rando
: > mizedRunner.java:693)
: > 	at
: > com.carrotsearch.randomizedtesting.rules.StatementAdapter.evaluate(Stat
: > ementAdapter.java:36)
: > 	at
: > com.carrotsearch.randomizedtesting.rules.SystemPropertiesRestoreRule$1.
: > evaluate(SystemPropertiesRestoreRule.java:53)
: > 	at
: > org.apache.lucene.util.AbstractBeforeAfterRule$1.evaluate(AbstractBeforeA
: > fterRule.java:46)
: > 	at
: > org.apache.lucene.util.TestRuleStoreClassName$1.evaluate(TestRuleStoreCl
: > assName.java:42)
: > 	at
: > com.carrotsearch.randomizedtesting.rules.SystemPropertiesInvariantRule$1
: > .evaluate(SystemPropertiesInvariantRule.java:55)
: > 	at
: > com.carrotsearch.randomizedtesting.rules.NoShadowingOrOverridesOnMet
: > hodsRule$1.evaluate(NoShadowingOrOverridesOnMethodsRule.java:39)
: > 	at
: > com.carrotsearch.randomizedtesting.rules.NoShadowingOrOverridesOnMet
: > hodsRule$1.evaluate(NoShadowingOrOverridesOnMethodsRule.java:39)
: > 	at
: > com.carrotsearch.randomizedtesting.rules.StatementAdapter.evaluate(Stat
: > ementAdapter.java:36)
: > 	at
: > org.apache.lucene.util.TestRuleAssertionsRequired$1.evaluate(TestRuleAss
: > ertionsRequired.java:43)
: > 	at
: > org.apache.lucene.util.TestRuleMarkFailure$1.evaluate(TestRuleMarkFailure
: > .java:48)
: > 	at
: > org.apache.lucene.util.TestRuleIgnoreAfterMaxFailures$1.evaluate(TestRule
: > IgnoreAfterMaxFailures.java:70)
: > 	at
: > org.apache.lucene.util.TestRuleIgnoreTestSuites$1.evaluate(TestRuleIgnore
: > TestSuites.java:55)
: > 	at
: > com.carrotsearch.randomizedtesting.rules.StatementAdapter.evaluate(Stat
: > ementAdapter.java:36)
: > 	at
: > com.carrotsearch.randomizedtesting.ThreadLeakControl$StatementRunner.
: > run(ThreadLeakControl.java:358)
: > 	at java.lang.Thread.run(Thread.java:679)
: > 
: > 
: > REGRESSION:  org.apache.solr.request.TestRemoteStreaming.testStreamUrl
: > 
: > Error Message:
: > 
: > 
: > Stack Trace:
: > java.lang.NullPointerException
: > 	at
: > __randomizedtesting.SeedInfo.seed([687EE273825E73E2:456B46E1D4A78A08
: > ]:0)
: > 	at
: > org.apache.solr.client.solrj.impl.HttpSolrServer.request(HttpSolrServer.java:
: > 269)
: > 	at
: > org.apache.solr.client.solrj.impl.HttpSolrServer.request(HttpSolrServer.java:
: > 182)
: > 	at
: > org.apache.solr.client.solrj.request.AbstractUpdateRequest.process(Abstrac
: > tUpdateRequest.java:117)
: > 	at org.apache.solr.client.solrj.SolrServer.commit(SolrServer.java:168)
: > 	at org.apache.solr.client.solrj.SolrServer.commit(SolrServer.java:146)
: > 	at
: > org.apache.solr.request.TestRemoteStreaming.doBefore(TestRemoteStrea
: > ming.java:60)
: > 	at sun.reflect.NativeMethodAccessorImpl.invoke0(Native Method)
: > 	at
: > sun.reflect.NativeMethodAccessorImpl.invoke(NativeMethodAccessorImpl.j
: > ava:57)
: > 	at
: > sun.reflect.DelegatingMethodAccessorImpl.invoke(DelegatingMethodAcces
: > sorImpl.java:43)
: > 	at java.lang.reflect.Method.invoke(Method.java:616)
: > 	at
: > com.carrotsearch.randomizedtesting.RandomizedRunner.invoke(Randomize
: > dRunner.java:1559)
: > 	at
: > com.carrotsearch.randomizedtesting.RandomizedRunner.access$600(Rando
: > mizedRunner.java:79)
: > 	at
: > com.carrotsearch.randomizedtesting.RandomizedRunner$7.evaluate(Rando
: > mizedRunner.java:771)
: > 	at
: > com.carrotsearch.randomizedtesting.RandomizedRunner$8.evaluate(Rando
: > mizedRunner.java:787)
: > 	at
: > com.carrotsearch.randomizedtesting.rules.SystemPropertiesRestoreRule$1.
: > evaluate(SystemPropertiesRestoreRule.java:53)
: > 	at
: > org.apache.lucene.util.TestRuleSetupTeardownChained$1.evaluate(TestRule
: > SetupTeardownChained.java:50)
: > 	at
: > org.apache.lucene.util.TestRuleFieldCacheSanity$1.evaluate(TestRuleFieldCa
: > cheSanity.java:51)
: > 	at
: > org.apache.lucene.util.AbstractBeforeAfterRule$1.evaluate(AbstractBeforeA
: > fterRule.java:46)
: > 	at
: > com.carrotsearch.randomizedtesting.rules.SystemPropertiesInvariantRule$1
: > .evaluate(SystemPropertiesInvariantRule.java:55)
: > 	at
: > org.apache.lucene.util.TestRuleThreadAndTestName$1.evaluate(TestRuleTh
: > readAndTestName.java:49)
: > 	at
: > org.apache.lucene.util.TestRuleIgnoreAfterMaxFailures$1.evaluate(TestRule
: > IgnoreAfterMaxFailures.java:70)
: > 	at
: > org.apache.lucene.util.TestRuleMarkFailure$1.evaluate(TestRuleMarkFailure
: > .java:48)
: > 	at
: > com.carrotsearch.randomizedtesting.rules.StatementAdapter.evaluate(Stat
: > ementAdapter.java:36)
: > 	at
: > com.carrotsearch.randomizedtesting.ThreadLeakControl$StatementRunner.
: > run(ThreadLeakControl.java:358)
: > 	at
: > com.carrotsearch.randomizedtesting.ThreadLeakControl.forkTimeoutingTask
: > (ThreadLeakControl.java:782)
: > 	at
: > com.carrotsearch.randomizedtesting.ThreadLeakControl$3.evaluate(ThreadL
: > eakControl.java:442)
: > 	at
: > com.carrotsearch.randomizedtesting.RandomizedRunner.runSingleTest(Ran
: > domizedRunner.java:746)
: > 	at
: > com.carrotsearch.randomizedtesting.RandomizedRunner$3.evaluate(Rando
: > mizedRunner.java:648)
: > 	at
: > com.carrotsearch.randomizedtesting.RandomizedRunner$4.evaluate(Rando
: > mizedRunner.java:682)
: > 	at
: > com.carrotsearch.randomizedtesting.RandomizedRunner$5.evaluate(Rando
: > mizedRunner.java:693)
: > 	at
: > com.carrotsearch.randomizedtesting.rules.StatementAdapter.evaluate(Stat
: > ementAdapter.java:36)
: > 	at
: > com.carrotsearch.randomizedtesting.rules.SystemPropertiesRestoreRule$1.
: > evaluate(SystemPropertiesRestoreRule.java:53)
: > 	at
: > org.apache.lucene.util.AbstractBeforeAfterRule$1.evaluate(AbstractBeforeA
: > fterRule.java:46)
: > 	at
: > org.apache.lucene.util.TestRuleStoreClassName$1.evaluate(TestRuleStoreCl
: > assName.java:42)
: > 	at
: > com.carrotsearch.randomizedtesting.rules.SystemPropertiesInvariantRule$1
: > .evaluate(SystemPropertiesInvariantRule.java:55)
: > 	at
: > com.carrotsearch.randomizedtesting.rules.NoShadowingOrOverridesOnMet
: > hodsRule$1.evaluate(NoShadowingOrOverridesOnMethodsRule.java:39)
: > 	at
: > com.carrotsearch.randomizedtesting.rules.NoShadowingOrOverridesOnMet
: > hodsRule$1.evaluate(NoShadowingOrOverridesOnMethodsRule.java:39)
: > 	at
: > com.carrotsearch.randomizedtesting.rules.StatementAdapter.evaluate(Stat
: > ementAdapter.java:36)
: > 	at
: > org.apache.lucene.util.TestRuleAssertionsRequired$1.evaluate(TestRuleAss
: > ertionsRequired.java:43)
: > 	at
: > org.apache.lucene.util.TestRuleMarkFailure$1.evaluate(TestRuleMarkFailure
: > .java:48)
: > 	at
: > org.apache.lucene.util.TestRuleIgnoreAfterMaxFailures$1.evaluate(TestRule
: > IgnoreAfterMaxFailures.java:70)
: > 	at
: > org.apache.lucene.util.TestRuleIgnoreTestSuites$1.evaluate(TestRuleIgnore
: > TestSuites.java:55)
: > 	at
: > com.carrotsearch.randomizedtesting.rules.StatementAdapter.evaluate(Stat
: > ementAdapter.java:36)
: > 	at
: > com.carrotsearch.randomizedtesting.ThreadLeakControl$StatementRunner.
: > run(ThreadLeakControl.java:358)
: > 	at java.lang.Thread.run(Thread.java:679)
: > 
: > 
: > REGRESSION:
: > org.apache.solr.request.TestRemoteStreaming.testNoUrlAccess
: > 
: > Error Message:
: > 
: > 
: > Stack Trace:
: > java.lang.NullPointerException
: > 	at
: > __randomizedtesting.SeedInfo.seed([687EE273825E73E2:F6F4AB84423E14DE
: > ]:0)
: > 	at
: > org.apache.solr.client.solrj.impl.HttpSolrServer.request(HttpSolrServer.java:
: > 269)
: > 	at
: > org.apache.solr.client.solrj.impl.HttpSolrServer.request(HttpSolrServer.java:
: > 182)
: > 	at
: > org.apache.solr.client.solrj.request.AbstractUpdateRequest.process(Abstrac
: > tUpdateRequest.java:117)
: > 	at org.apache.solr.client.solrj.SolrServer.commit(SolrServer.java:168)
: > 	at org.apache.solr.client.solrj.SolrServer.commit(SolrServer.java:146)
: > 	at
: > org.apache.solr.request.TestRemoteStreaming.doBefore(TestRemoteStrea
: > ming.java:60)
: > 	at sun.reflect.NativeMethodAccessorImpl.invoke0(Native Method)
: > 	at
: > sun.reflect.NativeMethodAccessorImpl.invoke(NativeMethodAccessorImpl.j
: > ava:57)
: > 	at
: > sun.reflect.DelegatingMethodAccessorImpl.invoke(DelegatingMethodAcces
: > sorImpl.java:43)
: > 	at java.lang.reflect.Method.invoke(Method.java:616)
: > 	at
: > com.carrotsearch.randomizedtesting.RandomizedRunner.invoke(Randomize
: > dRunner.java:1559)
: > 	at
: > com.carrotsearch.randomizedtesting.RandomizedRunner.access$600(Rando
: > mizedRunner.java:79)
: > 	at
: > com.carrotsearch.randomizedtesting.RandomizedRunner$7.evaluate(Rando
: > mizedRunner.java:771)
: > 	at
: > com.carrotsearch.randomizedtesting.RandomizedRunner$8.evaluate(Rando
: > mizedRunner.java:787)
: > 	at
: > com.carrotsearch.randomizedtesting.rules.SystemPropertiesRestoreRule$1.
: > evaluate(SystemPropertiesRestoreRule.java:53)
: > 	at
: > org.apache.lucene.util.TestRuleSetupTeardownChained$1.evaluate(TestRule
: > SetupTeardownChained.java:50)
: > 	at
: > org.apache.lucene.util.TestRuleFieldCacheSanity$1.evaluate(TestRuleFieldCa
: > cheSanity.java:51)
: > 	at
: > org.apache.lucene.util.AbstractBeforeAfterRule$1.evaluate(AbstractBeforeA
: > fterRule.java:46)
: > 	at
: > com.carrotsearch.randomizedtesting.rules.SystemPropertiesInvariantRule$1
: > .evaluate(SystemPropertiesInvariantRule.java:55)
: > 	at
: > org.apache.lucene.util.TestRuleThreadAndTestName$1.evaluate(TestRuleTh
: > readAndTestName.java:49)
: > 	at
: > org.apache.lucene.util.TestRuleIgnoreAfterMaxFailures$1.evaluate(TestRule
: > IgnoreAfterMaxFailures.java:70)
: > 	at
: > org.apache.lucene.util.TestRuleMarkFailure$1.evaluate(TestRuleMarkFailure
: > .java:48)
: > 	at
: > com.carrotsearch.randomizedtesting.rules.StatementAdapter.evaluate(Stat
: > ementAdapter.java:36)
: > 	at
: > com.carrotsearch.randomizedtesting.ThreadLeakControl$StatementRunner.
: > run(ThreadLeakControl.java:358)
: > 	at
: > com.carrotsearch.randomizedtesting.ThreadLeakControl.forkTimeoutingTask
: > (ThreadLeakControl.java:782)
: > 	at
: > com.carrotsearch.randomizedtesting.ThreadLeakControl$3.evaluate(ThreadL
: > eakControl.java:442)
: > 	at
: > com.carrotsearch.randomizedtesting.RandomizedRunner.runSingleTest(Ran
: > domizedRunner.java:746)
: > 	at
: > com.carrotsearch.randomizedtesting.RandomizedRunner$3.evaluate(Rando
: > mizedRunner.java:648)
: > 	at
: > com.carrotsearch.randomizedtesting.RandomizedRunner$4.evaluate(Rando
: > mizedRunner.java:682)
: > 	at
: > com.carrotsearch.randomizedtesting.RandomizedRunner$5.evaluate(Rando
: > mizedRunner.java:693)
: > 	at
: > com.carrotsearch.randomizedtesting.rules.StatementAdapter.evaluate(Stat
: > ementAdapter.java:36)
: > 	at
: > com.carrotsearch.randomizedtesting.rules.SystemPropertiesRestoreRule$1.
: > evaluate(SystemPropertiesRestoreRule.java:53)
: > 	at
: > org.apache.lucene.util.AbstractBeforeAfterRule$1.evaluate(AbstractBeforeA
: > fterRule.java:46)
: > 	at
: > org.apache.lucene.util.TestRuleStoreClassName$1.evaluate(TestRuleStoreCl
: > assName.java:42)
: > 	at
: > com.carrotsearch.randomizedtesting.rules.SystemPropertiesInvariantRule$1
: > .evaluate(SystemPropertiesInvariantRule.java:55)
: > 	at
: > com.carrotsearch.randomizedtesting.rules.NoShadowingOrOverridesOnMet
: > hodsRule$1.evaluate(NoShadowingOrOverridesOnMethodsRule.java:39)
: > 	at
: > com.carrotsearch.randomizedtesting.rules.NoShadowingOrOverridesOnMet
: > hodsRule$1.evaluate(NoShadowingOrOverridesOnMethodsRule.java:39)
: > 	at
: > com.carrotsearch.randomizedtesting.rules.StatementAdapter.evaluate(Stat
: > ementAdapter.java:36)
: > 	at
: > org.apache.lucene.util.TestRuleAssertionsRequired$1.evaluate(TestRuleAss
: > ertionsRequired.java:43)
: > 	at
: > org.apache.lucene.util.TestRuleMarkFailure$1.evaluate(TestRuleMarkFailure
: > .java:48)
: > 	at
: > org.apache.lucene.util.TestRuleIgnoreAfterMaxFailures$1.evaluate(TestRule
: > IgnoreAfterMaxFailures.java:70)
: > 	at
: > org.apache.lucene.util.TestRuleIgnoreTestSuites$1.evaluate(TestRuleIgnore
: > TestSuites.java:55)
: > 	at
: > com.carrotsearch.randomizedtesting.rules.StatementAdapter.evaluate(Stat
: > ementAdapter.java:36)
: > 	at
: > com.carrotsearch.randomizedtesting.ThreadLeakControl$StatementRunner.
: > run(ThreadLeakControl.java:358)
: > 	at java.lang.Thread.run(Thread.java:679)
: > 
: > 
: > REGRESSION:
: > org.apache.solr.request.TestRemoteStreaming.testMakeDeleteAllUrl
: > 
: > Error Message:
: > 
: > 
: > Stack Trace:
: > java.lang.NullPointerException
: > 	at
: > __randomizedtesting.SeedInfo.seed([687EE273825E73E2:33A6AC28AEFC950]
: > :0)
: > 	at
: > org.apache.solr.client.solrj.impl.HttpSolrServer.request(HttpSolrServer.java:
: > 269)
: > 	at
: > org.apache.solr.client.solrj.impl.HttpSolrServer.request(HttpSolrServer.java:
: > 182)
: > 	at
: > org.apache.solr.client.solrj.request.AbstractUpdateRequest.process(Abstrac
: > tUpdateRequest.java:117)
: > 	at org.apache.solr.client.solrj.SolrServer.commit(SolrServer.java:168)
: > 	at org.apache.solr.client.solrj.SolrServer.commit(SolrServer.java:146)
: > 	at
: > org.apache.solr.request.TestRemoteStreaming.doBefore(TestRemoteStrea
: > ming.java:60)
: > 	at sun.reflect.NativeMethodAccessorImpl.invoke0(Native Method)
: > 	at
: > sun.reflect.NativeMethodAccessorImpl.invoke(NativeMethodAccessorImpl.j
: > ava:57)
: > 	at
: > sun.reflect.DelegatingMethodAccessorImpl.invoke(DelegatingMethodAcces
: > sorImpl.java:43)
: > 	at java.lang.reflect.Method.invoke(Method.java:616)
: > 	at
: > com.carrotsearch.randomizedtesting.RandomizedRunner.invoke(Randomize
: > dRunner.java:1559)
: > 	at
: > com.carrotsearch.randomizedtesting.RandomizedRunner.access$600(Rando
: > mizedRunner.java:79)
: > 	at
: > com.carrotsearch.randomizedtesting.RandomizedRunner$7.evaluate(Rando
: > mizedRunner.java:771)
: > 	at
: > com.carrotsearch.randomizedtesting.RandomizedRunner$8.evaluate(Rando
: > mizedRunner.java:787)
: > 	at
: > com.carrotsearch.randomizedtesting.rules.SystemPropertiesRestoreRule$1.
: > evaluate(SystemPropertiesRestoreRule.java:53)
: > 	at
: > org.apache.lucene.util.TestRuleSetupTeardownChained$1.evaluate(TestRule
: > SetupTeardownChained.java:50)
: > 	at
: > org.apache.lucene.util.TestRuleFieldCacheSanity$1.evaluate(TestRuleFieldCa
: > cheSanity.java:51)
: > 	at
: > org.apache.lucene.util.AbstractBeforeAfterRule$1.evaluate(AbstractBeforeA
: > fterRule.java:46)
: > 	at
: > com.carrotsearch.randomizedtesting.rules.SystemPropertiesInvariantRule$1
: > .evaluate(SystemPropertiesInvariantRule.java:55)
: > 	at
: > org.apache.lucene.util.TestRuleThreadAndTestName$1.evaluate(TestRuleTh
: > readAndTestName.java:49)
: > 	at
: > org.apache.lucene.util.TestRuleIgnoreAfterMaxFailures$1.evaluate(TestRule
: > IgnoreAfterMaxFailures.java:70)
: > 	at
: > org.apache.lucene.util.TestRuleMarkFailure$1.evaluate(TestRuleMarkFailure
: > .java:48)
: > 	at
: > com.carrotsearch.randomizedtesting.rules.StatementAdapter.evaluate(Stat
: > ementAdapter.java:36)
: > 	at
: > com.carrotsearch.randomizedtesting.ThreadLeakControl$StatementRunner.
: > run(ThreadLeakControl.java:358)
: > 	at
: > com.carrotsearch.randomizedtesting.ThreadLeakControl.forkTimeoutingTask
: > (ThreadLeakControl.java:782)
: > 	at
: > com.carrotsearch.randomizedtesting.ThreadLeakControl$3.evaluate(ThreadL
: > eakControl.java:442)
: > 	at
: > com.carrotsearch.randomizedtesting.RandomizedRunner.runSingleTest(Ran
: > domizedRunner.java:746)
: > 	at
: > com.carrotsearch.randomizedtesting.RandomizedRunner$3.evaluate(Rando
: > mizedRunner.java:648)
: > 	at
: > com.carrotsearch.randomizedtesting.RandomizedRunner$4.evaluate(Rando
: > mizedRunner.java:682)
: > 	at
: > com.carrotsearch.randomizedtesting.RandomizedRunner$5.evaluate(Rando
: > mizedRunner.java:693)
: > 	at
: > com.carrotsearch.randomizedtesting.rules.StatementAdapter.evaluate(Stat
: > ementAdapter.java:36)
: > 	at
: > com.carrotsearch.randomizedtesting.rules.SystemPropertiesRestoreRule$1.
: > evaluate(SystemPropertiesRestoreRule.java:53)
: > 	at
: > org.apache.lucene.util.AbstractBeforeAfterRule$1.evaluate(AbstractBeforeA
: > fterRule.java:46)
: > 	at
: > org.apache.lucene.util.TestRuleStoreClassName$1.evaluate(TestRuleStoreCl
: > assName.java:42)
: > 	at
: > com.carrotsearch.randomizedtesting.rules.SystemPropertiesInvariantRule$1
: > .evaluate(SystemPropertiesInvariantRule.java:55)
: > 	at
: > com.carrotsearch.randomizedtesting.rules.NoShadowingOrOverridesOnMet
: > hodsRule$1.evaluate(NoShadowingOrOverridesOnMethodsRule.java:39)
: > 	at
: > com.carrotsearch.randomizedtesting.rules.NoShadowingOrOverridesOnMet
: > hodsRule$1.evaluate(NoShadowingOrOverridesOnMethodsRule.java:39)
: > 	at
: > com.carrotsearch.randomizedtesting.rules.StatementAdapter.evaluate(Stat
: > ementAdapter.java:36)
: > 	at
: > org.apache.lucene.util.TestRuleAssertionsRequired$1.evaluate(TestRuleAss
: > ertionsRequired.java:43)
: > 	at
: > org.apache.lucene.util.TestRuleMarkFailure$1.evaluate(TestRuleMarkFailure
: > .java:48)
: > 	at
: > org.apache.lucene.util.TestRuleIgnoreAfterMaxFailures$1.evaluate(TestRule
: > IgnoreAfterMaxFailures.java:70)
: > 	at
: > org.apache.lucene.util.TestRuleIgnoreTestSuites$1.evaluate(TestRuleIgnore
: > TestSuites.java:55)
: > 	at
: > com.carrotsearch.randomizedtesting.rules.StatementAdapter.evaluate(Stat
: > ementAdapter.java:36)
: > 	at
: > com.carrotsearch.randomizedtesting.ThreadLeakControl$StatementRunner.
: > run(ThreadLeakControl.java:358)
: > 	at java.lang.Thread.run(Thread.java:679)
: > 
: > 
: > REGRESSION:  org.apache.solr.schema.TestBinaryField.testSimple
: > 
: > Error Message:
: > 
: > 
: > Stack Trace:
: > java.lang.NullPointerException
: > 	at
: > __randomizedtesting.SeedInfo.seed([687EE273825E73E2:50CDC68DA5ADA73
: > 3]:0)
: > 	at
: > org.apache.solr.client.solrj.impl.HttpSolrServer.request(HttpSolrServer.java:
: > 269)
: > 	at
: > org.apache.solr.client.solrj.impl.HttpSolrServer.request(HttpSolrServer.java:
: > 182)
: > 	at
: > org.apache.solr.client.solrj.request.AbstractUpdateRequest.process(Abstrac
: > tUpdateRequest.java:117)
: > 	at org.apache.solr.client.solrj.SolrServer.commit(SolrServer.java:168)
: > 	at org.apache.solr.client.solrj.SolrServer.commit(SolrServer.java:146)
: > 	at
: > org.apache.solr.schema.TestBinaryField.testSimple(TestBinaryField.java:110)
: > 	at sun.reflect.NativeMethodAccessorImpl.invoke0(Native Method)
: > 	at
: > sun.reflect.NativeMethodAccessorImpl.invoke(NativeMethodAccessorImpl.j
: > ava:57)
: > 	at
: > sun.reflect.DelegatingMethodAccessorImpl.invoke(DelegatingMethodAcces
: > sorImpl.java:43)
: > 	at java.lang.reflect.Method.invoke(Method.java:616)
: > 	at
: > com.carrotsearch.randomizedtesting.RandomizedRunner.invoke(Randomize
: > dRunner.java:1559)
: > 	at
: > com.carrotsearch.randomizedtesting.RandomizedRunner.access$600(Rando
: > mizedRunner.java:79)
: > 	at
: > com.carrotsearch.randomizedtesting.RandomizedRunner$6.evaluate(Rando
: > mizedRunner.java:737)
: > 	at
: > com.carrotsearch.randomizedtesting.RandomizedRunner$7.evaluate(Rando
: > mizedRunner.java:773)
: > 	at
: > com.carrotsearch.randomizedtesting.RandomizedRunner$8.evaluate(Rando
: > mizedRunner.java:787)
: > 	at
: > com.carrotsearch.randomizedtesting.rules.SystemPropertiesRestoreRule$1.
: > evaluate(SystemPropertiesRestoreRule.java:53)
: > 	at
: > org.apache.lucene.util.TestRuleSetupTeardownChained$1.evaluate(TestRule
: > SetupTeardownChained.java:50)
: > 	at
: > org.apache.lucene.util.TestRuleFieldCacheSanity$1.evaluate(TestRuleFieldCa
: > cheSanity.java:51)
: > 	at
: > org.apache.lucene.util.AbstractBeforeAfterRule$1.evaluate(AbstractBeforeA
: > fterRule.java:46)
: > 	at
: > com.carrotsearch.randomizedtesting.rules.SystemPropertiesInvariantRule$1
: > .evaluate(SystemPropertiesInvariantRule.java:55)
: > 	at
: > org.apache.lucene.util.TestRuleThreadAndTestName$1.evaluate(TestRuleTh
: > readAndTestName.java:49)
: > 	at
: > org.apache.lucene.util.TestRuleIgnoreAfterMaxFailures$1.evaluate(TestRule
: > IgnoreAfterMaxFailures.java:70)
: > 	at
: > org.apache.lucene.util.TestRuleMarkFailure$1.evaluate(TestRuleMarkFailure
: > .java:48)
: > 	at
: > com.carrotsearch.randomizedtesting.rules.StatementAdapter.evaluate(Stat
: > ementAdapter.java:36)
: > 	at
: > com.carrotsearch.randomizedtesting.ThreadLeakControl$StatementRunner.
: > run(ThreadLeakControl.java:358)
: > 	at
: > com.carrotsearch.randomizedtesting.ThreadLeakControl.forkTimeoutingTask
: > (ThreadLeakControl.java:782)
: > 	at
: > com.carrotsearch.randomizedtesting.ThreadLeakControl$3.evaluate(ThreadL
: > eakControl.java:442)
: > 	at
: > com.carrotsearch.randomizedtesting.RandomizedRunner.runSingleTest(Ran
: > domizedRunner.java:746)
: > 	at
: > com.carrotsearch.randomizedtesting.RandomizedRunner$3.evaluate(Rando
: > mizedRunner.java:648)
: > 	at
: > com.carrotsearch.randomizedtesting.RandomizedRunner$4.evaluate(Rando
: > mizedRunner.java:682)
: > 	at
: > com.carrotsearch.randomizedtesting.RandomizedRunner$5.evaluate(Rando
: > mizedRunner.java:693)
: > 	at
: > org.apache.lucene.util.AbstractBeforeAfterRule$1.evaluate(AbstractBeforeA
: > fterRule.java:46)
: > 	at
: > org.apache.lucene.util.TestRuleStoreClassName$1.evaluate(TestRuleStoreCl
: > assName.java:42)
: > 	at
: > com.carrotsearch.randomizedtesting.rules.SystemPropertiesInvariantRule$1
: > .evaluate(SystemPropertiesInvariantRule.java:55)
: > 	at
: > com.carrotsearch.randomizedtesting.rules.NoShadowingOrOverridesOnMet
: > hodsRule$1.evaluate(NoShadowingOrOverridesOnMethodsRule.java:39)
: > 	at
: > com.carrotsearch.randomizedtesting.rules.NoShadowingOrOverridesOnMet
: > hodsRule$1.evaluate(NoShadowingOrOverridesOnMethodsRule.java:39)
: > 	at
: > com.carrotsearch.randomizedtesting.rules.StatementAdapter.evaluate(Stat
: > ementAdapter.java:36)
: > 	at
: > org.apache.lucene.util.TestRuleAssertionsRequired$1.evaluate(TestRuleAss
: > ertionsRequired.java:43)
: > 	at
: > org.apache.lucene.util.TestRuleMarkFailure$1.evaluate(TestRuleMarkFailure
: > .java:48)
: > 	at
: > org.apache.lucene.util.TestRuleIgnoreAfterMaxFailures$1.evaluate(TestRule
: > IgnoreAfterMaxFailures.java:70)
: > 	at
: > org.apache.lucene.util.TestRuleIgnoreTestSuites$1.evaluate(TestRuleIgnore
: > TestSuites.java:55)
: > 	at
: > com.carrotsearch.randomizedtesting.rules.StatementAdapter.evaluate(Stat
: > ementAdapter.java:36)
: > 	at
: > com.carrotsearch.randomizedtesting.ThreadLeakControl$StatementRunner.
: > run(ThreadLeakControl.java:358)
: > 	at java.lang.Thread.run(Thread.java:679)
: > 
: > 
: > REGRESSION:  org.apache.solr.update.PeerSyncTest.testDistribSearch
: > 
: > Error Message:
: > expected:<true> but was:<false>
: > 
: > Stack Trace:
: > java.lang.AssertionError: expected:<true> but was:<false>
: > 	at
: > __randomizedtesting.SeedInfo.seed([687EE273825E73E2:E9986C6BF50113DE
: > ]:0)
: > 	at org.junit.Assert.fail(Assert.java:93)
: > 	at org.junit.Assert.failNotEquals(Assert.java:647)
: > 	at org.junit.Assert.assertEquals(Assert.java:128)
: > 	at org.junit.Assert.assertEquals(Assert.java:147)
: > 	at
: > org.apache.solr.update.PeerSyncTest.assertSync(PeerSyncTest.java:178)
: > 	at
: > org.apache.solr.update.PeerSyncTest.doTest(PeerSyncTest.java:75)
: > 	at
: > org.apache.solr.BaseDistributedSearchTestCase.testDistribSearch(BaseDistri
: > butedSearchTestCase.java:806)
: > 	at sun.reflect.NativeMethodAccessorImpl.invoke0(Native Method)
: > 	at
: > sun.reflect.NativeMethodAccessorImpl.invoke(NativeMethodAccessorImpl.j
: > ava:57)
: > 	at
: > sun.reflect.DelegatingMethodAccessorImpl.invoke(DelegatingMethodAcces
: > sorImpl.java:43)
: > 	at java.lang.reflect.Method.invoke(Method.java:616)
: > 	at
: > com.carrotsearch.randomizedtesting.RandomizedRunner.invoke(Randomize
: > dRunner.java:1559)
: > 	at
: > com.carrotsearch.randomizedtesting.RandomizedRunner.access$600(Rando
: > mizedRunner.java:79)
: > 	at
: > com.carrotsearch.randomizedtesting.RandomizedRunner$6.evaluate(Rando
: > mizedRunner.java:737)
: > 	at
: > com.carrotsearch.randomizedtesting.RandomizedRunner$7.evaluate(Rando
: > mizedRunner.java:773)
: > 	at
: > com.carrotsearch.randomizedtesting.RandomizedRunner$8.evaluate(Rando
: > mizedRunner.java:787)
: > 	at
: > com.carrotsearch.randomizedtesting.rules.SystemPropertiesRestoreRule$1.
: > evaluate(SystemPropertiesRestoreRule.java:53)
: > 	at
: > org.apache.lucene.util.TestRuleSetupTeardownChained$1.evaluate(TestRule
: > SetupTeardownChained.java:50)
: > 	at
: > org.apache.lucene.util.TestRuleFieldCacheSanity$1.evaluate(TestRuleFieldCa
: > cheSanity.java:51)
: > 	at
: > org.apache.lucene.util.AbstractBeforeAfterRule$1.evaluate(AbstractBeforeA
: > fterRule.java:46)
: > 	at
: > com.carrotsearch.randomizedtesting.rules.SystemPropertiesInvariantRule$1
: > .evaluate(SystemPropertiesInvariantRule.java:55)
: > 	at
: > org.apache.lucene.util.TestRuleThreadAndTestName$1.evaluate(TestRuleTh
: > readAndTestName.java:49)
: > 	at
: > org.apache.lucene.util.TestRuleIgnoreAfterMaxFailures$1.evaluate(TestRule
: > IgnoreAfterMaxFailures.java:70)
: > 	at
: > org.apache.lucene.util.TestRuleMarkFailure$1.evaluate(TestRuleMarkFailure
: > .java:48)
: > 	at
: > com.carrotsearch.randomizedtesting.rules.StatementAdapter.evaluate(Stat
: > ementAdapter.java:36)
: > 	at
: > com.carrotsearch.randomizedtesting.ThreadLeakControl$StatementRunner.
: > run(ThreadLeakControl.java:358)
: > 	at
: > com.carrotsearch.randomizedtesting.ThreadLeakControl.forkTimeoutingTask
: > (ThreadLeakControl.java:782)
: > 	at
: > com.carrotsearch.randomizedtesting.ThreadLeakControl$3.evaluate(ThreadL
: > eakControl.java:442)
: > 	at
: > com.carrotsearch.randomizedtesting.RandomizedRunner.runSingleTest(Ran
: > domizedRunner.java:746)
: > 	at
: > com.carrotsearch.randomizedtesting.RandomizedRunner$3.evaluate(Rando
: > mizedRunner.java:648)
: > 	at
: > com.carrotsearch.randomizedtesting.RandomizedRunner$4.evaluate(Rando
: > mizedRunner.java:682)
: > 	at
: > com.carrotsearch.randomizedtesting.RandomizedRunner$5.evaluate(Rando
: > mizedRunner.java:693)
: > 	at
: > com.carrotsearch.randomizedtesting.rules.StatementAdapter.evaluate(Stat
: > ementAdapter.java:36)
: > 	at
: > com.carrotsearch.randomizedtesting.rules.SystemPropertiesRestoreRule$1.
: > evaluate(SystemPropertiesRestoreRule.java:53)
: > 	at
: > org.apache.lucene.util.AbstractBeforeAfterRule$1.evaluate(AbstractBeforeA
: > fterRule.java:46)
: > 	at
: > org.apache.lucene.util.TestRuleStoreClassName$1.evaluate(TestRuleStoreCl
: > assName.java:42)
: > 	at
: > com.carrotsearch.randomizedtesting.rules.SystemPropertiesInvariantRule$1
: > .evaluate(SystemPropertiesInvariantRule.java:55)
: > 	at
: > com.carrotsearch.randomizedtesting.rules.NoShadowingOrOverridesOnMet
: > hodsRule$1.evaluate(NoShadowingOrOverridesOnMethodsRule.java:39)
: > 	at
: > com.carrotsearch.randomizedtesting.rules.NoShadowingOrOverridesOnMet
: > hodsRule$1.evaluate(NoShadowingOrOverridesOnMethodsRule.java:39)
: > 	at
: > com.carrotsearch.randomizedtesting.rules.StatementAdapter.evaluate(Stat
: > ementAdapter.java:36)
: > 	at
: > org.apache.lucene.util.TestRuleAssertionsRequired$1.evaluate(TestRuleAss
: > ertionsRequired.java:43)
: > 	at
: > org.apache.lucene.util.TestRuleMarkFailure$1.evaluate(TestRuleMarkFailure
: > .java:48)
: > 	at
: > org.apache.lucene.util.TestRuleIgnoreAfterMaxFailures$1.evaluate(TestRule
: > IgnoreAfterMaxFailures.java:70)
: > 	at
: > org.apache.lucene.util.TestRuleIgnoreTestSuites$1.evaluate(TestRuleIgnore
: > TestSuites.java:55)
: > 	at
: > com.carrotsearch.randomizedtesting.rules.StatementAdapter.evaluate(Stat
: > ementAdapter.java:36)
: > 	at
: > com.carrotsearch.randomizedtesting.ThreadLeakControl$StatementRunner.
: > run(ThreadLeakControl.java:358)
: > 	at java.lang.Thread.run(Thread.java:679)
: > 
: > 
: > REGRESSION:
: > org.apache.solr.update.SolrCmdDistributorTest.testDistribSearch
: > 
: > Error Message:
: > [org.apache.solr.update.SolrCmdDistributor$Error@5428179e] expected:<0>
: > but was:<1>
: > 
: > Stack Trace:
: > java.lang.AssertionError:
: > [org.apache.solr.update.SolrCmdDistributor$Error@5428179e] expected:<0>
: > but was:<1>
: > 	at
: > __randomizedtesting.SeedInfo.seed([687EE273825E73E2:E9986C6BF50113DE
: > ]:0)
: > 	at org.junit.Assert.fail(Assert.java:93)
: > 	at org.junit.Assert.failNotEquals(Assert.java:647)
: > 	at org.junit.Assert.assertEquals(Assert.java:128)
: > 	at org.junit.Assert.assertEquals(Assert.java:472)
: > 	at
: > org.apache.solr.update.SolrCmdDistributorTest.doTest(SolrCmdDistributorTe
: > st.java:123)
: > 	at
: > org.apache.solr.BaseDistributedSearchTestCase.testDistribSearch(BaseDistri
: > butedSearchTestCase.java:806)
: > 	at sun.reflect.NativeMethodAccessorImpl.invoke0(Native Method)
: > 	at
: > sun.reflect.NativeMethodAccessorImpl.invoke(NativeMethodAccessorImpl.j
: > ava:57)
: > 	at
: > sun.reflect.DelegatingMethodAccessorImpl.invoke(DelegatingMethodAcces
: > sorImpl.java:43)
: > 	at java.lang.reflect.Method.invoke(Method.java:616)
: > 	at
: > com.carrotsearch.randomizedtesting.RandomizedRunner.invoke(Randomize
: > dRunner.java:1559)
: > 	at
: > com.carrotsearch.randomizedtesting.RandomizedRunner.access$600(Rando
: > mizedRunner.java:79)
: > 	at
: > com.carrotsearch.randomizedtesting.RandomizedRunner$6.evaluate(Rando
: > mizedRunner.java:737)
: > 	at
: > com.carrotsearch.randomizedtesting.RandomizedRunner$7.evaluate(Rando
: > mizedRunner.java:773)
: > 	at
: > com.carrotsearch.randomizedtesting.RandomizedRunner$8.evaluate(Rando
: > mizedRunner.java:787)
: > 	at
: > com.carrotsearch.randomizedtesting.rules.SystemPropertiesRestoreRule$1.
: > evaluate(SystemPropertiesRestoreRule.java:53)
: > 	at
: > org.apache.lucene.util.TestRuleSetupTeardownChained$1.evaluate(TestRule
: > SetupTeardownChained.java:50)
: > 	at
: > org.apache.lucene.util.TestRuleFieldCacheSanity$1.evaluate(TestRuleFieldCa
: > cheSanity.java:51)
: > 	at
: > org.apache.lucene.util.AbstractBeforeAfterRule$1.evaluate(AbstractBeforeA
: > fterRule.java:46)
: > 	at
: > com.carrotsearch.randomizedtesting.rules.SystemPropertiesInvariantRule$1
: > .evaluate(SystemPropertiesInvariantRule.java:55)
: > 	at
: > org.apache.lucene.util.TestRuleThreadAndTestName$1.evaluate(TestRuleTh
: > readAndTestName.java:49)
: > 	at
: > org.apache.lucene.util.TestRuleIgnoreAfterMaxFailures$1.evaluate(TestRule
: > IgnoreAfterMaxFailures.java:70)
: > 	at
: > org.apache.lucene.util.TestRuleMarkFailure$1.evaluate(TestRuleMarkFailure
: > .java:48)
: > 	at
: > com.carrotsearch.randomizedtesting.rules.StatementAdapter.evaluate(Stat
: > ementAdapter.java:36)
: > 	at
: > com.carrotsearch.randomizedtesting.ThreadLeakControl$StatementRunner.
: > run(ThreadLeakControl.java:358)
: > 	at
: > com.carrotsearch.randomizedtesting.ThreadLeakControl.forkTimeoutingTask
: > (ThreadLeakControl.java:782)
: > 	at
: > com.carrotsearch.randomizedtesting.ThreadLeakControl$3.evaluate(ThreadL
: > eakControl.java:442)
: > 	at
: > com.carrotsearch.randomizedtesting.RandomizedRunner.runSingleTest(Ran
: > domizedRunner.java:746)
: > 	at
: > com.carrotsearch.randomizedtesting.RandomizedRunner$3.evaluate(Rando
: > mizedRunner.java:648)
: > 	at
: > com.carrotsearch.randomizedtesting.RandomizedRunner$4.evaluate(Rando
: > mizedRunner.java:682)
: > 	at
: > com.carrotsearch.randomizedtesting.RandomizedRunner$5.evaluate(Rando
: > mizedRunner.java:693)
: > 	at
: > com.carrotsearch.randomizedtesting.rules.StatementAdapter.evaluate(Stat
: > ementAdapter.java:36)
: > 	at
: > com.carrotsearch.randomizedtesting.rules.SystemPropertiesRestoreRule$1.
: > evaluate(SystemPropertiesRestoreRule.java:53)
: > 	at
: > org.apache.lucene.util.AbstractBeforeAfterRule$1.evaluate(AbstractBeforeA
: > fterRule.java:46)
: > 	at
: > org.apache.lucene.util.TestRuleStoreClassName$1.evaluate(TestRuleStoreCl
: > assName.java:42)
: > 	at
: > com.carrotsearch.randomizedtesting.rules.SystemPropertiesInvariantRule$1
: > .evaluate(SystemPropertiesInvariantRule.java:55)
: > 	at
: > com.carrotsearch.randomizedtesting.rules.NoShadowingOrOverridesOnMet
: > hodsRule$1.evaluate(NoShadowingOrOverridesOnMethodsRule.java:39)
: > 	at
: > com.carrotsearch.randomizedtesting.rules.NoShadowingOrOverridesOnMet
: > hodsRule$1.evaluate(NoShadowingOrOverridesOnMethodsRule.java:39)
: > 	at
: > com.carrotsearch.randomizedtesting.rules.StatementAdapter.evaluate(Stat
: > ementAdapter.java:36)
: > 	at
: > org.apache.lucene.util.TestRuleAssertionsRequired$1.evaluate(TestRuleAss
: > ertionsRequired.java:43)
: > 	at
: > org.apache.lucene.util.TestRuleMarkFailure$1.evaluate(TestRuleMarkFailure
: > .java:48)
: > 	at
: > org.apache.lucene.util.TestRuleIgnoreAfterMaxFailures$1.evaluate(TestRule
: > IgnoreAfterMaxFailures.java:70)
: > 	at
: > org.apache.lucene.util.TestRuleIgnoreTestSuites$1.evaluate(TestRuleIgnore
: > TestSuites.java:55)
: > 	at
: > com.carrotsearch.randomizedtesting.rules.StatementAdapter.evaluate(Stat
: > ementAdapter.java:36)
: > 	at
: > com.carrotsearch.randomizedtesting.ThreadLeakControl$StatementRunner.
: > run(ThreadLeakControl.java:358)
: > 	at java.lang.Thread.run(Thread.java:679)
: > 
: > 
: > FAILED:
: > org.apache.solr.cloud.CollectionsAPIDistributedZkTest.testDistribSearch
: > 
: > Error Message:
: > Could not find new collection nodes_used_collection
: > 
: > Stack Trace:
: > java.lang.AssertionError: Could not find new collection
: > nodes_used_collection
: > 	at
: > __randomizedtesting.SeedInfo.seed([687EE273825E73E2:E9986C6BF50113DE
: > ]:0)
: > 	at org.junit.Assert.fail(Assert.java:93)
: > 	at
: > org.apache.solr.cloud.AbstractFullDistribZkTestBase.checkForCollection(Abst
: > ractFullDistribZkTestBase.java:1499)
: > 	at
: > org.apache.solr.cloud.CollectionsAPIDistributedZkTest.testNodesUsedByCre
: > ate(CollectionsAPIDistributedZkTest.java:372)
: > 	at
: > org.apache.solr.cloud.CollectionsAPIDistributedZkTest.doTest(CollectionsAPI
: > DistributedZkTest.java:144)
: > 	at
: > org.apache.solr.BaseDistributedSearchTestCase.testDistribSearch(BaseDistri
: > butedSearchTestCase.java:806)
: > 	at sun.reflect.NativeMethodAccessorImpl.invoke0(Native Method)
: > 	at
: > sun.reflect.NativeMethodAccessorImpl.invoke(NativeMethodAccessorImpl.j
: > ava:57)
: > 	at
: > sun.reflect.DelegatingMethodAccessorImpl.invoke(DelegatingMethodAcces
: > sorImpl.java:43)
: > 	at java.lang.reflect.Method.invoke(Method.java:616)
: > 	at
: > com.carrotsearch.randomizedtesting.RandomizedRunner.invoke(Randomize
: > dRunner.java:1559)
: > 	at
: > com.carrotsearch.randomizedtesting.RandomizedRunner.access$600(Rando
: > mizedRunner.java:79)
: > 	at
: > com.carrotsearch.randomizedtesting.RandomizedRunner$6.evaluate(Rando
: > mizedRunner.java:737)
: > 	at
: > com.carrotsearch.randomizedtesting.RandomizedRunner$7.evaluate(Rando
: > mizedRunner.java:773)
: > 	at
: > com.carrotsearch.randomizedtesting.RandomizedRunner$8.evaluate(Rando
: > mizedRunner.java:787)
: > 	at
: > com.carrotsearch.randomizedtesting.rules.SystemPropertiesRestoreRule$1.
: > evaluate(SystemPropertiesRestoreRule.java:53)
: > 	at
: > org.apache.lucene.util.TestRuleSetupTeardownChained$1.evaluate(TestRule
: > SetupTeardownChained.java:50)
: > 	at
: > org.apache.lucene.util.TestRuleFieldCacheSanity$1.evaluate(TestRuleFieldCa
: > cheSanity.java:51)
: > 	at
: > org.apache.lucene.util.AbstractBeforeAfterRule$1.evaluate(AbstractBeforeA
: > fterRule.java:46)
: > 	at
: > com.carrotsearch.randomizedtesting.rules.SystemPropertiesInvariantRule$1
: > .evaluate(SystemPropertiesInvariantRule.java:55)
: > 	at
: > org.apache.lucene.util.TestRuleThreadAndTestName$1.evaluate(TestRuleTh
: > readAndTestName.java:49)
: > 	at
: > org.apache.lucene.util.TestRuleIgnoreAfterMaxFailures$1.evaluate(TestRule
: > IgnoreAfterMaxFailures.java:70)
: > 	at
: > org.apache.lucene.util.TestRuleMarkFailure$1.evaluate(TestRuleMarkFailure
: > .java:48)
: > 	at
: > com.carrotsearch.randomizedtesting.rules.StatementAdapter.evaluate(Stat
: > ementAdapter.java:36)
: > 	at
: > com.carrotsearch.randomizedtesting.ThreadLeakControl$StatementRunner.
: > run(ThreadLeakControl.java:358)
: > 	at
: > com.carrotsearch.randomizedtesting.ThreadLeakControl.forkTimeoutingTask
: > (ThreadLeakControl.java:782)
: > 	at
: > com.carrotsearch.randomizedtesting.ThreadLeakControl$3.evaluate(ThreadL
: > eakControl.java:442)
: > 	at
: > com.carrotsearch.randomizedtesting.RandomizedRunner.runSingleTest(Ran
: > domizedRunner.java:746)
: > 	at
: > com.carrotsearch.randomizedtesting.RandomizedRunner$3.evaluate(Rando
: > mizedRunner.java:648)
: > 	at
: > com.carrotsearch.randomizedtesting.RandomizedRunner$4.evaluate(Rando
: > mizedRunner.java:682)
: > 	at
: > com.carrotsearch.randomizedtesting.RandomizedRunner$5.evaluate(Rando
: > mizedRunner.java:693)
: > 	at
: > com.carrotsearch.randomizedtesting.rules.StatementAdapter.evaluate(Stat
: > ementAdapter.java:36)
: > 	at
: > com.carrotsearch.randomizedtesting.rules.SystemPropertiesRestoreRule$1.
: > evaluate(SystemPropertiesRestoreRule.java:53)
: > 	at
: > org.apache.lucene.util.AbstractBeforeAfterRule$1.evaluate(AbstractBeforeA
: > fterRule.java:46)
: > 	at
: > org.apache.lucene.util.TestRuleStoreClassName$1.evaluate(TestRuleStoreCl
: > assName.java:42)
: > 	at
: > com.carrotsearch.randomizedtesting.rules.SystemPropertiesInvariantRule$1
: > .evaluate(SystemPropertiesInvariantRule.java:55)
: > 	at
: > com.carrotsearch.randomizedtesting.rules.NoShadowingOrOverridesOnMet
: > hodsRule$1.evaluate(NoShadowingOrOverridesOnMethodsRule.java:39)
: > 	at
: > com.carrotsearch.randomizedtesting.rules.NoShadowingOrOverridesOnMet
: > hodsRule$1.evaluate(NoShadowingOrOverridesOnMethodsRule.java:39)
: > 	at
: > com.carrotsearch.randomizedtesting.rules.StatementAdapter.evaluate(Stat
: > ementAdapter.java:36)
: > 	at
: > org.apache.lucene.util.TestRuleAssertionsRequired$1.evaluate(TestRuleAss
: > ertionsRequired.java:43)
: > 	at
: > org.apache.lucene.util.TestRuleMarkFailure$1.evaluate(TestRuleMarkFailure
: > .java:48)
: > 	at
: > org.apache.lucene.util.TestRuleIgnoreAfterMaxFailures$1.evaluate(TestRule
: > IgnoreAfterMaxFailures.java:70)
: > 	at
: > org.apache.lucene.util.TestRuleIgnoreTestSuites$1.evaluate(TestRuleIgnore
: > TestSuites.java:55)
: > 	at
: > com.carrotsearch.randomizedtesting.rules.StatementAdapter.evaluate(Stat
: > ementAdapter.java:36)
: > 	at
: > com.carrotsearch.randomizedtesting.ThreadLeakControl$StatementRunner.
: > run(ThreadLeakControl.java:358)
: > 	at java.lang.Thread.run(Thread.java:679)
: > 
: > 
: > 
: > 
: > Build Log:
: > [...truncated 8388 lines...]
: > [junit4:junit4] Suite: org.apache.solr.schema.TestBinaryField
: > [junit4:junit4]   1> INFO  - 2013-04-16 20:11:02.880;
: > org.apache.solr.core.SolrResourceLoader; new SolrResourceLoader for
: > directory: 'solr/collection1/'
: > [junit4:junit4]   1> INFO  - 2013-04-16 20:11:02.944;
: > org.eclipse.jetty.server.Server; jetty-8.1.8.v20121106
: > [junit4:junit4]   1> INFO  - 2013-04-16 20:11:02.954;
: > org.eclipse.jetty.server.AbstractConnector; Started
: > SocketConnector@127.0.0.1:57486
: > [junit4:junit4]   1> INFO  - 2013-04-16 20:11:02.956;
: > org.apache.solr.servlet.SolrDispatchFilter; SolrDispatchFilter.init()
: > [junit4:junit4]   1> INFO  - 2013-04-16 20:11:02.957;
: > org.apache.solr.core.SolrResourceLoader; JNDI not configured for solr
: > (NoInitialContextEx)
: > [junit4:junit4]   1> INFO  - 2013-04-16 20:11:02.958;
: > org.apache.solr.core.SolrResourceLoader; using system property
: > solr.solr.home: /usr/home/hudson/hudson-slave/workspace/Lucene-Solr-
: > Tests-4.x-Java6/solr/build/solr-core/test/J1/./solrtest-TestBinaryField-
: > 1366143062877/example
: > [junit4:junit4]   1> INFO  - 2013-04-16 20:11:02.959;
: > org.apache.solr.core.CoreContainer$Initializer; looking for solr config file:
: > /usr/home/hudson/hudson-slave/workspace/Lucene-Solr-Tests-4.x-
: > Java6/solr/build/solr-core/test/J1/./solrtest-TestBinaryField-
: > 1366143062877/example/solr.xml
: > [junit4:junit4]   1> INFO  - 2013-04-16 20:11:02.960;
: > org.apache.solr.core.CoreContainer; New CoreContainer 954599881
: > [junit4:junit4]   1> INFO  - 2013-04-16 20:11:02.962;
: > org.apache.solr.core.CoreContainer$Initializer; no solr.xml found. using
: > default old-style solr.xml
: > [junit4:junit4]   1> INFO  - 2013-04-16 20:11:02.963;
: > org.apache.solr.core.CoreContainer; Loading CoreContainer using Solr Home:
: > '/usr/home/hudson/hudson-slave/workspace/Lucene-Solr-Tests-4.x-
: > Java6/solr/build/solr-core/test/J1/./solrtest-TestBinaryField-
: > 1366143062877/example/'
: > [junit4:junit4]   1> INFO  - 2013-04-16 20:11:02.964;
: > org.apache.solr.core.SolrResourceLoader; new SolrResourceLoader for
: > directory: '/usr/home/hudson/hudson-slave/workspace/Lucene-Solr-Tests-
: > 4.x-Java6/solr/build/solr-core/test/J1/./solrtest-TestBinaryField-
: > 1366143062877/example/'
: > [junit4:junit4]   1> INFO  - 2013-04-16 20:11:03.201;
: > org.apache.solr.handler.component.HttpShardHandlerFactory; Setting
: > socketTimeout to: 0
: > [junit4:junit4]   1> INFO  - 2013-04-16 20:11:03.203;
: > org.apache.solr.handler.component.HttpShardHandlerFactory; Setting
: > urlScheme to: http://
: > [junit4:junit4]   1> INFO  - 2013-04-16 20:11:03.203;
: > org.apache.solr.handler.component.HttpShardHandlerFactory; Setting
: > connTimeout to: 0
: > [junit4:junit4]   1> INFO  - 2013-04-16 20:11:03.204;
: > org.apache.solr.handler.component.HttpShardHandlerFactory; Setting
: > maxConnectionsPerHost to: 20
: > [junit4:junit4]   1> INFO  - 2013-04-16 20:11:03.205;
: > org.apache.solr.handler.component.HttpShardHandlerFactory; Setting
: > corePoolSize to: 0
: > [junit4:junit4]   1> INFO  - 2013-04-16 20:11:03.205;
: > org.apache.solr.handler.component.HttpShardHandlerFactory; Setting
: > maximumPoolSize to: 2147483647
: > [junit4:junit4]   1> INFO  - 2013-04-16 20:11:03.206;
: > org.apache.solr.handler.component.HttpShardHandlerFactory; Setting
: > maxThreadIdleTime to: 5
: > [junit4:junit4]   1> INFO  - 2013-04-16 20:11:03.207;
: > org.apache.solr.handler.component.HttpShardHandlerFactory; Setting
: > sizeOfQueue to: -1
: > [junit4:junit4]   1> INFO  - 2013-04-16 20:11:03.208;
: > org.apache.solr.handler.component.HttpShardHandlerFactory; Setting
: > fairnessPolicy to: false
: > [junit4:junit4]   1> INFO  - 2013-04-16 20:11:03.209;
: > org.apache.solr.client.solrj.impl.HttpClientUtil; Creating new http client,
: > config:maxConnectionsPerHost=20&maxConnections=10000&socketTimeout
: > =0&connTimeout=0&retry=false
: > [junit4:junit4]   1> INFO  - 2013-04-16 20:11:03.230;
: > org.apache.solr.core.CoreContainer; Registering Log Listener
: > [junit4:junit4]   1> INFO  - 2013-04-16 20:11:03.237;
: > org.apache.solr.core.CoreContainer; Creating SolrCore 'collection1' using
: > instanceDir: /usr/home/hudson/hudson-slave/workspace/Lucene-Solr-
: > Tests-4.x-Java6/solr/build/solr-core/test/J1/./solrtest-TestBinaryField-
: > 1366143062877/example/collection1
: > [junit4:junit4]   1> INFO  - 2013-04-16 20:11:03.239;
: > org.apache.solr.core.SolrResourceLoader; new SolrResourceLoader for
: > directory: '/usr/home/hudson/hudson-slave/workspace/Lucene-Solr-Tests-
: > 4.x-Java6/solr/build/solr-core/test/J1/./solrtest-TestBinaryField-
: > 1366143062877/example/collection1/'
: > [junit4:junit4]   1> INFO  - 2013-04-16 20:11:03.311;
: > org.apache.solr.core.SolrConfig; Using Lucene MatchVersion: LUCENE_43
: > [junit4:junit4]   1> INFO  - 2013-04-16 20:11:03.419;
: > org.apache.solr.core.SolrConfig; Loaded SolrConfig: solrconfig.xml
: > [junit4:junit4]   1> INFO  - 2013-04-16 20:11:03.420;
: > org.apache.solr.schema.IndexSchema; Reading Solr Schema from
: > schema.xml
: > [junit4:junit4]   1> INFO  - 2013-04-16 20:11:03.429;
: > org.apache.solr.schema.IndexSchema; Schema name=test
: > [junit4:junit4]   1> INFO  - 2013-04-16 20:11:03.589;
: > org.apache.solr.schema.IndexSchema; unique key field: id
: > [junit4:junit4]   1> INFO  - 2013-04-16 20:11:03.593;
: > org.apache.solr.core.SolrCore; org.apache.solr.core.MockDirectoryFactory
: > [junit4:junit4]   1> INFO  - 2013-04-16 20:11:03.593;
: > org.apache.solr.core.SolrCore; [collection1] Opening new SolrCore at
: > /usr/home/hudson/hudson-slave/workspace/Lucene-Solr-Tests-4.x-
: > Java6/solr/build/solr-core/test/J1/./solrtest-TestBinaryField-
: > 1366143062877/example/collection1/, dataDir=/usr/home/hudson/hudson-
: > slave/workspace/Lucene-Solr-Tests-4.x-Java6/solr/build/solr-
: > core/test/J1/./solrtest-TestBinaryField-
: > 1366143062877/example/collection1/data/
: > [junit4:junit4]   1> INFO  - 2013-04-16 20:11:03.594;
: > org.apache.solr.core.SolrCore; JMX monitoring not detected for core:
: > collection1
: > [junit4:junit4]   1> INFO  - 2013-04-16 20:11:03.595;
: > org.apache.solr.core.SolrCore; org.apache.solr.core.MockDirectoryFactory
: > [junit4:junit4]   1> INFO  - 2013-04-16 20:11:03.596;
: > org.apache.solr.core.CachingDirectoryFactory; return new directory for
: > /usr/home/hudson/hudson-slave/workspace/Lucene-Solr-Tests-4.x-
: > Java6/solr/build/solr-core/test/J1/./solrtest-TestBinaryField-
: > 1366143062877/example/collection1/data
: > [junit4:junit4]   1> INFO  - 2013-04-16 20:11:03.597;
: > org.apache.solr.core.SolrCore; New index directory detected: old=null
: > new=/usr/home/hudson/hudson-slave/workspace/Lucene-Solr-Tests-4.x-
: > Java6/solr/build/solr-core/test/J1/./solrtest-TestBinaryField-
: > 1366143062877/example/collection1/data/index/
: > [junit4:junit4]   1> WARN  - 2013-04-16 20:11:03.598;
: > org.apache.solr.core.SolrCore; [collection1] Solr index directory
: > '/usr/home/hudson/hudson-slave/workspace/Lucene-Solr-Tests-4.x-
: > Java6/solr/build/solr-core/test/J1/./solrtest-TestBinaryField-
: > 1366143062877/example/collection1/data/index' doesn't exist. Creating new
: > index...
: > [junit4:junit4]   1> INFO  - 2013-04-16 20:11:03.599;
: > org.apache.solr.core.CachingDirectoryFactory; return new directory for
: > /usr/home/hudson/hudson-slave/workspace/Lucene-Solr-Tests-4.x-
: > Java6/solr/build/solr-core/test/J1/./solrtest-TestBinaryField-
: > 1366143062877/example/collection1/data/index
: > [junit4:junit4]   1> INFO  - 2013-04-16 20:11:03.602;
: > org.apache.solr.core.SolrDeletionPolicy; SolrDeletionPolicy.onCommit:
: > commits:num=1
: > [junit4:junit4]   1>
: > 	commit{dir=MockDirWrapper(org.apache.lucene.store.RAMDirector
: > y@294e430c
: > lockFactory=org.apache.lucene.store.SingleInstanceLockFactory@252cdd20),
: > segFN=segments_1,generation=1,filenames=[segments_1]
: > [junit4:junit4]   1> INFO  - 2013-04-16 20:11:03.603;
: > org.apache.solr.core.SolrDeletionPolicy; newest commit = 1[segments_1]
: > [junit4:junit4]   1> INFO  - 2013-04-16 20:11:03.605;
: > org.apache.solr.core.RequestHandlers; created standard:
: > solr.StandardRequestHandler
: > [junit4:junit4]   1> INFO  - 2013-04-16 20:11:03.606;
: > org.apache.solr.core.RequestHandlers; created defaults:
: > solr.StandardRequestHandler
: > [junit4:junit4]   1> INFO  - 2013-04-16 20:11:03.606;
: > org.apache.solr.core.RequestHandlers; adding lazy requestHandler:
: > solr.StandardRequestHandler
: > [junit4:junit4]   1> INFO  - 2013-04-16 20:11:03.607;
: > org.apache.solr.core.RequestHandlers; created lazy:
: > solr.StandardRequestHandler
: > [junit4:junit4]   1> INFO  - 2013-04-16 20:11:03.608;
: > org.apache.solr.core.RequestHandlers; created /update:
: > solr.UpdateRequestHandler
: > [junit4:junit4]   1> INFO  - 2013-04-16 20:11:03.698;
: > org.apache.solr.core.RequestHandlers; created /replication:
: > solr.ReplicationHandler
: > [junit4:junit4]   1> INFO  - 2013-04-16 20:11:03.706;
: > org.apache.solr.handler.loader.XMLLoader; xsltCacheLifetimeSeconds=60
: > [junit4:junit4]   1> INFO  - 2013-04-16 20:11:03.710;
: > org.apache.solr.search.SolrIndexSearcher; Opening Searcher@3238c403
: > main
: > [junit4:junit4]   1> INFO  - 2013-04-16 20:11:03.711;
: > org.apache.solr.update.CommitTracker; Hard AutoCommit: disabled
: > [junit4:junit4]   1> INFO  - 2013-04-16 20:11:03.711;
: > org.apache.solr.update.CommitTracker; Soft AutoCommit: disabled
: > [junit4:junit4]   1> INFO  - 2013-04-16 20:11:03.720;
: > org.apache.solr.handler.ReplicationHandler; Commits will be reserved for
: > 10000
: > [junit4:junit4]   1> INFO  - 2013-04-16 20:11:03.720;
: > org.apache.solr.core.CoreContainer; registering core: collection1
: > [junit4:junit4]   1> INFO  - 2013-04-16 20:11:03.720;
: > org.apache.solr.core.SolrCore; [collection1] Registered new searcher
: > Searcher@3238c403 main{StandardDirectoryReader(segments_1:1)}
: > [junit4:junit4]   1> INFO  - 2013-04-16 20:11:03.721; org.apache.solr.servl
: > 
: > [...truncated too long message...]
: > 
: > ache.solr.cloud.ChaosMonkey.stop(ChaosMonkey.java:509)
: > [junit4:junit4]   2> 	        at
: > org.apache.solr.cloud.AbstractFullDistribZkTestBase.destroyServers(Abstract
: > FullDistribZkTestBase.java:1361)
: > [junit4:junit4]   2> 	        at
: > org.apache.solr.BaseDistributedSearchTestCase.tearDown(BaseDistributedS
: > earchTestCase.java:285)
: > [junit4:junit4]   2> 	        at
: > org.apache.solr.cloud.AbstractDistribZkTestBase.tearDown(AbstractDistribZk
: > TestBase.java:223)
: > [junit4:junit4]   2> 	        at
: > org.apache.solr.cloud.AbstractFullDistribZkTestBase.tearDown(AbstractFullDi
: > stribZkTestBase.java:1342)
: > [junit4:junit4]   2> 	        at
: > org.apache.solr.cloud.ChaosMonkeySafeLeaderTest.tearDown(ChaosMonke
: > ySafeLeaderTest.java:74)
: > [junit4:junit4]   2> 	        at
: > sun.reflect.NativeMethodAccessorImpl.invoke0(Native Method)
: > [junit4:junit4]   2> 	        at
: > sun.reflect.NativeMethodAccessorImpl.invoke(NativeMethodAccessorImpl.j
: > ava:57)
: > [junit4:junit4]   2> 	        at
: > sun.reflect.DelegatingMethodAccessorImpl.invoke(DelegatingMethodAcces
: > sorImpl.java:43)
: > [junit4:junit4]   2> 	        at
: > java.lang.reflect.Method.invoke(Method.java:616)
: > [junit4:junit4]   2> 	        at
: > com.carrotsearch.randomizedtesting.RandomizedRunner.invoke(Randomize
: > dRunner.java:1559)
: > [junit4:junit4]   2> 	        at
: > com.carrotsearch.randomizedtesting.RandomizedRunner.access$600(Rando
: > mizedRunner.java:79)
: > [junit4:junit4]   2> 	        at
: > com.carrotsearch.randomizedtesting.RandomizedRunner$8.evaluate(Rando
: > mizedRunner.java:795)
: > [junit4:junit4]   2> 	        at
: > com.carrotsearch.randomizedtesting.rules.SystemPropertiesRestoreRule$1.
: > evaluate(SystemPropertiesRestoreRule.java:53)
: > [junit4:junit4]   2> 	        at
: > org.apache.lucene.util.TestRuleSetupTeardownChained$1.evaluate(TestRule
: > SetupTeardownChained.java:50)
: > [junit4:junit4]   2> 	        at
: > org.apache.lucene.util.TestRuleFieldCacheSanity$1.evaluate(TestRuleFieldCa
: > cheSanity.java:51)
: > [junit4:junit4]   2> 	        at
: > org.apache.lucene.util.AbstractBeforeAfterRule$1.evaluate(AbstractBeforeA
: > fterRule.java:46)
: > [junit4:junit4]   2> 	        at
: > com.carrotsearch.randomizedtesting.rules.SystemPropertiesInvariantRule$1
: > .evaluate(SystemPropertiesInvariantRule.java:55)
: > [junit4:junit4]   2> 	        at
: > org.apache.lucene.util.TestRuleThreadAndTestName$1.evaluate(TestRuleTh
: > readAndTestName.java:49)
: > [junit4:junit4]   2> 	        at
: > org.apache.lucene.util.TestRuleIgnoreAfterMaxFailures$1.evaluate(TestRule
: > IgnoreAfterMaxFailures.java:70)
: > [junit4:junit4]   2> 	        at
: > org.apache.lucene.util.TestRuleMarkFailure$1.evaluate(TestRuleMarkFailure
: > .java:48)
: > [junit4:junit4]   2> 	        at
: > com.carrotsearch.randomizedtesting.rules.StatementAdapter.evaluate(Stat
: > ementAdapter.java:36)
: > [junit4:junit4]   2> 	        at
: > com.carrotsearch.randomizedtesting.ThreadLeakControl$StatementRunner.
: > run(ThreadLeakControl.java:358)
: > [junit4:junit4]   2> 	        at
: > com.carrotsearch.randomizedtesting.ThreadLeakControl.forkTimeoutingTask
: > (ThreadLeakControl.java:782)
: > [junit4:junit4]   2> 	        at
: > com.carrotsearch.randomizedtesting.ThreadLeakControl$3.evaluate(ThreadL
: > eakControl.java:442)
: > [junit4:junit4]   2> 	        at
: > com.carrotsearch.randomizedtesting.RandomizedRunner.runSingleTest(Ran
: > domizedRunner.java:746)
: > [junit4:junit4]   2> 	        at
: > com.carrotsearch.randomizedtesting.RandomizedRunner$3.evaluate(Rando
: > mizedRunner.java:648)
: > [junit4:junit4]   2> 	        at
: > com.carrotsearch.randomizedtesting.RandomizedRunner$4.evaluate(Rando
: > mizedRunner.java:682)
: > [junit4:junit4]   2> 	        at
: > com.carrotsearch.randomizedtesting.RandomizedRunner$5.evaluate(Rando
: > mizedRunner.java:693)
: > [junit4:junit4]   2> 	        at
: > com.carrotsearch.randomizedtesting.rules.StatementAdapter.evaluate(Stat
: > ementAdapter.java:36)
: > [junit4:junit4]   2> 	        at
: > com.carrotsearch.randomizedtesting.rules.SystemPropertiesRestoreRule$1.
: > evaluate(SystemPropertiesRestoreRule.java:53)
: > [junit4:junit4]   2> 	        at
: > org.apache.lucene.util.AbstractBeforeAfterRule$1.evaluate(AbstractBeforeA
: > fterRule.java:46)
: > [junit4:junit4]   2> 	        at
: > org.apache.lucene.util.TestRuleStoreClassName$1.evaluate(TestRuleStoreCl
: > assName.java:42)
: > [junit4:junit4]   2> 	        at
: > com.carrotsearch.randomizedtesting.rules.SystemPropertiesInvariantRule$1
: > .evaluate(SystemPropertiesInvariantRule.java:55)
: > [junit4:junit4]   2> 	        at
: > com.carrotsearch.randomizedtesting.rules.NoShadowingOrOverridesOnMet
: > hodsRule$1.evaluate(NoShadowingOrOverridesOnMethodsRule.java:39)
: > [junit4:junit4]   2> 	        at
: > com.carrotsearch.randomizedtesting.rules.NoShadowingOrOverridesOnMet
: > hodsRule$1.evaluate(NoShadowingOrOverridesOnMethodsRule.java:39)
: > [junit4:junit4]   2> 	        at
: > com.carrotsearch.randomizedtesting.rules.StatementAdapter.evaluate(Stat
: > ementAdapter.java:36)
: > [junit4:junit4]   2> 	        at
: > org.apache.lucene.util.TestRuleAssertionsRequired$1.evaluate(TestRuleAss
: > ertionsRequired.java:43)
: > [junit4:junit4]   2> 	        at
: > org.apache.lucene.util.TestRuleMarkFailure$1.evaluate(TestRuleMarkFailure
: > .java:48)
: > [junit4:junit4]   2> 	        at
: > org.apache.lucene.util.TestRuleIgnoreAfterMaxFailures$1.evaluate(TestRule
: > IgnoreAfterMaxFailures.java:70)
: > [junit4:junit4]   2> 	        at
: > org.apache.lucene.util.TestRuleIgnoreTestSuites$1.evaluate(TestRuleIgnore
: > TestSuites.java:55)
: > [junit4:junit4]   2> 	        at
: > com.carrotsearch.randomizedtesting.rules.StatementAdapter.evaluate(Stat
: > ementAdapter.java:36)
: > [junit4:junit4]   2> 	        at
: > com.carrotsearch.randomizedtesting.ThreadLeakControl$StatementRunner.
: > run(ThreadLeakControl.java:358)
: > [junit4:junit4]   2> 	        at java.lang.Thread.run(Thread.java:679)
: > [junit4:junit4]   2> NOTE: test params are: codec=Lucene42:
: > {range_facet_l=Lucene41(blocksize=128), text=Pulsing41(freqCutoff=7
: > minBlockSize=78 maxBlockSize=228), _version_=Lucene41(blocksize=128),
: > rnd_b=PostingsFormat(name=MockSep),
: > intDefault=Lucene41(blocksize=128), id=PostingsFormat(name=MockSep),
: > timestamp=Lucene41(blocksize=128), a_t=Lucene41(blocksize=128),
: > range_facet_sl=Pulsing41(freqCutoff=7 minBlockSize=78 maxBlockSize=228),
: > range_facet_si=PostingsFormat(name=MockRandom),
: > other_tl1=Lucene41(blocksize=128),
: > multiDefault=PostingsFormat(name=MockRandom),
: > a_si=PostingsFormat(name=MockRandom)}, docValues:{},
: > sim=RandomSimilarityProvider(queryNorm=true,coord=crazy): {},
: > locale=es_NI, timezone=America/Port-au-Prince
: > [junit4:junit4]   2> NOTE: FreeBSD 9.0-RELEASE amd64/Sun Microsystems Inc.
: > 1.6.0_32 (64-bit)/cpus=16,threads=59,free=296368136,total=399114240
: > [junit4:junit4]   2> NOTE: All tests run in this JVM: [TestOmitPositions,
: > TestIndexingPerformance, TestAtomicUpdateErrorCases,
: > ShardRoutingCustomTest, RequestHandlersTest, TestBinaryField,
: > SimplePostToolTest, SortByFunctionTest, TimeZoneUtilsTest,
: > TestIndexSearcher, DebugComponentTest, TestDefaultSimilarityFactory,
: > SolrPluginUtilsTest, BadCopyFieldTest, TestDFRSimilarityFactory,
: > TestLuceneMatchVersion, TestDynamicFieldResource, TestSolrJ,
: > TestJmxMonitoredMap, ZkNodePropsTest, BasicZkTest,
: > IndexBasedSpellCheckerTest, TestUtils, TestBM25SimilarityFactory,
: > HighlighterConfigTest, TestFastOutputStream, DistanceFunctionTest,
: > SampleTest, TestStressLucene, CurrencyFieldOpenExchangeTest,
: > TestArbitraryIndexDir, TestSolrXMLSerializer, AliasIntegrationTest,
: > StandardRequestHandlerTest, DisMaxRequestHandlerTest, TestSolr4Spatial,
: > TestLazyCores, TestCSVLoader, TestPartialUpdateDeduplication,
: > ConvertedLegacyTest, TestHashPartitioner, TestCodecSupport,
: > TestZkChroot, RequiredFieldsTest, FieldAnalysisRequestHandlerTest,
: > ShardSplitTest, DefaultValueUpdateProcessorTest, TestDistributedGrouping,
: > TestBinaryResponseWriter, DirectSolrSpellCheckerTest,
: > TestPostingsSolrHighlighter, FileUtilsTest, TestCoreDiscovery,
: > CoreContainerCoreInitFailuresTest, OpenExchangeRatesOrgProviderTest,
: > TestFieldCollectionResource, PathHierarchyTokenizerFactoryTest,
: > UniqFieldsUpdateProcessorFactoryTest, TestElisionMultitermQuery,
: > EchoParamsTest, TermVectorComponentDistributedTest,
: > TestComponentsName, SolrCmdDistributorTest, NumericFieldsTest,
: > UpdateParamsTest, TestFieldTypeResource, TestMergePolicyConfig,
: > TestSuggestSpellingConverter, CurrencyFieldXmlFileTest,
: > BasicDistributedZkTest, ChaosMonkeySafeLeaderTest]
: > [junit4:junit4]   2> NOTE: reproduce with: ant test  -
: > Dtestcase=ChaosMonkeySafeLeaderTest -Dtests.seed=687EE273825E73E2 -
: > Dtests.multiplier=3 -Dtests.slow=true -Dtests.locale=es_NI -
: > Dtests.timezone=America/Port-au-Prince -Dtests.file.encoding=UTF-8
: > [junit4:junit4] ERROR   0.00s J1 | ChaosMonkeySafeLeaderTest (suite) <<<
: > [junit4:junit4]    > Throwable #1: java.lang.Exception: Suite timeout exceeded
: > (>= 7200000 msec).
: > [junit4:junit4]    > 	at
: > __randomizedtesting.SeedInfo.seed([687EE273825E73E2]:0)
: > [junit4:junit4] Completed on J1 in 7225.26s, 1 test, 2 errors <<< FAILURES!
: > 
: > [...truncated 19 lines...]
: > BUILD FAILED
: > /usr/home/hudson/hudson-slave/workspace/Lucene-Solr-Tests-4.x-
: > Java6/build.xml:381: The following error occurred while executing this line:
: > /usr/home/hudson/hudson-slave/workspace/Lucene-Solr-Tests-4.x-
: > Java6/build.xml:361: The following error occurred while executing this line:
: > /usr/home/hudson/hudson-slave/workspace/Lucene-Solr-Tests-4.x-
: > Java6/build.xml:39: The following error occurred while executing this line:
: > /usr/home/hudson/hudson-slave/workspace/Lucene-Solr-Tests-4.x-
: > Java6/solr/build.xml:183: The following error occurred while executing this
: > line:
: > /usr/home/hudson/hudson-slave/workspace/Lucene-Solr-Tests-4.x-
: > Java6/solr/common-build.xml:438: The following error occurred while
: > executing this line:
: > /usr/home/hudson/hudson-slave/workspace/Lucene-Solr-Tests-4.x-
: > Java6/lucene/common-build.xml:1234: The following error occurred while
: > executing this line:
: > /usr/home/hudson/hudson-slave/workspace/Lucene-Solr-Tests-4.x-
: > Java6/lucene/common-build.xml:878: There were test failures: 291 suites,
: > 1208 tests, 1 suite-level error, 26 errors, 13 failures, 27 ignored (8
: > assumptions)
: > 
: > Total time: 151 minutes 38 seconds
: > Build step 'Invoke Ant' marked build as failure
: > Archiving artifacts
: > Recording test results
: > Email was triggered for: Failure
: > Sending email for trigger: Failure
: > 
: 
: 
: 
: ---------------------------------------------------------------------
: To unsubscribe, e-mail: dev-unsubscribe@lucene.apache.org
: For additional commands, e-mail: dev-help@lucene.apache.org
: 
: 

-Hoss

---------------------------------------------------------------------
To unsubscribe, e-mail: dev-unsubscribe@lucene.apache.org
For additional commands, e-mail: dev-help@lucene.apache.org


Mime
View raw message