lucene-dev mailing list archives

Site index · List index
Message view « Date » · « Thread »
Top « Date » · « Thread »
From Robert Muir <rcm...@gmail.com>
Subject Re: [JENKINS] Lucene-Solr-NightlyTests-4.x - Build # 228 - Still Failing
Date Wed, 10 Apr 2013 21:54:08 GMT
i committed a fix

On Wed, Apr 10, 2013 at 5:48 PM, Apache Jenkins Server <
jenkins@builds.apache.org> wrote:

> Build: https://builds.apache.org/job/Lucene-Solr-NightlyTests-4.x/228/
>
> 4 tests failed.
> FAILED:  org.apache.lucene.facet.search.TestSearcherTaxonomyManager.test
>
> Error Message:
> Test abandoned because suite timeout was reached.
>
> Stack Trace:
> java.lang.Exception: Test abandoned because suite timeout was reached.
>         at __randomizedtesting.SeedInfo.seed([956580578007D779]:0)
>
>
> FAILED:
>  junit.framework.TestSuite.org.apache.lucene.facet.search.TestSearcherTaxonomyManager
>
> Error Message:
> Suite timeout exceeded (>= 7200000 msec).
>
> Stack Trace:
> java.lang.Exception: Suite timeout exceeded (>= 7200000 msec).
>         at __randomizedtesting.SeedInfo.seed([956580578007D779]:0)
>
>
> FAILED:
>  junit.framework.TestSuite.org.apache.lucene.facet.search.TestSearcherTaxonomyManager
>
> Error Message:
> Captured an uncaught exception in thread: Thread[id=390, name=Thread-97,
> state=RUNNABLE, group=TGRP-TestSearcherTaxonomyManager]
>
> Stack Trace:
> com.carrotsearch.randomizedtesting.UncaughtExceptionError: Captured an
> uncaught exception in thread: Thread[id=390, name=Thread-97,
> state=RUNNABLE, group=TGRP-TestSearcherTaxonomyManager]
> Caused by: java.lang.RuntimeException:
> java.lang.UnsupportedOperationException: this codec cannot write docvalues
>         at __randomizedtesting.SeedInfo.seed([956580578007D779]:0)
>         at
> org.apache.lucene.facet.search.TestSearcherTaxonomyManager$2.run(TestSearcherTaxonomyManager.java:117)
> Caused by: java.lang.UnsupportedOperationException: this codec cannot
> write docvalues
>         at
> org.apache.lucene.codecs.lucene3x.Lucene3xCodec$1.fieldsConsumer(Lucene3xCodec.java:73)
>         at
> org.apache.lucene.index.DocValuesProcessor.flush(DocValuesProcessor.java:77)
>         at
> org.apache.lucene.index.TwoStoredFieldsConsumers.flush(TwoStoredFieldsConsumers.java:42)
>         at
> org.apache.lucene.index.DocFieldProcessor.flush(DocFieldProcessor.java:80)
>         at
> org.apache.lucene.index.DocumentsWriterPerThread.flush(DocumentsWriterPerThread.java:493)
>         at
> org.apache.lucene.index.DocumentsWriter.doFlush(DocumentsWriter.java:422)
>         at
> org.apache.lucene.index.DocumentsWriter.flushAllThreads(DocumentsWriter.java:559)
>         at
> org.apache.lucene.index.IndexWriter.getReader(IndexWriter.java:365)
>         at
> org.apache.lucene.index.StandardDirectoryReader.doOpenFromWriter(StandardDirectoryReader.java:270)
>         at
> org.apache.lucene.index.StandardDirectoryReader.doOpenIfChanged(StandardDirectoryReader.java:245)
>         at
> org.apache.lucene.index.StandardDirectoryReader.doOpenIfChanged(StandardDirectoryReader.java:235)
>         at
> org.apache.lucene.index.DirectoryReader.openIfChanged(DirectoryReader.java:170)
>         at
> org.apache.lucene.facet.search.SearcherTaxonomyManager.refreshIfNeeded(SearcherTaxonomyManager.java:106)
>         at
> org.apache.lucene.facet.search.SearcherTaxonomyManager.refreshIfNeeded(SearcherTaxonomyManager.java:42)
>         at
> org.apache.lucene.search.ReferenceManager.doMaybeRefresh(ReferenceManager.java:155)
>         at
> org.apache.lucene.search.ReferenceManager.maybeRefresh(ReferenceManager.java:204)
>         at
> org.apache.lucene.facet.search.TestSearcherTaxonomyManager$2.run(TestSearcherTaxonomyManager.java:111)
>
>
> FAILED:
>  junit.framework.TestSuite.org.apache.lucene.facet.search.TestSearcherTaxonomyManager
>
> Error Message:
> Captured an uncaught exception in thread: Thread[id=389, name=Thread-96,
> state=RUNNABLE, group=TGRP-TestSearcherTaxonomyManager]
>
> Stack Trace:
> com.carrotsearch.randomizedtesting.UncaughtExceptionError: Captured an
> uncaught exception in thread: Thread[id=389, name=Thread-96,
> state=RUNNABLE, group=TGRP-TestSearcherTaxonomyManager]
> Caused by: java.lang.UnsupportedOperationException: this codec cannot
> write docvalues
>         at __randomizedtesting.SeedInfo.seed([956580578007D779]:0)
>         at
> org.apache.lucene.codecs.lucene3x.Lucene3xCodec$1.fieldsConsumer(Lucene3xCodec.java:73)
>         at
> org.apache.lucene.index.DocValuesProcessor.flush(DocValuesProcessor.java:77)
>         at
> org.apache.lucene.index.TwoStoredFieldsConsumers.flush(TwoStoredFieldsConsumers.java:42)
>         at
> org.apache.lucene.index.DocFieldProcessor.flush(DocFieldProcessor.java:80)
>         at
> org.apache.lucene.index.DocumentsWriterPerThread.flush(DocumentsWriterPerThread.java:493)
>         at
> org.apache.lucene.index.DocumentsWriter.doFlush(DocumentsWriter.java:422)
>         at
> org.apache.lucene.index.DocumentsWriter.postUpdate(DocumentsWriter.java:316)
>         at
> org.apache.lucene.index.DocumentsWriter.updateDocument(DocumentsWriter.java:389)
>         at
> org.apache.lucene.index.IndexWriter.updateDocument(IndexWriter.java:1481)
>         at
> org.apache.lucene.index.IndexWriter.addDocument(IndexWriter.java:1156)
>         at
> org.apache.lucene.index.IndexWriter.addDocument(IndexWriter.java:1137)
>         at
> org.apache.lucene.facet.search.TestSearcherTaxonomyManager$1.run(TestSearcherTaxonomyManager.java:84)
>
>
>
>
> Build Log:
> [...truncated 6452 lines...]
> [junit4:junit4] Suite:
> org.apache.lucene.facet.search.TestSearcherTaxonomyManager
> [junit4:junit4]   2> 10-04-2013 19:48:23
> com.carrotsearch.randomizedtesting.RandomizedRunner$QueueUncaughtExceptionsHandler
> uncaughtException
> [junit4:junit4]   2> WARNING: Uncaught exception in thread:
> Thread[Thread-97,5,TGRP-TestSearcherTaxonomyManager]
> [junit4:junit4]   2> java.lang.RuntimeException:
> java.lang.UnsupportedOperationException: this codec cannot write docvalues
> [junit4:junit4]   2>    at
> __randomizedtesting.SeedInfo.seed([956580578007D779]:0)
> [junit4:junit4]   2>    at
> org.apache.lucene.facet.search.TestSearcherTaxonomyManager$2.run(TestSearcherTaxonomyManager.java:117)
> [junit4:junit4]   2> Caused by: java.lang.UnsupportedOperationException:
> this codec cannot write docvalues
> [junit4:junit4]   2>    at
> org.apache.lucene.codecs.lucene3x.Lucene3xCodec$1.fieldsConsumer(Lucene3xCodec.java:73)
> [junit4:junit4]   2>    at
> org.apache.lucene.index.DocValuesProcessor.flush(DocValuesProcessor.java:77)
> [junit4:junit4]   2>    at
> org.apache.lucene.index.TwoStoredFieldsConsumers.flush(TwoStoredFieldsConsumers.java:42)
> [junit4:junit4]   2>    at
> org.apache.lucene.index.DocFieldProcessor.flush(DocFieldProcessor.java:80)
> [junit4:junit4]   2>    at
> org.apache.lucene.index.DocumentsWriterPerThread.flush(DocumentsWriterPerThread.java:493)
> [junit4:junit4]   2>    at
> org.apache.lucene.index.DocumentsWriter.doFlush(DocumentsWriter.java:422)
> [junit4:junit4]   2>    at
> org.apache.lucene.index.DocumentsWriter.flushAllThreads(DocumentsWriter.java:559)
> [junit4:junit4]   2>    at
> org.apache.lucene.index.IndexWriter.getReader(IndexWriter.java:365)
> [junit4:junit4]   2>    at
> org.apache.lucene.index.StandardDirectoryReader.doOpenFromWriter(StandardDirectoryReader.java:270)
> [junit4:junit4]   2>    at
> org.apache.lucene.index.StandardDirectoryReader.doOpenIfChanged(StandardDirectoryReader.java:245)
> [junit4:junit4]   2>    at
> org.apache.lucene.index.StandardDirectoryReader.doOpenIfChanged(StandardDirectoryReader.java:235)
> [junit4:junit4]   2>    at
> org.apache.lucene.index.DirectoryReader.openIfChanged(DirectoryReader.java:170)
> [junit4:junit4]   2>    at
> org.apache.lucene.facet.search.SearcherTaxonomyManager.refreshIfNeeded(SearcherTaxonomyManager.java:106)
> [junit4:junit4]   2>    at
> org.apache.lucene.facet.search.SearcherTaxonomyManager.refreshIfNeeded(SearcherTaxonomyManager.java:42)
> [junit4:junit4]   2>    at
> org.apache.lucene.search.ReferenceManager.doMaybeRefresh(ReferenceManager.java:155)
> [junit4:junit4]   2>    at
> org.apache.lucene.search.ReferenceManager.maybeRefresh(ReferenceManager.java:204)
> [junit4:junit4]   2>    at
> org.apache.lucene.facet.search.TestSearcherTaxonomyManager$2.run(TestSearcherTaxonomyManager.java:111)
> [junit4:junit4]   2> 10-04-2013 19:48:28
> com.carrotsearch.randomizedtesting.RandomizedRunner$QueueUncaughtExceptionsHandler
> uncaughtException
> [junit4:junit4]   2> WARNING: Uncaught exception in thread:
> Thread[Thread-96,5,TGRP-TestSearcherTaxonomyManager]
> [junit4:junit4]   2> java.lang.UnsupportedOperationException: this codec
> cannot write docvalues
> [junit4:junit4]   2>    at
> __randomizedtesting.SeedInfo.seed([956580578007D779]:0)
> [junit4:junit4]   2>    at
> org.apache.lucene.codecs.lucene3x.Lucene3xCodec$1.fieldsConsumer(Lucene3xCodec.java:73)
> [junit4:junit4]   2>    at
> org.apache.lucene.index.DocValuesProcessor.flush(DocValuesProcessor.java:77)
> [junit4:junit4]   2>    at
> org.apache.lucene.index.TwoStoredFieldsConsumers.flush(TwoStoredFieldsConsumers.java:42)
> [junit4:junit4]   2>    at
> org.apache.lucene.index.DocFieldProcessor.flush(DocFieldProcessor.java:80)
> [junit4:junit4]   2>    at
> org.apache.lucene.index.DocumentsWriterPerThread.flush(DocumentsWriterPerThread.java:493)
> [junit4:junit4]   2>    at
> org.apache.lucene.index.DocumentsWriter.doFlush(DocumentsWriter.java:422)
> [junit4:junit4]   2>    at
> org.apache.lucene.index.DocumentsWriter.postUpdate(DocumentsWriter.java:316)
> [junit4:junit4]   2>    at
> org.apache.lucene.index.DocumentsWriter.updateDocument(DocumentsWriter.java:389)
> [junit4:junit4]   2>    at
> org.apache.lucene.index.IndexWriter.updateDocument(IndexWriter.java:1481)
> [junit4:junit4]   2>    at
> org.apache.lucene.index.IndexWriter.addDocument(IndexWriter.java:1156)
> [junit4:junit4]   2>    at
> org.apache.lucene.index.IndexWriter.addDocument(IndexWriter.java:1137)
> [junit4:junit4]   2>    at
> org.apache.lucene.facet.search.TestSearcherTaxonomyManager$1.run(TestSearcherTaxonomyManager.java:84)
> [junit4:junit4]   2> 10-04-2013 21:48:23
> com.carrotsearch.randomizedtesting.ThreadLeakControl$2 evaluate
> [junit4:junit4]   2> WARNING: Suite execution timed out:
> org.apache.lucene.facet.search.TestSearcherTaxonomyManager
> [junit4:junit4]   2> ==== jstack at approximately timeout time ====
> [junit4:junit4]   2>
> "TEST-TestSearcherTaxonomyManager.test-seed#[956580578007D779]" ID=388
> RUNNABLE
> [junit4:junit4]   2>    at java.lang.Throwable.getStackTraceElement(Native
> Method)
> [junit4:junit4]   2>    at
> java.lang.Throwable.getOurStackTrace(Throwable.java:608)
> [junit4:junit4]   2>    - locked java.lang.Exception@5bc1f36d
> [junit4:junit4]   2>    at
> java.lang.Throwable.getStackTrace(Throwable.java:599)
> [junit4:junit4]   2>    at
> org.apache.lucene.codecs.lucene3x.PreFlexRWPostingsFormat$1.sortTermsByUnicode(PreFlexRWPostingsFormat.java:58)
> [junit4:junit4]   2>    at
> org.apache.lucene.codecs.lucene3x.Lucene3xFields$PreTermsEnum.reset(Lucene3xFields.java:689)
> [junit4:junit4]   2>    at
> org.apache.lucene.codecs.lucene3x.Lucene3xFields$PreTerms.iterator(Lucene3xFields.java:179)
> [junit4:junit4]   2>    at
> org.apache.lucene.index.MultiFields.getTermDocsEnum(MultiFields.java:152)
> [junit4:junit4]   2>    at
> org.apache.lucene.facet.taxonomy.directory.DirectoryTaxonomyReader.getOrdinal(DirectoryTaxonomyReader.java:273)
> [junit4:junit4]   2>    at
> org.apache.lucene.facet.search.FacetsAccumulator.accumulate(FacetsAccumulator.java:182)
> [junit4:junit4]   2>    at
> org.apache.lucene.facet.search.FacetsCollector.getFacetResults(FacetsCollector.java:214)
> [junit4:junit4]   2>    at
> org.apache.lucene.facet.search.TestSearcherTaxonomyManager.test(TestSearcherTaxonomyManager.java:136)
> [junit4:junit4]   2>    at
> sun.reflect.NativeMethodAccessorImpl.invoke0(Native Method)
> [junit4:junit4]   2>    at
> sun.reflect.NativeMethodAccessorImpl.invoke(NativeMethodAccessorImpl.java:57)
> [junit4:junit4]   2>    at
> sun.reflect.DelegatingMethodAccessorImpl.invoke(DelegatingMethodAccessorImpl.java:43)
> [junit4:junit4]   2>    at java.lang.reflect.Method.invoke(Method.java:616)
> [junit4:junit4]   2>    at
> com.carrotsearch.randomizedtesting.RandomizedRunner.invoke(RandomizedRunner.java:1559)
> [junit4:junit4]   2>    at
> com.carrotsearch.randomizedtesting.RandomizedRunner.access$600(RandomizedRunner.java:79)
> [junit4:junit4]   2>    at
> com.carrotsearch.randomizedtesting.RandomizedRunner$6.evaluate(RandomizedRunner.java:737)
> [junit4:junit4]   2>    at
> com.carrotsearch.randomizedtesting.RandomizedRunner$7.evaluate(RandomizedRunner.java:773)
> [junit4:junit4]   2>    at
> com.carrotsearch.randomizedtesting.RandomizedRunner$8.evaluate(RandomizedRunner.java:787)
> [junit4:junit4]   2>    at
> org.apache.lucene.util.TestRuleSetupTeardownChained$1.evaluate(TestRuleSetupTeardownChained.java:50)
> [junit4:junit4]   2>    at
> org.apache.lucene.util.TestRuleFieldCacheSanity$1.evaluate(TestRuleFieldCacheSanity.java:51)
> [junit4:junit4]   2>    at
> org.apache.lucene.util.AbstractBeforeAfterRule$1.evaluate(AbstractBeforeAfterRule.java:46)
> [junit4:junit4]   2>    at
> com.carrotsearch.randomizedtesting.rules.SystemPropertiesInvariantRule$1.evaluate(SystemPropertiesInvariantRule.java:55)
> [junit4:junit4]   2>    at
> org.apache.lucene.util.TestRuleThreadAndTestName$1.evaluate(TestRuleThreadAndTestName.java:49)
> [junit4:junit4]   2>    at
> org.apache.lucene.util.TestRuleIgnoreAfterMaxFailures$1.evaluate(TestRuleIgnoreAfterMaxFailures.java:70)
> [junit4:junit4]   2>    at
> org.apache.lucene.util.TestRuleMarkFailure$1.evaluate(TestRuleMarkFailure.java:48)
> [junit4:junit4]   2>    at
> com.carrotsearch.randomizedtesting.rules.StatementAdapter.evaluate(StatementAdapter.java:36)
> [junit4:junit4]   2>    at
> com.carrotsearch.randomizedtesting.ThreadLeakControl$StatementRunner.run(ThreadLeakControl.java:358)
> [junit4:junit4]   2>    at
> com.carrotsearch.randomizedtesting.ThreadLeakControl.forkTimeoutingTask(ThreadLeakControl.java:782)
> [junit4:junit4]   2>    at
> com.carrotsearch.randomizedtesting.ThreadLeakControl$3.evaluate(ThreadLeakControl.java:442)
> [junit4:junit4]   2>    at
> com.carrotsearch.randomizedtesting.RandomizedRunner.runSingleTest(RandomizedRunner.java:746)
> [junit4:junit4]   2>    at
> com.carrotsearch.randomizedtesting.RandomizedRunner$3.evaluate(RandomizedRunner.java:648)
> [junit4:junit4]   2>    at
> com.carrotsearch.randomizedtesting.RandomizedRunner$4.evaluate(RandomizedRunner.java:682)
> [junit4:junit4]   2>    at
> com.carrotsearch.randomizedtesting.RandomizedRunner$5.evaluate(RandomizedRunner.java:693)
> [junit4:junit4]   2>    at
> org.apache.lucene.util.AbstractBeforeAfterRule$1.evaluate(AbstractBeforeAfterRule.java:46)
> [junit4:junit4]   2>    at
> org.apache.lucene.util.TestRuleStoreClassName$1.evaluate(TestRuleStoreClassName.java:42)
> [junit4:junit4]   2>    at
> com.carrotsearch.randomizedtesting.rules.SystemPropertiesInvariantRule$1.evaluate(SystemPropertiesInvariantRule.java:55)
> [junit4:junit4]   2>    at
> com.carrotsearch.randomizedtesting.rules.NoShadowingOrOverridesOnMethodsRule$1.evaluate(NoShadowingOrOverridesOnMethodsRule.java:39)
> [junit4:junit4]   2>    at
> com.carrotsearch.randomizedtesting.rules.NoShadowingOrOverridesOnMethodsRule$1.evaluate(NoShadowingOrOverridesOnMethodsRule.java:39)
> [junit4:junit4]   2>    at
> com.carrotsearch.randomizedtesting.rules.StatementAdapter.evaluate(StatementAdapter.java:36)
> [junit4:junit4]   2>    at
> org.apache.lucene.util.TestRuleAssertionsRequired$1.evaluate(TestRuleAssertionsRequired.java:43)
> [junit4:junit4]   2>    at
> org.apache.lucene.util.TestRuleMarkFailure$1.evaluate(TestRuleMarkFailure.java:48)
> [junit4:junit4]   2>    at
> org.apache.lucene.util.TestRuleIgnoreAfterMaxFailures$1.evaluate(TestRuleIgnoreAfterMaxFailures.java:70)
> [junit4:junit4]   2>    at
> org.apache.lucene.util.TestRuleIgnoreTestSuites$1.evaluate(TestRuleIgnoreTestSuites.java:55)
> [junit4:junit4]   2>    at
> com.carrotsearch.randomizedtesting.rules.StatementAdapter.evaluate(StatementAdapter.java:36)
> [junit4:junit4]   2>    at
> com.carrotsearch.randomizedtesting.ThreadLeakControl$StatementRunner.run(ThreadLeakControl.java:358)
> [junit4:junit4]   2>    at java.lang.Thread.run(Thread.java:679)
> [junit4:junit4]   2>
> [junit4:junit4]   2>
> "SUITE-TestSearcherTaxonomyManager-seed#[956580578007D779]" ID=387 RUNNABLE
> [junit4:junit4]   2>    at sun.management.ThreadImpl.dumpThreads0(Native
> Method)
> [junit4:junit4]   2>    at
> sun.management.ThreadImpl.dumpAllThreads(ThreadImpl.java:392)
> [junit4:junit4]   2>    at
> com.carrotsearch.randomizedtesting.ThreadLeakControl.formatThreadStacksFull(ThreadLeakControl.java:655)
> [junit4:junit4]   2>    at
> com.carrotsearch.randomizedtesting.ThreadLeakControl.access$800(ThreadLeakControl.java:60)
> [junit4:junit4]   2>    at
> com.carrotsearch.randomizedtesting.ThreadLeakControl$2.evaluate(ThreadLeakControl.java:396)
> [junit4:junit4]   2>    - locked java.lang.Object@1a54a82b
> [junit4:junit4]   2>    at
> com.carrotsearch.randomizedtesting.RandomizedRunner.runSuite(RandomizedRunner.java:556)
> [junit4:junit4]   2>    at
> com.carrotsearch.randomizedtesting.RandomizedRunner.access$200(RandomizedRunner.java:79)
> [junit4:junit4]   2>    at
> com.carrotsearch.randomizedtesting.RandomizedRunner$1.run(RandomizedRunner.java:492)
> [junit4:junit4]   2>
> [junit4:junit4]   2> "Signal Dispatcher" ID=4 RUNNABLE
> [junit4:junit4]   2>
> [junit4:junit4]   2> "Finalizer" ID=3 WAITING on
> java.lang.ref.ReferenceQueue$Lock@2becac8e
> [junit4:junit4]   2>    at java.lang.Object.wait(Native Method)
> [junit4:junit4]   2>    - waiting on
> java.lang.ref.ReferenceQueue$Lock@2becac8e
> [junit4:junit4]   2>    at
> java.lang.ref.ReferenceQueue.remove(ReferenceQueue.java:133)
> [junit4:junit4]   2>    at
> java.lang.ref.ReferenceQueue.remove(ReferenceQueue.java:149)
> [junit4:junit4]   2>    at
> java.lang.ref.Finalizer$FinalizerThread.run(Finalizer.java:177)
> [junit4:junit4]   2>
> [junit4:junit4]   2> "Reference Handler" ID=2 WAITING on
> java.lang.ref.Reference$Lock@3f34b529
> [junit4:junit4]   2>    at java.lang.Object.wait(Native Method)
> [junit4:junit4]   2>    - waiting on java.lang.ref.Reference$Lock@3f34b529
> [junit4:junit4]   2>    at java.lang.Object.wait(Object.java:502)
> [junit4:junit4]   2>    at
> java.lang.ref.Reference$ReferenceHandler.run(Reference.java:133)
> [junit4:junit4]   2>
> [junit4:junit4]   2> "main" ID=1 WAITING on
> com.carrotsearch.randomizedtesting.RandomizedRunner$1@3c11d1eb
> [junit4:junit4]   2>    at java.lang.Object.wait(Native Method)
> [junit4:junit4]   2>    - waiting on
> com.carrotsearch.randomizedtesting.RandomizedRunner$1@3c11d1eb
> [junit4:junit4]   2>    at java.lang.Thread.join(Thread.java:1203)
> [junit4:junit4]   2>    at java.lang.Thread.join(Thread.java:1256)
> [junit4:junit4]   2>    at
> com.carrotsearch.randomizedtesting.RandomizedRunner.runSuite(RandomizedRunner.java:502)
> [junit4:junit4]   2>    at
> com.carrotsearch.randomizedtesting.RandomizedRunner.run(RandomizedRunner.java:399)
> [junit4:junit4]   2>    at
> com.carrotsearch.ant.tasks.junit4.slave.SlaveMain.execute(SlaveMain.java:180)
> [junit4:junit4]   2>    at
> com.carrotsearch.ant.tasks.junit4.slave.SlaveMain.main(SlaveMain.java:275)
> [junit4:junit4]   2>    at
> com.carrotsearch.ant.tasks.junit4.slave.SlaveMainSafe.main(SlaveMainSafe.java:12)
> [junit4:junit4]   2>
> [junit4:junit4]   2> ^^==============================================
> [junit4:junit4]   2>
> [junit4:junit4]   2> NOTE: download the large Jenkins line-docs file by
> running 'ant get-jenkins-line-docs' in the lucene directory.
> [junit4:junit4]   2> NOTE: reproduce with: ant test
>  -Dtestcase=TestSearcherTaxonomyManager -Dtests.method=test
> -Dtests.seed=956580578007D779 -Dtests.multiplier=2 -Dtests.nightly=true
> -Dtests.slow=true
> -Dtests.linedocsfile=/home/hudson/lucene-data/enwiki.random.lines.txt
> -Dtests.locale=vi_VN -Dtests.timezone=Africa/Nouakchott
> -Dtests.file.encoding=ISO8859-1
> [junit4:junit4] ERROR   7200s J0 | TestSearcherTaxonomyManager.test <<<
> [junit4:junit4]    > Throwable #1: java.lang.Exception: Test abandoned
> because suite timeout was reached.
> [junit4:junit4]    >    at
> __randomizedtesting.SeedInfo.seed([956580578007D779]:0)
> [junit4:junit4]   2> 10-04-2013 21:48:23
> com.carrotsearch.randomizedtesting.ThreadLeakControl checkThreadLeaks
> [junit4:junit4]   2> WARNING: Will linger awaiting termination of 1 leaked
> thread(s).
> [junit4:junit4]   2> 10-04-2013 21:48:43
> com.carrotsearch.randomizedtesting.ThreadLeakControl checkThreadLeaks
> [junit4:junit4]   2> SEVERE: 1 thread leaked from SUITE scope at
> org.apache.lucene.facet.search.TestSearcherTaxonomyManager:
> [junit4:junit4]   2>    1) Thread[id=388,
> name=TEST-TestSearcherTaxonomyManager.test-seed#[956580578007D779],
> state=RUNNABLE, group=TGRP-TestSearcherTaxonomyManager]
> [junit4:junit4]   2>         at
> java.lang.Throwable.getStackTraceElement(Native Method)
> [junit4:junit4]   2>         at
> java.lang.Throwable.getOurStackTrace(Throwable.java:608)
> [junit4:junit4]   2>         at
> java.lang.Throwable.getStackTrace(Throwable.java:599)
> [junit4:junit4]   2>         at
> org.apache.lucene.codecs.lucene3x.PreFlexRWPostingsFormat$1.sortTermsByUnicode(PreFlexRWPostingsFormat.java:58)
> [junit4:junit4]   2>         at
> org.apache.lucene.codecs.lucene3x.Lucene3xFields$PreTermsEnum.reset(Lucene3xFields.java:689)
> [junit4:junit4]   2>         at
> org.apache.lucene.codecs.lucene3x.Lucene3xFields$PreTerms.iterator(Lucene3xFields.java:179)
> [junit4:junit4]   2>         at
> org.apache.lucene.index.MultiFields.getTermDocsEnum(MultiFields.java:152)
> [junit4:junit4]   2>         at
> org.apache.lucene.facet.taxonomy.directory.DirectoryTaxonomyReader.getOrdinal(DirectoryTaxonomyReader.java:273)
> [junit4:junit4]   2>         at
> org.apache.lucene.facet.search.FacetsAccumulator.accumulate(FacetsAccumulator.java:182)
> [junit4:junit4]   2>         at
> org.apache.lucene.facet.search.FacetsCollector.getFacetResults(FacetsCollector.java:214)
> [junit4:junit4]   2>         at
> org.apache.lucene.facet.search.TestSearcherTaxonomyManager.test(TestSearcherTaxonomyManager.java:136)
> [junit4:junit4]   2>         at
> sun.reflect.NativeMethodAccessorImpl.invoke0(Native Method)
> [junit4:junit4]   2>         at
> sun.reflect.NativeMethodAccessorImpl.invoke(NativeMethodAccessorImpl.java:57)
> [junit4:junit4]   2>         at
> sun.reflect.DelegatingMethodAccessorImpl.invoke(DelegatingMethodAccessorImpl.java:43)
> [junit4:junit4]   2>         at
> java.lang.reflect.Method.invoke(Method.java:616)
> [junit4:junit4]   2>         at
> com.carrotsearch.randomizedtesting.RandomizedRunner.invoke(RandomizedRunner.java:1559)
> [junit4:junit4]   2>         at
> com.carrotsearch.randomizedtesting.RandomizedRunner.access$600(RandomizedRunner.java:79)
> [junit4:junit4]   2>         at
> com.carrotsearch.randomizedtesting.RandomizedRunner$6.evaluate(RandomizedRunner.java:737)
> [junit4:junit4]   2>         at
> com.carrotsearch.randomizedtesting.RandomizedRunner$7.evaluate(RandomizedRunner.java:773)
> [junit4:junit4]   2>         at
> com.carrotsearch.randomizedtesting.RandomizedRunner$8.evaluate(RandomizedRunner.java:787)
> [junit4:junit4]   2>         at
> org.apache.lucene.util.TestRuleSetupTeardownChained$1.evaluate(TestRuleSetupTeardownChained.java:50)
> [junit4:junit4]   2>         at
> org.apache.lucene.util.TestRuleFieldCacheSanity$1.evaluate(TestRuleFieldCacheSanity.java:51)
> [junit4:junit4]   2>         at
> org.apache.lucene.util.AbstractBeforeAfterRule$1.evaluate(AbstractBeforeAfterRule.java:46)
> [junit4:junit4]   2>         at
> com.carrotsearch.randomizedtesting.rules.SystemPropertiesInvariantRule$1.evaluate(SystemPropertiesInvariantRule.java:55)
> [junit4:junit4]   2>         at
> org.apache.lucene.util.TestRuleThreadAndTestName$1.evaluate(TestRuleThreadAndTestName.java:49)
> [junit4:junit4]   2>         at
> org.apache.lucene.util.TestRuleIgnoreAfterMaxFailures$1.evaluate(TestRuleIgnoreAfterMaxFailures.java:70)
> [junit4:junit4]   2>         at
> org.apache.lucene.util.TestRuleMarkFailure$1.evaluate(TestRuleMarkFailure.java:48)
> [junit4:junit4]   2>         at
> com.carrotsearch.randomizedtesting.rules.StatementAdapter.evaluate(StatementAdapter.java:36)
> [junit4:junit4]   2>         at
> com.carrotsearch.randomizedtesting.ThreadLeakControl$StatementRunner.run(ThreadLeakControl.java:358)
> [junit4:junit4]   2>         at
> com.carrotsearch.randomizedtesting.ThreadLeakControl.forkTimeoutingTask(ThreadLeakControl.java:782)
> [junit4:junit4]   2>         at
> com.carrotsearch.randomizedtesting.ThreadLeakControl$3.evaluate(ThreadLeakControl.java:442)
> [junit4:junit4]   2>         at
> com.carrotsearch.randomizedtesting.RandomizedRunner.runSingleTest(RandomizedRunner.java:746)
> [junit4:junit4]   2>         at
> com.carrotsearch.randomizedtesting.RandomizedRunner$3.evaluate(RandomizedRunner.java:648)
> [junit4:junit4]   2>         at
> com.carrotsearch.randomizedtesting.RandomizedRunner$4.evaluate(RandomizedRunner.java:682)
> [junit4:junit4]   2>         at
> com.carrotsearch.randomizedtesting.RandomizedRunner$5.evaluate(RandomizedRunner.java:693)
> [junit4:junit4]   2>         at
> org.apache.lucene.util.AbstractBeforeAfterRule$1.evaluate(AbstractBeforeAfterRule.java:46)
> [junit4:junit4]   2>         at
> org.apache.lucene.util.TestRuleStoreClassName$1.evaluate(TestRuleStoreClassName.java:42)
> [junit4:junit4]   2>         at
> com.carrotsearch.randomizedtesting.rules.SystemPropertiesInvariantRule$1.evaluate(SystemPropertiesInvariantRule.java:55)
> [junit4:junit4]   2>         at
> com.carrotsearch.randomizedtesting.rules.NoShadowingOrOverridesOnMethodsRule$1.evaluate(NoShadowingOrOverridesOnMethodsRule.java:39)
> [junit4:junit4]   2>         at
> com.carrotsearch.randomizedtesting.rules.NoShadowingOrOverridesOnMethodsRule$1.evaluate(NoShadowingOrOverridesOnMethodsRule.java:39)
> [junit4:junit4]   2>         at
> com.carrotsearch.randomizedtesting.rules.StatementAdapter.evaluate(StatementAdapter.java:36)
> [junit4:junit4]   2>         at
> org.apache.lucene.util.TestRuleAssertionsRequired$1.evaluate(TestRuleAssertionsRequired.java:43)
> [junit4:junit4]   2>         at
> org.apache.lucene.util.TestRuleMarkFailure$1.evaluate(TestRuleMarkFailure.java:48)
> [junit4:junit4]   2>         at
> org.apache.lucene.util.TestRuleIgnoreAfterMaxFailures$1.evaluate(TestRuleIgnoreAfterMaxFailures.java:70)
> [junit4:junit4]   2>         at
> org.apache.lucene.util.TestRuleIgnoreTestSuites$1.evaluate(TestRuleIgnoreTestSuites.java:55)
> [junit4:junit4]   2>         at
> com.carrotsearch.randomizedtesting.rules.StatementAdapter.evaluate(StatementAdapter.java:36)
> [junit4:junit4]   2>         at
> com.carrotsearch.randomizedtesting.ThreadLeakControl$StatementRunner.run(ThreadLeakControl.java:358)
> [junit4:junit4]   2>         at java.lang.Thread.run(Thread.java:679)
> [junit4:junit4]   2> 10-04-2013 21:48:43
> com.carrotsearch.randomizedtesting.ThreadLeakControl tryToInterruptAll
> [junit4:junit4]   2> INFO: Starting to interrupt leaked threads:
> [junit4:junit4]   2>    1) Thread[id=388,
> name=TEST-TestSearcherTaxonomyManager.test-seed#[956580578007D779],
> state=RUNNABLE, group=TGRP-TestSearcherTaxonomyManager]
> [junit4:junit4]   2> 10-04-2013 21:48:46
> com.carrotsearch.randomizedtesting.ThreadLeakControl tryToInterruptAll
> [junit4:junit4]   2> SEVERE: There are still zombie threads that couldn't
> be terminated:
> [junit4:junit4]   2>    1) Thread[id=388,
> name=TEST-TestSearcherTaxonomyManager.test-seed#[956580578007D779],
> state=RUNNABLE, group=TGRP-TestSearcherTaxonomyManager]
> [junit4:junit4]   2>         at
> java.lang.Throwable.getStackTraceElement(Native Method)
> [junit4:junit4]   2>         at
> java.lang.Throwable.getOurStackTrace(Throwable.java:608)
> [junit4:junit4]   2>         at
> java.lang.Throwable.getStackTrace(Throwable.java:599)
> [junit4:junit4]   2>         at
> org.apache.lucene.codecs.lucene3x.PreFlexRWPostingsFormat$1.sortTermsByUnicode(PreFlexRWPostingsFormat.java:58)
> [junit4:junit4]   2>         at
> org.apache.lucene.codecs.lucene3x.Lucene3xFields$PreTermsEnum.reset(Lucene3xFields.java:689)
> [junit4:junit4]   2>         at
> org.apache.lucene.codecs.lucene3x.Lucene3xFields$PreTerms.iterator(Lucene3xFields.java:179)
> [junit4:junit4]   2>         at
> org.apache.lucene.index.MultiFields.getTermDocsEnum(MultiFields.java:152)
> [junit4:junit4]   2>         at
> org.apache.lucene.facet.taxonomy.directory.DirectoryTaxonomyReader.getOrdinal(DirectoryTaxonomyReader.java:273)
> [junit4:junit4]   2>         at
> org.apache.lucene.facet.search.FacetsAccumulator.accumulate(FacetsAccumulator.java:182)
> [junit4:junit4]   2>         at
> org.apache.lucene.facet.search.FacetsCollector.getFacetResults(FacetsCollector.java:214)
> [junit4:junit4]   2>         at
> org.apache.lucene.facet.search.TestSearcherTaxonomyManager.test(TestSearcherTaxonomyManager.java:136)
> [junit4:junit4]   2>         at
> sun.reflect.NativeMethodAccessorImpl.invoke0(Native Method)
> [junit4:junit4]   2>         at
> sun.reflect.NativeMethodAccessorImpl.invoke(NativeMethodAccessorImpl.java:57)
> [junit4:junit4]   2>         at
> sun.reflect.DelegatingMethodAccessorImpl.invoke(DelegatingMethodAccessorImpl.java:43)
> [junit4:junit4]   2>         at
> java.lang.reflect.Method.invoke(Method.java:616)
> [junit4:junit4]   2>         at
> com.carrotsearch.randomizedtesting.RandomizedRunner.invoke(RandomizedRunner.java:1559)
> [junit4:junit4]   2>         at
> com.carrotsearch.randomizedtesting.RandomizedRunner.access$600(RandomizedRunner.java:79)
> [junit4:junit4]   2>         at
> com.carrotsearch.randomizedtesting.RandomizedRunner$6.evaluate(RandomizedRunner.java:737)
> [junit4:junit4]   2>         at
> com.carrotsearch.randomizedtesting.RandomizedRunner$7.evaluate(RandomizedRunner.java:773)
> [junit4:junit4]   2>         at
> com.carrotsearch.randomizedtesting.RandomizedRunner$8.evaluate(RandomizedRunner.java:787)
> [junit4:junit4]   2>         at
> org.apache.lucene.util.TestRuleSetupTeardownChained$1.evaluate(TestRuleSetupTeardownChained.java:50)
> [junit4:junit4]   2>         at
> org.apache.lucene.util.TestRuleFieldCacheSanity$1.evaluate(TestRuleFieldCacheSanity.java:51)
> [junit4:junit4]   2>         at
> org.apache.lucene.util.AbstractBeforeAfterRule$1.evaluate(AbstractBeforeAfterRule.java:46)
> [junit4:junit4]   2>         at
> com.carrotsearch.randomizedtesting.rules.SystemPropertiesInvariantRule$1.evaluate(SystemPropertiesInvariantRule.java:55)
> [junit4:junit4]   2>         at
> org.apache.lucene.util.TestRuleThreadAndTestName$1.evaluate(TestRuleThreadAndTestName.java:49)
> [junit4:junit4]   2>         at
> org.apache.lucene.util.TestRuleIgnoreAfterMaxFailures$1.evaluate(TestRuleIgnoreAfterMaxFailures.java:70)
> [junit4:junit4]   2>         at
> org.apache.lucene.util.TestRuleMarkFailure$1.evaluate(TestRuleMarkFailure.java:48)
> [junit4:junit4]   2>         at
> com.carrotsearch.randomizedtesting.rules.StatementAdapter.evaluate(StatementAdapter.java:36)
> [junit4:junit4]   2>         at
> com.carrotsearch.randomizedtesting.ThreadLeakControl$StatementRunner.run(ThreadLeakControl.java:358)
> [junit4:junit4]   2>         at
> com.carrotsearch.randomizedtesting.ThreadLeakControl.forkTimeoutingTask(ThreadLeakControl.java:782)
> [junit4:junit4]   2>         at
> com.carrotsearch.randomizedtesting.ThreadLeakControl$3.evaluate(ThreadLeakControl.java:442)
> [junit4:junit4]   2>         at
> com.carrotsearch.randomizedtesting.RandomizedRunner.runSingleTest(RandomizedRunner.java:746)
> [junit4:junit4]   2>         at
> com.carrotsearch.randomizedtesting.RandomizedRunner$3.evaluate(RandomizedRunner.java:648)
> [junit4:junit4]   2>         at
> com.carrotsearch.randomizedtesting.RandomizedRunner$4.evaluate(RandomizedRunner.java:682)
> [junit4:junit4]   2>         at
> com.carrotsearch.randomizedtesting.RandomizedRunner$5.evaluate(RandomizedRunner.java:693)
> [junit4:junit4]   2>         at
> org.apache.lucene.util.AbstractBeforeAfterRule$1.evaluate(AbstractBeforeAfterRule.java:46)
> [junit4:junit4]   2>         at
> org.apache.lucene.util.TestRuleStoreClassName$1.evaluate(TestRuleStoreClassName.java:42)
> [junit4:junit4]   2>         at
> com.carrotsearch.randomizedtesting.rules.SystemPropertiesInvariantRule$1.evaluate(SystemPropertiesInvariantRule.java:55)
> [junit4:junit4]   2>         at
> com.carrotsearch.randomizedtesting.rules.NoShadowingOrOverridesOnMethodsRule$1.evaluate(NoShadowingOrOverridesOnMethodsRule.java:39)
> [junit4:junit4]   2>         at
> com.carrotsearch.randomizedtesting.rules.NoShadowingOrOverridesOnMethodsRule$1.evaluate(NoShadowingOrOverridesOnMethodsRule.java:39)
> [junit4:junit4]   2>         at
> com.carrotsearch.randomizedtesting.rules.StatementAdapter.evaluate(StatementAdapter.java:36)
> [junit4:junit4]   2>         at
> org.apache.lucene.util.TestRuleAssertionsRequired$1.evaluate(TestRuleAssertionsRequired.java:43)
> [junit4:junit4]   2>         at
> org.apache.lucene.util.TestRuleMarkFailure$1.evaluate(TestRuleMarkFailure.java:48)
> [junit4:junit4]   2>         at
> org.apache.lucene.util.TestRuleIgnoreAfterMaxFailures$1.evaluate(TestRuleIgnoreAfterMaxFailures.java:70)
> [junit4:junit4]   2>         at
> org.apache.lucene.util.TestRuleIgnoreTestSuites$1.evaluate(TestRuleIgnoreTestSuites.java:55)
> [junit4:junit4]   2>         at
> com.carrotsearch.randomizedtesting.rules.StatementAdapter.evaluate(StatementAdapter.java:36)
> [junit4:junit4]   2>         at
> com.carrotsearch.randomizedtesting.ThreadLeakControl$StatementRunner.run(ThreadLeakControl.java:358)
> [junit4:junit4]   2>         at java.lang.Thread.run(Thread.java:679)
> [junit4:junit4]   2> NOTE: test params are: codec=Lucene3x,
> sim=DefaultSimilarity, locale=vi_VN, timezone=Africa/Nouakchott
> [junit4:junit4]   2> NOTE: FreeBSD 9.0-RELEASE amd64/Sun Microsystems Inc.
> 1.6.0_32 (64-bit)/cpus=16,threads=2,free=36374680,total=371720192
> [junit4:junit4]   2> NOTE: All tests run in this JVM: [IntToObjectMapTest,
> CountingFacetsAggregatorTest, TestFacetArrays, SamplingWrapperTest,
> TestConcurrentFacetedIndexing, TestDirectoryTaxonomyReader,
> MultiCategoryListIteratorTest, SamplingAccumulatorTest, DrillDownQueryTest,
> PerDimensionIndexingParamsTest, TestTotalFacetCountsCache, EncodingTest,
> TestCompactLabelToOrdinal, TestTaxonomyCombined, TestDrillSideways,
> TestCharBlockArray, TestTopKResultsHandler, TestScoredDocIDsUtils,
> TestTopKInEachNodeResultHandler, OrdinalMappingReaderTest,
> TestFacetsPayloadMigrationReader, TestFacetsCollector,
> AssociationsFacetRequestTest, IntHashSetTest,
> TestStandardFacetsAccumulator, IntToIntMapTest, ObjectToIntMapTest,
> IntToFloatMapTest, IntToDoubleMapTest, FloatToObjectMapTest,
> ArrayHashMapTest, ObjectToFloatMapTest, IntArrayTest,
> CategoryListParamsTest, FacetIndexingParamsTest, FacetRequestTest,
> TestSearcherTaxonomyManager]
> [junit4:junit4]   2> NOTE: download the large Jenkins line-docs file by
> running 'ant get-jenkins-line-docs' in the lucene directory.
> [junit4:junit4]   2> NOTE: reproduce with: ant test
>  -Dtestcase=TestSearcherTaxonomyManager -Dtests.seed=956580578007D779
> -Dtests.multiplier=2 -Dtests.nightly=true -Dtests.slow=true
> -Dtests.linedocsfile=/home/hudson/lucene-data/enwiki.random.lines.txt
> -Dtests.locale=vi_VN -Dtests.timezone=Africa/Nouakchott
> -Dtests.file.encoding=ISO8859-1
> [junit4:junit4] ERROR   0.00s J0 | TestSearcherTaxonomyManager (suite) <<<
> [junit4:junit4]    > Throwable #1: java.lang.Exception: Suite timeout
> exceeded (>= 7200000 msec).
> [junit4:junit4]    >    at
> __randomizedtesting.SeedInfo.seed([956580578007D779]:0)Throwable #2:
> com.carrotsearch.randomizedtesting.UncaughtExceptionError: Captured an
> uncaught exception in thread: Thread[id=390, name=Thread-97,
> state=RUNNABLE, group=TGRP-TestSearcherTaxonomyManager]
> [junit4:junit4]    > Caused by: java.lang.RuntimeException:
> java.lang.UnsupportedOperationException: this codec cannot write docvalues
> [junit4:junit4]    >    at
> __randomizedtesting.SeedInfo.seed([956580578007D779]:0)
> [junit4:junit4]    >    at
> org.apache.lucene.facet.search.TestSearcherTaxonomyManager$2.run(TestSearcherTaxonomyManager.java:117)
> [junit4:junit4]    > Caused by: java.lang.UnsupportedOperationException:
> this codec cannot write docvalues
> [junit4:junit4]    >    at
> org.apache.lucene.codecs.lucene3x.Lucene3xCodec$1.fieldsConsumer(Lucene3xCodec.java:73)
> [junit4:junit4]    >    at
> org.apache.lucene.index.DocValuesProcessor.flush(DocValuesProcessor.java:77)
> [junit4:junit4]    >    at
> org.apache.lucene.index.TwoStoredFieldsConsumers.flush(TwoStoredFieldsConsumers.java:42)
> [junit4:junit4]    >    at
> org.apache.lucene.index.DocFieldProcessor.flush(DocFieldProcessor.java:80)
> [junit4:junit4]    >    at
> org.apache.lucene.index.DocumentsWriterPerThread.flush(DocumentsWriterPerThread.java:493)
> [junit4:junit4]    >    at
> org.apache.lucene.index.DocumentsWriter.doFlush(DocumentsWriter.java:422)
> [junit4:junit4]    >    at
> org.apache.lucene.index.DocumentsWriter.flushAllThreads(DocumentsWriter.java:559)
> [junit4:junit4]    >    at
> org.apache.lucene.index.IndexWriter.getReader(IndexWriter.java:365)
> [junit4:junit4]    >    at
> org.apache.lucene.index.StandardDirectoryReader.doOpenFromWriter(StandardDirectoryReader.java:270)
> [junit4:junit4]    >    at
> org.apache.lucene.index.StandardDirectoryReader.doOpenIfChanged(StandardDirectoryReader.java:245)
> [junit4:junit4]    >    at
> org.apache.lucene.index.StandardDirectoryReader.doOpenIfChanged(StandardDirectoryReader.java:235)
> [junit4:junit4]    >    at
> org.apache.lucene.index.DirectoryReader.openIfChanged(DirectoryReader.java:170)
> [junit4:junit4]    >    at
> org.apache.lucene.facet.search.SearcherTaxonomyManager.refreshIfNeeded(SearcherTaxonomyManager.java:106)
> [junit4:junit4]    >    at
> org.apache.lucene.facet.search.SearcherTaxonomyManager.refreshIfNeeded(SearcherTaxonomyManager.java:42)
> [junit4:junit4]    >    at
> org.apache.lucene.search.ReferenceManager.doMaybeRefresh(ReferenceManager.java:155)
> [junit4:junit4]    >    at
> org.apache.lucene.search.ReferenceManager.maybeRefresh(ReferenceManager.java:204)
> [junit4:junit4]    >    at
> org.apache.lucene.facet.search.TestSearcherTaxonomyManager$2.run(TestSearcherTaxonomyManager.java:111)Throwable
> #3: com.carrotsearch.randomizedtesting.UncaughtExceptionError: Captured an
> uncaught exception in thread: Thread[id=389, name=Thread-96,
> state=RUNNABLE, group=TGRP-TestSearcherTaxonomyManager]
> [junit4:junit4]    > Caused by: java.lang.UnsupportedOperationException:
> this codec cannot write docvalues
> [junit4:junit4]    >    at
> __randomizedtesting.SeedInfo.seed([956580578007D779]:0)
> [junit4:junit4]    >    at
> org.apache.lucene.codecs.lucene3x.Lucene3xCodec$1.fieldsConsumer(Lucene3xCodec.java:73)
> [junit4:junit4]    >    at
> org.apache.lucene.index.DocValuesProcessor.flush(DocValuesProcessor.java:77)
> [junit4:junit4]    >    at
> org.apache.lucene.index.TwoStoredFieldsConsumers.flush(TwoStoredFieldsConsumers.java:42)
> [junit4:junit4]    >    at
> org.apache.lucene.index.DocFieldProcessor.flush(DocFieldProcessor.java:80)
> [junit4:junit4]    >    at
> org.apache.lucene.index.DocumentsWriterPerThread.flush(DocumentsWriterPerThread.java:493)
> [junit4:junit4]    >    at
> org.apache.lucene.index.DocumentsWriter.doFlush(DocumentsWriter.java:422)
> [junit4:junit4]    >    at
> org.apache.lucene.index.DocumentsWriter.postUpdate(DocumentsWriter.java:316)
> [junit4:junit4]    >    at
> org.apache.lucene.index.DocumentsWriter.updateDocument(DocumentsWriter.java:389)
> [junit4:junit4]    >    at
> org.apache.lucene.index.IndexWriter.updateDocument(IndexWriter.java:1481)
> [junit4:junit4]    >    at
> org.apache.lucene.index.IndexWriter.addDocument(IndexWriter.java:1156)
> [junit4:junit4]    >    at
> org.apache.lucene.index.IndexWriter.addDocument(IndexWriter.java:1137)
> [junit4:junit4]    >    at
> org.apache.lucene.facet.search.TestSearcherTaxonomyManager$1.run(TestSearcherTaxonomyManager.java:84)
> [junit4:junit4] Completed on J0 in 7223.29s, 2 tests, 4 errors <<<
> FAILURES!
>
> [...truncated 11 lines...]
> BUILD FAILED
> /usr/home/hudson/hudson-slave/workspace/Lucene-Solr-NightlyTests-4.x/build.xml:388:
> The following error occurred while executing this line:
> /usr/home/hudson/hudson-slave/workspace/Lucene-Solr-NightlyTests-4.x/build.xml:361:
> The following error occurred while executing this line:
> /usr/home/hudson/hudson-slave/workspace/Lucene-Solr-NightlyTests-4.x/build.xml:39:
> The following error occurred while executing this line:
> /usr/home/hudson/hudson-slave/workspace/Lucene-Solr-NightlyTests-4.x/lucene/build.xml:548:
> The following error occurred while executing this line:
> /usr/home/hudson/hudson-slave/workspace/Lucene-Solr-NightlyTests-4.x/lucene/common-build.xml:1778:
> The following error occurred while executing this line:
> /usr/home/hudson/hudson-slave/workspace/Lucene-Solr-NightlyTests-4.x/lucene/module-build.xml:61:
> The following error occurred while executing this line:
> /usr/home/hudson/hudson-slave/workspace/Lucene-Solr-NightlyTests-4.x/lucene/common-build.xml:1234:
> The following error occurred while executing this line:
> /usr/home/hudson/hudson-slave/workspace/Lucene-Solr-NightlyTests-4.x/lucene/common-build.xml:878:
> There were test failures: 52 suites, 221 tests, 3 suite-level errors, 1
> error
>
> Total time: 178 minutes 29 seconds
> Build step 'Invoke Ant' marked build as failure
> Archiving artifacts
> Recording test results
> Email was triggered for: Failure
> Sending email for trigger: Failure
>
>
>
>
> ---------------------------------------------------------------------
> To unsubscribe, e-mail: dev-unsubscribe@lucene.apache.org
> For additional commands, e-mail: dev-help@lucene.apache.org
>

Mime
View raw message