lucene-dev mailing list archives

Site index · List index
Message view « Date » · « Thread »
Top « Date » · « Thread »
From Robert Muir <rcm...@gmail.com>
Subject Re: [JENKINS] Lucene-Solr-4.x-Linux (32bit/jdk1.6.0_43) - Build # 5049 - Still Failing!
Date Wed, 10 Apr 2013 06:05:30 GMT
test bug: I committed a fix.

On Tue, Apr 9, 2013 at 10:02 PM, Policeman Jenkins Server <
jenkins@thetaphi.de> wrote:

> Build: http://jenkins.thetaphi.de/job/Lucene-Solr-4.x-Linux/5049/
> Java: 32bit/jdk1.6.0_43 -server -XX:+UseConcMarkSweepGC
>
> 2 tests failed.
> REGRESSION:
>  org.apache.lucene.index.sorter.TestEarlyTermination.testEarlyTermination
>
> Error Message:
> this codec cannot write docvalues
>
> Stack Trace:
> java.lang.UnsupportedOperationException: this codec cannot write docvalues
>         at
> org.apache.lucene.codecs.lucene3x.Lucene3xCodec$1.fieldsConsumer(Lucene3xCodec.java:73)
>         at
> org.apache.lucene.index.DocValuesProcessor.flush(DocValuesProcessor.java:77)
>         at
> org.apache.lucene.index.TwoStoredFieldsConsumers.flush(TwoStoredFieldsConsumers.java:42)
>         at
> org.apache.lucene.index.DocFieldProcessor.flush(DocFieldProcessor.java:80)
>         at
> org.apache.lucene.index.DocumentsWriterPerThread.flush(DocumentsWriterPerThread.java:493)
>         at
> org.apache.lucene.index.DocumentsWriter.doFlush(DocumentsWriter.java:422)
>         at
> org.apache.lucene.index.DocumentsWriter.flushAllThreads(DocumentsWriter.java:559)
>         at
> org.apache.lucene.index.IndexWriter.prepareCommitInternal(IndexWriter.java:2691)
>         at
> org.apache.lucene.index.IndexWriter.commitInternal(IndexWriter.java:2835)
>         at
> org.apache.lucene.index.IndexWriter.commit(IndexWriter.java:2815)
>         at
> org.apache.lucene.index.RandomIndexWriter.commit(RandomIndexWriter.java:239)
>         at
> org.apache.lucene.index.sorter.TestEarlyTermination.createRandomIndexes(TestEarlyTermination.java:89)
>         at
> org.apache.lucene.index.sorter.TestEarlyTermination.testEarlyTermination(TestEarlyTermination.java:108)
>         at sun.reflect.NativeMethodAccessorImpl.invoke0(Native Method)
>         at
> sun.reflect.NativeMethodAccessorImpl.invoke(NativeMethodAccessorImpl.java:39)
>         at
> sun.reflect.DelegatingMethodAccessorImpl.invoke(DelegatingMethodAccessorImpl.java:25)
>         at java.lang.reflect.Method.invoke(Method.java:597)
>         at
> com.carrotsearch.randomizedtesting.RandomizedRunner.invoke(RandomizedRunner.java:1559)
>         at
> com.carrotsearch.randomizedtesting.RandomizedRunner.access$600(RandomizedRunner.java:79)
>         at
> com.carrotsearch.randomizedtesting.RandomizedRunner$6.evaluate(RandomizedRunner.java:737)
>         at
> com.carrotsearch.randomizedtesting.RandomizedRunner$7.evaluate(RandomizedRunner.java:773)
>         at
> com.carrotsearch.randomizedtesting.RandomizedRunner$8.evaluate(RandomizedRunner.java:787)
>         at
> org.apache.lucene.util.TestRuleSetupTeardownChained$1.evaluate(TestRuleSetupTeardownChained.java:50)
>         at
> org.apache.lucene.util.TestRuleFieldCacheSanity$1.evaluate(TestRuleFieldCacheSanity.java:51)
>         at
> org.apache.lucene.util.AbstractBeforeAfterRule$1.evaluate(AbstractBeforeAfterRule.java:46)
>         at
> com.carrotsearch.randomizedtesting.rules.SystemPropertiesInvariantRule$1.evaluate(SystemPropertiesInvariantRule.java:55)
>         at
> org.apache.lucene.util.TestRuleThreadAndTestName$1.evaluate(TestRuleThreadAndTestName.java:49)
>         at
> org.apache.lucene.util.TestRuleIgnoreAfterMaxFailures$1.evaluate(TestRuleIgnoreAfterMaxFailures.java:70)
>         at
> org.apache.lucene.util.TestRuleMarkFailure$1.evaluate(TestRuleMarkFailure.java:48)
>         at
> com.carrotsearch.randomizedtesting.rules.StatementAdapter.evaluate(StatementAdapter.java:36)
>         at
> com.carrotsearch.randomizedtesting.ThreadLeakControl$StatementRunner.run(ThreadLeakControl.java:358)
>         at
> com.carrotsearch.randomizedtesting.ThreadLeakControl.forkTimeoutingTask(ThreadLeakControl.java:782)
>         at
> com.carrotsearch.randomizedtesting.ThreadLeakControl$3.evaluate(ThreadLeakControl.java:442)
>         at
> com.carrotsearch.randomizedtesting.RandomizedRunner.runSingleTest(RandomizedRunner.java:746)
>         at
> com.carrotsearch.randomizedtesting.RandomizedRunner$3.evaluate(RandomizedRunner.java:648)
>         at
> com.carrotsearch.randomizedtesting.RandomizedRunner$4.evaluate(RandomizedRunner.java:682)
>         at
> com.carrotsearch.randomizedtesting.RandomizedRunner$5.evaluate(RandomizedRunner.java:693)
>         at
> org.apache.lucene.util.AbstractBeforeAfterRule$1.evaluate(AbstractBeforeAfterRule.java:46)
>         at
> org.apache.lucene.util.TestRuleStoreClassName$1.evaluate(TestRuleStoreClassName.java:42)
>         at
> com.carrotsearch.randomizedtesting.rules.SystemPropertiesInvariantRule$1.evaluate(SystemPropertiesInvariantRule.java:55)
>         at
> com.carrotsearch.randomizedtesting.rules.NoShadowingOrOverridesOnMethodsRule$1.evaluate(NoShadowingOrOverridesOnMethodsRule.java:39)
>         at
> com.carrotsearch.randomizedtesting.rules.NoShadowingOrOverridesOnMethodsRule$1.evaluate(NoShadowingOrOverridesOnMethodsRule.java:39)
>         at
> com.carrotsearch.randomizedtesting.rules.StatementAdapter.evaluate(StatementAdapter.java:36)
>         at
> org.apache.lucene.util.TestRuleAssertionsRequired$1.evaluate(TestRuleAssertionsRequired.java:43)
>         at
> org.apache.lucene.util.TestRuleMarkFailure$1.evaluate(TestRuleMarkFailure.java:48)
>         at
> org.apache.lucene.util.TestRuleIgnoreAfterMaxFailures$1.evaluate(TestRuleIgnoreAfterMaxFailures.java:70)
>         at
> org.apache.lucene.util.TestRuleIgnoreTestSuites$1.evaluate(TestRuleIgnoreTestSuites.java:55)
>         at
> com.carrotsearch.randomizedtesting.rules.StatementAdapter.evaluate(StatementAdapter.java:36)
>         at
> com.carrotsearch.randomizedtesting.ThreadLeakControl$StatementRunner.run(ThreadLeakControl.java:358)
>         at java.lang.Thread.run(Thread.java:662)
>
>
> REGRESSION:
>  org.apache.lucene.index.sorter.TestEarlyTermination.testEarlyTerminationDifferentSorter
>
> Error Message:
> this codec cannot write docvalues
>
> Stack Trace:
> java.lang.UnsupportedOperationException: this codec cannot write docvalues
>         at
> org.apache.lucene.codecs.lucene3x.Lucene3xCodec$1.fieldsConsumer(Lucene3xCodec.java:73)
>         at
> org.apache.lucene.index.DocValuesProcessor.flush(DocValuesProcessor.java:77)
>         at
> org.apache.lucene.index.TwoStoredFieldsConsumers.flush(TwoStoredFieldsConsumers.java:42)
>         at
> org.apache.lucene.index.DocFieldProcessor.flush(DocFieldProcessor.java:80)
>         at
> org.apache.lucene.index.DocumentsWriterPerThread.flush(DocumentsWriterPerThread.java:493)
>         at
> org.apache.lucene.index.DocumentsWriter.doFlush(DocumentsWriter.java:422)
>         at
> org.apache.lucene.index.DocumentsWriter.flushAllThreads(DocumentsWriter.java:559)
>         at
> org.apache.lucene.index.IndexWriter.prepareCommitInternal(IndexWriter.java:2691)
>         at
> org.apache.lucene.index.IndexWriter.commitInternal(IndexWriter.java:2835)
>         at
> org.apache.lucene.index.IndexWriter.commit(IndexWriter.java:2815)
>         at
> org.apache.lucene.index.RandomIndexWriter.commit(RandomIndexWriter.java:239)
>         at
> org.apache.lucene.index.sorter.TestEarlyTermination.createRandomIndexes(TestEarlyTermination.java:89)
>         at
> org.apache.lucene.index.sorter.TestEarlyTermination.testEarlyTerminationDifferentSorter(TestEarlyTermination.java:132)
>         at sun.reflect.NativeMethodAccessorImpl.invoke0(Native Method)
>         at
> sun.reflect.NativeMethodAccessorImpl.invoke(NativeMethodAccessorImpl.java:39)
>         at
> sun.reflect.DelegatingMethodAccessorImpl.invoke(DelegatingMethodAccessorImpl.java:25)
>         at java.lang.reflect.Method.invoke(Method.java:597)
>         at
> com.carrotsearch.randomizedtesting.RandomizedRunner.invoke(RandomizedRunner.java:1559)
>         at
> com.carrotsearch.randomizedtesting.RandomizedRunner.access$600(RandomizedRunner.java:79)
>         at
> com.carrotsearch.randomizedtesting.RandomizedRunner$6.evaluate(RandomizedRunner.java:737)
>         at
> com.carrotsearch.randomizedtesting.RandomizedRunner$7.evaluate(RandomizedRunner.java:773)
>         at
> com.carrotsearch.randomizedtesting.RandomizedRunner$8.evaluate(RandomizedRunner.java:787)
>         at
> org.apache.lucene.util.TestRuleSetupTeardownChained$1.evaluate(TestRuleSetupTeardownChained.java:50)
>         at
> org.apache.lucene.util.TestRuleFieldCacheSanity$1.evaluate(TestRuleFieldCacheSanity.java:51)
>         at
> org.apache.lucene.util.AbstractBeforeAfterRule$1.evaluate(AbstractBeforeAfterRule.java:46)
>         at
> com.carrotsearch.randomizedtesting.rules.SystemPropertiesInvariantRule$1.evaluate(SystemPropertiesInvariantRule.java:55)
>         at
> org.apache.lucene.util.TestRuleThreadAndTestName$1.evaluate(TestRuleThreadAndTestName.java:49)
>         at
> org.apache.lucene.util.TestRuleIgnoreAfterMaxFailures$1.evaluate(TestRuleIgnoreAfterMaxFailures.java:70)
>         at
> org.apache.lucene.util.TestRuleMarkFailure$1.evaluate(TestRuleMarkFailure.java:48)
>         at
> com.carrotsearch.randomizedtesting.rules.StatementAdapter.evaluate(StatementAdapter.java:36)
>         at
> com.carrotsearch.randomizedtesting.ThreadLeakControl$StatementRunner.run(ThreadLeakControl.java:358)
>         at
> com.carrotsearch.randomizedtesting.ThreadLeakControl.forkTimeoutingTask(ThreadLeakControl.java:782)
>         at
> com.carrotsearch.randomizedtesting.ThreadLeakControl$3.evaluate(ThreadLeakControl.java:442)
>         at
> com.carrotsearch.randomizedtesting.RandomizedRunner.runSingleTest(RandomizedRunner.java:746)
>         at
> com.carrotsearch.randomizedtesting.RandomizedRunner$3.evaluate(RandomizedRunner.java:648)
>         at
> com.carrotsearch.randomizedtesting.RandomizedRunner$4.evaluate(RandomizedRunner.java:682)
>         at
> com.carrotsearch.randomizedtesting.RandomizedRunner$5.evaluate(RandomizedRunner.java:693)
>         at
> org.apache.lucene.util.AbstractBeforeAfterRule$1.evaluate(AbstractBeforeAfterRule.java:46)
>         at
> org.apache.lucene.util.TestRuleStoreClassName$1.evaluate(TestRuleStoreClassName.java:42)
>         at
> com.carrotsearch.randomizedtesting.rules.SystemPropertiesInvariantRule$1.evaluate(SystemPropertiesInvariantRule.java:55)
>         at
> com.carrotsearch.randomizedtesting.rules.NoShadowingOrOverridesOnMethodsRule$1.evaluate(NoShadowingOrOverridesOnMethodsRule.java:39)
>         at
> com.carrotsearch.randomizedtesting.rules.NoShadowingOrOverridesOnMethodsRule$1.evaluate(NoShadowingOrOverridesOnMethodsRule.java:39)
>         at
> com.carrotsearch.randomizedtesting.rules.StatementAdapter.evaluate(StatementAdapter.java:36)
>         at
> org.apache.lucene.util.TestRuleAssertionsRequired$1.evaluate(TestRuleAssertionsRequired.java:43)
>         at
> org.apache.lucene.util.TestRuleMarkFailure$1.evaluate(TestRuleMarkFailure.java:48)
>         at
> org.apache.lucene.util.TestRuleIgnoreAfterMaxFailures$1.evaluate(TestRuleIgnoreAfterMaxFailures.java:70)
>         at
> org.apache.lucene.util.TestRuleIgnoreTestSuites$1.evaluate(TestRuleIgnoreTestSuites.java:55)
>         at
> com.carrotsearch.randomizedtesting.rules.StatementAdapter.evaluate(StatementAdapter.java:36)
>         at
> com.carrotsearch.randomizedtesting.ThreadLeakControl$StatementRunner.run(ThreadLeakControl.java:358)
>         at java.lang.Thread.run(Thread.java:662)
>
>
>
>
> Build Log:
> [...truncated 6905 lines...]
> [junit4:junit4] Suite: org.apache.lucene.index.sorter.TestEarlyTermination
> [junit4:junit4]   2> NOTE: reproduce with: ant test
>  -Dtestcase=TestEarlyTermination -Dtests.method=testEarlyTermination
> -Dtests.seed=E1B77D354A004858 -Dtests.multiplier=3 -Dtests.slow=true
> -Dtests.locale=sv_SE -Dtests.timezone=Asia/Brunei
> -Dtests.file.encoding=UTF-8
> [junit4:junit4] ERROR   0.07s J1 |
> TestEarlyTermination.testEarlyTermination <<<
> [junit4:junit4]    > Throwable #1:
> java.lang.UnsupportedOperationException: this codec cannot write docvalues
> [junit4:junit4]    >    at
> org.apache.lucene.codecs.lucene3x.Lucene3xCodec$1.fieldsConsumer(Lucene3xCodec.java:73)
> [junit4:junit4]    >    at
> org.apache.lucene.index.DocValuesProcessor.flush(DocValuesProcessor.java:77)
> [junit4:junit4]    >    at
> org.apache.lucene.index.TwoStoredFieldsConsumers.flush(TwoStoredFieldsConsumers.java:42)
> [junit4:junit4]    >    at
> org.apache.lucene.index.DocFieldProcessor.flush(DocFieldProcessor.java:80)
> [junit4:junit4]    >    at
> org.apache.lucene.index.DocumentsWriterPerThread.flush(DocumentsWriterPerThread.java:493)
> [junit4:junit4]    >    at
> org.apache.lucene.index.DocumentsWriter.doFlush(DocumentsWriter.java:422)
> [junit4:junit4]    >    at
> org.apache.lucene.index.DocumentsWriter.flushAllThreads(DocumentsWriter.java:559)
> [junit4:junit4]    >    at
> org.apache.lucene.index.IndexWriter.prepareCommitInternal(IndexWriter.java:2691)
> [junit4:junit4]    >    at
> org.apache.lucene.index.IndexWriter.commitInternal(IndexWriter.java:2835)
> [junit4:junit4]    >    at
> org.apache.lucene.index.IndexWriter.commit(IndexWriter.java:2815)
> [junit4:junit4]    >    at
> org.apache.lucene.index.RandomIndexWriter.commit(RandomIndexWriter.java:239)
> [junit4:junit4]    >    at
> org.apache.lucene.index.sorter.TestEarlyTermination.createRandomIndexes(TestEarlyTermination.java:89)
> [junit4:junit4]    >    at
> org.apache.lucene.index.sorter.TestEarlyTermination.testEarlyTermination(TestEarlyTermination.java:108)
> [junit4:junit4]    >    at java.lang.Thread.run(Thread.java:662)Throwable
> #2: java.lang.NullPointerException
> [junit4:junit4]    >    at
> org.apache.lucene.index.sorter.TestEarlyTermination.tearDown(TestEarlyTermination.java:101)
> [junit4:junit4]    >    at java.lang.Thread.run(Thread.java:662)
> [junit4:junit4]   2> NOTE: reproduce with: ant test
>  -Dtestcase=TestEarlyTermination
> -Dtests.method=testEarlyTerminationDifferentSorter
> -Dtests.seed=E1B77D354A004858 -Dtests.multiplier=3 -Dtests.slow=true
> -Dtests.locale=sv_SE -Dtests.timezone=Asia/Brunei
> -Dtests.file.encoding=UTF-8
> [junit4:junit4] ERROR   0.02s J1 |
> TestEarlyTermination.testEarlyTerminationDifferentSorter <<<
> [junit4:junit4]    > Throwable #1:
> java.lang.UnsupportedOperationException: this codec cannot write docvalues
> [junit4:junit4]    >    at
> org.apache.lucene.codecs.lucene3x.Lucene3xCodec$1.fieldsConsumer(Lucene3xCodec.java:73)
> [junit4:junit4]    >    at
> org.apache.lucene.index.DocValuesProcessor.flush(DocValuesProcessor.java:77)
> [junit4:junit4]    >    at
> org.apache.lucene.index.TwoStoredFieldsConsumers.flush(TwoStoredFieldsConsumers.java:42)
> [junit4:junit4]    >    at
> org.apache.lucene.index.DocFieldProcessor.flush(DocFieldProcessor.java:80)
> [junit4:junit4]    >    at
> org.apache.lucene.index.DocumentsWriterPerThread.flush(DocumentsWriterPerThread.java:493)
> [junit4:junit4]    >    at
> org.apache.lucene.index.DocumentsWriter.doFlush(DocumentsWriter.java:422)
> [junit4:junit4]    >    at
> org.apache.lucene.index.DocumentsWriter.flushAllThreads(DocumentsWriter.java:559)
> [junit4:junit4]    >    at
> org.apache.lucene.index.IndexWriter.prepareCommitInternal(IndexWriter.java:2691)
> [junit4:junit4]    >    at
> org.apache.lucene.index.IndexWriter.commitInternal(IndexWriter.java:2835)
> [junit4:junit4]    >    at
> org.apache.lucene.index.IndexWriter.commit(IndexWriter.java:2815)
> [junit4:junit4]    >    at
> org.apache.lucene.index.RandomIndexWriter.commit(RandomIndexWriter.java:239)
> [junit4:junit4]    >    at
> org.apache.lucene.index.sorter.TestEarlyTermination.createRandomIndexes(TestEarlyTermination.java:89)
> [junit4:junit4]    >    at
> org.apache.lucene.index.sorter.TestEarlyTermination.testEarlyTerminationDifferentSorter(TestEarlyTermination.java:132)
> [junit4:junit4]    >    at java.lang.Thread.run(Thread.java:662)Throwable
> #2: java.lang.NullPointerException
> [junit4:junit4]    >    at
> org.apache.lucene.index.sorter.TestEarlyTermination.tearDown(TestEarlyTermination.java:101)
> [junit4:junit4]    >    at java.lang.Thread.run(Thread.java:662)
> [junit4:junit4]   2> NOTE: test params are: codec=Lucene3x,
> sim=RandomSimilarityProvider(queryNorm=true,coord=yes): {}, locale=sv_SE,
> timezone=Asia/Brunei
> [junit4:junit4]   2> NOTE: Linux 3.2.0-39-generic i386/Sun Microsystems
> Inc. 1.6.0_43 (32-bit)/cpus=8,threads=1,free=45627448,total=65470464
> [junit4:junit4]   2> NOTE: All tests run in this JVM:
> [TestPKIndexSplitter, TestEarlyTermination]
> [junit4:junit4] Completed on J1 in 0.12s, 2 tests, 2 errors <<< FAILURES!
>
> [...truncated 38 lines...]
> BUILD FAILED
> /mnt/ssd/jenkins/workspace/Lucene-Solr-4.x-Linux/build.xml:381: The
> following error occurred while executing this line:
> /mnt/ssd/jenkins/workspace/Lucene-Solr-4.x-Linux/build.xml:361: The
> following error occurred while executing this line:
> /mnt/ssd/jenkins/workspace/Lucene-Solr-4.x-Linux/build.xml:39: The
> following error occurred while executing this line:
> /mnt/ssd/jenkins/workspace/Lucene-Solr-4.x-Linux/lucene/build.xml:548: The
> following error occurred while executing this line:
> /mnt/ssd/jenkins/workspace/Lucene-Solr-4.x-Linux/lucene/common-build.xml:1778:
> The following error occurred while executing this line:
> /mnt/ssd/jenkins/workspace/Lucene-Solr-4.x-Linux/lucene/module-build.xml:61:
> The following error occurred while executing this line:
> /mnt/ssd/jenkins/workspace/Lucene-Solr-4.x-Linux/lucene/common-build.xml:1234:
> The following error occurred while executing this line:
> /mnt/ssd/jenkins/workspace/Lucene-Solr-4.x-Linux/lucene/common-build.xml:878:
> There were test failures: 11 suites, 41 tests, 2 errors
>
> Total time: 21 minutes 33 seconds
> Build step 'Invoke Ant' marked build as failure
> Archiving artifacts
> Recording test results
> Description set: Java: 32bit/jdk1.6.0_43 -server -XX:+UseConcMarkSweepGC
> Email was triggered for: Failure
> Sending email for trigger: Failure
>
>
>
>
> ---------------------------------------------------------------------
> To unsubscribe, e-mail: dev-unsubscribe@lucene.apache.org
> For additional commands, e-mail: dev-help@lucene.apache.org
>

Mime
View raw message