lucene-dev mailing list archives

Site index · List index
Message view « Date » · « Thread »
Top « Date » · « Thread »
From Policeman Jenkins Server <jenk...@thetaphi.de>
Subject [JENKINS] Lucene-Solr-4.x-Linux (32bit/ibm-j9-jdk6) - Build # 5334 - Failure!
Date Sun, 28 Apr 2013 15:19:03 GMT
Build: http://jenkins.thetaphi.de/job/Lucene-Solr-4.x-Linux/5334/
Java: 32bit/ibm-j9-jdk6 

1 tests failed.
REGRESSION:  org.apache.lucene.search.join.TestBlockJoinSorting.testNestedSorting

Error Message:
limit=2 actual=4

Stack Trace:
java.lang.AssertionError: limit=2 actual=4
	at __randomizedtesting.SeedInfo.seed([51EE345C29BF7C40:5907D91D6916712E]:0)
	at org.apache.lucene.index.RandomIndexWriter.doRandomForceMerge(RandomIndexWriter.java:293)
	at org.apache.lucene.index.RandomIndexWriter.close(RandomIndexWriter.java:336)
	at org.apache.lucene.search.join.TestBlockJoinSorting.testNestedSorting(TestBlockJoinSorting.java:212)
	at sun.reflect.NativeMethodAccessorImpl.invoke0(Native Method)
	at sun.reflect.NativeMethodAccessorImpl.invoke(NativeMethodAccessorImpl.java:60)
	at sun.reflect.DelegatingMethodAccessorImpl.invoke(DelegatingMethodAccessorImpl.java:37)
	at java.lang.reflect.Method.invoke(Method.java:611)
	at com.carrotsearch.randomizedtesting.RandomizedRunner.invoke(RandomizedRunner.java:1559)
	at com.carrotsearch.randomizedtesting.RandomizedRunner.access$600(RandomizedRunner.java:79)
	at com.carrotsearch.randomizedtesting.RandomizedRunner$6.evaluate(RandomizedRunner.java:737)
	at com.carrotsearch.randomizedtesting.RandomizedRunner$7.evaluate(RandomizedRunner.java:773)
	at com.carrotsearch.randomizedtesting.RandomizedRunner$8.evaluate(RandomizedRunner.java:787)
	at org.apache.lucene.util.TestRuleSetupTeardownChained$1.evaluate(TestRuleSetupTeardownChained.java:50)
	at org.apache.lucene.util.TestRuleFieldCacheSanity$1.evaluate(TestRuleFieldCacheSanity.java:51)
	at org.apache.lucene.util.AbstractBeforeAfterRule$1.evaluate(AbstractBeforeAfterRule.java:46)
	at com.carrotsearch.randomizedtesting.rules.SystemPropertiesInvariantRule$1.evaluate(SystemPropertiesInvariantRule.java:55)
	at org.apache.lucene.util.TestRuleThreadAndTestName$1.evaluate(TestRuleThreadAndTestName.java:49)
	at org.apache.lucene.util.TestRuleIgnoreAfterMaxFailures$1.evaluate(TestRuleIgnoreAfterMaxFailures.java:70)
	at org.apache.lucene.util.TestRuleMarkFailure$1.evaluate(TestRuleMarkFailure.java:48)
	at com.carrotsearch.randomizedtesting.rules.StatementAdapter.evaluate(StatementAdapter.java:36)
	at com.carrotsearch.randomizedtesting.ThreadLeakControl$StatementRunner.run(ThreadLeakControl.java:358)
	at com.carrotsearch.randomizedtesting.ThreadLeakControl.forkTimeoutingTask(ThreadLeakControl.java:782)
	at com.carrotsearch.randomizedtesting.ThreadLeakControl$3.evaluate(ThreadLeakControl.java:442)
	at com.carrotsearch.randomizedtesting.RandomizedRunner.runSingleTest(RandomizedRunner.java:746)
	at com.carrotsearch.randomizedtesting.RandomizedRunner$3.evaluate(RandomizedRunner.java:648)
	at com.carrotsearch.randomizedtesting.RandomizedRunner$4.evaluate(RandomizedRunner.java:682)
	at com.carrotsearch.randomizedtesting.RandomizedRunner$5.evaluate(RandomizedRunner.java:693)
	at org.apache.lucene.util.AbstractBeforeAfterRule$1.evaluate(AbstractBeforeAfterRule.java:46)
	at org.apache.lucene.util.TestRuleStoreClassName$1.evaluate(TestRuleStoreClassName.java:42)
	at com.carrotsearch.randomizedtesting.rules.SystemPropertiesInvariantRule$1.evaluate(SystemPropertiesInvariantRule.java:55)
	at com.carrotsearch.randomizedtesting.rules.NoShadowingOrOverridesOnMethodsRule$1.evaluate(NoShadowingOrOverridesOnMethodsRule.java:39)
	at com.carrotsearch.randomizedtesting.rules.NoShadowingOrOverridesOnMethodsRule$1.evaluate(NoShadowingOrOverridesOnMethodsRule.java:39)
	at com.carrotsearch.randomizedtesting.rules.StatementAdapter.evaluate(StatementAdapter.java:36)
	at org.apache.lucene.util.TestRuleAssertionsRequired$1.evaluate(TestRuleAssertionsRequired.java:43)
	at org.apache.lucene.util.TestRuleMarkFailure$1.evaluate(TestRuleMarkFailure.java:48)
	at org.apache.lucene.util.TestRuleIgnoreAfterMaxFailures$1.evaluate(TestRuleIgnoreAfterMaxFailures.java:70)
	at org.apache.lucene.util.TestRuleIgnoreTestSuites$1.evaluate(TestRuleIgnoreTestSuites.java:55)
	at com.carrotsearch.randomizedtesting.rules.StatementAdapter.evaluate(StatementAdapter.java:36)
	at com.carrotsearch.randomizedtesting.ThreadLeakControl$StatementRunner.run(ThreadLeakControl.java:358)
	at java.lang.Thread.run(Thread.java:738)




Build Log:
[...truncated 6696 lines...]
[junit4:junit4] Suite: org.apache.lucene.search.join.TestBlockJoinSorting
[junit4:junit4]   2> NOTE: reproduce with: ant test  -Dtestcase=TestBlockJoinSorting -Dtests.method=testNestedSorting
-Dtests.seed=51EE345C29BF7C40 -Dtests.multiplier=3 -Dtests.slow=true -Dtests.locale=mk_MK
-Dtests.timezone=Europe/Belfast -Dtests.file.encoding=UTF-8
[junit4:junit4] FAILURE 0.50s J0 | TestBlockJoinSorting.testNestedSorting <<<
[junit4:junit4]    > Throwable #1: java.lang.AssertionError: limit=2 actual=4
[junit4:junit4]    > 	at __randomizedtesting.SeedInfo.seed([51EE345C29BF7C40:5907D91D6916712E]:0)
[junit4:junit4]    > 	at org.apache.lucene.index.RandomIndexWriter.doRandomForceMerge(RandomIndexWriter.java:293)
[junit4:junit4]    > 	at org.apache.lucene.index.RandomIndexWriter.close(RandomIndexWriter.java:336)
[junit4:junit4]    > 	at org.apache.lucene.search.join.TestBlockJoinSorting.testNestedSorting(TestBlockJoinSorting.java:212)
[junit4:junit4]    > 	at java.lang.Thread.run(Thread.java:738)
[junit4:junit4]   2> NOTE: test params are: codec=Appending, sim=RandomSimilarityProvider(queryNorm=false,coord=no):
{}, locale=mk_MK, timezone=Europe/Belfast
[junit4:junit4]   2> NOTE: Linux 3.2.0-40-generic x86/IBM Corporation 1.6.0 (32-bit)/cpus=8,threads=1,free=3710224,total=12267008
[junit4:junit4]   2> NOTE: All tests run in this JVM: [TestBlockJoinSorting]
[junit4:junit4] Completed on J0 in 0.81s, 1 test, 1 failure <<< FAILURES!

[...truncated 16 lines...]
BUILD FAILED
/mnt/ssd/jenkins/workspace/Lucene-Solr-4.x-Linux/build.xml:384: The following error occurred
while executing this line:
/mnt/ssd/jenkins/workspace/Lucene-Solr-4.x-Linux/build.xml:377: The following error occurred
while executing this line:
/mnt/ssd/jenkins/workspace/Lucene-Solr-4.x-Linux/build.xml:39: The following error occurred
while executing this line:
/mnt/ssd/jenkins/workspace/Lucene-Solr-4.x-Linux/lucene/build.xml:548: The following error
occurred while executing this line:
/mnt/ssd/jenkins/workspace/Lucene-Solr-4.x-Linux/lucene/common-build.xml:1800: The following
error occurred while executing this line:
/mnt/ssd/jenkins/workspace/Lucene-Solr-4.x-Linux/lucene/module-build.xml:61: The following
error occurred while executing this line:
/mnt/ssd/jenkins/workspace/Lucene-Solr-4.x-Linux/lucene/common-build.xml:1243: The following
error occurred while executing this line:
/mnt/ssd/jenkins/workspace/Lucene-Solr-4.x-Linux/lucene/common-build.xml:887: There were test
failures: 3 suites, 15 tests, 1 failure

Total time: 20 minutes 15 seconds
Build step 'Invoke Ant' marked build as failure
Description set: Java: 32bit/ibm-j9-jdk6 
Archiving artifacts
Recording test results
Email was triggered for: Failure
Sending email for trigger: Failure



Mime
View raw message