lucene-dev mailing list archives

Site index · List index
Message view « Date » · « Thread »
Top « Date » · « Thread »
From Apache Jenkins Server <jenk...@builds.apache.org>
Subject [JENKINS] Lucene-Solr-Tests-trunk-java7 - Build # 3877 - Failure
Date Thu, 11 Apr 2013 18:37:26 GMT
Build: https://builds.apache.org/job/Lucene-Solr-Tests-trunk-java7/3877/

2 tests failed.
REGRESSION:  org.apache.lucene.search.TestBooleanOr.testBooleanScorerMax

Error Message:
Test abandoned because suite timeout was reached.

Stack Trace:
java.lang.Exception: Test abandoned because suite timeout was reached.
	at __randomizedtesting.SeedInfo.seed([FB4CB2F81A74301E]:0)


FAILED:  junit.framework.TestSuite.org.apache.lucene.search.TestBooleanOr

Error Message:
Suite timeout exceeded (>= 7200000 msec).

Stack Trace:
java.lang.Exception: Suite timeout exceeded (>= 7200000 msec).
	at __randomizedtesting.SeedInfo.seed([FB4CB2F81A74301E]:0)




Build Log:
[...truncated 1472 lines...]
[junit4:junit4] Suite: org.apache.lucene.search.TestBooleanOr
[junit4:junit4]   2> NOTE: reproduce with: ant test  -Dtestcase=TestBooleanOr -Dtests.method=testBooleanScorerMax
-Dtests.seed=FB4CB2F81A74301E -Dtests.multiplier=3 -Dtests.slow=true -Dtests.locale=sr_RS_#Latn
-Dtests.timezone=Europe/Amsterdam -Dtests.file.encoding=US-ASCII
[junit4:junit4] ERROR   7200s J0 | TestBooleanOr.testBooleanScorerMax <<<
[junit4:junit4]    > Throwable #1: java.lang.Exception: Test abandoned because suite timeout
was reached.
[junit4:junit4]    > 	at __randomizedtesting.SeedInfo.seed([FB4CB2F81A74301E]:0)
[junit4:junit4]   2> NOTE: test params are: codec=Asserting, sim=RandomSimilarityProvider(queryNorm=false,coord=crazy):
{field=DFR I(F)B1, T=DFR I(ne)B2, C=DFR GB2}, locale=sr_RS_#Latn, timezone=Europe/Amsterdam
[junit4:junit4]   2> NOTE: FreeBSD 9.0-RELEASE amd64/Oracle Corporation 1.7.0_17 (64-bit)/cpus=16,threads=2,free=322256320,total=505413632
[junit4:junit4]   2> NOTE: All tests run in this JVM: [TestSearchAfter, TestBlockPostingsFormat3,
TestAutomatonQuery, TestMockAnalyzer, MultiCollectorTest, Nested1, ThrowInUncaught, TestIndexWriterUnicode,
TestCompressingStoredFieldsFormat, TestSloppyPhraseQuery2, TestIdentityHashSet, TestStressNRT,
TestSumDocFreq, TestVersionComparator, TestTermVectorsReader, TestTermsEnum, TestDocCount,
TestExplanations, TestIndexWriter, TestBooleanQuery, TestPersistentSnapshotDeletionPolicy,
TestRollingUpdates, TestPerFieldPostingsFormat2, TestNumericRangeQuery32, TestFieldMaskingSpanQuery,
TestNearSpansOrdered, TestDateTools, TestDocsAndPositions, TestSegmentReader, TestNoDeletionPolicy,
TestNGramPhraseQuery, TestNRTManager, TestSmallFloat, TestWorstCaseTestBehavior, TestIndexWriterCommit,
TestNewestSegment, TestSpanExplanationsOfNonMatches, TestDocument, TestToken, TestTopDocsCollector,
TestForUtil, TestWeakIdentityMap, TestIntsRef, TestCollectionUtil, TestSimilarityBase, TestDocumentsWriterDeleteQueue,
TestPayloadTermQuery, TestDoc, TestSpanMultiTermQueryWrapper, TestConstantScoreQuery, TestFlushByRamOrCountsPolicy,
TestSpanSearchEquivalence, TestSimilarity2, TestIndexWriterConfig, TestPayloadsOnVectors,
TestSimilarityProvider, TestLazyProxSkipping, Test2BDocs, TestLucene42DocValuesFormat, TestDocumentsWriterStallControl,
Before3, Before3, TestSearch, TestFieldInfos, TestCustomNorms, TestLiveFieldValues, Test2BTerms,
TestIndexFileDeleter, TestPriorityQueue, TestBytesStore, TestTerm, TestSorterTemplate, TestDocIdSet,
TestIndexWriterMerging, TestUnicodeUtil, TestLucene40DocValuesFormat, TestPositionIncrement,
TestFilteredSearch, TestTwoPhaseCommitTool, TestOmitPositions, TestSubScorerFreqs, TestCompressingTermVectorsFormat,
TestFieldCacheRewriteMethod, TestMergeSchedulerExternal, TestCharTermAttributeImpl, TestSloppyPhraseQuery,
Test2BPositions, TestIndexWriterReader, TestLucene40TermVectorsFormat, TestFSTs, TestNumericRangeQuery64,
TestLookaheadTokenFilter, TestShardSearching, TestDeletionPolicy, TestBooleanOr]
[junit4:junit4]   2> NOTE: reproduce with: ant test  -Dtestcase=TestBooleanOr -Dtests.seed=FB4CB2F81A74301E
-Dtests.multiplier=3 -Dtests.slow=true -Dtests.locale=sr_RS_#Latn -Dtests.timezone=Europe/Amsterdam
-Dtests.file.encoding=US-ASCII
[junit4:junit4] ERROR   0.00s J0 | TestBooleanOr (suite) <<<
[junit4:junit4]    > Throwable #1: java.lang.Exception: Suite timeout exceeded (>= 7200000
msec).
[junit4:junit4]    > 	at __randomizedtesting.SeedInfo.seed([FB4CB2F81A74301E]:0)
[junit4:junit4] Completed on J0 in 7223.29s, 5 tests, 2 errors <<< FAILURES!

[...truncated 11 lines...]
BUILD FAILED
/usr/home/hudson/hudson-slave/workspace/Lucene-Solr-Tests-trunk-java7/build.xml:375: The following
error occurred while executing this line:
/usr/home/hudson/hudson-slave/workspace/Lucene-Solr-Tests-trunk-java7/build.xml:355: The following
error occurred while executing this line:
/usr/home/hudson/hudson-slave/workspace/Lucene-Solr-Tests-trunk-java7/build.xml:39: The following
error occurred while executing this line:
/usr/home/hudson/hudson-slave/workspace/Lucene-Solr-Tests-trunk-java7/lucene/build.xml:50:
The following error occurred while executing this line:
/usr/home/hudson/hudson-slave/workspace/Lucene-Solr-Tests-trunk-java7/lucene/common-build.xml:1231:
The following error occurred while executing this line:
/usr/home/hudson/hudson-slave/workspace/Lucene-Solr-Tests-trunk-java7/lucene/common-build.xml:875:
There were test failures: 351 suites, 2210 tests, 1 suite-level error, 1 error, 42 ignored
(30 assumptions)

Total time: 128 minutes 16 seconds
Build step 'Invoke Ant' marked build as failure
Archiving artifacts
Recording test results
Email was triggered for: Failure
Sending email for trigger: Failure



Mime
View raw message