lucene-dev mailing list archives

Site index · List index
Message view « Date » · « Thread »
Top « Date » · « Thread »
From Apache Jenkins Server <jenk...@builds.apache.org>
Subject [JENKINS] Lucene-Solr-NightlyTests-trunk - Build # 230 - Still Failing
Date Wed, 10 Apr 2013 12:05:39 GMT
Build: https://builds.apache.org/job/Lucene-Solr-NightlyTests-trunk/230/

1 tests failed.
FAILED:  org.apache.lucene.spatial.prefix.SpatialOpRecursivePrefixTreeTest.testWithin {#8
seed=[38E942697C48DBB6:DAD55B74070E99B]}

Error Message:
Didn't match org.apache.lucene.spatial.prefix.SpatialOpRecursivePrefixTreeTest$ShapePair@758e7898
in Rect(minX=120.0,maxX=254.0,minY=-98.0,maxY=118.0) Expect: [0] (of 1)

Stack Trace:
java.lang.AssertionError: Didn't match org.apache.lucene.spatial.prefix.SpatialOpRecursivePrefixTreeTest$ShapePair@758e7898
in Rect(minX=120.0,maxX=254.0,minY=-98.0,maxY=118.0) Expect: [0] (of 1)
	at __randomizedtesting.SeedInfo.seed([38E942697C48DBB6:DAD55B74070E99B]:0)
	at org.junit.Assert.fail(Assert.java:93)
	at org.apache.lucene.spatial.prefix.SpatialOpRecursivePrefixTreeTest.doTest(SpatialOpRecursivePrefixTreeTest.java:186)
	at org.apache.lucene.spatial.prefix.SpatialOpRecursivePrefixTreeTest.testWithin(SpatialOpRecursivePrefixTreeTest.java:83)
	at sun.reflect.NativeMethodAccessorImpl.invoke0(Native Method)
	at sun.reflect.NativeMethodAccessorImpl.invoke(NativeMethodAccessorImpl.java:57)
	at sun.reflect.DelegatingMethodAccessorImpl.invoke(DelegatingMethodAccessorImpl.java:43)
	at java.lang.reflect.Method.invoke(Method.java:601)
	at com.carrotsearch.randomizedtesting.RandomizedRunner.invoke(RandomizedRunner.java:1559)
	at com.carrotsearch.randomizedtesting.RandomizedRunner.access$600(RandomizedRunner.java:79)
	at com.carrotsearch.randomizedtesting.RandomizedRunner$6.evaluate(RandomizedRunner.java:737)
	at com.carrotsearch.randomizedtesting.RandomizedRunner$7.evaluate(RandomizedRunner.java:773)
	at com.carrotsearch.randomizedtesting.RandomizedRunner$8.evaluate(RandomizedRunner.java:787)
	at org.apache.lucene.util.TestRuleSetupTeardownChained$1.evaluate(TestRuleSetupTeardownChained.java:50)
	at org.apache.lucene.util.TestRuleFieldCacheSanity$1.evaluate(TestRuleFieldCacheSanity.java:51)
	at org.apache.lucene.util.AbstractBeforeAfterRule$1.evaluate(AbstractBeforeAfterRule.java:46)
	at com.carrotsearch.randomizedtesting.rules.SystemPropertiesInvariantRule$1.evaluate(SystemPropertiesInvariantRule.java:55)
	at org.apache.lucene.util.TestRuleThreadAndTestName$1.evaluate(TestRuleThreadAndTestName.java:49)
	at org.apache.lucene.util.TestRuleIgnoreAfterMaxFailures$1.evaluate(TestRuleIgnoreAfterMaxFailures.java:70)
	at org.apache.lucene.util.TestRuleMarkFailure$1.evaluate(TestRuleMarkFailure.java:48)
	at com.carrotsearch.randomizedtesting.rules.StatementAdapter.evaluate(StatementAdapter.java:36)
	at com.carrotsearch.randomizedtesting.ThreadLeakControl$StatementRunner.run(ThreadLeakControl.java:358)
	at com.carrotsearch.randomizedtesting.ThreadLeakControl.forkTimeoutingTask(ThreadLeakControl.java:782)
	at com.carrotsearch.randomizedtesting.ThreadLeakControl$3.evaluate(ThreadLeakControl.java:442)
	at com.carrotsearch.randomizedtesting.RandomizedRunner.runSingleTest(RandomizedRunner.java:746)
	at com.carrotsearch.randomizedtesting.RandomizedRunner$3.evaluate(RandomizedRunner.java:648)
	at com.carrotsearch.randomizedtesting.RandomizedRunner$4.evaluate(RandomizedRunner.java:682)
	at com.carrotsearch.randomizedtesting.RandomizedRunner$5.evaluate(RandomizedRunner.java:693)
	at org.apache.lucene.util.AbstractBeforeAfterRule$1.evaluate(AbstractBeforeAfterRule.java:46)
	at org.apache.lucene.util.TestRuleStoreClassName$1.evaluate(TestRuleStoreClassName.java:42)
	at com.carrotsearch.randomizedtesting.rules.SystemPropertiesInvariantRule$1.evaluate(SystemPropertiesInvariantRule.java:55)
	at com.carrotsearch.randomizedtesting.rules.NoShadowingOrOverridesOnMethodsRule$1.evaluate(NoShadowingOrOverridesOnMethodsRule.java:39)
	at com.carrotsearch.randomizedtesting.rules.NoShadowingOrOverridesOnMethodsRule$1.evaluate(NoShadowingOrOverridesOnMethodsRule.java:39)
	at com.carrotsearch.randomizedtesting.rules.StatementAdapter.evaluate(StatementAdapter.java:36)
	at org.apache.lucene.util.TestRuleAssertionsRequired$1.evaluate(TestRuleAssertionsRequired.java:43)
	at org.apache.lucene.util.TestRuleMarkFailure$1.evaluate(TestRuleMarkFailure.java:48)
	at org.apache.lucene.util.TestRuleIgnoreAfterMaxFailures$1.evaluate(TestRuleIgnoreAfterMaxFailures.java:70)
	at org.apache.lucene.util.TestRuleIgnoreTestSuites$1.evaluate(TestRuleIgnoreTestSuites.java:55)
	at com.carrotsearch.randomizedtesting.rules.StatementAdapter.evaluate(StatementAdapter.java:36)
	at com.carrotsearch.randomizedtesting.ThreadLeakControl$StatementRunner.run(ThreadLeakControl.java:358)
	at java.lang.Thread.run(Thread.java:722)




Build Log:
[...truncated 8040 lines...]
[junit4:junit4] Suite: org.apache.lucene.spatial.prefix.SpatialOpRecursivePrefixTreeTest
[junit4:junit4]   1> Strategy: RecursivePrefixTreeStrategy(prefixGridScanLevel:1,SPG:(QuadPrefixTree(maxLevels:5,ctx:SpatialContext{geo=false,
calculator=CartesianDistCalc, worldBounds=Rect(minX=0.0,maxX=256.0,minY=-128.0,maxY=128.0)})))
[junit4:junit4]   1> Strategy: RecursivePrefixTreeStrategy(prefixGridScanLevel:4,SPG:(QuadPrefixTree(maxLevels:8,ctx:SpatialContext{geo=false,
calculator=CartesianDistCalc, worldBounds=Rect(minX=0.0,maxX=256.0,minY=-128.0,maxY=128.0)})))
[junit4:junit4]   1> Strategy: RecursivePrefixTreeStrategy(prefixGridScanLevel:1,SPG:(QuadPrefixTree(maxLevels:5,ctx:SpatialContext{geo=false,
calculator=CartesianDistCalc, worldBounds=Rect(minX=0.0,maxX=256.0,minY=-128.0,maxY=128.0)})))
[junit4:junit4]   1> Strategy: RecursivePrefixTreeStrategy(prefixGridScanLevel:0,SPG:(QuadPrefixTree(maxLevels:4,ctx:SpatialContext{geo=false,
calculator=CartesianDistCalc, worldBounds=Rect(minX=0.0,maxX=256.0,minY=-128.0,maxY=128.0)})))
[junit4:junit4]   1> Strategy: RecursivePrefixTreeStrategy(prefixGridScanLevel:-1,SPG:(QuadPrefixTree(maxLevels:3,ctx:SpatialContext{geo=false,
calculator=CartesianDistCalc, worldBounds=Rect(minX=0.0,maxX=256.0,minY=-128.0,maxY=128.0)})))
[junit4:junit4]   1> Strategy: RecursivePrefixTreeStrategy(prefixGridScanLevel:-3,SPG:(QuadPrefixTree(maxLevels:1,ctx:SpatialContext{geo=false,
calculator=CartesianDistCalc, worldBounds=Rect(minX=0.0,maxX=256.0,minY=-128.0,maxY=128.0)})))
[junit4:junit4]   1> Strategy: RecursivePrefixTreeStrategy(prefixGridScanLevel:0,SPG:(QuadPrefixTree(maxLevels:4,ctx:SpatialContext{geo=false,
calculator=CartesianDistCalc, worldBounds=Rect(minX=0.0,maxX=256.0,minY=-128.0,maxY=128.0)})))
[junit4:junit4]   1> Strategy: RecursivePrefixTreeStrategy(prefixGridScanLevel:2,SPG:(QuadPrefixTree(maxLevels:6,ctx:SpatialContext{geo=false,
calculator=CartesianDistCalc, worldBounds=Rect(minX=0.0,maxX=256.0,minY=-128.0,maxY=128.0)})))
[junit4:junit4]   1> Strategy: RecursivePrefixTreeStrategy(prefixGridScanLevel:1,SPG:(QuadPrefixTree(maxLevels:5,ctx:SpatialContext{geo=false,
calculator=CartesianDistCalc, worldBounds=Rect(minX=0.0,maxX=256.0,minY=-128.0,maxY=128.0)})))
[junit4:junit4]   1> Strategy: RecursivePrefixTreeStrategy(prefixGridScanLevel:-2,SPG:(QuadPrefixTree(maxLevels:2,ctx:SpatialContext{geo=false,
calculator=CartesianDistCalc, worldBounds=Rect(minX=0.0,maxX=256.0,minY=-128.0,maxY=128.0)})))
[junit4:junit4]   1> Strategy: RecursivePrefixTreeStrategy(prefixGridScanLevel:-2,SPG:(QuadPrefixTree(maxLevels:2,ctx:SpatialContext{geo=false,
calculator=CartesianDistCalc, worldBounds=Rect(minX=0.0,maxX=256.0,minY=-128.0,maxY=128.0)})))
[junit4:junit4]   1> Strategy: RecursivePrefixTreeStrategy(prefixGridScanLevel:3,SPG:(QuadPrefixTree(maxLevels:7,ctx:SpatialContext{geo=false,
calculator=CartesianDistCalc, worldBounds=Rect(minX=0.0,maxX=256.0,minY=-128.0,maxY=128.0)})))
[junit4:junit4]   1> Strategy: RecursivePrefixTreeStrategy(prefixGridScanLevel:-1,SPG:(QuadPrefixTree(maxLevels:3,ctx:SpatialContext{geo=false,
calculator=CartesianDistCalc, worldBounds=Rect(minX=0.0,maxX=256.0,minY=-128.0,maxY=128.0)})))
[junit4:junit4]   1> Strategy: RecursivePrefixTreeStrategy(prefixGridScanLevel:-1,SPG:(QuadPrefixTree(maxLevels:3,ctx:SpatialContext{geo=false,
calculator=CartesianDistCalc, worldBounds=Rect(minX=0.0,maxX=256.0,minY=-128.0,maxY=128.0)})))
[junit4:junit4]   1> Strategy: RecursivePrefixTreeStrategy(prefixGridScanLevel:4,SPG:(QuadPrefixTree(maxLevels:8,ctx:SpatialContext{geo=false,
calculator=CartesianDistCalc, worldBounds=Rect(minX=0.0,maxX=256.0,minY=-128.0,maxY=128.0)})))
[junit4:junit4]   1> Strategy: RecursivePrefixTreeStrategy(prefixGridScanLevel:3,SPG:(QuadPrefixTree(maxLevels:7,ctx:SpatialContext{geo=false,
calculator=CartesianDistCalc, worldBounds=Rect(minX=0.0,maxX=256.0,minY=-128.0,maxY=128.0)})))
[junit4:junit4]   1> Strategy: RecursivePrefixTreeStrategy(prefixGridScanLevel:0,SPG:(QuadPrefixTree(maxLevels:4,ctx:SpatialContext{geo=false,
calculator=CartesianDistCalc, worldBounds=Rect(minX=0.0,maxX=256.0,minY=-128.0,maxY=128.0)})))
[junit4:junit4]   1> Strategy: RecursivePrefixTreeStrategy(prefixGridScanLevel:1,SPG:(QuadPrefixTree(maxLevels:5,ctx:SpatialContext{geo=false,
calculator=CartesianDistCalc, worldBounds=Rect(minX=0.0,maxX=256.0,minY=-128.0,maxY=128.0)})))
[junit4:junit4]   1> Strategy: RecursivePrefixTreeStrategy(prefixGridScanLevel:-1,SPG:(QuadPrefixTree(maxLevels:3,ctx:SpatialContext{geo=false,
calculator=CartesianDistCalc, worldBounds=Rect(minX=0.0,maxX=256.0,minY=-128.0,maxY=128.0)})))
[junit4:junit4]   1> Strategy: RecursivePrefixTreeStrategy(prefixGridScanLevel:0,SPG:(QuadPrefixTree(maxLevels:4,ctx:SpatialContext{geo=false,
calculator=CartesianDistCalc, worldBounds=Rect(minX=0.0,maxX=256.0,minY=-128.0,maxY=128.0)})))
[junit4:junit4]   1> Strategy: RecursivePrefixTreeStrategy(prefixGridScanLevel:3,SPG:(QuadPrefixTree(maxLevels:7,ctx:SpatialContext{geo=false,
calculator=CartesianDistCalc, worldBounds=Rect(minX=0.0,maxX=256.0,minY=-128.0,maxY=128.0)})))
[junit4:junit4]   2> NOTE: download the large Jenkins line-docs file by running 'ant get-jenkins-line-docs'
in the lucene directory.
[junit4:junit4]   2> NOTE: reproduce with: ant test  -Dtestcase=SpatialOpRecursivePrefixTreeTest
-Dtests.method="testWithin {#8 seed=[38E942697C48DBB6:DAD55B74070E99B]}" -Dtests.seed=38E942697C48DBB6
-Dtests.multiplier=2 -Dtests.nightly=true -Dtests.slow=true -Dtests.linedocsfile=/home/hudson/lucene-data/enwiki.random.lines.txt
-Dtests.locale=th -Dtests.timezone=America/Kralendijk -Dtests.file.encoding=ISO-8859-1
[junit4:junit4] FAILURE 0.13s J1 | SpatialOpRecursivePrefixTreeTest.testWithin {#8 seed=[38E942697C48DBB6:DAD55B74070E99B]}
<<<
[junit4:junit4]    > Throwable #1: java.lang.AssertionError: Didn't match org.apache.lucene.spatial.prefix.SpatialOpRecursivePrefixTreeTest$ShapePair@758e7898
in Rect(minX=120.0,maxX=254.0,minY=-98.0,maxY=118.0) Expect: [0] (of 1)
[junit4:junit4]    > 	at __randomizedtesting.SeedInfo.seed([38E942697C48DBB6:DAD55B74070E99B]:0)
[junit4:junit4]    > 	at org.apache.lucene.spatial.prefix.SpatialOpRecursivePrefixTreeTest.doTest(SpatialOpRecursivePrefixTreeTest.java:186)
[junit4:junit4]    > 	at org.apache.lucene.spatial.prefix.SpatialOpRecursivePrefixTreeTest.testWithin(SpatialOpRecursivePrefixTreeTest.java:83)
[junit4:junit4]    > 	at java.lang.Thread.run(Thread.java:722)
[junit4:junit4]   1> Strategy: RecursivePrefixTreeStrategy(prefixGridScanLevel:3,SPG:(QuadPrefixTree(maxLevels:7,ctx:SpatialContext{geo=false,
calculator=CartesianDistCalc, worldBounds=Rect(minX=0.0,maxX=256.0,minY=-128.0,maxY=128.0)})))
[junit4:junit4]   1> Strategy: RecursivePrefixTreeStrategy(prefixGridScanLevel:-2,SPG:(QuadPrefixTree(maxLevels:2,ctx:SpatialContext{geo=false,
calculator=CartesianDistCalc, worldBounds=Rect(minX=0.0,maxX=256.0,minY=-128.0,maxY=128.0)})))
[junit4:junit4]   1> Strategy: RecursivePrefixTreeStrategy(prefixGridScanLevel:-1,SPG:(QuadPrefixTree(maxLevels:3,ctx:SpatialContext{geo=false,
calculator=CartesianDistCalc, worldBounds=Rect(minX=0.0,maxX=256.0,minY=-128.0,maxY=128.0)})))
[junit4:junit4]   1> Strategy: RecursivePrefixTreeStrategy(prefixGridScanLevel:4,SPG:(QuadPrefixTree(maxLevels:8,ctx:SpatialContext{geo=false,
calculator=CartesianDistCalc, worldBounds=Rect(minX=0.0,maxX=256.0,minY=-128.0,maxY=128.0)})))
[junit4:junit4]   1> Strategy: RecursivePrefixTreeStrategy(prefixGridScanLevel:2,SPG:(QuadPrefixTree(maxLevels:6,ctx:SpatialContext{geo=false,
calculator=CartesianDistCalc, worldBounds=Rect(minX=0.0,maxX=256.0,minY=-128.0,maxY=128.0)})))
[junit4:junit4]   1> Strategy: RecursivePrefixTreeStrategy(prefixGridScanLevel:-2,SPG:(QuadPrefixTree(maxLevels:2,ctx:SpatialContext{geo=false,
calculator=CartesianDistCalc, worldBounds=Rect(minX=0.0,maxX=256.0,minY=-128.0,maxY=128.0)})))
[junit4:junit4]   1> Strategy: RecursivePrefixTreeStrategy(prefixGridScanLevel:0,SPG:(QuadPrefixTree(maxLevels:4,ctx:SpatialContext{geo=false,
calculator=CartesianDistCalc, worldBounds=Rect(minX=0.0,maxX=256.0,minY=-128.0,maxY=128.0)})))
[junit4:junit4]   1> Strategy: RecursivePrefixTreeStrategy(prefixGridScanLevel:1,SPG:(QuadPrefixTree(maxLevels:5,ctx:SpatialContext{geo=false,
calculator=CartesianDistCalc, worldBounds=Rect(minX=0.0,maxX=256.0,minY=-128.0,maxY=128.0)})))
[junit4:junit4]   1> Strategy: RecursivePrefixTreeStrategy(prefixGridScanLevel:3,SPG:(QuadPrefixTree(maxLevels:7,ctx:SpatialContext{geo=false,
calculator=CartesianDistCalc, worldBounds=Rect(minX=0.0,maxX=256.0,minY=-128.0,maxY=128.0)})))
[junit4:junit4]   1> Strategy: RecursivePrefixTreeStrategy(prefixGridScanLevel:1,SPG:(QuadPrefixTree(maxLevels:5,ctx:SpatialContext{geo=false,
calculator=CartesianDistCalc, worldBounds=Rect(minX=0.0,maxX=256.0,minY=-128.0,maxY=128.0)})))
[junit4:junit4]   1> Strategy: RecursivePrefixTreeStrategy(prefixGridScanLevel:3,SPG:(QuadPrefixTree(maxLevels:7,ctx:SpatialContext{geo=false,
calculator=CartesianDistCalc, worldBounds=Rect(minX=0.0,maxX=256.0,minY=-128.0,maxY=128.0)})))
[junit4:junit4]   2> NOTE: test params are: codec=Lucene41, sim=DefaultSimilarity, locale=th,
timezone=America/Kralendijk
[junit4:junit4]   2> NOTE: FreeBSD 9.0-RELEASE amd64/Oracle Corporation 1.7.0_17 (64-bit)/cpus=16,threads=1,free=232847488,total=256573440
[junit4:junit4]   2> NOTE: All tests run in this JVM: [TestTermQueryPrefixGridStrategy,
DistanceStrategyTest, TestBBoxStrategy, SpatialOpRecursivePrefixTreeTest]
[junit4:junit4] Completed on J1 in 3.42s, 32 tests, 1 failure <<< FAILURES!

[...truncated 26 lines...]
BUILD FAILED
/usr/home/hudson/hudson-slave/workspace/Lucene-Solr-NightlyTests-trunk/build.xml:382: The
following error occurred while executing this line:
/usr/home/hudson/hudson-slave/workspace/Lucene-Solr-NightlyTests-trunk/build.xml:355: The
following error occurred while executing this line:
/usr/home/hudson/hudson-slave/workspace/Lucene-Solr-NightlyTests-trunk/build.xml:39: The following
error occurred while executing this line:
/usr/home/hudson/hudson-slave/workspace/Lucene-Solr-NightlyTests-trunk/lucene/build.xml:548:
The following error occurred while executing this line:
/usr/home/hudson/hudson-slave/workspace/Lucene-Solr-NightlyTests-trunk/lucene/common-build.xml:1776:
The following error occurred while executing this line:
/usr/home/hudson/hudson-slave/workspace/Lucene-Solr-NightlyTests-trunk/lucene/module-build.xml:61:
The following error occurred while executing this line:
/usr/home/hudson/hudson-slave/workspace/Lucene-Solr-NightlyTests-trunk/lucene/common-build.xml:1231:
The following error occurred while executing this line:
/usr/home/hudson/hudson-slave/workspace/Lucene-Solr-NightlyTests-trunk/lucene/common-build.xml:875:
There were test failures: 13 suites, 64 tests, 1 failure, 2 ignored (2 assumptions)

Total time: 55 minutes 41 seconds
Build step 'Invoke Ant' marked build as failure
Archiving artifacts
Recording test results
Email was triggered for: Failure
Sending email for trigger: Failure



Mime
View raw message