lucene-dev mailing list archives

Site index · List index
Message view « Date » · « Thread »
Top « Date » · « Thread »
From Apache Jenkins Server <jenk...@builds.apache.org>
Subject [JENKINS] Lucene-Solr-Tests-4.x-java7 - Build # 1137 - Still Failing
Date Thu, 11 Apr 2013 16:28:47 GMT
Build: https://builds.apache.org/job/Lucene-Solr-Tests-4.x-java7/1137/

1 tests failed.
REGRESSION:  org.apache.lucene.index.TestIndexWriterOutOfFileDescriptors.test

Error Message:
this codec cannot write docvalues

Stack Trace:
java.lang.UnsupportedOperationException: this codec cannot write docvalues
	at __randomizedtesting.SeedInfo.seed([35D4240F66422C09:BD801BD5C8BE41F1]:0)
	at org.apache.lucene.codecs.lucene3x.Lucene3xCodec$1.fieldsConsumer(Lucene3xCodec.java:73)
	at org.apache.lucene.index.DocValuesProcessor.flush(DocValuesProcessor.java:77)
	at org.apache.lucene.index.TwoStoredFieldsConsumers.flush(TwoStoredFieldsConsumers.java:42)
	at org.apache.lucene.index.DocFieldProcessor.flush(DocFieldProcessor.java:80)
	at org.apache.lucene.index.DocumentsWriterPerThread.flush(DocumentsWriterPerThread.java:493)
	at org.apache.lucene.index.DocumentsWriter.doFlush(DocumentsWriter.java:422)
	at org.apache.lucene.index.DocumentsWriter.flushAllThreads(DocumentsWriter.java:559)
	at org.apache.lucene.index.IndexWriter.doFlush(IndexWriter.java:2930)
	at org.apache.lucene.index.IndexWriter.flush(IndexWriter.java:2906)
	at org.apache.lucene.index.IndexWriter.closeInternal(IndexWriter.java:940)
	at org.apache.lucene.index.IndexWriter.close(IndexWriter.java:895)
	at org.apache.lucene.index.IndexWriter.close(IndexWriter.java:857)
	at org.apache.lucene.index.TestIndexWriterOutOfFileDescriptors.test(TestIndexWriterOutOfFileDescriptors.java:84)
	at sun.reflect.NativeMethodAccessorImpl.invoke0(Native Method)
	at sun.reflect.NativeMethodAccessorImpl.invoke(NativeMethodAccessorImpl.java:57)
	at sun.reflect.DelegatingMethodAccessorImpl.invoke(DelegatingMethodAccessorImpl.java:43)
	at java.lang.reflect.Method.invoke(Method.java:601)
	at com.carrotsearch.randomizedtesting.RandomizedRunner.invoke(RandomizedRunner.java:1559)
	at com.carrotsearch.randomizedtesting.RandomizedRunner.access$600(RandomizedRunner.java:79)
	at com.carrotsearch.randomizedtesting.RandomizedRunner$6.evaluate(RandomizedRunner.java:737)
	at com.carrotsearch.randomizedtesting.RandomizedRunner$7.evaluate(RandomizedRunner.java:773)
	at com.carrotsearch.randomizedtesting.RandomizedRunner$8.evaluate(RandomizedRunner.java:787)
	at org.apache.lucene.util.TestRuleSetupTeardownChained$1.evaluate(TestRuleSetupTeardownChained.java:50)
	at org.apache.lucene.util.TestRuleFieldCacheSanity$1.evaluate(TestRuleFieldCacheSanity.java:51)
	at org.apache.lucene.util.AbstractBeforeAfterRule$1.evaluate(AbstractBeforeAfterRule.java:46)
	at com.carrotsearch.randomizedtesting.rules.SystemPropertiesInvariantRule$1.evaluate(SystemPropertiesInvariantRule.java:55)
	at org.apache.lucene.util.TestRuleThreadAndTestName$1.evaluate(TestRuleThreadAndTestName.java:49)
	at org.apache.lucene.util.TestRuleIgnoreAfterMaxFailures$1.evaluate(TestRuleIgnoreAfterMaxFailures.java:70)
	at org.apache.lucene.util.TestRuleMarkFailure$1.evaluate(TestRuleMarkFailure.java:48)
	at com.carrotsearch.randomizedtesting.rules.StatementAdapter.evaluate(StatementAdapter.java:36)
	at com.carrotsearch.randomizedtesting.ThreadLeakControl$StatementRunner.run(ThreadLeakControl.java:358)
	at com.carrotsearch.randomizedtesting.ThreadLeakControl.forkTimeoutingTask(ThreadLeakControl.java:782)
	at com.carrotsearch.randomizedtesting.ThreadLeakControl$3.evaluate(ThreadLeakControl.java:442)
	at com.carrotsearch.randomizedtesting.RandomizedRunner.runSingleTest(RandomizedRunner.java:746)
	at com.carrotsearch.randomizedtesting.RandomizedRunner$3.evaluate(RandomizedRunner.java:648)
	at com.carrotsearch.randomizedtesting.RandomizedRunner$4.evaluate(RandomizedRunner.java:682)
	at com.carrotsearch.randomizedtesting.RandomizedRunner$5.evaluate(RandomizedRunner.java:693)
	at org.apache.lucene.util.AbstractBeforeAfterRule$1.evaluate(AbstractBeforeAfterRule.java:46)
	at org.apache.lucene.util.TestRuleStoreClassName$1.evaluate(TestRuleStoreClassName.java:42)
	at com.carrotsearch.randomizedtesting.rules.SystemPropertiesInvariantRule$1.evaluate(SystemPropertiesInvariantRule.java:55)
	at com.carrotsearch.randomizedtesting.rules.NoShadowingOrOverridesOnMethodsRule$1.evaluate(NoShadowingOrOverridesOnMethodsRule.java:39)
	at com.carrotsearch.randomizedtesting.rules.NoShadowingOrOverridesOnMethodsRule$1.evaluate(NoShadowingOrOverridesOnMethodsRule.java:39)
	at com.carrotsearch.randomizedtesting.rules.StatementAdapter.evaluate(StatementAdapter.java:36)
	at org.apache.lucene.util.TestRuleAssertionsRequired$1.evaluate(TestRuleAssertionsRequired.java:43)
	at org.apache.lucene.util.TestRuleMarkFailure$1.evaluate(TestRuleMarkFailure.java:48)
	at org.apache.lucene.util.TestRuleIgnoreAfterMaxFailures$1.evaluate(TestRuleIgnoreAfterMaxFailures.java:70)
	at org.apache.lucene.util.TestRuleIgnoreTestSuites$1.evaluate(TestRuleIgnoreTestSuites.java:55)
	at com.carrotsearch.randomizedtesting.rules.StatementAdapter.evaluate(StatementAdapter.java:36)
	at com.carrotsearch.randomizedtesting.ThreadLeakControl$StatementRunner.run(ThreadLeakControl.java:358)
	at java.lang.Thread.run(Thread.java:722)




Build Log:
[...truncated 389 lines...]
[junit4:junit4] Suite: org.apache.lucene.index.TestIndexWriterOutOfFileDescriptors
[junit4:junit4]   2> NOTE: reproduce with: ant test  -Dtestcase=TestIndexWriterOutOfFileDescriptors
-Dtests.method=test -Dtests.seed=35D4240F66422C09 -Dtests.multiplier=3 -Dtests.slow=true -Dtests.locale=in
-Dtests.timezone=Pacific/Port_Moresby -Dtests.file.encoding=UTF-8
[junit4:junit4] ERROR   0.14s J1 | TestIndexWriterOutOfFileDescriptors.test <<<
[junit4:junit4]    > Throwable #1: java.lang.UnsupportedOperationException: this codec
cannot write docvalues
[junit4:junit4]    > 	at __randomizedtesting.SeedInfo.seed([35D4240F66422C09:BD801BD5C8BE41F1]:0)
[junit4:junit4]    > 	at org.apache.lucene.codecs.lucene3x.Lucene3xCodec$1.fieldsConsumer(Lucene3xCodec.java:73)
[junit4:junit4]    > 	at org.apache.lucene.index.DocValuesProcessor.flush(DocValuesProcessor.java:77)
[junit4:junit4]    > 	at org.apache.lucene.index.TwoStoredFieldsConsumers.flush(TwoStoredFieldsConsumers.java:42)
[junit4:junit4]    > 	at org.apache.lucene.index.DocFieldProcessor.flush(DocFieldProcessor.java:80)
[junit4:junit4]    > 	at org.apache.lucene.index.DocumentsWriterPerThread.flush(DocumentsWriterPerThread.java:493)
[junit4:junit4]    > 	at org.apache.lucene.index.DocumentsWriter.doFlush(DocumentsWriter.java:422)
[junit4:junit4]    > 	at org.apache.lucene.index.DocumentsWriter.flushAllThreads(DocumentsWriter.java:559)
[junit4:junit4]    > 	at org.apache.lucene.index.IndexWriter.doFlush(IndexWriter.java:2930)
[junit4:junit4]    > 	at org.apache.lucene.index.IndexWriter.flush(IndexWriter.java:2906)
[junit4:junit4]    > 	at org.apache.lucene.index.IndexWriter.closeInternal(IndexWriter.java:940)
[junit4:junit4]    > 	at org.apache.lucene.index.IndexWriter.close(IndexWriter.java:895)
[junit4:junit4]    > 	at org.apache.lucene.index.IndexWriter.close(IndexWriter.java:857)
[junit4:junit4]    > 	at org.apache.lucene.index.TestIndexWriterOutOfFileDescriptors.test(TestIndexWriterOutOfFileDescriptors.java:84)
[junit4:junit4]    > 	at java.lang.Thread.run(Thread.java:722)
[junit4:junit4]   2> NOTE: test params are: codec=Lucene3x, sim=RandomSimilarityProvider(queryNorm=true,coord=yes):
{body=DFR G2, titleTokenized=DFR I(ne)3(800.0)}, locale=in, timezone=Pacific/Port_Moresby
[junit4:junit4]   2> NOTE: FreeBSD 9.0-RELEASE amd64/Oracle Corporation 1.7.0_17 (64-bit)/cpus=16,threads=1,free=31779464,total=114294784
[junit4:junit4]   2> NOTE: All tests run in this JVM: [TestQueryWrapperFilter, TestNumericUtils,
TestDocumentsWriterStallControl, TestIntsRef, TestTerm, TestLucene42DocValuesFormat, TestDocValuesScoring,
TestCharsRef, TestSpanExplanations, TestSloppyPhraseQuery2, TestTransactionRollback, TestSurrogates,
TestReuseDocsEnum, TestLucene3xPostingsFormat, TestNot, TestMultiMMap, TestSimpleAttributeImpl,
TestIndexWriterReader, TestTermRangeQuery, TestPersistentSnapshotDeletionPolicy, TestLucene40StoredFieldsFormat,
TestForceMergeForever, TestMultiPhraseQuery, TestNumericTokenStream, TestCheckIndex, TestIndexWriterMergePolicy,
TestParallelCompositeReader, TestAssertions, TestIndexWriterOutOfFileDescriptors]
[junit4:junit4] Completed on J1 in 0.15s, 1 test, 1 error <<< FAILURES!

[...truncated 924 lines...]
BUILD FAILED
/usr/home/hudson/hudson-slave/workspace/Lucene-Solr-Tests-4.x-java7/build.xml:381: The following
error occurred while executing this line:
/usr/home/hudson/hudson-slave/workspace/Lucene-Solr-Tests-4.x-java7/build.xml:361: The following
error occurred while executing this line:
/usr/home/hudson/hudson-slave/workspace/Lucene-Solr-Tests-4.x-java7/build.xml:39: The following
error occurred while executing this line:
/usr/home/hudson/hudson-slave/workspace/Lucene-Solr-Tests-4.x-java7/lucene/build.xml:50: The
following error occurred while executing this line:
/usr/home/hudson/hudson-slave/workspace/Lucene-Solr-Tests-4.x-java7/lucene/common-build.xml:1234:
The following error occurred while executing this line:
/usr/home/hudson/hudson-slave/workspace/Lucene-Solr-Tests-4.x-java7/lucene/common-build.xml:878:
There were test failures: 359 suites, 2261 tests, 1 error, 61 ignored (49 assumptions)

Total time: 10 minutes 25 seconds
Build step 'Invoke Ant' marked build as failure
Archiving artifacts
Recording test results
Email was triggered for: Failure
Sending email for trigger: Failure



Mime
View raw message