lucene-dev mailing list archives

Site index · List index
Message view « Date » · « Thread »
Top « Date » · « Thread »
From Policeman Jenkins Server <jenk...@thetaphi.de>
Subject [JENKINS] Lucene-Solr-trunk-MacOSX ([[ Exception while replacing ENV. Please report this as a bug. ]]
Date Tue, 02 Apr 2013 15:16:09 GMT
{{ java.lang.NullPointerException }})
 - Build # 372 - Failure!
MIME-Version: 1.0
Content-Type: multipart/mixed; 
	boundary="----=_Part_90_1788693553.1364915769483"
X-Jenkins-Job: Lucene-Solr-trunk-MacOSX
X-Jenkins-Result: FAILURE
Precedence: bulk

------=_Part_90_1788693553.1364915769483
Content-Type: text/plain; charset=UTF-8
Content-Transfer-Encoding: 7bit

Build: http://jenkins.thetaphi.de/job/Lucene-Solr-trunk-MacOSX/372/
Java: [[ Exception while replacing ENV. Please report this as a bug. ]]
{{ java.lang.NullPointerException }}

No tests ran.

Build Log:
[...truncated 10103 lines...]
[junit4:junit4] Suite: org.apache.solr.client.solrj.TestBatchUpdate
[junit4:junit4]   1> 60572 [SUITE-TestBatchUpdate-seed#[F0B79D6E55FFA148]-worker] WARN
 org.apache.solr.SolrTestCaseJ4  ? startTrackingSearchers: numOpens=37 numCloses=37
[junit4:junit4]   1> 60634 [SUITE-TestBatchUpdate-seed#[F0B79D6E55FFA148]-worker] INFO
 org.apache.solr.SolrJettyTestBase  ? Randomized ssl (true) and clientAuth (false)
[junit4:junit4]   1> 60635 [SUITE-TestBatchUpdate-seed#[F0B79D6E55FFA148]-worker] INFO
 org.apache.solr.SolrTestCaseJ4  ? ####initCore
[junit4:junit4]   1> 60636 [SUITE-TestBatchUpdate-seed#[F0B79D6E55FFA148]-worker] INFO
 org.apache.solr.SolrTestCaseJ4  ? ####initCore end
[junit4:junit4]   1> 60651 [SUITE-TestBatchUpdate-seed#[F0B79D6E55FFA148]-worker] INFO
 org.eclipse.jetty.server.Server  ? jetty-8.1.8.v20121106
[junit4:junit4]   1> 61049 [SUITE-TestBatchUpdate-seed#[F0B79D6E55FFA148]-worker] INFO
 org.eclipse.jetty.util.ssl.SslContextFactory  ? Enabled Protocols [SSLv2Hello, SSLv3, TLSv1,
TLSv1.1, TLSv1.2] of [SSLv2Hello, SSLv3, TLSv1, TLSv1.1, TLSv1.2]
[junit4:junit4]   1> 61058 [SUITE-TestBatchUpdate-seed#[F0B79D6E55FFA148]-worker] INFO
 org.eclipse.jetty.server.AbstractConnector  ? Started SslSelectChannelConnector@127.0.0.1:51160
[junit4:junit4]   1> 61060 [SUITE-TestBatchUpdate-seed#[F0B79D6E55FFA148]-worker] INFO
 org.apache.solr.servlet.SolrDispatchFilter  ? SolrDispatchFilter.init()
[junit4:junit4]   1> 61062 [SUITE-TestBatchUpdate-seed#[F0B79D6E55FFA148]-worker] INFO
 org.apache.solr.core.SolrResourceLoader  ? JNDI not configured for solr (NoInitialContextEx)
[junit4:junit4]   1> 61063 [SUITE-TestBatchUpdate-seed#[F0B79D6E55FFA148]-worker] INFO
 org.apache.solr.core.SolrResourceLoader  ? using system property solr.solr.home: /Users/jenkins/jenkins-slave/workspace/Lucene-Solr-trunk-MacOSX/solr/example/solr
[junit4:junit4]   1> 61063 [SUITE-TestBatchUpdate-seed#[F0B79D6E55FFA148]-worker] INFO
 org.apache.solr.core.CoreContainer  ? looking for solr config file: /Users/jenkins/jenkins-slave/workspace/Lucene-Solr-trunk-MacOSX/solr/example/solr/solr.xml
[junit4:junit4]   1> 61065 [SUITE-TestBatchUpdate-seed#[F0B79D6E55FFA148]-worker] INFO
 org.apache.solr.core.CoreContainer  ? New CoreContainer 984960070
[junit4:junit4]   1> 61067 [SUITE-TestBatchUpdate-seed#[F0B79D6E55FFA148]-worker] INFO
 org.apache.solr.core.CoreContainer  ? Loading CoreContainer using Solr Home: '/Users/jenkins/jenkins-slave/workspace/Lucene-Solr-trunk-MacOSX/solr/example/solr/'
[junit4:junit4]   1> 61068 [SUITE-TestBatchUpdate-seed#[F0B79D6E55FFA148]-worker] INFO
 org.apache.solr.core.SolrResourceLoader  ? new SolrResourceLoader for directory: '/Users/jenkins/jenkins-slave/workspace/Lucene-Solr-trunk-MacOSX/solr/example/solr/'
[junit4:junit4]   1> 61184 [SUITE-TestBatchUpdate-seed#[F0B79D6E55FFA148]-worker] INFO
 org.apache.solr.handler.component.HttpShardHandlerFactory  ? Setting socketTimeout to: 0
[junit4:junit4]   1> 61185 [SUITE-TestBatchUpdate-seed#[F0B79D6E55FFA148]-worker] INFO
 org.apache.solr.handler.component.HttpShardHandlerFactory  ? Setting urlScheme to: http://
[junit4:junit4]   1> 61185 [SUITE-TestBatchUpdate-seed#[F0B79D6E55FFA148]-worker] INFO
 org.apache.solr.handler.component.HttpShardHandlerFactory  ? Setting connTimeout to: 0
[junit4:junit4]   1> 61186 [SUITE-TestBatchUpdate-seed#[F0B79D6E55FFA148]-worker] INFO
 org.apache.solr.handler.component.HttpShardHandlerFactory  ? Setting maxConnectionsPerHost
to: 20
[junit4:junit4]   1> 61187 [SUITE-TestBatchUpdate-seed#[F0B79D6E55FFA148]-worker] INFO
 org.apache.solr.handler.component.HttpShardHandlerFactory  ? Setting corePoolSize to: 0
[junit4:junit4]   1> 61187 [SUITE-TestBatchUpdate-seed#[F0B79D6E55FFA148]-worker] INFO
 org.apache.solr.handler.component.HttpShardHandlerFactory  ? Setting maximumPoolSize to:
2147483647
[junit4:junit4]   1> 61188 [SUITE-TestBatchUpdate-seed#[F0B79D6E55FFA148]-worker] INFO
 org.apache.solr.handler.component.HttpShardHandlerFactory  ? Setting maxThreadIdleTime to:
5
[junit4:junit4]   1> 61189 [SUITE-TestBatchUpdate-seed#[F0B79D6E55FFA148]-worker] INFO
 org.apache.solr.handler.component.HttpShardHandlerFactory  ? Setting sizeOfQueue to: -1
[junit4:junit4]   1> 61190 [SUITE-TestBatchUpdate-seed#[F0B79D6E55FFA148]-worker] INFO
 org.apache.solr.handler.component.HttpShardHandlerFactory  ? Setting fairnessPolicy to: false
[junit4:junit4]   1> 61191 [SUITE-TestBatchUpdate-seed#[F0B79D6E55FFA148]-worker] INFO
 org.apache.solr.client.solrj.impl.HttpClientUtil  ? Creating new http client, config:maxConnectionsPerHost=20&maxConnections=10000&socketTimeout=0&connTimeout=0&retry=false
[junit4:junit4]   1> 61211 [SUITE-TestBatchUpdate-seed#[F0B79D6E55FFA148]-worker] INFO
 org.apache.solr.core.CoreContainer  ? Registering Log Listener
[junit4:junit4]   1> 61267 [coreLoadExecutor-116-thread-1] INFO  org.apache.solr.core.CoreContainer
 ? Creating SolrCore 'collection1' using instanceDir: /Users/jenkins/jenkins-slave/workspace/Lucene-Solr-trunk-MacOSX/solr/example/solr/collection1
[junit4:junit4]   1> 61269 [coreLoadExecutor-116-thread-1] INFO  org.apache.solr.core.SolrResourceLoader
 ? new SolrResourceLoader for directory: '/Users/jenkins/jenkins-slave/workspace/Lucene-Solr-trunk-MacOSX/solr/example/solr/collection1/'
[junit4:junit4]   1> 61339 [coreLoadExecutor-116-thread-1] INFO  org.apache.solr.core.SolrConfig
 ? Adding specified lib dirs to ClassLoader
[junit4:junit4]   1> 61552 [coreLoadExecutor-116-thread-1] INFO  org.apache.solr.core.SolrConfig
 ? Using Lucene MatchVersion: LUCENE_50
[junit4:junit4]   1> 61765 [coreLoadExecutor-116-thread-1] INFO  org.apache.solr.core.Config
 ? Loaded SolrConfig: solrconfig.xml
[junit4:junit4]   1> 61774 [coreLoadExecutor-116-thread-1] INFO  org.apache.solr.schema.IndexSchema
 ? Reading Solr Schema from schema.xml
[junit4:junit4]   1> 61846 [coreLoadExecutor-116-thread-1] INFO  org.apache.solr.schema.IndexSchema
 ? Schema name=example
[junit4:junit4]   1> 63811 [coreLoadExecutor-116-thread-1] INFO  org.apache.solr.schema.IndexSchema
 ? unique key field: id
[junit4:junit4]   1> 63924 [coreLoadExecutor-116-thread-1] INFO  org.apache.solr.schema.FileExchangeRateProvider
 ? Reloading exchange rates from file currency.xml
[junit4:junit4]   1> 63946 [coreLoadExecutor-116-thread-1] INFO  org.apache.solr.schema.FileExchangeRateProvider
 ? Reloading exchange rates from file currency.xml
[junit4:junit4]   1> 64354 [coreLoadExecutor-116-thread-1] INFO  org.apache.solr.core.SolrCore
 ? org.apache.solr.core.MockDirectoryFactory
[junit4:junit4]   1> 64355 [coreLoadExecutor-116-thread-1] INFO  org.apache.solr.core.SolrCore
 ? [collection1] Opening new SolrCore at /Users/jenkins/jenkins-slave/workspace/Lucene-Solr-trunk-MacOSX/solr/example/solr/collection1/,
dataDir=/Users/jenkins/jenkins-slave/workspace/Lucene-Solr-trunk-MacOSX/solr/build/solr-solrj/test/J0/solrtest-TestBatchUpdate-1364915383054/
[junit4:junit4]   1> 64361 [coreLoadExecutor-116-thread-1] INFO  org.apache.solr.core.JmxMonitoredMap
 ? JMX monitoring is enabled. Adding Solr mbeans to JMX Server: com.sun.jmx.mbeanserver.JmxMBeanServer@7d89ff39
[junit4:junit4]   1> 64396 [coreLoadExecutor-116-thread-1] INFO  org.apache.solr.core.SolrCore
 ? [collection1] Added SolrEventListener for newSearcher: org.apache.solr.core.QuerySenderListener{queries=[]}
[junit4:junit4]   1> 64397 [coreLoadExecutor-116-thread-1] INFO  org.apache.solr.core.SolrCore
 ? [collection1] Added SolrEventListener for firstSearcher: org.apache.solr.core.QuerySenderListener{queries=[{q=static
firstSearcher warming in solrconfig.xml}]}
[junit4:junit4]   1> 64423 [coreLoadExecutor-116-thread-1] INFO  org.apache.solr.core.SolrCore
 ? org.apache.solr.core.MockDirectoryFactory
[junit4:junit4]   1> 64424 [coreLoadExecutor-116-thread-1] INFO  org.apache.solr.core.CachingDirectoryFactory
 ? return new directory for /Users/jenkins/jenkins-slave/workspace/Lucene-Solr-trunk-MacOSX/solr/build/solr-solrj/test/J0/solrtest-TestBatchUpdate-1364915383054
[junit4:junit4]   1> 64425 [coreLoadExecutor-116-thread-1] INFO  org.apache.solr.core.SolrCore
 ? New index directory detected: old=null new=/Users/jenkins/jenkins-slave/workspace/Lucene-Solr-trunk-MacOSX/solr/build/solr-solrj/test/J0/solrtest-TestBatchUpdate-1364915383054/index/
[junit4:junit4]   1> 64426 [coreLoadExecutor-116-thread-1] WARN  org.apache.solr.core.SolrCore
 ? [collection1] Solr index directory '/Users/jenkins/jenkins-slave/workspace/Lucene-Solr-trunk-MacOSX/solr/build/solr-solrj/test/J0/solrtest-TestBatchUpdate-1364915383054/index'
doesn't exist. Creating new index...
[junit4:junit4]   1> 64427 [coreLoadExecutor-116-thread-1] INFO  org.apache.solr.core.CachingDirectoryFactory
 ? return new directory for /Users/jenkins/jenkins-slave/workspace/Lucene-Solr-trunk-MacOSX/solr/build/solr-solrj/test/J0/solrtest-TestBatchUpdate-1364915383054/index
[junit4:junit4]   1> 64430 [coreLoadExecutor-116-thread-1] INFO  org.apache.solr.core.SolrCore
 ? SolrDeletionPolicy.onCommit: commits:num=1
[junit4:junit4]   1> 	commit{dir=MockDirWrapper(org.apache.lucene.store.RAMDirectory@ca2394c
lockFactory=org.apache.lucene.store.NativeFSLockFactory@32e16d62),segFN=segments_1,generation=1,filenames=[segments_1]
[junit4:junit4]   1> 64431 [coreLoadExecutor-116-thread-1] INFO  org.apache.solr.core.SolrCore
 ? newest commit = 1[segments_1]
[junit4:junit4]   1> 64454 [coreLoadExecutor-116-thread-1] INFO  org.apache.solr.core.SolrCore
 ? created json: solr.JSONResponseWriter
[junit4:junit4]   1> 64455 [coreLoadExecutor-116-thread-1] INFO  org.apache.solr.core.SolrCore
 ? adding lazy queryResponseWriter: solr.VelocityResponseWriter
[junit4:junit4]   1> 64458 [coreLoadExecutor-116-thread-1] INFO  org.apache.solr.core.SolrCore
 ? created velocity: solr.VelocityResponseWriter
[junit4:junit4]   1> 64491 [coreLoadExecutor-116-thread-1] INFO  org.apache.solr.core.SolrCore
 ? created xslt: solr.XSLTResponseWriter
[junit4:junit4]   1> 64492 [coreLoadExecutor-116-thread-1] INFO  org.apache.solr.response.XSLTResponseWriter
 ? xsltCacheLifetimeSeconds=5
[junit4:junit4]   1> 64821 [coreLoadExecutor-116-thread-1] INFO  org.apache.solr.core.RequestHandlers
 ? created /select: solr.SearchHandler
[junit4:junit4]   1> 64823 [coreLoadExecutor-116-thread-1] INFO  org.apache.solr.core.RequestHandlers
 ? created /query: solr.SearchHandler
[junit4:junit4]   1> 64839 [coreLoadExecutor-116-thread-1] INFO  org.apache.solr.core.RequestHandlers
 ? created /get: solr.RealTimeGetHandler
[junit4:junit4]   1> 64841 [coreLoadExecutor-116-thread-1] INFO  org.apache.solr.core.RequestHandlers
 ? created /browse: solr.SearchHandler
[junit4:junit4]   1> 64842 [coreLoadExecutor-116-thread-1] INFO  org.apache.solr.core.RequestHandlers
 ? created /update: solr.UpdateRequestHandler
[junit4:junit4]   1> 64859 [coreLoadExecutor-116-thread-1] INFO  org.apache.solr.core.RequestHandlers
 ? created /update/json: solr.JsonUpdateRequestHandler
[junit4:junit4]   1> 64874 [coreLoadExecutor-116-thread-1] INFO  org.apache.solr.core.RequestHandlers
 ? created /update/csv: solr.CSVRequestHandler
[junit4:junit4]   1> 64875 [coreLoadExecutor-116-thread-1] INFO  org.apache.solr.core.RequestHandlers
 ? adding lazy requestHandler: solr.extraction.ExtractingRequestHandler
[junit4:junit4]   1> 64876 [coreLoadExecutor-116-thread-1] INFO  org.apache.solr.core.RequestHandlers
 ? created /update/extract: solr.extraction.ExtractingRequestHandler
[junit4:junit4]   1> 64877 [coreLoadExecutor-116-thread-1] INFO  org.apache.solr.core.RequestHandlers
 ? adding lazy requestHandler: solr.FieldAnalysisRequestHandler
[junit4:junit4]   1> 64878 [coreLoadExecutor-116-thread-1] INFO  org.apache.solr.core.RequestHandlers
 ? created /analysis/field: solr.FieldAnalysisRequestHandler
[junit4:junit4]   1> 64878 [coreLoadExecutor-116-thread-1] INFO  org.apache.solr.core.RequestHandlers
 ? adding lazy requestHandler: solr.DocumentAnalysisRequestHandler
[junit4:junit4]   1> 64879 [coreLoadExecutor-116-thread-1] INFO  org.apache.solr.core.RequestHandlers
 ? created /analysis/document: solr.DocumentAnalysisRequestHandler
[junit4:junit4]   1> 64893 [coreLoadExecutor-116-thread-1] INFO  org.apache.solr.core.RequestHandlers
 ? created /admin/: solr.admin.AdminHandlers
[junit4:junit4]   1> 64910 [coreLoadExecutor-116-thread-1] INFO  org.apache.solr.core.RequestHandlers
 ? created /admin/ping: solr.PingRequestHandler
[junit4:junit4]   1> 64927 [coreLoadExecutor-116-thread-1] INFO  org.apache.solr.core.RequestHandlers
 ? created /debug/dump: solr.DumpRequestHandler
[junit4:junit4]   1> 64929 [coreLoadExecutor-116-thread-1] INFO  org.apache.solr.core.RequestHandlers
 ? created /replication: solr.ReplicationHandler
[junit4:junit4]   1> 64930 [coreLoadExecutor-116-thread-1] INFO  org.apache.solr.core.RequestHandlers
 ? adding lazy requestHandler: solr.SearchHandler
[junit4:junit4]   1> 64931 [coreLoadExecutor-116-thread-1] INFO  org.apache.solr.core.RequestHandlers
 ? created /spell: solr.SearchHandler
[junit4:junit4]   1> 64931 [coreLoadExecutor-116-thread-1] INFO  org.apache.solr.core.RequestHandlers
 ? adding lazy requestHandler: solr.SearchHandler
[junit4:junit4]   1> 64933 [coreLoadExecutor-116-thread-1] INFO  org.apache.solr.core.RequestHandlers
 ? created /tvrh: solr.SearchHandler
[junit4:junit4]   1> 64933 [coreLoadExecutor-116-thread-1] INFO  org.apache.solr.core.RequestHandlers
 ? adding lazy requestHandler: solr.SearchHandler
[junit4:junit4]   1> 64934 [coreLoadExecutor-116-thread-1] INFO  org.apache.solr.core.RequestHandlers
 ? created /terms: solr.SearchHandler
[junit4:junit4]   1> 64935 [coreLoadExecutor-116-thread-1] INFO  org.apache.solr.core.RequestHandlers
 ? adding lazy requestHandler: solr.SearchHandler
[junit4:junit4]   1> 64936 [coreLoadExecutor-116-thread-1] INFO  org.apache.solr.core.RequestHandlers
 ? created /elevate: solr.SearchHandler
[junit4:junit4]   1> 64946 [coreLoadExecutor-116-thread-1] INFO  org.apache.solr.handler.loader.XMLLoader
 ? xsltCacheLifetimeSeconds=60
[junit4:junit4]   1> 64948 [coreLoadExecutor-116-thread-1] INFO  org.apache.solr.handler.loader.XMLLoader
 ? xsltCacheLifetimeSeconds=60
[junit4:junit4]   1> 64951 [coreLoadExecutor-116-thread-1] INFO  org.apache.solr.handler.loader.XMLLoader
 ? xsltCacheLifetimeSeconds=60
[junit4:junit4]   1> 64961 [coreLoadExecutor-116-thread-1] INFO  org.apache.solr.search.SolrIndexSearcher
 ? Opening Searcher@7ce37f76 main
[junit4:junit4]   1> 64971 [coreLoadExecutor-116-thread-1] INFO  org.apache.solr.update.UpdateHandler
 ? Clearing tlog files, tlogDir=/Users/jenkins/jenkins-slave/workspace/Lucene-Solr-trunk-MacOSX/solr/build/solr-solrj/test/J0/solrtest-TestBatchUpdate-1364915383054/tlog
[junit4:junit4]   1> 64973 [coreLoadExecutor-116-thread-1] INFO  org.apache.solr.core.SolrCore
 ? Hard AutoCommit: if uncommited for 15000ms; 
[junit4:junit4]   1> 64973 [coreLoadExecutor-116-thread-1] INFO  org.apache.solr.core.SolrCore
 ? Soft AutoCommit: disabled
[junit4:junit4]   1> 64975 [coreLoadExecutor-116-thread-1] INFO  org.apache.solr.handler.component.SpellCheckComponent
 ? Initializing spell checkers
[junit4:junit4]   1> 65031 [coreLoadExecutor-116-thread-1] INFO  org.apache.solr.spelling.DirectSolrSpellChecker
 ? init: {name=default,field=name,classname=solr.DirectSolrSpellChecker,distanceMeasure=internal,accuracy=0.5,maxEdits=2,minPrefix=1,maxInspections=5,minQueryLength=4,maxQueryFrequency=0.01}
[junit4:junit4]   1> 65083 [coreLoadExecutor-116-thread-1] INFO  org.apache.solr.handler.component.SpellCheckComponent
 ? No queryConverter defined, using default converter
[junit4:junit4]   1> 65100 [coreLoadExecutor-116-thread-1] INFO  org.apache.solr.handler.component.QueryElevationComponent
 ? Loading QueryElevation from: /Users/jenkins/jenkins-slave/workspace/Lucene-Solr-trunk-MacOSX/solr/example/solr/collection1/conf/elevate.xml
[junit4:junit4]   1> 65183 [coreLoadExecutor-116-thread-1] INFO  org.apache.solr.handler.ReplicationHandler
 ? Commits will be reserved for  10000
[junit4:junit4]   1> 65186 [searcherExecutor-117-thread-1] INFO  org.apache.solr.core.SolrCore
 ? QuerySenderListener sending requests to Searcher@7ce37f76 main{StandardDirectoryReader(segments_1:1)}
[junit4:junit4]   1> 65377 [searcherExecutor-117-thread-1] INFO  org.apache.solr.core.SolrCore
 ? [collection1] webapp=null path=null params={event=firstSearcher&q=static+firstSearcher+warming+in+solrconfig.xml&distrib=false}
hits=0 status=0 QTime=157 
[junit4:junit4]   1> 65378 [searcherExecutor-117-thread-1] INFO  org.apache.solr.core.SolrCore
 ? QuerySenderListener done.
[junit4:junit4]   1> 65379 [searcherExecutor-117-thread-1] INFO  org.apache.solr.handler.component.SpellCheckComponent
 ? Loading spell index for spellchecker: default
[junit4:junit4]   1> 65380 [searcherExecutor-117-thread-1] INFO  org.apache.solr.handler.component.SpellCheckComponent
 ? Loading spell index for spellchecker: wordbreak
[junit4:junit4]   1> 65389 [searcherExecutor-117-thread-1] INFO  org.apache.solr.core.SolrCore
 ? [collection1] Registered new searcher Searcher@7ce37f76 main{StandardDirectoryReader(segments_1:1)}
[junit4:junit4]   1> 65396 [coreLoadExecutor-116-thread-1] INFO  org.apache.solr.core.CoreContainer
 ? registering core: collection1
[junit4:junit4]   1> 65398 [SUITE-TestBatchUpdate-seed#[F0B79D6E55FFA148]-worker] INFO
 org.apache.solr.servlet.SolrDispatchFilter  ? user.dir=/Users/jenkins/jenkins-slave/workspace/Lucene-Solr-trunk-MacOSX/solr/build/solr-solrj/test/J0
[junit4:junit4]   1> 65398 [SUITE-TestBatchUpdate-seed#[F0B79D6E55FFA148]-worker] INFO
 org.apache.solr.servlet.SolrDispatchFilter  ? SolrDispatchFilter.init() done
[junit4:junit4]   1> 65399 [SUITE-TestBatchUpdate-seed#[F0B79D6E55FFA148]-worker] INFO
 org.apache.solr.SolrJettyTestBase  ? Jetty Assigned Port#51160
[junit4:junit4]   2> Creating dataDir: /Users/jenkins/jenkins-slave/workspace/Lucene-Solr-trunk-MacOSX/solr/build/solr-solrj/test/J0/./solrtest-TestBatchUpdate-1364915383054
[junit4:junit4]   1> 65420 [TEST-TestBatchUpdate.testWithBinaryBean-seed#[F0B79D6E55FFA148]]
INFO  org.apache.solr.SolrTestCaseJ4  ? ###Starting testWithBinaryBean
[junit4:junit4]   1> 65421 [TEST-TestBatchUpdate.testWithBinaryBean-seed#[F0B79D6E55FFA148]]
INFO  org.apache.solr.client.solrj.impl.HttpClientUtil  ? Creating new http client, config:maxConnections=128&maxConnectionsPerHost=32&followRedirects=false
[junit4:junit4]   1> 65798 [qtp1183846997-186] INFO  org.apache.solr.core.SolrCore  ? SolrDeletionPolicy.onInit:
commits:num=1
[junit4:junit4]   1> 	commit{dir=MockDirWrapper(org.apache.lucene.store.RAMDirectory@ca2394c
lockFactory=org.apache.lucene.store.NativeFSLockFactory@32e16d62),segFN=segments_1,generation=1,filenames=[segments_1]
[junit4:junit4]   1> 65801 [qtp1183846997-186] INFO  org.apache.solr.core.SolrCore  ? newest
commit = 1[segments_1]
[junit4:junit4]   1> 65803 [qtp1183846997-186] INFO  org.apache.solr.search.SolrIndexSearcher
 ? Opening Searcher@6d2c0060 realtime
[junit4:junit4]   1> 65805 [qtp1183846997-186] INFO  org.apache.solr.update.processor.LogUpdateProcessor
 ? [collection1] webapp=/solr path=/update params={wt=javabin&version=2} {deleteByQuery=*:*
(-1431217518109786112)} 0 17
[junit4:junit4]   1> 67059 [qtp1183846997-187] INFO  org.apache.solr.update.processor.LogUpdateProcessor
 ? [collection1] webapp=/solr path=/update params={wt=javabin&version=2} {add=[1 (1431217518204157952),
2 (1431217518210449408), 3 (1431217518211497984), 4 (1431217518212546560), 5 (1431217518213595136),
6 (1431217518215692288), 7 (1431217518216740864), 8 (1431217518217789440), 9 (1431217518218838016),
10 (1431217518220935168), ... (1000 adds)]} 0 1177
[junit4:junit4]   1> 67069 [qtp1183846997-184] INFO  org.apache.solr.update.UpdateHandler
 ? start commit{,optimize=false,openSearcher=true,waitSearcher=true,expungeDeletes=false,softCommit=false,prepareCommit=false}
[junit4:junit4]   1> 67302 [qtp1183846997-184] INFO  org.apache.solr.core.SolrCore  ? SolrDeletionPolicy.onCommit:
commits:num=2
[junit4:junit4]   1> 	commit{dir=MockDirWrapper(org.apache.lucene.store.RAMDirectory@ca2394c
lockFactory=org.apache.lucene.store.NativeFSLockFactory@32e16d62),segFN=segments_1,generation=1,filenames=[segments_1]
[junit4:junit4]   1> 	commit{dir=MockDirWrapper(org.apache.lucene.store.RAMDirectory@ca2394c
lockFactory=org.apache.lucene.store.NativeFSLockFactory@32e16d62),segFN=segments_2,generation=2,filenames=[_0.fnm,
_0_Lucene41_0.doc, _0_Lucene41_0.pos, _0.nvd, segments_2, _0.fdx, _0.si, _0.nvm, _0_Lucene41_0.tim,
_0.fdt, _0_Lucene41_0.tip]
[junit4:junit4]   1> 67303 [qtp1183846997-184] INFO  org.apache.solr.core.SolrCore  ? newest
commit = 2[_0.fnm, _0_Lucene41_0.doc, _0_Lucene41_0.pos, _0.nvd, segments_2, _0.fdx, _0.si,
_0.nvm, _0_Lucene41_0.tim, _0.fdt, _0_Lucene41_0.tip]
[junit4:junit4]   1> 67432 [qtp1183846997-184] INFO  org.apache.solr.search.SolrIndexSearcher
 ? Opening Searcher@a33c98c main
[junit4:junit4]   1> 67438 [searcherExecutor-117-thread-1] INFO  org.apache.solr.core.SolrCore
 ? QuerySenderListener sending requests to Searcher@a33c98c main{StandardDirectoryReader(segments_2:3:nrt
_0(5.0):C1000)}
[junit4:junit4]   1> 67439 [searcherExecutor-117-thread-1] INFO  org.apache.solr.core.SolrCore
 ? QuerySenderListener done.
[junit4:junit4]   1> 67443 [qtp1183846997-184] INFO  org.apache.solr.update.UpdateHandler
 ? end_commit_flush
[junit4:junit4]   1> 67447 [searcherExecutor-117-thread-1] INFO  org.apache.solr.core.SolrCore
 ? [collection1] Registered new searcher Searcher@a33c98c main{StandardDirectoryReader(segments_2:3:nrt
_0(5.0):C1000)}
[junit4:junit4]   1> 67449 [qtp1183846997-184] INFO  org.apache.solr.update.processor.LogUpdateProcessor
 ? [collection1] webapp=/solr path=/update params={waitSearcher=true&commit=true&wt=javabin&version=2&softCommit=false}
{commit=} 0 380
[junit4:junit4]   1> 67462 [qtp1183846997-186] INFO  org.apache.solr.core.SolrCore  ? [collection1]
webapp=/solr path=/select params={q=*:*&wt=javabin&version=2} hits=1000 status=0 QTime=2

[junit4:junit4]   1> 67499 [TEST-TestBatchUpdate.testWithBinaryBean-seed#[F0B79D6E55FFA148]]
INFO  org.apache.solr.SolrTestCaseJ4  ? ###Ending testWithBinaryBean
[junit4:junit4]   1> 67520 [TEST-TestBatchUpdate.testWithXml-seed#[F0B79D6E55FFA148]] INFO
 org.apache.solr.SolrTestCaseJ4  ? ###Starting testWithXml
[junit4:junit4]   1> 67745 [qtp1183846997-188] INFO  org.apache.solr.search.SolrIndexSearcher
 ? Opening Searcher@4a62a8af realtime
[junit4:junit4]   1> 67747 [qtp1183846997-188] INFO  org.apache.solr.update.processor.LogUpdateProcessor
 ? [collection1] webapp=/solr path=/update params={wt=javabin&version=2} {deleteByQuery=*:*
(-1431217519925919744)} 0 222
[junit4:junit4]   1> 68893 [qtp1183846997-189] INFO  org.apache.solr.update.processor.LogUpdateProcessor
 ? [collection1] webapp=/solr path=/update params={wt=javabin&version=2} {add=[1 (1431217520223715328),
2 (1431217520230006784), 3 (1431217520232103936), 4 (1431217520233152512), 5 (1431217520234201088),
6 (1431217520236298240), 7 (1431217520237346816), 8 (1431217520238395392), 9 (1431217520239443968),
10 (1431217520240492544), ... (1000 adds)]} 0 1086
[junit4:junit4]   1> 82750 [commitScheduler-119-thread-1] INFO  org.apache.solr.update.UpdateHandler
 ? start commit{,optimize=false,openSearcher=false,waitSearcher=true,expungeDeletes=false,softCommit=false,prepareCommit=false}
[junit4:junit4]   1> 82953 [commitScheduler-119-thread-1] INFO  org.apache.solr.core.SolrCore
 ? SolrDeletionPolicy.onCommit: commits:num=2
[junit4:junit4]   1> 	commit{dir=MockDirWrapper(org.apache.lucene.store.RAMDirectory@ca2394c
lockFactory=org.apache.lucene.store.NativeFSLockFactory@32e16d62),segFN=segments_2,generation=2,filenames=[_0.fnm,
_0_Lucene41_0.doc, _0_Lucene41_0.pos, _0.nvd, segments_2, _0.fdx, _0.si, _0.nvm, _0_Lucene41_0.tim,
_0.fdt, _0_Lucene41_0.tip]
[junit4:junit4]   1> 	commit{dir=MockDirWrapper(org.apache.lucene.store.RAMDirectory@ca2394c
lockFactory=org.apache.lucene.store.NativeFSLockFactory@32e16d62),segFN=segments_3,generation=3,filenames=[_1.fdx,
_1_Lucene41_0.pos, _1.nvm, _1_Lucene41_0.doc, _1.fdt, _1.si, _1_Lucene41_0.tim, _1.nvd, _1_Lucene41_0.tip,
_1.fnm, segments_3]
[junit4:junit4]   1> 82955 [commitScheduler-119-thread-1] INFO  org.apache.solr.core.SolrCore
 ? newest commit = 3[_1.fdx, _1_Lucene41_0.pos, _1.nvm, _1_Lucene41_0.doc, _1.fdt, _1.si,
_1_Lucene41_0.tim, _1.nvd, _1_Lucene41_0.tip, _1.fnm, segments_3]
[junit4:junit4]   1> 82960 [commitScheduler-119-thread-1] INFO  org.apache.solr.search.SolrIndexSearcher
 ? Opening Searcher@67aea87d realtime
[junit4:junit4]   1> 82965 [commitScheduler-119-thread-1] INFO  org.apache.solr.update.UpdateHandler
 ? end_commit_flush
[junit4:junit4]   1> 269126 [qtp1183846997-184] INFO  org.apache.solr.update.UpdateHandler
 ? start commit{,optimize=false,openSearcher=true,waitSearcher=true,expungeDeletes=false,softCommit=false,prepareCommit=false}
[junit4:junit4]   1> 269127 [TEST-TestBatchUpdate.testWithXml-seed#[F0B79D6E55FFA148]]
INFO  org.apache.solr.SolrTestCaseJ4  ? ###Ending testWithXml
[junit4:junit4]   1> 269129 [qtp1183846997-184] INFO  org.apache.solr.core.SolrCore  ?
SolrDeletionPolicy.onCommit: commits:num=2
[junit4:junit4]   1> 	commit{dir=MockDirWrapper(org.apache.lucene.store.RAMDirectory@ca2394c
lockFactory=org.apache.lucene.store.NativeFSLockFactory@32e16d62),segFN=segments_3,generation=3,filenames=[_1.fdx,
_1_Lucene41_0.pos, _1.nvm, _1_Lucene41_0.doc, _1.fdt, _1.si, _1_Lucene41_0.tim, _1.nvd, _1_Lucene41_0.tip,
_1.fnm, segments_3]
[junit4:junit4]   1> 	commit{dir=MockDirWrapper(org.apache.lucene.store.RAMDirectory@ca2394c
lockFactory=org.apache.lucene.store.NativeFSLockFactory@32e16d62),segFN=segments_4,generation=4,filenames=[_1.fdx,
_1_Lucene41_0.pos, _1.nvm, _1_Lucene41_0.doc, _1.fdt, _1.si, _1_Lucene41_0.tim, _1.nvd, _1_Lucene41_0.tip,
_1.fnm, segments_4]
[junit4:junit4]   1> 269129 [qtp1183846997-184] INFO  org.apache.solr.core.SolrCore  ?
newest commit = 4[_1.fdx, _1_Lucene41_0.pos, _1.nvm, _1_Lucene41_0.doc, _1.fdt, _1.si, _1_Lucene41_0.tim,
_1.nvd, _1_Lucene41_0.tip, _1.fnm, segments_4]
[junit4:junit4]   1> 269130 [qtp1183846997-184] INFO  org.apache.solr.search.SolrIndexSearcher
 ? Opening Searcher@533f6c57 main
[junit4:junit4]   1> 269131 [qtp1183846997-184] INFO  org.apache.solr.update.UpdateHandler
 ? end_commit_flush
[junit4:junit4]   1> 269131 [searcherExecutor-117-thread-1] INFO  org.apache.solr.core.SolrCore
 ? QuerySenderListener sending requests to Searcher@533f6c57 main{StandardDirectoryReader(segments_3:7:nrt
_1(5.0):C1000)}
[junit4:junit4]   1> 269132 [searcherExecutor-117-thread-1] INFO  org.apache.solr.core.SolrCore
 ? QuerySenderListener done.
[junit4:junit4]   1> 269140 [searcherExecutor-117-thread-1] INFO  org.apache.solr.core.SolrCore
 ? [collection1] Registered new searcher Searcher@533f6c57 main{StandardDirectoryReader(segments_3:7:nrt
_1(5.0):C1000)}
[junit4:junit4]   1> 269143 [qtp1183846997-184] INFO  org.apache.solr.update.processor.LogUpdateProcessor
 ? [collection1] webapp=/solr path=/update params={waitSearcher=true&commit=true&wt=javabin&version=2&softCommit=false}
{commit=} 0 17
[junit4:junit4]   2> NOTE: reproduce with: ant test  -Dtestcase=TestBatchUpdate -Dtests.method=testWithXml
-Dtests.seed=F0B79D6E55FFA148 -Dtests.slow=true -Dtests.locale=ar_SD -Dtests.timezone=Asia/Ulan_Bator
-Dtests.file.encoding=ISO-8859-1
[junit4:junit4] ERROR    202s | TestBatchUpdate.testWithXml <<<
[junit4:junit4]    > Throwable #1: org.apache.solr.client.solrj.SolrServerException: IOException
occured when talking to server at: https://127.0.0.1:51160/solr
[junit4:junit4]    > 	at __randomizedtesting.SeedInfo.seed([F0B79D6E55FFA148:5B552498D7F9B825]:0)
[junit4:junit4]    > 	at org.apache.solr.client.solrj.impl.HttpSolrServer.request(HttpSolrServer.java:416)
[junit4:junit4]    > 	at org.apache.solr.client.solrj.impl.HttpSolrServer.request(HttpSolrServer.java:181)
[junit4:junit4]    > 	at org.apache.solr.client.solrj.request.AbstractUpdateRequest.process(AbstractUpdateRequest.java:117)
[junit4:junit4]    > 	at org.apache.solr.client.solrj.SolrServer.commit(SolrServer.java:168)
[junit4:junit4]    > 	at org.apache.solr.client.solrj.SolrServer.commit(SolrServer.java:146)
[junit4:junit4]    > 	at org.apache.solr.client.solrj.TestBatchUpdate.doIt(TestBatchUpdate.java:130)
[junit4:junit4]    > 	at org.apache.solr.client.solrj.TestBatchUpdate.testWithXml(TestBatchUpdate.java:54)
[junit4:junit4]    > 	at java.lang.Thread.run(Thread.java:722)
[junit4:junit4]    > Caused by: org.apache.http.NoHttpResponseException: The target server
failed to respond
[junit4:junit4]    > 	at org.apache.http.impl.conn.DefaultHttpResponseParser.parseHead(DefaultHttpResponseParser.java:95)
[junit4:junit4]    > 	at org.apache.http.impl.conn.DefaultHttpResponseParser.parseHead(DefaultHttpResponseParser.java:62)
[junit4:junit4]    > 	at org.apache.http.impl.io.AbstractMessageParser.parse(AbstractMessageParser.java:254)
[junit4:junit4]    > 	at org.apache.http.impl.AbstractHttpClientConnection.receiveResponseHeader(AbstractHttpClientConnection.java:289)
[junit4:junit4]    > 	at org.apache.http.impl.conn.DefaultClientConnection.receiveResponseHeader(DefaultClientConnection.java:252)
[junit4:junit4]    > 	at org.apache.http.impl.conn.ManagedClientConnectionImpl.receiveResponseHeader(ManagedClientConnectionImpl.java:191)
[junit4:junit4]    > 	at org.apache.http.protocol.HttpRequestExecutor.doReceiveResponse(HttpRequestExecutor.java:300)
[junit4:junit4]    > 	at org.apache.http.protocol.HttpRequestExecutor.execute(HttpRequestExecutor.java:127)
[junit4:junit4]    > 	at org.apache.http.impl.client.DefaultRequestDirector.tryExecute(DefaultRequestDirector.java:717)
[junit4:junit4]    > 	at org.apache.http.impl.client.DefaultRequestDirector.execute(DefaultRequestDirector.java:522)
[junit4:junit4]    > 	at org.apache.http.impl.client.AbstractHttpClient.execute(AbstractHttpClient.java:906)
[junit4:junit4]    > 	at org.apache.http.impl.client.AbstractHttpClient.execute(AbstractHttpClient.java:805)
[junit4:junit4]    > 	at org.apache.http.impl.client.AbstractHttpClient.execute(AbstractHttpClient.java:784)
[junit4:junit4]    > 	at org.apache.solr.client.solrj.impl.HttpSolrServer.request(HttpSolrServer.java:353)
[junit4:junit4]    > 	... 46 more
[junit4:junit4]   1> 269249 [TEST-TestBatchUpdate.testWithBinary-seed#[F0B79D6E55FFA148]]
INFO  org.apache.solr.SolrTestCaseJ4  ? ###Starting testWithBinary
[junit4:junit4]   1> 269292 [qtp1183846997-187] INFO  org.apache.solr.search.SolrIndexSearcher
 ? Opening Searcher@5b7fb78d realtime
[junit4:junit4]   1> 269293 [qtp1183846997-187] INFO  org.apache.solr.update.processor.LogUpdateProcessor
 ? [collection1] webapp=/solr path=/update params={wt=javabin&version=2} {deleteByQuery=*:*
(-1431217731472982016)} 0 21
[junit4:junit4]   1> 269838 [qtp1183846997-189] INFO  org.apache.solr.update.processor.LogUpdateProcessor
 ? [collection1] webapp=/solr path=/update params={wt=javabin&version=2} {add=[1 (1431217731529605120),
2 (1431217731531702272), 3 (1431217731531702273), 4 (1431217731532750848), 5 (1431217731532750849),
6 (1431217731533799424), 7 (1431217731533799425), 8 (1431217731534848000), 9 (1431217731534848001),
10 (1431217731535896576), ... (1000 adds)]} 0 512
[junit4:junit4]   1> 269849 [qtp1183846997-184] INFO  org.apache.solr.update.UpdateHandler
 ? start commit{,optimize=false,openSearcher=true,waitSearcher=true,expungeDeletes=false,softCommit=false,prepareCommit=false}
[junit4:junit4]   1> 270014 [qtp1183846997-184] INFO  org.apache.solr.core.SolrCore  ?
SolrDeletionPolicy.onCommit: commits:num=2
[junit4:junit4]   1> 	commit{dir=MockDirWrapper(org.apache.lucene.store.RAMDirectory@ca2394c
lockFactory=org.apache.lucene.store.NativeFSLockFactory@32e16d62),segFN=segments_4,generation=4,filenames=[_1.fdx,
_1_Lucene41_0.pos, _1.nvm, _1_Lucene41_0.doc, _1.fdt, _1.si, _1_Lucene41_0.tim, _1.nvd, _1_Lucene41_0.tip,
_1.fnm, segments_4]
[junit4:junit4]   1> 	commit{dir=MockDirWrapper(org.apache.lucene.store.RAMDirectory@ca2394c
lockFactory=org.apache.lucene.store.NativeFSLockFactory@32e16d62),segFN=segments_5,generation=5,filenames=[_2.si,
_2_Lucene41_0.pos, _2_Lucene41_0.tim, _2.nvm, _2.nvd, _2.fdt, _2_Lucene41_0.doc, _2_Lucene41_0.tip,
segments_5, _2.fdx, _2.fnm]
[junit4:junit4]   1> 270016 [qtp1183846997-184] INFO  org.apache.solr.core.SolrCore  ?
newest commit = 5[_2.si, _2_Lucene41_0.pos, _2_Lucene41_0.tim, _2.nvm, _2.nvd, _2.fdt, _2_Lucene41_0.doc,
_2_Lucene41_0.tip, segments_5, _2.fdx, _2.fnm]
[junit4:junit4]   1> 270019 [qtp1183846997-184] INFO  org.apache.solr.search.SolrIndexSearcher
 ? Opening Searcher@3142a13 main
[junit4:junit4]   1> 270051 [searcherExecutor-117-thread-1] INFO  org.apache.solr.core.SolrCore
 ? QuerySenderListener sending requests to Searcher@3142a13 main{StandardDirectoryReader(segments_5:11:nrt
_2(5.0):C1000)}
[junit4:junit4]   1> 270051 [searcherExecutor-117-thread-1] INFO  org.apache.solr.core.SolrCore
 ? QuerySenderListener done.
[junit4:junit4]   1> 270071 [searcherExecutor-117-thread-1] INFO  org.apache.solr.core.SolrCore
 ? [collection1] Registered new searcher Searcher@3142a13 main{StandardDirectoryReader(segments_5:11:nrt
_2(5.0):C1000)}
[junit4:junit4]   1> 270074 [qtp1183846997-184] INFO  org.apache.solr.update.UpdateHandler
 ? end_commit_flush
[junit4:junit4]   1> 270075 [qtp1183846997-184] INFO  org.apache.solr.update.processor.LogUpdateProcessor
 ? [collection1] webapp=/solr path=/update params={waitSearcher=true&commit=true&wt=javabin&version=2&softCommit=false}
{commit=} 0 226
[junit4:junit4]   1> 270110 [qtp1183846997-184] INFO  org.apache.solr.core.SolrCore  ?
[collection1] webapp=/solr path=/select params={q=*:*&wt=javabin&version=2} hits=1000
status=0 QTime=19 
[junit4:junit4]   1> 270139 [TEST-TestBatchUpdate.testWithBinary-seed#[F0B79D6E55FFA148]]
INFO  org.apache.solr.SolrTestCaseJ4  ? ###Ending testWithBinary
[junit4:junit4]   1> 270163 [SUITE-TestBatchUpdate-seed#[F0B79D6E55FFA148]-worker] INFO
 org.apache.solr.core.CoreContainer  ? Shutting down CoreContainer instance=984960070
[junit4:junit4]   1> 270177 [SUITE-TestBatchUpdate-seed#[F0B79D6E55FFA148]-worker] INFO
 org.apache.solr.core.SolrCore  ? [collection1]  CLOSING SolrCore org.apache.solr.core.SolrCore@1e43ac0b
[junit4:junit4]   1> 270306 [SUITE-TestBatchUpdate-seed#[F0B79D6E55FFA148]-worker] INFO
 org.apache.solr.update.UpdateHandler  ? closing DirectUpdateHandler2{commits=4,autocommit
maxTime=15000ms,autocommits=1,soft autocommits=0,optimizes=0,rollbacks=0,expungeDeletes=0,docsPending=0,adds=0,deletesById=0,deletesByQuery=0,errors=0,cumulative_adds=3000,cumulative_deletesById=0,cumulative_deletesByQuery=3,cumulative_errors=0}
[junit4:junit4]   1> 270308 [SUITE-TestBatchUpdate-seed#[F0B79D6E55FFA148]-worker] INFO
 org.apache.solr.update.SolrCoreState  ? Closing SolrCoreState
[junit4:junit4]   1> 270309 [SUITE-TestBatchUpdate-seed#[F0B79D6E55FFA148]-worker] INFO
 org.apache.solr.update.DefaultSolrCoreState  ? SolrCoreState ref count has reached 0 - closing
IndexWriter
[junit4:junit4]   1> 270313 [SUITE-TestBatchUpdate-seed#[F0B79D6E55FFA148]-worker] INFO
 org.apache.solr.update.DefaultSolrCoreState  ? closing IndexWriter with IndexWriterCloser
[junit4:junit4]   1> 270322 [SUITE-TestBatchUpdate-seed#[F0B79D6E55FFA148]-worker] INFO
 org.apache.solr.core.SolrCore  ? [collection1] Closing main searcher on request.
[junit4:junit4]   1> 270323 [SUITE-TestBatchUpdate-seed#[F0B79D6E55FFA148]-worker] INFO
 org.apache.solr.core.CachingDirectoryFactory  ? Closing MockDirectoryFactory - 2 directories
currently being tracked
[junit4:junit4]   1> 270324 [SUITE-TestBatchUpdate-seed#[F0B79D6E55FFA148]-worker] INFO
 org.apache.solr.core.CachingDirectoryFactory  ? looking to close /Users/jenkins/jenkins-slave/workspace/Lucene-Solr-trunk-MacOSX/solr/build/solr-solrj/test/J0/solrtest-TestBatchUpdate-1364915383054
[CachedDir<<refCount=0;path=/Users/jenkins/jenkins-slave/workspace/Lucene-Solr-trunk-MacOSX/solr/build/solr-solrj/test/J0/solrtest-TestBatchUpdate-1364915383054;done=false>>]
[junit4:junit4]   1> 270325 [SUITE-TestBatchUpdate-seed#[F0B79D6E55FFA148]-worker] INFO
 org.apache.solr.core.CachingDirectoryFactory  ? Closing directory: /Users/jenkins/jenkins-slave/workspace/Lucene-Solr-trunk-MacOSX/solr/build/solr-solrj/test/J0/solrtest-TestBatchUpdate-1364915383054
[junit4:junit4]   1> 270327 [SUITE-TestBatchUpdate-seed#[F0B79D6E55FFA148]-worker] INFO
 org.apache.solr.core.CachingDirectoryFactory  ? looking to close /Users/jenkins/jenkins-slave/workspace/Lucene-Solr-trunk-MacOSX/solr/build/solr-solrj/test/J0/solrtest-TestBatchUpdate-1364915383054/index
[CachedDir<<refCount=0;path=/Users/jenkins/jenkins-slave/workspace/Lucene-Solr-trunk-MacOSX/solr/build/solr-solrj/test/J0/solrtest-TestBatchUpdate-1364915383054/index;done=false>>]
[junit4:junit4]   1> 270327 [SUITE-TestBatchUpdate-seed#[F0B79D6E55FFA148]-worker] INFO
 org.apache.solr.core.CachingDirectoryFactory  ? Closing directory: /Users/jenkins/jenkins-slave/workspace/Lucene-Solr-trunk-MacOSX/solr/build/solr-solrj/test/J0/solrtest-TestBatchUpdate-1364915383054/index
[junit4:junit4]   1> 270328 [SUITE-TestBatchUpdate-seed#[F0B79D6E55FFA148]-worker] INFO
 org.eclipse.jetty.server.handler.ContextHandler  ? stopped o.e.j.s.ServletContextHandler{/solr,null}
[junit4:junit4]   1> 270388 [SUITE-TestBatchUpdate-seed#[F0B79D6E55FFA148]-worker] INFO
 org.apache.solr.SolrTestCaseJ4  ? ###deleteCore
[junit4:junit4]   2> NOTE: test params are: codec=CheapBastard, sim=RandomSimilarityProvider(queryNorm=true,coord=no):
{}, locale=ar_SD, timezone=Asia/Ulan_Bator
[junit4:junit4]   2> NOTE: Mac OS X 10.8.3 x86_64/Oracle Corporation 1.7.0_17 (64-bit)/cpus=2,threads=1,free=66183368,total=97517568
[junit4:junit4]   2> NOTE: All tests run in this JVM: [TestSolrProperties, TestLBHttpSolrServer,
TestBatchUpdate]
[junit4:junit4] Completed in 210.18s, 3 tests, 1 error <<< FAILURES!

[...truncated 135 lines...]
BUILD FAILED
/Users/jenkins/jenkins-slave/workspace/Lucene-Solr-trunk-MacOSX/build.xml:375: The following
error occurred while executing this line:
/Users/jenkins/jenkins-slave/workspace/Lucene-Solr-trunk-MacOSX/build.xml:355: The following
error occurred while executing this line:
/Users/jenkins/jenkins-slave/workspace/Lucene-Solr-trunk-MacOSX/build.xml:39: The following
error occurred while executing this line:
/Users/jenkins/jenkins-slave/workspace/Lucene-Solr-trunk-MacOSX/solr/build.xml:196: The following
error occurred while executing this line:
/Users/jenkins/jenkins-slave/workspace/Lucene-Solr-trunk-MacOSX/solr/common-build.xml:448:
The following error occurred while executing this line:
/Users/jenkins/jenkins-slave/workspace/Lucene-Solr-trunk-MacOSX/lucene/common-build.xml:1231:
The following error occurred while executing this line:
/Users/jenkins/jenkins-slave/workspace/Lucene-Solr-trunk-MacOSX/lucene/common-build.xml:875:
There were test failures: 45 suites, 266 tests, 1 error

Total time: 99 minutes 16 seconds
Build step 'Invoke Ant' marked build as failure
Archiving artifacts
ERROR: Failed to archive artifacts: **/*.events,heapdumps/**,README.txt
hudson.util.IOException2: hudson.remoting.RequestAbortedException: java.io.IOException: Unexpected
reader termination
	at hudson.FilePath.copyRecursiveTo(FilePath.java:1903)
	at hudson.tasks.ArtifactArchiver.perform(ArtifactArchiver.java:116)
	at hudson.tasks.BuildStepMonitor$1.perform(BuildStepMonitor.java:19)
	at hudson.model.AbstractBuild$AbstractBuildExecution.perform(AbstractBuild.java:798)
	at hudson.model.AbstractBuild$AbstractBuildExecution.performAllBuildSteps(AbstractBuild.java:770)
	at hudson.model.Build$BuildExecution.post2(Build.java:183)
	at hudson.model.AbstractBuild$AbstractBuildExecution.post(AbstractBuild.java:720)
	at hudson.model.Run.execute(Run.java:1600)
	at hudson.model.FreeStyleBuild.run(FreeStyleBuild.java:46)
	at hudson.model.ResourceController.execute(ResourceController.java:88)
	at hudson.model.Executor.run(Executor.java:237)
Caused by: java.util.concurrent.ExecutionException: hudson.remoting.RequestAbortedException:
java.io.IOException: Unexpected reader termination
	at hudson.remoting.Request$1.get(Request.java:256)
	at hudson.remoting.Request$1.get(Request.java:210)
	at hudson.remoting.FutureAdapter.get(FutureAdapter.java:55)
	at hudson.FilePath.copyRecursiveTo(FilePath.java:1901)
	... 10 more
Caused by: hudson.remoting.RequestAbortedException: java.io.IOException: Unexpected reader
termination
	at hudson.remoting.Request.abort(Request.java:299)
	at hudson.remoting.Channel.terminate(Channel.java:732)
	at hudson.remoting.SynchronousCommandTransport$ReaderThread.run(SynchronousCommandTransport.java:76)
Caused by: java.io.IOException: Unexpected reader termination
	... 1 more
Caused by: java.lang.OutOfMemoryError: PermGen space
	at sun.misc.Unsafe.defineClass(Native Method)
	at sun.reflect.ClassDefiner.defineClass(ClassDefiner.java:63)
	at sun.reflect.MethodAccessorGenerator$1.run(MethodAccessorGenerator.java:399)
	at sun.reflect.MethodAccessorGenerator$1.run(MethodAccessorGenerator.java:396)
	at java.security.AccessController.doPrivileged(Native Method)
	at sun.reflect.MethodAccessorGenerator.generate(MethodAccessorGenerator.java:395)
	at sun.reflect.MethodAccessorGenerator.generateSerializationConstructor(MethodAccessorGenerator.java:113)
	at sun.reflect.ReflectionFactory.newConstructorForSerialization(ReflectionFactory.java:331)
	at java.io.ObjectStreamClass.getSerializableConstructor(ObjectStreamClass.java:1356)
	at java.io.ObjectStreamClass.access$1500(ObjectStreamClass.java:69)
	at java.io.ObjectStreamClass$2.run(ObjectStreamClass.java:480)
	at java.io.ObjectStreamClass$2.run(ObjectStreamClass.java:455)
	at java.security.AccessController.doPrivileged(Native Method)
	at java.io.ObjectStreamClass.<init>(ObjectStreamClass.java:455)
	at java.io.ObjectStreamClass.lookup(ObjectStreamClass.java:352)
	at java.io.ObjectStreamClass.initNonProxy(ObjectStreamClass.java:589)
	at java.io.ObjectInputStream.readNonProxyDesc(ObjectInputStream.java:1601)
	at java.io.ObjectInputStream.readClassDesc(ObjectInputStream.java:1514)
	at java.io.ObjectInputStream.readOrdinaryObject(ObjectInputStream.java:1750)
	at java.io.ObjectInputStream.readObject0(ObjectInputStream.java:1347)
	at java.io.ObjectInputStream.readObject(ObjectInputStream.java:369)
	at hudson.remoting.Command.readFrom(Command.java:92)
	at hudson.remoting.ClassicCommandTransport.read(ClassicCommandTransport.java:59)
	at hudson.remoting.SynchronousCommandTransport$ReaderThread.run(SynchronousCommandTransport.java:48)
Recording test results
ERROR: Publisher hudson.tasks.junit.JUnitResultArchiver aborted due to exception
hudson.remoting.ChannelClosedException: channel is already closed
	at hudson.remoting.Channel.send(Channel.java:494)
	at hudson.remoting.Request.call(Request.java:129)
	at hudson.remoting.Channel.call(Channel.java:672)
	at hudson.EnvVars.getRemote(EnvVars.java:212)
	at hudson.model.Computer.getEnvironment(Computer.java:882)
	at jenkins.model.CoreEnvironmentContributor.buildEnvironmentFor(CoreEnvironmentContributor.java:28)
	at hudson.model.Run.getEnvironment(Run.java:2028)
	at hudson.model.AbstractBuild.getEnvironment(AbstractBuild.java:927)
	at hudson.tasks.junit.JUnitResultArchiver.perform(JUnitResultArchiver.java:131)
	at hudson.tasks.BuildStepMonitor$1.perform(BuildStepMonitor.java:19)
	at hudson.model.AbstractBuild$AbstractBuildExecution.perform(AbstractBuild.java:798)
	at hudson.model.AbstractBuild$AbstractBuildExecution.performAllBuildSteps(AbstractBuild.java:770)
	at hudson.model.Build$BuildExecution.post2(Build.java:183)
	at hudson.model.AbstractBuild$AbstractBuildExecution.post(AbstractBuild.java:720)
	at hudson.model.Run.execute(Run.java:1600)
	at hudson.model.FreeStyleBuild.run(FreeStyleBuild.java:46)
	at hudson.model.ResourceController.execute(ResourceController.java:88)
	at hudson.model.Executor.run(Executor.java:237)
Caused by: java.io.IOException: Unexpected reader termination
	at hudson.remoting.SynchronousCommandTransport$ReaderThread.run(SynchronousCommandTransport.java:76)
Caused by: java.lang.OutOfMemoryError: PermGen space
	at sun.misc.Unsafe.defineClass(Native Method)
	at sun.reflect.ClassDefiner.defineClass(ClassDefiner.java:63)
	at sun.reflect.MethodAccessorGenerator$1.run(MethodAccessorGenerator.java:399)
	at sun.reflect.MethodAccessorGenerator$1.run(MethodAccessorGenerator.java:396)
	at java.security.AccessController.doPrivileged(Native Method)
	at sun.reflect.MethodAccessorGenerator.generate(MethodAccessorGenerator.java:395)
	at sun.reflect.MethodAccessorGenerator.generateSerializationConstructor(MethodAccessorGenerator.java:113)
	at sun.reflect.ReflectionFactory.newConstructorForSerialization(ReflectionFactory.java:331)
	at java.io.ObjectStreamClass.getSerializableConstructor(ObjectStreamClass.java:1356)
	at java.io.ObjectStreamClass.access$1500(ObjectStreamClass.java:69)
	at java.io.ObjectStreamClass$2.run(ObjectStreamClass.java:480)
	at java.io.ObjectStreamClass$2.run(ObjectStreamClass.java:455)
	at java.security.AccessController.doPrivileged(Native Method)
	at java.io.ObjectStreamClass.<init>(ObjectStreamClass.java:455)
	at java.io.ObjectStreamClass.lookup(ObjectStreamClass.java:352)
	at java.io.ObjectStreamClass.initNonProxy(ObjectStreamClass.java:589)
	at java.io.ObjectInputStream.readNonProxyDesc(ObjectInputStream.java:1601)
	at java.io.ObjectInputStream.readClassDesc(ObjectInputStream.java:1514)
	at java.io.ObjectInputStream.readOrdinaryObject(ObjectInputStream.java:1750)
	at java.io.ObjectInputStream.readObject0(ObjectInputStream.java:1347)
	at java.io.ObjectInputStream.readObject(ObjectInputStream.java:369)
	at hudson.remoting.Command.readFrom(Command.java:92)
	at hudson.remoting.ClassicCommandTransport.read(ClassicCommandTransport.java:59)
	at hudson.remoting.SynchronousCommandTransport$ReaderThread.run(SynchronousCommandTransport.java:48)
Description set: Java: 64bit/jdk1.7.0 -XX:+UseG1GC
Email was triggered for: Failure
Sending email for trigger: Failure


------=_Part_90_1788693553.1364915769483--

---------------------------------------------------------------------
To unsubscribe, e-mail: dev-unsubscribe@lucene.apache.org
For additional commands, e-mail: dev-help@lucene.apache.org


Mime
View raw message