I'll dig this one.

Le 22 mars 2013 19:13, "Policeman Jenkins Server" <jenkins@thetaphi.de> a écrit :
Build: http://jenkins.thetaphi.de/job/Lucene-Solr-4.x-Linux/4782/
Java: 64bit/jdk1.7.0_15 -XX:+UseConcMarkSweepGC

3 tests failed.
FAILED:  junit.framework.TestSuite.org.apache.lucene.index.sorter.TestSortingMergePolicy

Error Message:
Suite timeout exceeded (>= 7200000 msec).

Stack Trace:
java.lang.Exception: Suite timeout exceeded (>= 7200000 msec).
        at __randomizedtesting.SeedInfo.seed([65EEF14FC2D459BD]:0)


FAILED:  junit.framework.TestSuite.org.apache.lucene.index.sorter.TestSortingMergePolicy

Error Message:
Captured an uncaught exception in thread: Thread[id=29, name=Lucene Merge Thread #5, state=RUNNABLE, group=TGRP-TestSortingMergePolicy]

Stack Trace:
com.carrotsearch.randomizedtesting.UncaughtExceptionError: Captured an uncaught exception in thread: Thread[id=29, name=Lucene Merge Thread #5, state=RUNNABLE, group=TGRP-TestSortingMergePolicy]
Caused by: org.apache.lucene.index.MergePolicy$MergeException: java.lang.AssertionError: info.dir=MockDirWrapper(org.apache.lucene.store.RAMDirectory@587b25cc lockFactory=org.apache.lucene.store.SingleInstanceLockFactory@7ceea175) vs MockDirWrapper(org.apache.lucene.store.RAMDirectory@4ae2bafc lockFactory=org.apache.lucene.store.SingleInstanceLockFactory@6b621ccc)
        at __randomizedtesting.SeedInfo.seed([65EEF14FC2D459BD]:0)
        at org.apache.lucene.index.ConcurrentMergeScheduler.handleMergeException(ConcurrentMergeScheduler.java:541)
        at org.apache.lucene.index.ConcurrentMergeScheduler$MergeThread.run(ConcurrentMergeScheduler.java:514)
Caused by: java.lang.AssertionError: info.dir=MockDirWrapper(org.apache.lucene.store.RAMDirectory@587b25cc lockFactory=org.apache.lucene.store.SingleInstanceLockFactory@7ceea175) vs MockDirWrapper(org.apache.lucene.store.RAMDirectory@4ae2bafc lockFactory=org.apache.lucene.store.SingleInstanceLockFactory@6b621ccc)
        at org.apache.lucene.index.IndexWriter$ReaderPool.get(IndexWriter.java:531)
        at org.apache.lucene.index.IndexWriter.numDeletedDocs(IndexWriter.java:563)
        at org.apache.lucene.index.IndexWriter.segString(IndexWriter.java:3896)
        at org.apache.lucene.index.IndexWriter.segString(IndexWriter.java:3886)
        at org.apache.lucene.index.IndexWriter.handleMergeException(IndexWriter.java:3243)
        at org.apache.lucene.index.IndexWriter.merge(IndexWriter.java:3300)
        at org.apache.lucene.index.ConcurrentMergeScheduler.doMerge(ConcurrentMergeScheduler.java:401)
        at org.apache.lucene.index.ConcurrentMergeScheduler$MergeThread.run(ConcurrentMergeScheduler.java:478)


FAILED:  org.apache.lucene.index.sorter.TestSortingMergePolicy.testSortingMP

Error Message:
Test abandoned because suite timeout was reached.

Stack Trace:
java.lang.Exception: Test abandoned because suite timeout was reached.
        at __randomizedtesting.SeedInfo.seed([65EEF14FC2D459BD]:0)




Build Log:
[...truncated 7704 lines...]
[junit4:junit4] Suite: org.apache.lucene.index.sorter.TestSortingMergePolicy
[junit4:junit4]   2> thg 3 22, 2013 6:09:33 CH com.carrotsearch.randomizedtesting.RandomizedRunner$QueueUncaughtExceptionsHandler uncaughtException
[junit4:junit4]   2> WARNING: Uncaught exception in thread: Thread[Lucene Merge Thread #5,6,TGRP-TestSortingMergePolicy]
[junit4:junit4]   2> org.apache.lucene.index.MergePolicy$MergeException: java.lang.AssertionError: info.dir=MockDirWrapper(org.apache.lucene.store.RAMDirectory@587b25cc lockFactory=org.apache.lucene.store.SingleInstanceLockFactory@7ceea175) vs MockDirWrapper(org.apache.lucene.store.RAMDirectory@4ae2bafc lockFactory=org.apache.lucene.store.SingleInstanceLockFactory@6b621ccc)
[junit4:junit4]   2>    at __randomizedtesting.SeedInfo.seed([65EEF14FC2D459BD]:0)
[junit4:junit4]   2>    at org.apache.lucene.index.ConcurrentMergeScheduler.handleMergeException(ConcurrentMergeScheduler.java:541)
[junit4:junit4]   2>    at org.apache.lucene.index.ConcurrentMergeScheduler$MergeThread.run(ConcurrentMergeScheduler.java:514)
[junit4:junit4]   2> Caused by: java.lang.AssertionError: info.dir=MockDirWrapper(org.apache.lucene.store.RAMDirectory@587b25cc lockFactory=org.apache.lucene.store.SingleInstanceLockFactory@7ceea175) vs MockDirWrapper(org.apache.lucene.store.RAMDirectory@4ae2bafc lockFactory=org.apache.lucene.store.SingleInstanceLockFactory@6b621ccc)
[junit4:junit4]   2>    at org.apache.lucene.index.IndexWriter$ReaderPool.get(IndexWriter.java:531)
[junit4:junit4]   2>    at org.apache.lucene.index.IndexWriter.numDeletedDocs(IndexWriter.java:563)
[junit4:junit4]   2>    at org.apache.lucene.index.IndexWriter.segString(IndexWriter.java:3896)
[junit4:junit4]   2>    at org.apache.lucene.index.IndexWriter.segString(IndexWriter.java:3886)
[junit4:junit4]   2>    at org.apache.lucene.index.IndexWriter.handleMergeException(IndexWriter.java:3243)
[junit4:junit4]   2>    at org.apache.lucene.index.IndexWriter.merge(IndexWriter.java:3300)
[junit4:junit4]   2>    at org.apache.lucene.index.ConcurrentMergeScheduler.doMerge(ConcurrentMergeScheduler.java:401)
[junit4:junit4]   2>    at org.apache.lucene.index.ConcurrentMergeScheduler$MergeThread.run(ConcurrentMergeScheduler.java:478)
[junit4:junit4]   2>
[junit4:junit4]   2> thg 3 22, 2013 8:09:32 CH com.carrotsearch.randomizedtesting.ThreadLeakControl$2 evaluate
[junit4:junit4]   2> WARNING: Suite execution timed out: org.apache.lucene.index.sorter.TestSortingMergePolicy
[junit4:junit4]   2> ==== jstack at approximately timeout time ====
[junit4:junit4]   2> "TEST-TestSortingMergePolicy.testSortingMP-seed#[65EEF14FC2D459BD]" ID=23 TIMED_WAITING on org.apache.lucene.index.IndexWriter@509693ef
[junit4:junit4]   2>    at java.lang.Object.wait(Native Method)
[junit4:junit4]   2>    - timed waiting on org.apache.lucene.index.IndexWriter@509693ef
[junit4:junit4]   2>    at org.apache.lucene.index.IndexWriter.doWait(IndexWriter.java:3907)
[junit4:junit4]   2>    at org.apache.lucene.index.IndexWriter.forceMerge(IndexWriter.java:1684)
[junit4:junit4]   2>    at org.apache.lucene.index.IndexWriter.forceMerge(IndexWriter.java:1610)
[junit4:junit4]   2>    at org.apache.lucene.index.sorter.TestSortingMergePolicy.createRandomIndexes(TestSortingMergePolicy.java:82)
[junit4:junit4]   2>    at org.apache.lucene.index.sorter.TestSortingMergePolicy.setUp(TestSortingMergePolicy.java:51)
[junit4:junit4]   2>    at sun.reflect.GeneratedMethodAccessor6.invoke(Unknown Source)
[junit4:junit4]   2>    at sun.reflect.DelegatingMethodAccessorImpl.invoke(DelegatingMethodAccessorImpl.java:43)
[junit4:junit4]   2>    at java.lang.reflect.Method.invoke(Method.java:601)
[junit4:junit4]   2>    at com.carrotsearch.randomizedtesting.RandomizedRunner.invoke(RandomizedRunner.java:1559)
[junit4:junit4]   2>    at com.carrotsearch.randomizedtesting.RandomizedRunner.access$600(RandomizedRunner.java:79)
[junit4:junit4]   2>    at com.carrotsearch.randomizedtesting.RandomizedRunner$7.evaluate(RandomizedRunner.java:771)
[junit4:junit4]   2>    at com.carrotsearch.randomizedtesting.RandomizedRunner$8.evaluate(RandomizedRunner.java:787)
[junit4:junit4]   2>    at org.apache.lucene.util.TestRuleSetupTeardownChained$1.evaluate(TestRuleSetupTeardownChained.java:50)
[junit4:junit4]   2>    at org.apache.lucene.util.TestRuleFieldCacheSanity$1.evaluate(TestRuleFieldCacheSanity.java:51)
[junit4:junit4]   2>    at org.apache.lucene.util.AbstractBeforeAfterRule$1.evaluate(AbstractBeforeAfterRule.java:46)
[junit4:junit4]   2>    at com.carrotsearch.randomizedtesting.rules.SystemPropertiesInvariantRule$1.evaluate(SystemPropertiesInvariantRule.java:55)
[junit4:junit4]   2>    at org.apache.lucene.util.TestRuleThreadAndTestName$1.evaluate(TestRuleThreadAndTestName.java:49)
[junit4:junit4]   2>    at org.apache.lucene.util.TestRuleIgnoreAfterMaxFailures$1.evaluate(TestRuleIgnoreAfterMaxFailures.java:70)
[junit4:junit4]   2>    at org.apache.lucene.util.TestRuleMarkFailure$1.evaluate(TestRuleMarkFailure.java:48)
[junit4:junit4]   2>    at com.carrotsearch.randomizedtesting.rules.StatementAdapter.evaluate(StatementAdapter.java:36)
[junit4:junit4]   2>    at com.carrotsearch.randomizedtesting.ThreadLeakControl$StatementRunner.run(ThreadLeakControl.java:358)
[junit4:junit4]   2>    at com.carrotsearch.randomizedtesting.ThreadLeakControl.forkTimeoutingTask(ThreadLeakControl.java:782)
[junit4:junit4]   2>    at com.carrotsearch.randomizedtesting.ThreadLeakControl$3.evaluate(ThreadLeakControl.java:442)
[junit4:junit4]   2>    at com.carrotsearch.randomizedtesting.RandomizedRunner.runSingleTest(RandomizedRunner.java:746)
[junit4:junit4]   2>    at com.carrotsearch.randomizedtesting.RandomizedRunner$3.evaluate(RandomizedRunner.java:648)
[junit4:junit4]   2>    at com.carrotsearch.randomizedtesting.RandomizedRunner$4.evaluate(RandomizedRunner.java:682)
[junit4:junit4]   2>    at com.carrotsearch.randomizedtesting.RandomizedRunner$5.evaluate(RandomizedRunner.java:693)
[junit4:junit4]   2>    at org.apache.lucene.util.AbstractBeforeAfterRule$1.evaluate(AbstractBeforeAfterRule.java:46)
[junit4:junit4]   2>    at org.apache.lucene.util.TestRuleStoreClassName$1.evaluate(TestRuleStoreClassName.java:42)
[junit4:junit4]   2>    at com.carrotsearch.randomizedtesting.rules.SystemPropertiesInvariantRule$1.evaluate(SystemPropertiesInvariantRule.java:55)
[junit4:junit4]   2>    at com.carrotsearch.randomizedtesting.rules.NoShadowingOrOverridesOnMethodsRule$1.evaluate(NoShadowingOrOverridesOnMethodsRule.java:39)
[junit4:junit4]   2>    at com.carrotsearch.randomizedtesting.rules.NoShadowingOrOverridesOnMethodsRule$1.evaluate(NoShadowingOrOverridesOnMethodsRule.java:39)
[junit4:junit4]   2>    at com.carrotsearch.randomizedtesting.rules.StatementAdapter.evaluate(StatementAdapter.java:36)
[junit4:junit4]   2>    at org.apache.lucene.util.TestRuleAssertionsRequired$1.evaluate(TestRuleAssertionsRequired.java:43)
[junit4:junit4]   2>    at org.apache.lucene.util.TestRuleMarkFailure$1.evaluate(TestRuleMarkFailure.java:48)
[junit4:junit4]   2>    at org.apache.lucene.util.TestRuleIgnoreAfterMaxFailures$1.evaluate(TestRuleIgnoreAfterMaxFailures.java:70)
[junit4:junit4]   2>    at org.apache.lucene.util.TestRuleIgnoreTestSuites$1.evaluate(TestRuleIgnoreTestSuites.java:55)
[junit4:junit4]   2>    at com.carrotsearch.randomizedtesting.rules.StatementAdapter.evaluate(StatementAdapter.java:36)
[junit4:junit4]   2>    at com.carrotsearch.randomizedtesting.ThreadLeakControl$StatementRunner.run(ThreadLeakControl.java:358)
[junit4:junit4]   2>    at java.lang.Thread.run(Thread.java:722)
[junit4:junit4]   2>
[junit4:junit4]   2> "SUITE-TestSortingMergePolicy-seed#[65EEF14FC2D459BD]" ID=22 RUNNABLE
[junit4:junit4]   2>    at sun.management.ThreadImpl.dumpThreads0(Native Method)
[junit4:junit4]   2>    at sun.management.ThreadImpl.dumpAllThreads(ThreadImpl.java:446)
[junit4:junit4]   2>    at com.carrotsearch.randomizedtesting.ThreadLeakControl.formatThreadStacksFull(ThreadLeakControl.java:655)
[junit4:junit4]   2>    at com.carrotsearch.randomizedtesting.ThreadLeakControl.access$800(ThreadLeakControl.java:60)
[junit4:junit4]   2>    at com.carrotsearch.randomizedtesting.ThreadLeakControl$2.evaluate(ThreadLeakControl.java:396)
[junit4:junit4]   2>    - locked java.lang.Object@4dca593e
[junit4:junit4]   2>    at com.carrotsearch.randomizedtesting.RandomizedRunner.runSuite(RandomizedRunner.java:556)
[junit4:junit4]   2>    at com.carrotsearch.randomizedtesting.RandomizedRunner.access$200(RandomizedRunner.java:79)
[junit4:junit4]   2>    at com.carrotsearch.randomizedtesting.RandomizedRunner$1.run(RandomizedRunner.java:492)
[junit4:junit4]   2>
[junit4:junit4]   2> "Signal Dispatcher" ID=5 RUNNABLE
[junit4:junit4]   2>
[junit4:junit4]   2> "Finalizer" ID=3 WAITING on java.lang.ref.ReferenceQueue$Lock@1fa91d58
[junit4:junit4]   2>    at java.lang.Object.wait(Native Method)
[junit4:junit4]   2>    - waiting on java.lang.ref.ReferenceQueue$Lock@1fa91d58
[junit4:junit4]   2>    at java.lang.ref.ReferenceQueue.remove(ReferenceQueue.java:135)
[junit4:junit4]   2>    at java.lang.ref.ReferenceQueue.remove(ReferenceQueue.java:151)
[junit4:junit4]   2>    at java.lang.ref.Finalizer$FinalizerThread.run(Finalizer.java:177)
[junit4:junit4]   2>
[junit4:junit4]   2> "Reference Handler" ID=2 WAITING on java.lang.ref.Reference$Lock@17c58ca5
[junit4:junit4]   2>    at java.lang.Object.wait(Native Method)
[junit4:junit4]   2>    - waiting on java.lang.ref.Reference$Lock@17c58ca5
[junit4:junit4]   2>    at java.lang.Object.wait(Object.java:503)
[junit4:junit4]   2>    at java.lang.ref.Reference$ReferenceHandler.run(Reference.java:133)
[junit4:junit4]   2>
[junit4:junit4]   2> "main" ID=1 WAITING on com.carrotsearch.randomizedtesting.RandomizedRunner$1@3e1229d2
[junit4:junit4]   2>    at java.lang.Object.wait(Native Method)
[junit4:junit4]   2>    - waiting on com.carrotsearch.randomizedtesting.RandomizedRunner$1@3e1229d2
[junit4:junit4]   2>    at java.lang.Thread.join(Thread.java:1258)
[junit4:junit4]   2>    at java.lang.Thread.join(Thread.java:1332)
[junit4:junit4]   2>    at com.carrotsearch.randomizedtesting.RandomizedRunner.runSuite(RandomizedRunner.java:502)
[junit4:junit4]   2>    at com.carrotsearch.randomizedtesting.RandomizedRunner.run(RandomizedRunner.java:399)
[junit4:junit4]   2>    at com.carrotsearch.ant.tasks.junit4.slave.SlaveMain.execute(SlaveMain.java:180)
[junit4:junit4]   2>    at com.carrotsearch.ant.tasks.junit4.slave.SlaveMain.main(SlaveMain.java:275)
[junit4:junit4]   2>    at com.carrotsearch.ant.tasks.junit4.slave.SlaveMainSafe.main(SlaveMainSafe.java:12)
[junit4:junit4]   2>
[junit4:junit4]   2> ^^==============================================
[junit4:junit4]   2>
[junit4:junit4]   2> NOTE: reproduce with: ant test  -Dtestcase=TestSortingMergePolicy -Dtests.method=testSortingMP -Dtests.seed=65EEF14FC2D459BD -Dtests.multiplier=3 -Dtests.slow=true -Dtests.locale=vi_VN -Dtests.timezone=Europe/Mariehamn -Dtests.file.encoding=UTF-8
[junit4:junit4] ERROR   7200s J1 | TestSortingMergePolicy.testSortingMP <<<
[junit4:junit4]    > Throwable #1: java.lang.Exception: Test abandoned because suite timeout was reached.
[junit4:junit4]    >    at __randomizedtesting.SeedInfo.seed([65EEF14FC2D459BD]:0)
[junit4:junit4]   2> thg 3 22, 2013 8:09:32 CH com.carrotsearch.randomizedtesting.ThreadLeakControl checkThreadLeaks
[junit4:junit4]   2> WARNING: Will linger awaiting termination of 1 leaked thread(s).
[junit4:junit4]   2> thg 3 22, 2013 8:09:52 CH com.carrotsearch.randomizedtesting.ThreadLeakControl checkThreadLeaks
[junit4:junit4]   2> SEVERE: 1 thread leaked from SUITE scope at org.apache.lucene.index.sorter.TestSortingMergePolicy:
[junit4:junit4]   2>    1) Thread[id=23, name=TEST-TestSortingMergePolicy.testSortingMP-seed#[65EEF14FC2D459BD], state=TIMED_WAITING, group=TGRP-TestSortingMergePolicy]
[junit4:junit4]   2>         at java.lang.Object.wait(Native Method)
[junit4:junit4]   2>         at org.apache.lucene.index.IndexWriter.doWait(IndexWriter.java:3907)
[junit4:junit4]   2>         at org.apache.lucene.index.IndexWriter.forceMerge(IndexWriter.java:1684)
[junit4:junit4]   2>         at org.apache.lucene.index.IndexWriter.forceMerge(IndexWriter.java:1610)
[junit4:junit4]   2>         at org.apache.lucene.index.sorter.TestSortingMergePolicy.createRandomIndexes(TestSortingMergePolicy.java:82)
[junit4:junit4]   2>         at org.apache.lucene.index.sorter.TestSortingMergePolicy.setUp(TestSortingMergePolicy.java:51)
[junit4:junit4]   2>         at sun.reflect.GeneratedMethodAccessor6.invoke(Unknown Source)
[junit4:junit4]   2>         at sun.reflect.DelegatingMethodAccessorImpl.invoke(DelegatingMethodAccessorImpl.java:43)
[junit4:junit4]   2>         at java.lang.reflect.Method.invoke(Method.java:601)
[junit4:junit4]   2>         at com.carrotsearch.randomizedtesting.RandomizedRunner.invoke(RandomizedRunner.java:1559)
[junit4:junit4]   2>         at com.carrotsearch.randomizedtesting.RandomizedRunner.access$600(RandomizedRunner.java:79)
[junit4:junit4]   2>         at com.carrotsearch.randomizedtesting.RandomizedRunner$7.evaluate(RandomizedRunner.java:771)
[junit4:junit4]   2>         at com.carrotsearch.randomizedtesting.RandomizedRunner$8.evaluate(RandomizedRunner.java:787)
[junit4:junit4]   2>         at org.apache.lucene.util.TestRuleSetupTeardownChained$1.evaluate(TestRuleSetupTeardownChained.java:50)
[junit4:junit4]   2>         at org.apache.lucene.util.TestRuleFieldCacheSanity$1.evaluate(TestRuleFieldCacheSanity.java:51)
[junit4:junit4]   2>         at org.apache.lucene.util.AbstractBeforeAfterRule$1.evaluate(AbstractBeforeAfterRule.java:46)
[junit4:junit4]   2>         at com.carrotsearch.randomizedtesting.rules.SystemPropertiesInvariantRule$1.evaluate(SystemPropertiesInvariantRule.java:55)
[junit4:junit4]   2>         at org.apache.lucene.util.TestRuleThreadAndTestName$1.evaluate(TestRuleThreadAndTestName.java:49)
[junit4:junit4]   2>         at org.apache.lucene.util.TestRuleIgnoreAfterMaxFailures$1.evaluate(TestRuleIgnoreAfterMaxFailures.java:70)
[junit4:junit4]   2>         at org.apache.lucene.util.TestRuleMarkFailure$1.evaluate(TestRuleMarkFailure.java:48)
[junit4:junit4]   2>         at com.carrotsearch.randomizedtesting.rules.StatementAdapter.evaluate(StatementAdapter.java:36)
[junit4:junit4]   2>         at com.carrotsearch.randomizedtesting.ThreadLeakControl$StatementRunner.run(ThreadLeakControl.java:358)
[junit4:junit4]   2>         at com.carrotsearch.randomizedtesting.ThreadLeakControl.forkTimeoutingTask(ThreadLeakControl.java:782)
[junit4:junit4]   2>         at com.carrotsearch.randomizedtesting.ThreadLeakControl$3.evaluate(ThreadLeakControl.java:442)
[junit4:junit4]   2>         at com.carrotsearch.randomizedtesting.RandomizedRunner.runSingleTest(RandomizedRunner.java:746)
[junit4:junit4]   2>         at com.carrotsearch.randomizedtesting.RandomizedRunner$3.evaluate(RandomizedRunner.java:648)
[junit4:junit4]   2>         at com.carrotsearch.randomizedtesting.RandomizedRunner$4.evaluate(RandomizedRunner.java:682)
[junit4:junit4]   2>         at com.carrotsearch.randomizedtesting.RandomizedRunner$5.evaluate(RandomizedRunner.java:693)
[junit4:junit4]   2>         at org.apache.lucene.util.AbstractBeforeAfterRule$1.evaluate(AbstractBeforeAfterRule.java:46)
[junit4:junit4]   2>         at org.apache.lucene.util.TestRuleStoreClassName$1.evaluate(TestRuleStoreClassName.java:42)
[junit4:junit4]   2>         at com.carrotsearch.randomizedtesting.rules.SystemPropertiesInvariantRule$1.evaluate(SystemPropertiesInvariantRule.java:55)
[junit4:junit4]   2>         at com.carrotsearch.randomizedtesting.rules.NoShadowingOrOverridesOnMethodsRule$1.evaluate(NoShadowingOrOverridesOnMethodsRule.java:39)
[junit4:junit4]   2>         at com.carrotsearch.randomizedtesting.rules.NoShadowingOrOverridesOnMethodsRule$1.evaluate(NoShadowingOrOverridesOnMethodsRule.java:39)
[junit4:junit4]   2>         at com.carrotsearch.randomizedtesting.rules.StatementAdapter.evaluate(StatementAdapter.java:36)
[junit4:junit4]   2>         at org.apache.lucene.util.TestRuleAssertionsRequired$1.evaluate(TestRuleAssertionsRequired.java:43)
[junit4:junit4]   2>         at org.apache.lucene.util.TestRuleMarkFailure$1.evaluate(TestRuleMarkFailure.java:48)
[junit4:junit4]   2>         at org.apache.lucene.util.TestRuleIgnoreAfterMaxFailures$1.evaluate(TestRuleIgnoreAfterMaxFailures.java:70)
[junit4:junit4]   2>         at org.apache.lucene.util.TestRuleIgnoreTestSuites$1.evaluate(TestRuleIgnoreTestSuites.java:55)
[junit4:junit4]   2>         at com.carrotsearch.randomizedtesting.rules.StatementAdapter.evaluate(StatementAdapter.java:36)
[junit4:junit4]   2>         at com.carrotsearch.randomizedtesting.ThreadLeakControl$StatementRunner.run(ThreadLeakControl.java:358)
[junit4:junit4]   2>         at java.lang.Thread.run(Thread.java:722)
[junit4:junit4]   2> thg 3 22, 2013 8:09:52 CH com.carrotsearch.randomizedtesting.ThreadLeakControl tryToInterruptAll
[junit4:junit4]   2> INFO: Starting to interrupt leaked threads:
[junit4:junit4]   2>    1) Thread[id=23, name=TEST-TestSortingMergePolicy.testSortingMP-seed#[65EEF14FC2D459BD], state=TIMED_WAITING, group=TGRP-TestSortingMergePolicy]
[junit4:junit4]   2> Mar 22, 2013 6:09:52 PM com.carrotsearch.randomizedtesting.ThreadLeakControl tryToInterruptAll
[junit4:junit4]   2> INFO: All leaked threads terminated.
[junit4:junit4]   2> NOTE: test params are: codec=Lucene42: {s=Pulsing41(freqCutoff=15 minBlockSize=73 maxBlockSize=159)}, docValues:{ndv=DocValuesFormat(name=Lucene42)}, sim=RandomSimilarityProvider(queryNorm=false,coord=yes): {}, locale=vi_VN, timezone=Europe/Mariehamn
[junit4:junit4]   2> NOTE: Linux 3.2.0-39-generic amd64/Oracle Corporation 1.7.0_15 (64-bit)/cpus=8,threads=1,free=93349800,total=126418944
[junit4:junit4]   2> NOTE: All tests run in this JVM: [SweetSpotSimilarityTest, SortingAtomicReaderTest, TestIndexSplitter, TestPKIndexSplitter, TestMultiPassIndexSplitter, IndexSortingTest, TestSortingMergePolicy]
[junit4:junit4]   2> NOTE: reproduce with: ant test  -Dtestcase=TestSortingMergePolicy -Dtests.seed=65EEF14FC2D459BD -Dtests.multiplier=3 -Dtests.slow=true -Dtests.locale=vi_VN -Dtests.timezone=Europe/Mariehamn -Dtests.file.encoding=UTF-8
[junit4:junit4] ERROR   0.00s J1 | TestSortingMergePolicy (suite) <<<
[junit4:junit4]    > Throwable #1: java.lang.Exception: Suite timeout exceeded (>= 7200000 msec).
[junit4:junit4]    >    at __randomizedtesting.SeedInfo.seed([65EEF14FC2D459BD]:0)
[junit4:junit4]    > Throwable #2: com.carrotsearch.randomizedtesting.UncaughtExceptionError: Captured an uncaught exception in thread: Thread[id=29, name=Lucene Merge Thread #5, state=RUNNABLE, group=TGRP-TestSortingMergePolicy]
[junit4:junit4]    > Caused by: org.apache.lucene.index.MergePolicy$MergeException: java.lang.AssertionError: info.dir=MockDirWrapper(org.apache.lucene.store.RAMDirectory@587b25cc lockFactory=org.apache.lucene.store.SingleInstanceLockFactory@7ceea175) vs MockDirWrapper(org.apache.lucene.store.RAMDirectory@4ae2bafc lockFactory=org.apache.lucene.store.SingleInstanceLockFactory@6b621ccc)
[junit4:junit4]    >    at __randomizedtesting.SeedInfo.seed([65EEF14FC2D459BD]:0)
[junit4:junit4]    >    at org.apache.lucene.index.ConcurrentMergeScheduler.handleMergeException(ConcurrentMergeScheduler.java:541)
[junit4:junit4]    >    at org.apache.lucene.index.ConcurrentMergeScheduler$MergeThread.run(ConcurrentMergeScheduler.java:514)
[junit4:junit4]    > Caused by: java.lang.AssertionError: info.dir=MockDirWrapper(org.apache.lucene.store.RAMDirectory@587b25cc lockFactory=org.apache.lucene.store.SingleInstanceLockFactory@7ceea175) vs MockDirWrapper(org.apache.lucene.store.RAMDirectory@4ae2bafc lockFactory=org.apache.lucene.store.SingleInstanceLockFactory@6b621ccc)
[junit4:junit4]    >    at org.apache.lucene.index.IndexWriter$ReaderPool.get(IndexWriter.java:531)
[junit4:junit4]    >    at org.apache.lucene.index.IndexWriter.numDeletedDocs(IndexWriter.java:563)
[junit4:junit4]    >    at org.apache.lucene.index.IndexWriter.segString(IndexWriter.java:3896)
[junit4:junit4]    >    at org.apache.lucene.index.IndexWriter.segString(IndexWriter.java:3886)
[junit4:junit4]    >    at org.apache.lucene.index.IndexWriter.handleMergeException(IndexWriter.java:3243)
[junit4:junit4]    >    at org.apache.lucene.index.IndexWriter.merge(IndexWriter.java:3300)
[junit4:junit4]    >    at org.apache.lucene.index.ConcurrentMergeScheduler.doMerge(ConcurrentMergeScheduler.java:401)
[junit4:junit4]    >    at org.apache.lucene.index.ConcurrentMergeScheduler$MergeThread.run(ConcurrentMergeScheduler.java:478)
[junit4:junit4] Completed on J1 in 7220.15s, 1 test, 3 errors <<< FAILURES!

[...truncated 11 lines...]
BUILD FAILED
/mnt/ssd/jenkins/workspace/Lucene-Solr-4.x-Linux/build.xml:381: The following error occurred while executing this line:
/mnt/ssd/jenkins/workspace/Lucene-Solr-4.x-Linux/build.xml:361: The following error occurred while executing this line:
/mnt/ssd/jenkins/workspace/Lucene-Solr-4.x-Linux/build.xml:39: The following error occurred while executing this line:
/mnt/ssd/jenkins/workspace/Lucene-Solr-4.x-Linux/lucene/build.xml:548: The following error occurred while executing this line:
/mnt/ssd/jenkins/workspace/Lucene-Solr-4.x-Linux/lucene/common-build.xml:1757: The following error occurred while executing this line:
/mnt/ssd/jenkins/workspace/Lucene-Solr-4.x-Linux/lucene/module-build.xml:61: The following error occurred while executing this line:
/mnt/ssd/jenkins/workspace/Lucene-Solr-4.x-Linux/lucene/common-build.xml:1213: The following error occurred while executing this line:
/mnt/ssd/jenkins/workspace/Lucene-Solr-4.x-Linux/lucene/common-build.xml:877: There were test failures: 10 suites, 39 tests, 2 suite-level errors, 1 error, 1 ignored (1 assumption)

Total time: 140 minutes 52 seconds
Build step 'Invoke Ant' marked build as failure
Archiving artifacts
Recording test results
Description set: Java: 64bit/jdk1.7.0_15 -XX:+UseConcMarkSweepGC
Email was triggered for: Failure
Sending email for trigger: Failure