lucene-dev mailing list archives

Site index · List index
Message view « Date » · « Thread »
Top « Date » · « Thread »
From Robert Muir <rcm...@gmail.com>
Subject Re: [JENKINS] Lucene-Solr-trunk-Linux (32bit/jdk1.7.0_15) - Build # 4610 - Still Failing!
Date Thu, 07 Mar 2013 22:51:02 GMT
I ran this seed thousand of times on my mac (different os, 64bit,
older jvm version).  when I get home I'll investigate this one on
linux and try to reproduce the failure with the exact configuration.

On Thu, Mar 7, 2013 at 7:37 AM, Robert Muir <rcmuir@gmail.com> wrote:
> does not look good!
>
> On Thu, Mar 7, 2013 at 7:01 AM, Policeman Jenkins Server
> <jenkins@thetaphi.de> wrote:
>> Build: http://jenkins.thetaphi.de/job/Lucene-Solr-trunk-Linux/4610/
>> Java: 32bit/jdk1.7.0_15 -server -XX:+UseG1GC
>>
>> 1 tests failed.
>> REGRESSION:  org.apache.lucene.search.grouping.TestGrouping.testRandom
>>
>> Error Message:
>> doc=113 maxDoc=111
>>
>> Stack Trace:
>> java.lang.AssertionError: doc=113 maxDoc=111
>>         at __randomizedtesting.SeedInfo.seed([574847AF1A4DABEC:250462A0AB2D1D9F]:0)
>>         at org.apache.lucene.index.FreqProxTermsWriterPerField.flush(FreqProxTermsWriterPerField.java:456)
>>         at org.apache.lucene.index.FreqProxTermsWriter.flush(FreqProxTermsWriter.java:85)
>>         at org.apache.lucene.index.TermsHash.flush(TermsHash.java:116)
>>         at org.apache.lucene.index.DocInverter.flush(DocInverter.java:53)
>>         at org.apache.lucene.index.DocFieldProcessor.flush(DocFieldProcessor.java:81)
>>         at org.apache.lucene.index.DocumentsWriterPerThread.flush(DocumentsWriterPerThread.java:494)
>>         at org.apache.lucene.index.DocumentsWriter.doFlush(DocumentsWriter.java:422)
>>         at org.apache.lucene.index.DocumentsWriter.postUpdate(DocumentsWriter.java:316)
>>         at org.apache.lucene.index.DocumentsWriter.updateDocument(DocumentsWriter.java:389)
>>         at org.apache.lucene.index.IndexWriter.updateDocument(IndexWriter.java:1471)
>>         at org.apache.lucene.index.IndexWriter.addDocument(IndexWriter.java:1146)
>>         at org.apache.lucene.index.RandomIndexWriter.addDocument(RandomIndexWriter.java:152)
>>         at org.apache.lucene.index.RandomIndexWriter.addDocument(RandomIndexWriter.java:114)
>>         at org.apache.lucene.search.grouping.TestGrouping.testRandom(TestGrouping.java:738)
>>         at sun.reflect.NativeMethodAccessorImpl.invoke0(Native Method)
>>         at sun.reflect.NativeMethodAccessorImpl.invoke(NativeMethodAccessorImpl.java:57)
>>         at sun.reflect.DelegatingMethodAccessorImpl.invoke(DelegatingMethodAccessorImpl.java:43)
>>         at java.lang.reflect.Method.invoke(Method.java:601)
>>         at com.carrotsearch.randomizedtesting.RandomizedRunner.invoke(RandomizedRunner.java:1559)
>>         at com.carrotsearch.randomizedtesting.RandomizedRunner.access$600(RandomizedRunner.java:79)
>>         at com.carrotsearch.randomizedtesting.RandomizedRunner$6.evaluate(RandomizedRunner.java:737)
>>         at com.carrotsearch.randomizedtesting.RandomizedRunner$7.evaluate(RandomizedRunner.java:773)
>>         at com.carrotsearch.randomizedtesting.RandomizedRunner$8.evaluate(RandomizedRunner.java:787)
>>         at org.apache.lucene.util.TestRuleSetupTeardownChained$1.evaluate(TestRuleSetupTeardownChained.java:50)
>>         at org.apache.lucene.util.TestRuleFieldCacheSanity$1.evaluate(TestRuleFieldCacheSanity.java:51)
>>         at org.apache.lucene.util.AbstractBeforeAfterRule$1.evaluate(AbstractBeforeAfterRule.java:46)
>>         at com.carrotsearch.randomizedtesting.rules.SystemPropertiesInvariantRule$1.evaluate(SystemPropertiesInvariantRule.java:55)
>>         at org.apache.lucene.util.TestRuleThreadAndTestName$1.evaluate(TestRuleThreadAndTestName.java:49)
>>         at org.apache.lucene.util.TestRuleIgnoreAfterMaxFailures$1.evaluate(TestRuleIgnoreAfterMaxFailures.java:70)
>>         at org.apache.lucene.util.TestRuleMarkFailure$1.evaluate(TestRuleMarkFailure.java:48)
>>         at com.carrotsearch.randomizedtesting.rules.StatementAdapter.evaluate(StatementAdapter.java:36)
>>         at com.carrotsearch.randomizedtesting.ThreadLeakControl$StatementRunner.run(ThreadLeakControl.java:358)
>>         at com.carrotsearch.randomizedtesting.ThreadLeakControl.forkTimeoutingTask(ThreadLeakControl.java:782)
>>         at com.carrotsearch.randomizedtesting.ThreadLeakControl$3.evaluate(ThreadLeakControl.java:442)
>>         at com.carrotsearch.randomizedtesting.RandomizedRunner.runSingleTest(RandomizedRunner.java:746)
>>         at com.carrotsearch.randomizedtesting.RandomizedRunner$3.evaluate(RandomizedRunner.java:648)
>>         at com.carrotsearch.randomizedtesting.RandomizedRunner$4.evaluate(RandomizedRunner.java:682)
>>         at com.carrotsearch.randomizedtesting.RandomizedRunner$5.evaluate(RandomizedRunner.java:693)
>>         at org.apache.lucene.util.AbstractBeforeAfterRule$1.evaluate(AbstractBeforeAfterRule.java:46)
>>         at org.apache.lucene.util.TestRuleStoreClassName$1.evaluate(TestRuleStoreClassName.java:42)
>>         at com.carrotsearch.randomizedtesting.rules.SystemPropertiesInvariantRule$1.evaluate(SystemPropertiesInvariantRule.java:55)
>>         at com.carrotsearch.randomizedtesting.rules.NoShadowingOrOverridesOnMethodsRule$1.evaluate(NoShadowingOrOverridesOnMethodsRule.java:39)
>>         at com.carrotsearch.randomizedtesting.rules.NoShadowingOrOverridesOnMethodsRule$1.evaluate(NoShadowingOrOverridesOnMethodsRule.java:39)
>>         at com.carrotsearch.randomizedtesting.rules.StatementAdapter.evaluate(StatementAdapter.java:36)
>>         at org.apache.lucene.util.TestRuleAssertionsRequired$1.evaluate(TestRuleAssertionsRequired.java:43)
>>         at org.apache.lucene.util.TestRuleMarkFailure$1.evaluate(TestRuleMarkFailure.java:48)
>>         at org.apache.lucene.util.TestRuleIgnoreAfterMaxFailures$1.evaluate(TestRuleIgnoreAfterMaxFailures.java:70)
>>         at org.apache.lucene.util.TestRuleIgnoreTestSuites$1.evaluate(TestRuleIgnoreTestSuites.java:55)
>>         at com.carrotsearch.randomizedtesting.rules.StatementAdapter.evaluate(StatementAdapter.java:36)
>>         at com.carrotsearch.randomizedtesting.ThreadLeakControl$StatementRunner.run(ThreadLeakControl.java:358)
>>         at java.lang.Thread.run(Thread.java:722)
>>
>>
>>
>>
>> Build Log:
>> [...truncated 6815 lines...]
>> [junit4:junit4] Suite: org.apache.lucene.search.grouping.TestGrouping
>> [junit4:junit4]   2> NOTE: reproduce with: ant test  -Dtestcase=TestGrouping -Dtests.method=testRandom
-Dtests.seed=574847AF1A4DABEC -Dtests.multiplier=3 -Dtests.slow=true -Dtests.locale=ja_JP
-Dtests.timezone=America/Belem -Dtests.file.encoding=UTF-8
>> [junit4:junit4] FAILURE 6.16s J1 | TestGrouping.testRandom <<<
>> [junit4:junit4]    > Throwable #1: java.lang.AssertionError: doc=113 maxDoc=111
>> [junit4:junit4]    >    at __randomizedtesting.SeedInfo.seed([574847AF1A4DABEC:250462A0AB2D1D9F]:0)
>> [junit4:junit4]    >    at org.apache.lucene.index.FreqProxTermsWriterPerField.flush(FreqProxTermsWriterPerField.java:456)
>> [junit4:junit4]    >    at org.apache.lucene.index.FreqProxTermsWriter.flush(FreqProxTermsWriter.java:85)
>> [junit4:junit4]    >    at org.apache.lucene.index.TermsHash.flush(TermsHash.java:116)
>> [junit4:junit4]    >    at org.apache.lucene.index.DocInverter.flush(DocInverter.java:53)
>> [junit4:junit4]    >    at org.apache.lucene.index.DocFieldProcessor.flush(DocFieldProcessor.java:81)
>> [junit4:junit4]    >    at org.apache.lucene.index.DocumentsWriterPerThread.flush(DocumentsWriterPerThread.java:494)
>> [junit4:junit4]    >    at org.apache.lucene.index.DocumentsWriter.doFlush(DocumentsWriter.java:422)
>> [junit4:junit4]    >    at org.apache.lucene.index.DocumentsWriter.postUpdate(DocumentsWriter.java:316)
>> [junit4:junit4]    >    at org.apache.lucene.index.DocumentsWriter.updateDocument(DocumentsWriter.java:389)
>> [junit4:junit4]    >    at org.apache.lucene.index.IndexWriter.updateDocument(IndexWriter.java:1471)
>> [junit4:junit4]    >    at org.apache.lucene.index.IndexWriter.addDocument(IndexWriter.java:1146)
>> [junit4:junit4]    >    at org.apache.lucene.index.RandomIndexWriter.addDocument(RandomIndexWriter.java:152)
>> [junit4:junit4]    >    at org.apache.lucene.index.RandomIndexWriter.addDocument(RandomIndexWriter.java:114)
>> [junit4:junit4]    >    at org.apache.lucene.search.grouping.TestGrouping.testRandom(TestGrouping.java:738)
>> [junit4:junit4]    >    at sun.reflect.NativeMethodAccessorImpl.invoke0(Native
Method)
>> [junit4:junit4]    >    at sun.reflect.NativeMethodAccessorImpl.invoke(NativeMethodAccessorImpl.java:57)
>> [junit4:junit4]    >    at sun.reflect.DelegatingMethodAccessorImpl.invoke(DelegatingMethodAccessorImpl.java:43)
>> [junit4:junit4]    >    at java.lang.reflect.Method.invoke(Method.java:601)
>> [junit4:junit4]    >    at com.carrotsearch.randomizedtesting.RandomizedRunner.invoke(RandomizedRunner.java:1559)
>> [junit4:junit4]    >    at com.carrotsearch.randomizedtesting.RandomizedRunner.access$600(RandomizedRunner.java:79)
>> [junit4:junit4]    >    at com.carrotsearch.randomizedtesting.RandomizedRunner$6.evaluate(RandomizedRunner.java:737)
>> [junit4:junit4]    >    at com.carrotsearch.randomizedtesting.RandomizedRunner$7.evaluate(RandomizedRunner.java:773)
>> [junit4:junit4]    >    at com.carrotsearch.randomizedtesting.RandomizedRunner$8.evaluate(RandomizedRunner.java:787)
>> [junit4:junit4]    >    at org.apache.lucene.util.TestRuleSetupTeardownChained$1.evaluate(TestRuleSetupTeardownChained.java:50)
>> [junit4:junit4]    >    at org.apache.lucene.util.TestRuleFieldCacheSanity$1.evaluate(TestRuleFieldCacheSanity.java:51)
>> [junit4:junit4]    >    at org.apache.lucene.util.AbstractBeforeAfterRule$1.evaluate(AbstractBeforeAfterRule.java:46)
>> [junit4:junit4]    >    at com.carrotsearch.randomizedtesting.rules.SystemPropertiesInvariantRule$1.evaluate(SystemPropertiesInvariantRule.java:55)
>> [junit4:junit4]    >    at org.apache.lucene.util.TestRuleThreadAndTestName$1.evaluate(TestRuleThreadAndTestName.java:49)
>> [junit4:junit4]    >    at org.apache.lucene.util.TestRuleIgnoreAfterMaxFailures$1.evaluate(TestRuleIgnoreAfterMaxFailures.java:70)
>> [junit4:junit4]    >    at org.apache.lucene.util.TestRuleMarkFailure$1.evaluate(TestRuleMarkFailure.java:48)
>> [junit4:junit4]    >    at com.carrotsearch.randomizedtesting.rules.StatementAdapter.evaluate(StatementAdapter.java:36)
>> [junit4:junit4]    >    at com.carrotsearch.randomizedtesting.ThreadLeakControl$StatementRunner.run(ThreadLeakControl.java:358)
>> [junit4:junit4]    >    at com.carrotsearch.randomizedtesting.ThreadLeakControl.forkTimeoutingTask(ThreadLeakControl.java:782)
>> [junit4:junit4]    >    at com.carrotsearch.randomizedtesting.ThreadLeakControl$3.evaluate(ThreadLeakControl.java:442)
>> [junit4:junit4]    >    at com.carrotsearch.randomizedtesting.RandomizedRunner.runSingleTest(RandomizedRunner.java:746)
>> [junit4:junit4]    >    at com.carrotsearch.randomizedtesting.RandomizedRunner$3.evaluate(RandomizedRunner.java:648)
>> [junit4:junit4]    >    at com.carrotsearch.randomizedtesting.RandomizedRunner$4.evaluate(RandomizedRunner.java:682)
>> [junit4:junit4]    >    at com.carrotsearch.randomizedtesting.RandomizedRunner$5.evaluate(RandomizedRunner.java:693)
>> [junit4:junit4]    >    at org.apache.lucene.util.AbstractBeforeAfterRule$1.evaluate(AbstractBeforeAfterRule.java:46)
>> [junit4:junit4]    >    at org.apache.lucene.util.TestRuleStoreClassName$1.evaluate(TestRuleStoreClassName.java:42)
>> [junit4:junit4]    >    at com.carrotsearch.randomizedtesting.rules.SystemPropertiesInvariantRule$1.evaluate(SystemPropertiesInvariantRule.java:55)
>> [junit4:junit4]    >    at com.carrotsearch.randomizedtesting.rules.NoShadowingOrOverridesOnMethodsRule$1.evaluate(NoShadowingOrOverridesOnMethodsRule.java:39)
>> [junit4:junit4]    >    at com.carrotsearch.randomizedtesting.rules.NoShadowingOrOverridesOnMethodsRule$1.evaluate(NoShadowingOrOverridesOnMethodsRule.java:39)
>> [junit4:junit4]    >    at com.carrotsearch.randomizedtesting.rules.StatementAdapter.evaluate(StatementAdapter.java:36)
>> [junit4:junit4]    >    at org.apache.lucene.util.TestRuleAssertionsRequired$1.evaluate(TestRuleAssertionsRequired.java:43)
>> [junit4:junit4]    >    at org.apache.lucene.util.TestRuleMarkFailure$1.evaluate(TestRuleMarkFailure.java:48)
>> [junit4:junit4]    >    at org.apache.lucene.util.TestRuleIgnoreAfterMaxFailures$1.evaluate(TestRuleIgnoreAfterMaxFailures.java:70)
>> [junit4:junit4]    >    at org.apache.lucene.util.TestRuleIgnoreTestSuites$1.evaluate(TestRuleIgnoreTestSuites.java:55)
>> [junit4:junit4]    >    at com.carrotsearch.randomizedtesting.rules.StatementAdapter.evaluate(StatementAdapter.java:36)
>> [junit4:junit4]    >    at com.carrotsearch.randomizedtesting.ThreadLeakControl$StatementRunner.run(ThreadLeakControl.java:358)
>> [junit4:junit4]    >    at java.lang.Thread.run(Thread.java:722)
>> [junit4:junit4]   2> NOTE: test params are: codec=HighCompressionCompressingStoredFields(storedFieldsFormat=CompressingStoredFieldsFormat(compressionMode=HIGH_COMPRESSION,
chunkSize=339), termVectorsFormat=CompressingTermVectorsFormat(compressionMode=HIGH_COMPRESSION,
chunkSize=339)), sim=RandomSimilarityProvider(queryNorm=true,coord=crazy): {content=DFR I(F)B1,
author=DFR I(n)B2}, locale=ja_JP, timezone=America/Belem
>> [junit4:junit4]   2> NOTE: Linux 3.2.0-38-generic i386/Oracle Corporation 1.7.0_15
(32-bit)/cpus=8,threads=1,free=22597672,total=67108864
>> [junit4:junit4]   2> NOTE: All tests run in this JVM: [AllGroupsCollectorTest,
AllGroupHeadsCollectorTest, TestGrouping]
>> [junit4:junit4] Completed on J1 in 6.25s, 2 tests, 1 failure <<< FAILURES!
>>
>> [...truncated 17 lines...]
>> BUILD FAILED
>> /mnt/ssd/jenkins/workspace/Lucene-Solr-trunk-Linux/build.xml:381: The following error
occurred while executing this line:
>> /mnt/ssd/jenkins/workspace/Lucene-Solr-trunk-Linux/build.xml:361: The following error
occurred while executing this line:
>> /mnt/ssd/jenkins/workspace/Lucene-Solr-trunk-Linux/build.xml:39: The following error
occurred while executing this line:
>> /mnt/ssd/jenkins/workspace/Lucene-Solr-trunk-Linux/lucene/build.xml:548: The following
error occurred while executing this line:
>> /mnt/ssd/jenkins/workspace/Lucene-Solr-trunk-Linux/lucene/common-build.xml:1758:
The following error occurred while executing this line:
>> /mnt/ssd/jenkins/workspace/Lucene-Solr-trunk-Linux/lucene/module-build.xml:61: The
following error occurred while executing this line:
>> /mnt/ssd/jenkins/workspace/Lucene-Solr-trunk-Linux/lucene/common-build.xml:1213:
The following error occurred while executing this line:
>> /mnt/ssd/jenkins/workspace/Lucene-Solr-trunk-Linux/lucene/common-build.xml:877: There
were test failures: 6 suites, 12 tests, 1 failure
>>
>> Total time: 23 minutes 44 seconds
>> Build step 'Invoke Ant' marked build as failure
>> Archiving artifacts
>> Recording test results
>> Description set: Java: 32bit/jdk1.7.0_15 -server -XX:+UseG1GC
>> Email was triggered for: Failure
>> Sending email for trigger: Failure
>>
>>
>>
>>
>> ---------------------------------------------------------------------
>> To unsubscribe, e-mail: dev-unsubscribe@lucene.apache.org
>> For additional commands, e-mail: dev-help@lucene.apache.org

---------------------------------------------------------------------
To unsubscribe, e-mail: dev-unsubscribe@lucene.apache.org
For additional commands, e-mail: dev-help@lucene.apache.org


Mime
View raw message