lucene-dev mailing list archives

Site index · List index
Message view « Date » · « Thread »
Top « Date » · « Thread »
From Robert Muir <rm...@apache.org>
Subject Re: [JENKINS] Lucene-Solr-4.x-MacOSX (64bit/jdk1.7.0) - Build # 296 - Failure!
Date Mon, 11 Mar 2013 04:39:01 GMT
I think this is caused by my commit of LUCENE-4819

Its funny that a trivial test like this found whatever the bug is, and
not crazier tests. I'll figure that out too.

On Mon, Mar 11, 2013 at 12:09 AM, Policeman Jenkins Server
<jenkins@thetaphi.de> wrote:
> Build: http://jenkins.thetaphi.de/job/Lucene-Solr-4.x-MacOSX/296/
> Java: 64bit/jdk1.7.0 -XX:+UseConcMarkSweepGC
>
> 2 tests failed.
> REGRESSION:  org.apache.solr.schema.DocValuesTest.testDocValuesMatch
>
> Error Message:
> Test abandoned because suite timeout was reached.
>
> Stack Trace:
> java.lang.Exception: Test abandoned because suite timeout was reached.
>         at __randomizedtesting.SeedInfo.seed([9C7CF1122999BD17]:0)
>
>
> FAILED:  junit.framework.TestSuite.org.apache.solr.schema.DocValuesTest
>
> Error Message:
> Suite timeout exceeded (>= 7200000 msec).
>
> Stack Trace:
> java.lang.Exception: Suite timeout exceeded (>= 7200000 msec).
>         at __randomizedtesting.SeedInfo.seed([9C7CF1122999BD17]:0)
>
>
>
>
> Build Log:
> [...truncated 9254 lines...]
> [junit4:junit4] Suite: org.apache.solr.schema.DocValuesTest
> [junit4:junit4]   2> 2 T1732 oas.SolrTestCaseJ4.initCore ####initCore
> [junit4:junit4]   2> Creating dataDir: /Users/jenkins/jenkins-slave/workspace/Lucene-Solr-4.x-MacOSX/solr/build/solr-core/test/J0/./solrtest-DocValuesTest-1362967701604
> [junit4:junit4]   2> 5 T1732 oasc.SolrResourceLoader.<init> new SolrResourceLoader for directory: '/Users/jenkins/jenkins-slave/workspace/Lucene-Solr-4.x-MacOSX/solr/build/solr-core/test-files/solr/collection1/'
> [junit4:junit4]   2> 7 T1732 oasc.SolrResourceLoader.replaceClassLoader Adding 'file:/Users/jenkins/jenkins-slave/workspace/Lucene-Solr-4.x-MacOSX/solr/build/solr-core/test-files/solr/collection1/lib/classes/' to classloader
> [junit4:junit4]   2> 7 T1732 oasc.SolrResourceLoader.replaceClassLoader Adding 'file:/Users/jenkins/jenkins-slave/workspace/Lucene-Solr-4.x-MacOSX/solr/build/solr-core/test-files/solr/collection1/lib/README' to classloader
> [junit4:junit4]   2> 134 T1732 oasc.SolrConfig.<init> Using Lucene MatchVersion: LUCENE_42
> [junit4:junit4]   2> 213 T1732 oasc.SolrConfig.<init> Loaded SolrConfig: solrconfig-basic.xml
> [junit4:junit4]   2> 214 T1732 oass.IndexSchema.readSchema Reading Solr Schema
> [junit4:junit4]   2> 218 T1732 oass.IndexSchema.readSchema Schema name=schema-docValues
> [junit4:junit4]   2> 278 T1732 oass.IndexSchema.readSchema unique key field: id
> [junit4:junit4]   2> 281 T1732 oasc.SolrResourceLoader.locateSolrHome JNDI not configured for solr (NoInitialContextEx)
> [junit4:junit4]   2> 282 T1732 oasc.SolrResourceLoader.locateSolrHome using system property solr.solr.home: /Users/jenkins/jenkins-slave/workspace/Lucene-Solr-4.x-MacOSX/solr/build/solr-core/test-files/solr
> [junit4:junit4]   2> 282 T1732 oasc.SolrResourceLoader.<init> new SolrResourceLoader for directory: '/Users/jenkins/jenkins-slave/workspace/Lucene-Solr-4.x-MacOSX/solr/build/solr-core/test-files/solr/'
> [junit4:junit4]   2> 301 T1732 oasc.CoreContainer.<init> New CoreContainer 1484355223
> [junit4:junit4]   2> 302 T1732 oasc.SolrCore.initDirectoryFactory org.apache.solr.core.MockDirectoryFactory
> [junit4:junit4]   2> 303 T1732 oasc.SolrCore.<init> [collection1] Opening new SolrCore at /Users/jenkins/jenkins-slave/workspace/Lucene-Solr-4.x-MacOSX/solr/build/solr-core/test-files/solr/collection1/, dataDir=/Users/jenkins/jenkins-slave/workspace/Lucene-Solr-4.x-MacOSX/solr/build/solr-core/test/J0/./solrtest-DocValuesTest-1362967701604/
> [junit4:junit4]   2> 303 T1732 oasc.SolrCore.<init> JMX monitoring not detected for core: collection1
> [junit4:junit4]   2> 305 T1732 oasc.SolrCore.initDirectoryFactory org.apache.solr.core.MockDirectoryFactory
> [junit4:junit4]   2> 308 T1732 oasc.CachingDirectoryFactory.get return new directory for /Users/jenkins/jenkins-slave/workspace/Lucene-Solr-4.x-MacOSX/solr/build/solr-core/test/J0/./solrtest-DocValuesTest-1362967701604 forceNew: false
> [junit4:junit4]   2> 309 T1732 oasc.SolrCore.getNewIndexDir New index directory detected: old=null new=/Users/jenkins/jenkins-slave/workspace/Lucene-Solr-4.x-MacOSX/solr/build/solr-core/test/J0/./solrtest-DocValuesTest-1362967701604/index/
> [junit4:junit4]   2> 310 T1732 oasc.SolrCore.initIndex WARNING [collection1] Solr index directory '/Users/jenkins/jenkins-slave/workspace/Lucene-Solr-4.x-MacOSX/solr/build/solr-core/test/J0/./solrtest-DocValuesTest-1362967701604/index' doesn't exist. Creating new index...
> [junit4:junit4]   2> 312 T1732 oasc.CachingDirectoryFactory.get return new directory for /Users/jenkins/jenkins-slave/workspace/Lucene-Solr-4.x-MacOSX/solr/build/solr-core/test/J0/./solrtest-DocValuesTest-1362967701604/index forceNew: false
> [junit4:junit4]   2> 316 T1732 oasc.SolrDeletionPolicy.onCommit SolrDeletionPolicy.onCommit: commits:num=1
> [junit4:junit4]   2>            commit{dir=MockDirWrapper(org.apache.lucene.store.RAMDirectory@436e0811 lockFactory=org.apache.lucene.store.NativeFSLockFactory@3f7e0e05),segFN=segments_1,generation=1,filenames=[segments_1]
> [junit4:junit4]   2> 317 T1732 oasc.SolrDeletionPolicy.updateCommits newest commit = 1[segments_1]
> [junit4:junit4]   2> 320 T1732 oasc.RequestHandlers.initHandlersFromConfig created standard: solr.StandardRequestHandler
> [junit4:junit4]   2> 326 T1732 oass.SolrIndexSearcher.<init> Opening Searcher@1aaed82e main
> [junit4:junit4]   2> 326 T1732 oasu.CommitTracker.<init> Hard AutoCommit: disabled
> [junit4:junit4]   2> 327 T1732 oasu.CommitTracker.<init> Soft AutoCommit: disabled
> [junit4:junit4]   2> 328 T1733 oasc.SolrCore.registerSearcher [collection1] Registered new searcher Searcher@1aaed82e main{StandardDirectoryReader(segments_1:1)}
> [junit4:junit4]   2> 328 T1732 oasc.CoreContainer.registerCore registering core: collection1
> [junit4:junit4]   2> 338 T1732 oas.SolrTestCaseJ4.initCore ####initCore end
> [junit4:junit4]   2> 346 T1732 oas.SolrTestCaseJ4.setUp ###Starting testDocValues
> [junit4:junit4]   2> ASYNC  NEW_CORE C69 name=collection1 org.apache.solr.core.SolrCore@d9e5aba
> [junit4:junit4]   2> 353 T1732 C69 oasu.DirectUpdateHandler2.deleteAll [collection1] REMOVING ALL DOCUMENTS FROM INDEX
> [junit4:junit4]   2> 357 T1732 C69 oasc.SolrDeletionPolicy.onInit SolrDeletionPolicy.onInit: commits:num=1
> [junit4:junit4]   2>            commit{dir=MockDirWrapper(org.apache.lucene.store.RAMDirectory@436e0811 lockFactory=org.apache.lucene.store.NativeFSLockFactory@3f7e0e05),segFN=segments_1,generation=1,filenames=[segments_1]
> [junit4:junit4]   2> 359 T1732 C69 oasc.SolrDeletionPolicy.updateCommits newest commit = 1[segments_1]
> [junit4:junit4]   2> 361 T1732 C69 UPDATE [collection1] webapp=null path=null params={} {deleteByQuery=*:*} 0 9
> [junit4:junit4]   2> 398 T1732 C69 UPDATE [collection1] webapp=null path=null params={} {add=[1]} 0 10
> [junit4:junit4]   2> 496 T1732 oass.SolrIndexSearcher.<init> Opening Searcher@de2a9e0 realtime
> [junit4:junit4]   2> 528 T1732 oas.SolrTestCaseJ4.tearDown ###Ending testDocValues
> [junit4:junit4]   2> 540 T1732 oas.SolrTestCaseJ4.setUp ###Starting testDocValuesFaceting
> [junit4:junit4]   2> 552 T1732 C69 oasu.DirectUpdateHandler2.deleteAll [collection1] REMOVING ALL DOCUMENTS FROM INDEX
> [junit4:junit4]   2> 555 T1732 C69 UPDATE [collection1] webapp=null path=null params={} {deleteByQuery=*:*} 0 3
> [junit4:junit4]   2> 568 T1732 C69 UPDATE [collection1] webapp=null path=null params={} {add=[0]} 0 2
> [junit4:junit4]   2> 581 T1732 C69 UPDATE [collection1] webapp=null path=null params={} {add=[1]} 0 1
> [junit4:junit4]   2> 593 T1732 C69 UPDATE [collection1] webapp=null path=null params={} {add=[2]} 0 1
> [junit4:junit4]   2> 606 T1732 C69 UPDATE [collection1] webapp=null path=null params={} {add=[3]} 0 1
> [junit4:junit4]   2> 631 T1732 C69 UPDATE [collection1] webapp=null path=null params={} {add=[4]} 0 3
> [junit4:junit4]   2> 643 T1732 C69 UPDATE [collection1] webapp=null path=null params={} {add=[5]} 0 1
> [junit4:junit4]   2> 654 T1732 C69 UPDATE [collection1] webapp=null path=null params={} {add=[6]} 0 1
> [junit4:junit4]   2> 662 T1732 C69 UPDATE [collection1] webapp=null path=null params={} {add=[7]} 0 1
> [junit4:junit4]   2> 669 T1732 C69 UPDATE [collection1] webapp=null path=null params={} {add=[8]} 0 1
> [junit4:junit4]   2> 677 T1732 C69 UPDATE [collection1] webapp=null path=null params={} {add=[9]} 0 1
> [junit4:junit4]   2> 685 T1732 C69 UPDATE [collection1] webapp=null path=null params={} {add=[10]} 0 1
> [junit4:junit4]   2> 693 T1732 C69 UPDATE [collection1] webapp=null path=null params={} {add=[11]} 0 1
> [junit4:junit4]   2> 699 T1732 C69 UPDATE [collection1] webapp=null path=null params={} {add=[12]} 0 0
> [junit4:junit4]   2> 705 T1732 C69 UPDATE [collection1] webapp=null path=null params={} {add=[13]} 0 0
> [junit4:junit4]   2> 712 T1732 C69 UPDATE [collection1] webapp=null path=null params={} {add=[14]} 0 1
> [junit4:junit4]   2> 732 T1732 C69 UPDATE [collection1] webapp=null path=null params={} {add=[15]} 0 1
> [junit4:junit4]   2> 744 T1732 C69 UPDATE [collection1] webapp=null path=null params={} {add=[16]} 0 2
> [junit4:junit4]   2> 756 T1732 C69 UPDATE [collection1] webapp=null path=null params={} {add=[17]} 0 1
> [junit4:junit4]   2> 769 T1732 C69 UPDATE [collection1] webapp=null path=null params={} {add=[18]} 0 1
> [junit4:junit4]   2> 778 T1732 C69 UPDATE [collection1] webapp=null path=null params={} {add=[19]} 0 1
> [junit4:junit4]   2> 786 T1732 C69 UPDATE [collection1] webapp=null path=null params={} {add=[20]} 0 1
> [junit4:junit4]   2> 795 T1732 C69 UPDATE [collection1] webapp=null path=null params={} {add=[21]} 0 1
> [junit4:junit4]   2> 808 T1732 C69 UPDATE [collection1] webapp=null path=null params={} {add=[22]} 0 1
> [junit4:junit4]   2> 821 T1732 C69 UPDATE [collection1] webapp=null path=null params={} {add=[23]} 0 1
> [junit4:junit4]   2> 835 T1732 C69 UPDATE [collection1] webapp=null path=null params={} {add=[24]} 0 2
> [junit4:junit4]   2> 847 T1732 C69 UPDATE [collection1] webapp=null path=null params={} {add=[25]} 0 1
> [junit4:junit4]   2> 865 T1732 C69 UPDATE [collection1] webapp=null path=null params={} {add=[26]} 0 1
> [junit4:junit4]   2> 873 T1732 C69 UPDATE [collection1] webapp=null path=null params={} {add=[27]} 0 1
> [junit4:junit4]   2> 880 T1732 C69 UPDATE [collection1] webapp=null path=null params={} {add=[28]} 0 1
> [junit4:junit4]   2> 886 T1732 C69 UPDATE [collection1] webapp=null path=null params={} {add=[29]} 0 0
> [junit4:junit4]   2> 895 T1732 C69 UPDATE [collection1] webapp=null path=null params={} {add=[30]} 0 1
> [junit4:junit4]   2> 902 T1732 C69 UPDATE [collection1] webapp=null path=null params={} {add=[31]} 0 1
> [junit4:junit4]   2> 907 T1732 C69 UPDATE [collection1] webapp=null path=null params={} {add=[32]} 0 1
> [junit4:junit4]   2> 915 T1732 C69 UPDATE [collection1] webapp=null path=null params={} {add=[33]} 0 1
> [junit4:junit4]   2> 929 T1732 C69 UPDATE [collection1] webapp=null path=null params={} {add=[34]} 0 1
> [junit4:junit4]   2> 942 T1732 C69 UPDATE [collection1] webapp=null path=null params={} {add=[35]} 0 2
> [junit4:junit4]   2> 955 T1732 C69 UPDATE [collection1] webapp=null path=null params={} {add=[36]} 0 1
> [junit4:junit4]   2> 968 T1732 C69 UPDATE [collection1] webapp=null path=null params={} {add=[37]} 0 1
> [junit4:junit4]   2> 974 T1732 C69 UPDATE [collection1] webapp=null path=null params={} {add=[38]} 0 1
> [junit4:junit4]   2> 981 T1732 C69 UPDATE [collection1] webapp=null path=null params={} {add=[39]} 0 1
> [junit4:junit4]   2> 987 T1732 C69 UPDATE [collection1] webapp=null path=null params={} {add=[40]} 0 0
> [junit4:junit4]   2> 994 T1732 C69 UPDATE [collection1] webapp=null path=null params={} {add=[41]} 0 0
> [junit4:junit4]   2> 1000 T1732 C69 UPDATE [collection1] webapp=null path=null params={} {add=[42]} 0 0
> [junit4:junit4]   2> 1008 T1732 C69 UPDATE [collection1] webapp=null path=null params={} {add=[43]} 0 0
> [junit4:junit4]   2> 1018 T1732 C69 UPDATE [collection1] webapp=null path=null params={} {add=[44]} 0 0
> [junit4:junit4]   2> 1027 T1732 C69 UPDATE [collection1] webapp=null path=null params={} {add=[45]} 0 1
> [junit4:junit4]   2> 1035 T1732 C69 UPDATE [collection1] webapp=null path=null params={} {add=[46]} 0 1
> [junit4:junit4]   2> 1044 T1732 C69 UPDATE [collection1] webapp=null path=null params={} {add=[47]} 0 2
> [junit4:junit4]   2> 1060 T1732 C69 UPDATE [collection1] webapp=null path=null params={} {add=[48]} 0 1
> [junit4:junit4]   2> 1070 T1732 C69 UPDATE [collection1] webapp=null path=null params={} {add=[49]} 0 2
> [junit4:junit4]   2> 1079 T1732 C69 UPDATE [collection1] webapp=null path=null params={} {add=[10000]} 0 1
> [junit4:junit4]   2> 1088 T1732 C69 UPDATE [collection1] webapp=null path=null params={} {add=[10001]} 0 1
> [junit4:junit4]   2> 1097 T1732 C69 UPDATE [collection1] webapp=null path=null params={} {add=[10002]} 0 1
> [junit4:junit4]   2> 1107 T1732 C69 UPDATE [collection1] webapp=null path=null params={} {add=[10003]} 0 1
> [junit4:junit4]   2> 1117 T1732 C69 UPDATE [collection1] webapp=null path=null params={} {add=[10004]} 0 1
> [junit4:junit4]   2> 1126 T1732 C69 UPDATE [collection1] webapp=null path=null params={} {add=[10005]} 0 1
> [junit4:junit4]   2> 1135 T1732 C69 UPDATE [collection1] webapp=null path=null params={} {add=[10006]} 0 2
> [junit4:junit4]   2> 1145 T1732 C69 UPDATE [collection1] webapp=null path=null params={} {add=[10007]} 0 1
> [junit4:junit4]   2> 1154 T1732 C69 UPDATE [collection1] webapp=null path=null params={} {add=[10008]} 0 1
> [junit4:junit4]   2> 1171 T1732 C69 UPDATE [collection1] webapp=null path=null params={} {add=[10009]} 0 1
> [junit4:junit4]   2> 1183 T1732 C69 UPDATE [collection1] webapp=null path=null params={} {add=[100010]} 0 2
> [junit4:junit4]   2> 1195 T1732 C69 UPDATE [collection1] webapp=null path=null params={} {add=[100011]} 0 1
> [junit4:junit4]   2> 1208 T1732 C69 UPDATE [collection1] webapp=null path=null params={} {add=[100012]} 0 1
> [junit4:junit4]   2> 1219 T1732 C69 UPDATE [collection1] webapp=null path=null params={} {add=[100013]} 0 1
> [junit4:junit4]   2> 1227 T1732 C69 UPDATE [collection1] webapp=null path=null params={} {add=[100014]} 0 1
> [junit4:junit4]   2> 1235 T1732 C69 UPDATE [collection1] webapp=null path=null params={} {add=[100015]} 0 1
> [junit4:junit4]   2> 1243 T1732 C69 UPDATE [collection1] webapp=null path=null params={} {add=[100016]} 0 1
> [junit4:junit4]   2> 1251 T1732 C69 UPDATE [collection1] webapp=null path=null params={} {add=[100017]} 0 0
> [junit4:junit4]   2> 1260 T1732 C69 UPDATE [collection1] webapp=null path=null params={} {add=[100018]} 0 1
> [junit4:junit4]   2> 1268 T1732 C69 UPDATE [collection1] webapp=null path=null params={} {add=[100019]} 0 1
> [junit4:junit4]   2> 1281 T1732 C69 UPDATE [collection1] webapp=null path=null params={} {add=[100020]} 0 0
> [junit4:junit4]   2> 1287 T1732 C69 UPDATE [collection1] webapp=null path=null params={} {add=[100021]} 0 1
> [junit4:junit4]   2> 1293 T1732 C69 UPDATE [collection1] webapp=null path=null params={} {add=[100022]} 0 0
> [junit4:junit4]   2> 1299 T1732 C69 UPDATE [collection1] webapp=null path=null params={} {add=[100023]} 0 0
> [junit4:junit4]   2> 1307 T1732 C69 UPDATE [collection1] webapp=null path=null params={} {add=[100024]} 0 0
> [junit4:junit4]   2> 1317 T1732 C69 UPDATE [collection1] webapp=null path=null params={} {add=[100025]} 0 2
> [junit4:junit4]   2> 1329 T1732 C69 UPDATE [collection1] webapp=null path=null params={} {add=[100026]} 0 1
> [junit4:junit4]   2> 1339 T1732 C69 UPDATE [collection1] webapp=null path=null params={} {add=[100027]} 0 1
> [junit4:junit4]   2> 1356 T1732 C69 UPDATE [collection1] webapp=null path=null params={} {add=[100028]} 0 2
> [junit4:junit4]   2> 1370 T1732 C69 UPDATE [collection1] webapp=null path=null params={} {add=[100029]} 0 2
> [junit4:junit4]   2> 1387 T1732 C69 UPDATE [collection1] webapp=null path=null params={} {add=[100030]} 0 2
> [junit4:junit4]   2> 1420 T1732 C69 UPDATE [collection1] webapp=null path=null params={} {add=[100031]} 0 1
> [junit4:junit4]   2> 1435 T1732 C69 UPDATE [collection1] webapp=null path=null params={} {add=[100032]} 0 1
> [junit4:junit4]   2> 1448 T1732 C69 UPDATE [collection1] webapp=null path=null params={} {add=[100033]} 0 1
> [junit4:junit4]   2> 1461 T1732 C69 UPDATE [collection1] webapp=null path=null params={} {add=[100034]} 0 1
> [junit4:junit4]   2> 1475 T1732 C69 UPDATE [collection1] webapp=null path=null params={} {add=[100035]} 0 1
> [junit4:junit4]   2> 1480 T1732 C69 UPDATE [collection1] webapp=null path=null params={} {add=[100036]} 0 1
> [junit4:junit4]   2> 1485 T1732 C69 UPDATE [collection1] webapp=null path=null params={} {add=[100037]} 0 1
> [junit4:junit4]   2> 1490 T1732 C69 UPDATE [collection1] webapp=null path=null params={} {add=[100038]} 0 1
> [junit4:junit4]   2> 1495 T1732 C69 UPDATE [collection1] webapp=null path=null params={} {add=[100039]} 0 0
> [junit4:junit4]   2> 1501 T1732 C69 UPDATE [collection1] webapp=null path=null params={} {add=[100040]} 0 1
> [junit4:junit4]   2> 1508 T1732 C69 UPDATE [collection1] webapp=null path=null params={} {add=[100041]} 0 1
> [junit4:junit4]   2> 1527 T1732 C69 UPDATE [collection1] webapp=null path=null params={} {add=[100042]} 0 1
> [junit4:junit4]   2> 1536 T1732 C69 UPDATE [collection1] webapp=null path=null params={} {add=[100043]} 0 0
> [junit4:junit4]   2> 1547 T1732 C69 UPDATE [collection1] webapp=null path=null params={} {add=[100044]} 0 1
> [junit4:junit4]   2> 1555 T1732 C69 UPDATE [collection1] webapp=null path=null params={} {add=[100045]} 0 1
> [junit4:junit4]   2> 1564 T1732 C69 UPDATE [collection1] webapp=null path=null params={} {add=[100046]} 0 1
> [junit4:junit4]   2> 1572 T1732 C69 UPDATE [collection1] webapp=null path=null params={} {add=[100047]} 0 1
> [junit4:junit4]   2> 1587 T1732 C69 UPDATE [collection1] webapp=null path=null params={} {add=[100048]} 0 1
> [junit4:junit4]   2> 1599 T1732 C69 UPDATE [collection1] webapp=null path=null params={} {add=[100049]} 0 3
> [junit4:junit4]   2> 1606 T1732 C69 oasu.DirectUpdateHandler2.commit start commit{,optimize=false,openSearcher=true,waitSearcher=true,expungeDeletes=false,softCommit=false,prepareCommit=false}
> [junit4:junit4]   2> 1622 T1732 C69 oasc.SolrDeletionPolicy.onCommit SolrDeletionPolicy.onCommit: commits:num=2
> [junit4:junit4]   2>            commit{dir=MockDirWrapper(org.apache.lucene.store.RAMDirectory@436e0811 lockFactory=org.apache.lucene.store.NativeFSLockFactory@3f7e0e05),segFN=segments_1,generation=1,filenames=[segments_1]
> [junit4:junit4]   2>            commit{dir=MockDirWrapper(org.apache.lucene.store.RAMDirectory@436e0811 lockFactory=org.apache.lucene.store.NativeFSLockFactory@3f7e0e05),segFN=segments_2,generation=2,filenames=[_1_Lucene42_0.dvm, _1_CheapBastard_0.dvdd, _1_Asserting_0.doc, _1_Lucene42_0.dvd, _1.fnm, _1_Asserting_0.dvm, _1.fdx, _1_Asserting_0.tim, _1.fdt, _1_Disk_0.dvdd, _1_Asserting_0.tip, _1.si, _1_Asserting_0.dvd, segments_2, _1_CheapBastard_0.dvdm, _1_Disk_0.dvdm]
> [junit4:junit4]   2> 1624 T1732 C69 oasc.SolrDeletionPolicy.updateCommits newest commit = 2[_1_Lucene42_0.dvm, _1_CheapBastard_0.dvdd, _1_Asserting_0.doc, _1_Lucene42_0.dvd, _1.fnm, _1_Asserting_0.dvm, _1.fdx, _1_Asserting_0.tim, _1.fdt, _1_Disk_0.dvdd, _1_Asserting_0.tip, _1.si, _1_Asserting_0.dvd, segments_2, _1_CheapBastard_0.dvdm, _1_Disk_0.dvdm]
> [junit4:junit4]   2> 1628 T1732 C69 oass.SolrIndexSearcher.<init> Opening Searcher@358e68a6 main
> [junit4:junit4]   2> 1632 T1733 oasc.SolrCore.registerSearcher [collection1] Registered new searcher Searcher@358e68a6 main{StandardDirectoryReader(segments_2:7:nrt _1(4.2):C100)}
> [junit4:junit4]   2> 1633 T1732 C69 oasu.DirectUpdateHandler2.commit end_commit_flush
> [junit4:junit4]   2> 1634 T1732 C69 UPDATE [collection1] webapp=null path=null params={} {commit=} 0 28
> [junit4:junit4]   2> 1668 T1732 C69 REQ [collection1] webapp=null path=null params={facet=true&facet.sort=count&q=*:*&facet.limit=1&facet.field=longdv&rows=0} hits=100 status=0 QTime=31
> [junit4:junit4]   2> 1681 T1732 C69 REQ [collection1] webapp=null path=null params={facet=true&facet.offset=1&facet.sort=count&q=*:*&facet.limit=1&facet.field=longdv&rows=0} hits=100 status=0 QTime=1
> [junit4:junit4]   2> 1687 T1732 C69 REQ [collection1] webapp=null path=null params={facet=true&facet.mincount=1&facet.offset=33&facet.sort=index&q=*:*&facet.limit=1&facet.field=longdv&rows=0} hits=100 status=0 QTime=1
> [junit4:junit4]   2> 1695 T1732 C69 REQ [collection1] webapp=null path=null params={facet=true&facet.sort=count&q=*:*&facet.limit=1&facet.field=floatdv&rows=0} hits=100 status=0 QTime=1
> [junit4:junit4]   2> 1718 T1732 C69 REQ [collection1] webapp=null path=null params={facet=true&facet.mincount=1&facet.offset=1&facet.sort=count&q=*:*&facet.limit=-1&facet.field=floatdv&rows=0} hits=100 status=0 QTime=3
> [junit4:junit4]   2> 1726 T1732 C69 REQ [collection1] webapp=null path=null params={facet=true&facet.mincount=1&facet.offset=33&facet.sort=index&q=*:*&facet.limit=1&facet.field=floatdv&rows=0} hits=100 status=0 QTime=1
> [junit4:junit4]   2> 1739 T1732 C69 REQ [collection1] webapp=null path=null params={facet=true&facet.sort=count&q=*:*&facet.limit=1&facet.field=doubledv&rows=0} hits=100 status=0 QTime=1
> [junit4:junit4]   2> 1746 T1732 C69 REQ [collection1] webapp=null path=null params={facet=true&facet.mincount=1&facet.offset=1&facet.sort=count&q=*:*&facet.limit=-1&facet.field=doubledv&rows=0} hits=100 status=0 QTime=3
> [junit4:junit4]   2> 1756 T1732 C69 REQ [collection1] webapp=null path=null params={facet=true&facet.mincount=1&facet.offset=33&facet.sort=index&q=*:*&facet.limit=1&facet.field=doubledv&rows=0} hits=100 status=0 QTime=1
> [junit4:junit4]   2> 1765 T1732 C69 REQ [collection1] webapp=null path=null params={facet=true&facet.sort=count&q=*:*&facet.limit=1&facet.field=intdv&rows=0} hits=100 status=0 QTime=1
> [junit4:junit4]   2> 1772 T1732 C69 REQ [collection1] webapp=null path=null params={facet=true&facet.mincount=1&facet.offset=1&facet.sort=count&q=*:*&facet.limit=-1&facet.field=intdv&rows=0} hits=100 status=0 QTime=4
> [junit4:junit4]   2> 1781 T1732 C69 REQ [collection1] webapp=null path=null params={facet=true&facet.mincount=1&facet.offset=33&facet.sort=index&q=*:*&facet.limit=1&facet.field=intdv&rows=0} hits=100 status=0 QTime=1
> [junit4:junit4]   2> 1793 T1732 C69 REQ [collection1] webapp=null path=null params={facet=true&facet.sort=count&q=*:*&facet.limit=1&facet.field=datedv&rows=0} hits=100 status=0 QTime=7
> [junit4:junit4]   2> 1806 T1732 C69 REQ [collection1] webapp=null path=null params={facet=true&facet.mincount=1&facet.offset=1&facet.sort=count&q=*:*&facet.limit=-1&facet.field=datedv&rows=0} hits=100 status=0 QTime=8
> [junit4:junit4]   2> 1814 T1732 C69 REQ [collection1] webapp=null path=null params={facet=true&facet.mincount=1&facet.offset=33&facet.sort=index&q=*:*&facet.limit=1&facet.field=datedv&rows=0} hits=100 status=0 QTime=1
> [junit4:junit4]   2> 1818 T1732 oas.SolrTestCaseJ4.tearDown ###Ending testDocValuesFaceting
> [junit4:junit4]   2> 1826 T1732 oas.SolrTestCaseJ4.setUp ###Starting testDocValuesStats
> [junit4:junit4]   2> 1836 T1732 C69 oasu.DirectUpdateHandler2.deleteAll [collection1] REMOVING ALL DOCUMENTS FROM INDEX
> [junit4:junit4]   2> 1837 T1732 C69 UPDATE [collection1] webapp=null path=null params={} {deleteByQuery=*:*} 0 1
> [junit4:junit4]   2> 1843 T1732 C69 UPDATE [collection1] webapp=null path=null params={} {add=[10000]} 0 1
> [junit4:junit4]   2> 1854 T1732 C69 UPDATE [collection1] webapp=null path=null params={} {add=[10001]} 0 0
> [junit4:junit4]   2> 1865 T1732 C69 UPDATE [collection1] webapp=null path=null params={} {add=[10002]} 0 1
> [junit4:junit4]   2> 1877 T1732 C69 UPDATE [collection1] webapp=null path=null params={} {add=[10003]} 0 1
> [junit4:junit4]   2> 1891 T1732 C69 UPDATE [collection1] webapp=null path=null params={} {add=[10004]} 0 1
> [junit4:junit4]   2> 1900 T1732 C69 UPDATE [collection1] webapp=null path=null params={} {add=[10005]} 0 1
> [junit4:junit4]   2> 1908 T1732 C69 UPDATE [collection1] webapp=null path=null params={} {add=[10006]} 0 1
> [junit4:junit4]   2> 1916 T1732 C69 UPDATE [collection1] webapp=null path=null params={} {add=[10007]} 0 1
> [junit4:junit4]   2> 1924 T1732 C69 UPDATE [collection1] webapp=null path=null params={} {add=[10008]} 0 0
> [junit4:junit4]   2> 1932 T1732 C69 UPDATE [collection1] webapp=null path=null params={} {add=[10009]} 0 0
> [junit4:junit4]   2> 1940 T1732 C69 UPDATE [collection1] webapp=null path=null params={} {add=[100010]} 0 0
> [junit4:junit4]   2> 1948 T1732 C69 UPDATE [collection1] webapp=null path=null params={} {add=[100011]} 0 0
> [junit4:junit4]   2> 1957 T1732 C69 UPDATE [collection1] webapp=null path=null params={} {add=[100012]} 0 1
> [junit4:junit4]   2> 1965 T1732 C69 UPDATE [collection1] webapp=null path=null params={} {add=[100013]} 0 1
> [junit4:junit4]   2> 1972 T1732 C69 UPDATE [collection1] webapp=null path=null params={} {add=[100014]} 0 1
> [junit4:junit4]   2> 1986 T1732 C69 UPDATE [collection1] webapp=null path=null params={} {add=[100015]} 0 1
> [junit4:junit4]   2> 1994 T1732 C69 UPDATE [collection1] webapp=null path=null params={} {add=[100016]} 0 1
> [junit4:junit4]   2> 2005 T1732 C69 UPDATE [collection1] webapp=null path=null params={} {add=[100017]} 0 2
> [junit4:junit4]   2> 2013 T1732 C69 UPDATE [collection1] webapp=null path=null params={} {add=[100018]} 0 1
> [junit4:junit4]   2> 2020 T1732 C69 UPDATE [collection1] webapp=null path=null params={} {add=[100019]} 0 1
> [junit4:junit4]   2> 2028 T1732 C69 UPDATE [collection1] webapp=null path=null params={} {add=[100020]} 0 1
> [junit4:junit4]   2> 2036 T1732 C69 UPDATE [collection1] webapp=null path=null params={} {add=[100021]} 0 0
> [junit4:junit4]   2> 2044 T1732 C69 UPDATE [collection1] webapp=null path=null params={} {add=[100022]} 0 1
> [junit4:junit4]   2> 2052 T1732 C69 UPDATE [collection1] webapp=null path=null params={} {add=[100023]} 0 1
> [junit4:junit4]   2> 2061 T1732 C69 UPDATE [collection1] webapp=null path=null params={} {add=[100024]} 0 1
> [junit4:junit4]   2> 2071 T1732 C69 UPDATE [collection1] webapp=null path=null params={} {add=[100025]} 0 1
> [junit4:junit4]   2> 2085 T1732 C69 UPDATE [collection1] webapp=null path=null params={} {add=[100026]} 0 1
> [junit4:junit4]   2> 2093 T1732 C69 UPDATE [collection1] webapp=null path=null params={} {add=[100027]} 0 1
> [junit4:junit4]   2> 2104 T1732 C69 UPDATE [collection1] webapp=null path=null params={} {add=[100028]} 0 0
> [junit4:junit4]   2> 2114 T1732 C69 UPDATE [collection1] webapp=null path=null params={} {add=[100029]} 0 0
> [junit4:junit4]   2> 2122 T1732 C69 UPDATE [collection1] webapp=null path=null params={} {add=[100030]} 0 1
> [junit4:junit4]   2> 2130 T1732 C69 UPDATE [collection1] webapp=null path=null params={} {add=[100031]} 0 1
> [junit4:junit4]   2> 2138 T1732 C69 UPDATE [collection1] webapp=null path=null params={} {add=[100032]} 0 1
> [junit4:junit4]   2> 2146 T1732 C69 UPDATE [collection1] webapp=null path=null params={} {add=[100033]} 0 1
> [junit4:junit4]   2> 2153 T1732 C69 UPDATE [collection1] webapp=null path=null params={} {add=[100034]} 0 0
> [junit4:junit4]   2> 2161 T1732 C69 UPDATE [collection1] webapp=null path=null params={} {add=[100035]} 0 0
> [junit4:junit4]   2> 2169 T1732 C69 UPDATE [collection1] webapp=null path=null params={} {add=[100036]} 0 1
> [junit4:junit4]   2> 2182 T1732 C69 UPDATE [collection1] webapp=null path=null params={} {add=[100037]} 0 1
> [junit4:junit4]   2> 2190 T1732 C69 UPDATE [collection1] webapp=null path=null params={} {add=[100038]} 0 1
> [junit4:junit4]   2> 2201 T1732 C69 UPDATE [collection1] webapp=null path=null params={} {add=[100039]} 0 1
> [junit4:junit4]   2> 2210 T1732 C69 UPDATE [collection1] webapp=null path=null params={} {add=[100040]} 0 1
> [junit4:junit4]   2> 2217 T1732 C69 UPDATE [collection1] webapp=null path=null params={} {add=[100041]} 0 0
> [junit4:junit4]   2> 2224 T1732 C69 UPDATE [collection1] webapp=null path=null params={} {add=[100042]} 0 0
> [junit4:junit4]   2> 2232 T1732 C69 UPDATE [collection1] webapp=null path=null params={} {add=[100043]} 0 1
> [junit4:junit4]   2> 2239 T1732 C69 UPDATE [collection1] webapp=null path=null params={} {add=[100044]} 0 0
> [junit4:junit4]   2> 2247 T1732 C69 UPDATE [collection1] webapp=null path=null params={} {add=[100045]} 0 1
> [junit4:junit4]   2> 2254 T1732 C69 UPDATE [collection1] webapp=null path=null params={} {add=[100046]} 0 0
> [junit4:junit4]   2> 2262 T1732 C69 UPDATE [collection1] webapp=null path=null params={} {add=[100047]} 0 1
> [junit4:junit4]   2> 2275 T1732 C69 UPDATE [collection1] webapp=null path=null params={} {add=[100048]} 0 1
> [junit4:junit4]   2> 2283 T1732 C69 UPDATE [collection1] webapp=null path=null params={} {add=[100049]} 0 1
> [junit4:junit4]   2> 2290 T1732 C69 oasu.DirectUpdateHandler2.commit start commit{,optimize=false,openSearcher=true,waitSearcher=true,expungeDeletes=false,softCommit=false,prepareCommit=false}
> [junit4:junit4]   2> 2301 T1732 C69 oasc.SolrDeletionPolicy.onCommit SolrDeletionPolicy.onCommit: commits:num=2
> [junit4:junit4]   2>            commit{dir=MockDirWrapper(org.apache.lucene.store.RAMDirectory@436e0811 lockFactory=org.apache.lucene.store.NativeFSLockFactory@3f7e0e05),segFN=segments_2,generation=2,filenames=[_1_Lucene42_0.dvm, _1_CheapBastard_0.dvdd, _1_Asserting_0.doc, _1_Lucene42_0.dvd, _1.fnm, _1_Asserting_0.dvm, _1.fdx, _1_Asserting_0.tim, _1.fdt, _1_Disk_0.dvdd, _1_Asserting_0.tip, _1.si, _1_Asserting_0.dvd, segments_2, _1_CheapBastard_0.dvdm, _1_Disk_0.dvdm]
> [junit4:junit4]   2>            commit{dir=MockDirWrapper(org.apache.lucene.store.RAMDirectory@436e0811 lockFactory=org.apache.lucene.store.NativeFSLockFactory@3f7e0e05),segFN=segments_3,generation=3,filenames=[_2.si, _2_Asserting_0.dvm, _2_Asserting_0.dvd, _2.fdt, _2.fdx, _2_CheapBastard_0.dvdd, _2.fnm, _2_Asserting_0.tim, _2_Asserting_0.tip, _2_Lucene42_0.dvm, _2_Disk_0.dvdd, _2_Asserting_0.doc, _2_CheapBastard_0.dvdm, _2_Disk_0.dvdm, segments_3, _2_Lucene42_0.dvd]
> [junit4:junit4]   2> 2302 T1732 C69 oasc.SolrDeletionPolicy.updateCommits newest commit = 3[_2.si, _2_Asserting_0.dvm, _2_Asserting_0.dvd, _2.fdt, _2.fdx, _2_CheapBastard_0.dvdd, _2.fnm, _2_Asserting_0.tim, _2_Asserting_0.tip, _2_Lucene42_0.dvm, _2_Disk_0.dvdd, _2_Asserting_0.doc, _2_CheapBastard_0.dvdm, _2_Disk_0.dvdm, segments_3, _2_Lucene42_0.dvd]
> [junit4:junit4]   2> 2304 T1732 C69 oass.SolrIndexSearcher.<init> Opening Searcher@50d0a56a main
> [junit4:junit4]   2> 2305 T1733 oasc.SolrCore.registerSearcher [collection1] Registered new searcher Searcher@50d0a56a main{StandardDirectoryReader(segments_3:10:nrt _2(4.2):C50)}
> [junit4:junit4]   2> 2305 T1732 C69 oasu.DirectUpdateHandler2.commit end_commit_flush
> [junit4:junit4]   2> 2306 T1732 C69 UPDATE [collection1] webapp=null path=null params={} {commit=} 0 16
> [junit4:junit4]   2> 2318 T1732 C69 REQ [collection1] webapp=null path=null params={stats.field=stringdv&stats=true&q=*:*&rows=0} hits=50 status=0 QTime=7
> [junit4:junit4]   2> 2328 T1732 C69 REQ [collection1] webapp=null path=null params={stats.field=floatdv&stats=true&q=*:*&rows=0} hits=50 status=0 QTime=0
> [junit4:junit4]   2> 2337 T1732 C69 REQ [collection1] webapp=null path=null params={stats.field=intdv&stats=true&q=*:*&rows=0} hits=50 status=0 QTime=1
> [junit4:junit4]   2> 2344 T1732 C69 REQ [collection1] webapp=null path=null params={stats.field=doubledv&stats=true&q=*:*&rows=0} hits=50 status=0 QTime=1
> [junit4:junit4]   2> 2351 T1732 C69 REQ [collection1] webapp=null path=null params={stats.field=longdv&stats=true&q=*:*&rows=0} hits=50 status=0 QTime=1
> [junit4:junit4]   2> 2359 T1732 C69 REQ [collection1] webapp=null path=null params={stats.field=datedv&stats=true&q=*:*&rows=0} hits=50 status=0 QTime=0
> [junit4:junit4]   2> 2365 T1732 C69 REQ [collection1] webapp=null path=null params={stats.field=floatdv&stats=true&q=*:*&stats.facet=intdv&rows=0} hits=50 status=0 QTime=1
> [junit4:junit4]   2> 2376 T1732 C69 REQ [collection1] webapp=null path=null params={stats.field=floatdv&stats=true&q=*:*&stats.facet=datedv&rows=0} hits=50 status=0 QTime=5
> [junit4:junit4]   2> 2437 T1732 oas.SolrTestCaseJ4.tearDown ###Ending testDocValuesStats
> [junit4:junit4]   2> 2447 T1732 oas.SolrTestCaseJ4.setUp ###Starting testDocValuesMatch
> [junit4:junit4]   2> 2454 T1732 C69 oasu.DirectUpdateHandler2.deleteAll [collection1] REMOVING ALL DOCUMENTS FROM INDEX
> [junit4:junit4]   2> 2455 T1732 C69 UPDATE [collection1] webapp=null path=null params={} {deleteByQuery=*:*} 0 2
> [junit4:junit4]   2> 2475 T1732 C69 UPDATE [collection1] webapp=null path=null params={} {add=[1]} 0 2
> [junit4:junit4]   2> 2495 T1732 C69 UPDATE [collection1] webapp=null path=null params={} {add=[2]} 0 1
> [junit4:junit4]   2> 2503 T1732 C69 UPDATE [collection1] webapp=null path=null params={} {add=[3]} 0 1
> [junit4:junit4]   2> 2512 T1732 C69 UPDATE [collection1] webapp=null path=null params={} {add=[4]} 0 2
> [junit4:junit4]   2> 2525 T1732 C69 oasu.DirectUpdateHandler2.commit start commit{,optimize=false,openSearcher=true,waitSearcher=true,expungeDeletes=false,softCommit=false,prepareCommit=false}
> [junit4:junit4]   2> 2532 T1732 C69 oasc.SolrDeletionPolicy.onCommit SolrDeletionPolicy.onCommit: commits:num=2
> [junit4:junit4]   2>            commit{dir=MockDirWrapper(org.apache.lucene.store.RAMDirectory@436e0811 lockFactory=org.apache.lucene.store.NativeFSLockFactory@3f7e0e05),segFN=segments_3,generation=3,filenames=[_2.si, _2_Asserting_0.dvm, _2_Asserting_0.dvd, _2.fdt, _2.fdx, _2_CheapBastard_0.dvdd, _2.fnm, _2_Asserting_0.tim, _2_Asserting_0.tip, _2_Lucene42_0.dvm, _2_Disk_0.dvdd, _2_Asserting_0.doc, _2_CheapBastard_0.dvdm, _2_Disk_0.dvdm, segments_3, _2_Lucene42_0.dvd]
> [junit4:junit4]   2>            commit{dir=MockDirWrapper(org.apache.lucene.store.RAMDirectory@436e0811 lockFactory=org.apache.lucene.store.NativeFSLockFactory@3f7e0e05),segFN=segments_4,generation=4,filenames=[_3_CheapBastard_0.dvdm, _3_Asserting_0.dvm, _3_Disk_0.dvdm, _3_CheapBastard_0.dvdd, _3.fnm, _3.fdt, _3_Asserting_0.dvd, _3.fdx, _3_Disk_0.dvdd, _3_Asserting_0.tim, _3_Asserting_0.tip, _3_Asserting_0.doc, _3_Lucene42_0.dvm, _3.si, _3_Lucene42_0.dvd, segments_4]
> [junit4:junit4]   2> 2533 T1732 C69 oasc.SolrDeletionPolicy.updateCommits newest commit = 4[_3_CheapBastard_0.dvdm, _3_Asserting_0.dvm, _3_Disk_0.dvdm, _3_CheapBastard_0.dvdd, _3.fnm, _3.fdt, _3_Asserting_0.dvd, _3.fdx, _3_Disk_0.dvdd, _3_Asserting_0.tim, _3_Asserting_0.tip, _3_Asserting_0.doc, _3_Lucene42_0.dvm, _3.si, _3_Lucene42_0.dvd, segments_4]
> [junit4:junit4]   2> 2537 T1732 C69 oass.SolrIndexSearcher.<init> Opening Searcher@6bdd8c97 main
> [junit4:junit4]   2> 2539 T1733 oasc.SolrCore.registerSearcher [collection1] Registered new searcher Searcher@6bdd8c97 main{StandardDirectoryReader(segments_4:13:nrt _3(4.2):C4)}
> [junit4:junit4]   2> 2539 T1732 C69 oasu.DirectUpdateHandler2.commit end_commit_flush
> [junit4:junit4]   2> 2540 T1732 C69 UPDATE [collection1] webapp=null path=null params={} {commit=} 0 16
> [junit4:junit4]   2> 2599 T1732 C69 REQ [collection1] webapp=null path=null params={sort=id+asc&q=stringdv:car} hits=1 status=0 QTime=54
> [junit4:junit4]   2> 2605 T1732 C69 REQ [collection1] webapp=null path=null params={sort=id+asc&q=stringdv:[b+TO+d]} hits=3 status=0 QTime=1
> [junit4:junit4]   2> 2623 T1732 C69 REQ [collection1] webapp=null path=null params={sort=id+asc&q=stringdv:c*} hits=2 status=0 QTime=12
> [junit4:junit4]   2> 7200062 T1731 ccr.ThreadLeakControl$2.evaluate WARNING Suite execution timed out: org.apache.solr.schema.DocValuesTest
> [junit4:junit4]   2>    ==== jstack at approximately timeout time ====
> [junit4:junit4]   2>    "searcherExecutor-777-thread-1" ID=1733 WAITING on java.util.concurrent.locks.AbstractQueuedSynchronizer$ConditionObject@739e7331
> [junit4:junit4]   2>            at sun.misc.Unsafe.park(Native Method)
> [junit4:junit4]   2>            - waiting on java.util.concurrent.locks.AbstractQueuedSynchronizer$ConditionObject@739e7331
> [junit4:junit4]   2>            at java.util.concurrent.locks.LockSupport.park(LockSupport.java:186)
> [junit4:junit4]   2>            at java.util.concurrent.locks.AbstractQueuedSynchronizer$ConditionObject.await(AbstractQueuedSynchronizer.java:2043)
> [junit4:junit4]   2>            at java.util.concurrent.LinkedBlockingQueue.take(LinkedBlockingQueue.java:442)
> [junit4:junit4]   2>            at java.util.concurrent.ThreadPoolExecutor.getTask(ThreadPoolExecutor.java:1068)
> [junit4:junit4]   2>            at java.util.concurrent.ThreadPoolExecutor.runWorker(ThreadPoolExecutor.java:1130)
> [junit4:junit4]   2>            at java.util.concurrent.ThreadPoolExecutor$Worker.run(ThreadPoolExecutor.java:615)
> [junit4:junit4]   2>            at java.lang.Thread.run(Thread.java:722)
> [junit4:junit4]   2>
> [junit4:junit4]   2>    "TEST-DocValuesTest.testDocValuesMatch-seed#[9C7CF1122999BD17]" ID=1732 RUNNABLE
> [junit4:junit4]   2>            at org.apache.lucene.search.FieldCacheRewriteMethod$MultiTermQueryFieldCacheWrapperFilter.getDocIdSet(FieldCacheRewriteMethod.java:147)
> [junit4:junit4]   2>            at org.apache.lucene.search.ConstantScoreQuery$ConstantWeight.scorer(ConstantScoreQuery.java:131)
> [junit4:junit4]   2>            at org.apache.lucene.search.IndexSearcher.search(IndexSearcher.java:603)
> [junit4:junit4]   2>            at org.apache.lucene.search.IndexSearcher.search(IndexSearcher.java:297)
> [junit4:junit4]   2>            at org.apache.solr.search.SolrIndexSearcher.getDocListNC(SolrIndexSearcher.java:1429)
> [junit4:junit4]   2>            at org.apache.solr.search.SolrIndexSearcher.getDocListC(SolrIndexSearcher.java:1304)
> [junit4:junit4]   2>            at org.apache.solr.search.SolrIndexSearcher.search(SolrIndexSearcher.java:395)
> [junit4:junit4]   2>            at org.apache.solr.handler.component.QueryComponent.process(QueryComponent.java:410)
> [junit4:junit4]   2>            at org.apache.solr.handler.component.SearchHandler.handleRequestBody(SearchHandler.java:208)
> [junit4:junit4]   2>            at org.apache.solr.handler.RequestHandlerBase.handleRequest(RequestHandlerBase.java:135)
> [junit4:junit4]   2>            at org.apache.solr.core.SolrCore.execute(SolrCore.java:1811)
> [junit4:junit4]   2>            at org.apache.solr.util.TestHarness.query(TestHarness.java:277)
> [junit4:junit4]   2>            at org.apache.solr.util.TestHarness.query(TestHarness.java:259)
> [junit4:junit4]   2>            at org.apache.solr.SolrTestCaseJ4.assertQ(SolrTestCaseJ4.java:492)
> [junit4:junit4]   2>            at org.apache.solr.SolrTestCaseJ4.assertQ(SolrTestCaseJ4.java:485)
> [junit4:junit4]   2>            at org.apache.solr.schema.DocValuesTest.testDocValuesMatch(DocValuesTest.java:264)
> [junit4:junit4]   2>            at sun.reflect.NativeMethodAccessorImpl.invoke0(Native Method)
> [junit4:junit4]   2>            at sun.reflect.NativeMethodAccessorImpl.invoke(NativeMethodAccessorImpl.java:57)
> [junit4:junit4]   2>            at sun.reflect.DelegatingMethodAccessorImpl.invoke(DelegatingMethodAccessorImpl.java:43)
> [junit4:junit4]   2>            at java.lang.reflect.Method.invoke(Method.java:601)
> [junit4:junit4]   2>            at com.carrotsearch.randomizedtesting.RandomizedRunner.invoke(RandomizedRunner.java:1559)
> [junit4:junit4]   2>            at com.carrotsearch.randomizedtesting.RandomizedRunner.access$600(RandomizedRunner.java:79)
> [junit4:junit4]   2>            at com.carrotsearch.randomizedtesting.RandomizedRunner$6.evaluate(RandomizedRunner.java:737)
> [junit4:junit4]   2>            at com.carrotsearch.randomizedtesting.RandomizedRunner$7.evaluate(RandomizedRunner.java:773)
> [junit4:junit4]   2>            at com.carrotsearch.randomizedtesting.RandomizedRunner$8.evaluate(RandomizedRunner.java:787)
> [junit4:junit4]   2>            at com.carrotsearch.randomizedtesting.rules.SystemPropertiesRestoreRule$1.evaluate(SystemPropertiesRestoreRule.java:53)
> [junit4:junit4]   2>            at org.apache.lucene.util.TestRuleSetupTeardownChained$1.evaluate(TestRuleSetupTeardownChained.java:50)
> [junit4:junit4]   2>            at org.apache.lucene.util.TestRuleFieldCacheSanity$1.evaluate(TestRuleFieldCacheSanity.java:51)
> [junit4:junit4]   2>            at org.apache.lucene.util.AbstractBeforeAfterRule$1.evaluate(AbstractBeforeAfterRule.java:46)
> [junit4:junit4]   2>            at com.carrotsearch.randomizedtesting.rules.SystemPropertiesInvariantRule$1.evaluate(SystemPropertiesInvariantRule.java:55)
> [junit4:junit4]   2>            at org.apache.lucene.util.TestRuleThreadAndTestName$1.evaluate(TestRuleThreadAndTestName.java:49)
> [junit4:junit4]   2>            at org.apache.lucene.util.TestRuleIgnoreAfterMaxFailures$1.evaluate(TestRuleIgnoreAfterMaxFailures.java:70)
> [junit4:junit4]   2>            at org.apache.lucene.util.TestRuleMarkFailure$1.evaluate(TestRuleMarkFailure.java:48)
> [junit4:junit4]   2>            at com.carrotsearch.randomizedtesting.rules.StatementAdapter.evaluate(StatementAdapter.java:36)
> [junit4:junit4]   2>            at com.carrotsearch.randomizedtesting.ThreadLeakControl$StatementRunner.run(ThreadLeakControl.java:358)
> [junit4:junit4]   2>            at com.carrotsearch.randomizedtesting.ThreadLeakControl.forkTimeoutingTask(ThreadLeakControl.java:782)
> [junit4:junit4]   2>            at com.carrotsearch.randomizedtesting.ThreadLeakControl$3.evaluate(ThreadLeakControl.java:442)
> [junit4:junit4]   2>            at com.carrotsearch.randomizedtesting.RandomizedRunner.runSingleTest(RandomizedRunner.java:746)
> [junit4:junit4]   2>            at com.carrotsearch.randomizedtesting.RandomizedRunner$3.evaluate(RandomizedRunner.java:648)
> [junit4:junit4]   2>            at com.carrotsearch.randomizedtesting.RandomizedRunner$4.evaluate(RandomizedRunner.java:682)
> [junit4:junit4]   2>            at com.carrotsearch.randomizedtesting.RandomizedRunner$5.evaluate(RandomizedRunner.java:693)
> [junit4:junit4]   2>            at com.carrotsearch.randomizedtesting.rules.StatementAdapter.evaluate(StatementAdapter.java:36)
> [junit4:junit4]   2>            at com.carrotsearch.randomizedtesting.rules.SystemPropertiesRestoreRule$1.evaluate(SystemPropertiesRestoreRule.java:53)
> [junit4:junit4]   2>            at org.apache.lucene.util.AbstractBeforeAfterRule$1.evaluate(AbstractBeforeAfterRule.java:46)
> [junit4:junit4]   2>            at org.apache.lucene.util.TestRuleStoreClassName$1.evaluate(TestRuleStoreClassName.java:42)
> [junit4:junit4]   2>            at com.carrotsearch.randomizedtesting.rules.SystemPropertiesInvariantRule$1.evaluate(SystemPropertiesInvariantRule.java:55)
> [junit4:junit4]   2>            at com.carrotsearch.randomizedtesting.rules.NoShadowingOrOverridesOnMethodsRule$1.evaluate(NoShadowingOrOverridesOnMethodsRule.java:39)
> [junit4:junit4]   2>            at com.carrotsearch.randomizedtesting.rules.NoShadowingOrOverridesOnMethodsRule$1.evaluate(NoShadowingOrOverridesOnMethodsRule.java:39)
> [junit4:junit4]   2>            at com.carrotsearch.randomizedtesting.rules.StatementAdapter.evaluate(StatementAdapter.java:36)
> [junit4:junit4]   2>            at org.apache.lucene.util.TestRuleAssertionsRequired$1.evaluate(TestRuleAssertionsRequired.java:43)
> [junit4:junit4]   2>            at org.apache.lucene.util.TestRuleMarkFailure$1.evaluate(TestRuleMarkFailure.java:48)
> [junit4:junit4]   2>            at org.apache.lucene.util.TestRuleIgnoreAfterMaxFailures$1.evaluate(TestRuleIgnoreAfterMaxFailures.java:70)
> [junit4:junit4]   2>            at org.apache.lucene.util.TestRuleIgnoreTestSuites$1.evaluate(TestRuleIgnoreTestSuites.java:55)
> [junit4:junit4]   2>            at com.carrotsearch.randomizedtesting.rules.StatementAdapter.evaluate(StatementAdapter.java:36)
> [junit4:junit4]   2>            at com.carrotsearch.randomizedtesting.ThreadLeakControl$StatementRunner.run(ThreadLeakControl.java:358)
> [junit4:junit4]   2>            at java.lang.Thread.run(Thread.java:722)
> [junit4:junit4]   2>
> [junit4:junit4]   2>    "SUITE-DocValuesTest-seed#[9C7CF1122999BD17]" ID=1731 RUNNABLE
> [junit4:junit4]   2>            at sun.management.ThreadImpl.dumpThreads0(Native Method)
> [junit4:junit4]   2>            at sun.management.ThreadImpl.dumpAllThreads(ThreadImpl.java:446)
> [junit4:junit4]   2>            at com.carrotsearch.randomizedtesting.ThreadLeakControl.formatThreadStacksFull(ThreadLeakControl.java:655)
> [junit4:junit4]   2>            at com.carrotsearch.randomizedtesting.ThreadLeakControl.access$800(ThreadLeakControl.java:60)
> [junit4:junit4]   2>            at com.carrotsearch.randomizedtesting.ThreadLeakControl$2.evaluate(ThreadLeakControl.java:396)
> [junit4:junit4]   2>            - locked java.lang.Object@279cd144
> [junit4:junit4]   2>            at com.carrotsearch.randomizedtesting.RandomizedRunner.runSuite(RandomizedRunner.java:556)
> [junit4:junit4]   2>            at com.carrotsearch.randomizedtesting.RandomizedRunner.access$200(RandomizedRunner.java:79)
> [junit4:junit4]   2>            at com.carrotsearch.randomizedtesting.RandomizedRunner$1.run(RandomizedRunner.java:492)
> [junit4:junit4]   2>
> [junit4:junit4]   2>    "TimeLimitedCollector timer thread" ID=1186 TIMED_WAITING
> [junit4:junit4]   2>            at java.lang.Thread.sleep(Native Method)
> [junit4:junit4]   2>            at org.apache.lucene.search.TimeLimitingCollector$TimerThread.run(TimeLimitingCollector.java:267)
> [junit4:junit4]   2>
> [junit4:junit4]   2>    "Signal Dispatcher" ID=5 RUNNABLE
> [junit4:junit4]   2>
> [junit4:junit4]   2>    "Finalizer" ID=3 WAITING on java.lang.ref.ReferenceQueue$Lock@286edbad
> [junit4:junit4]   2>            at java.lang.Object.wait(Native Method)
> [junit4:junit4]   2>            - waiting on java.lang.ref.ReferenceQueue$Lock@286edbad
> [junit4:junit4]   2>            at java.lang.ref.ReferenceQueue.remove(ReferenceQueue.java:135)
> [junit4:junit4]   2>            at java.lang.ref.ReferenceQueue.remove(ReferenceQueue.java:151)
> [junit4:junit4]   2>            at java.lang.ref.Finalizer$FinalizerThread.run(Finalizer.java:177)
> [junit4:junit4]   2>
> [junit4:junit4]   2>    "Reference Handler" ID=2 WAITING on java.lang.ref.Reference$Lock@6184f98
> [junit4:junit4]   2>            at java.lang.Object.wait(Native Method)
> [junit4:junit4]   2>            - waiting on java.lang.ref.Reference$Lock@6184f98
> [junit4:junit4]   2>            at java.lang.Object.wait(Object.java:503)
> [junit4:junit4]   2>            at java.lang.ref.Reference$ReferenceHandler.run(Reference.java:133)
> [junit4:junit4]   2>
> [junit4:junit4]   2>    "main" ID=1 WAITING on com.carrotsearch.randomizedtesting.RandomizedRunner$1@13f22fe7
> [junit4:junit4]   2>            at java.lang.Object.wait(Native Method)
> [junit4:junit4]   2>            - waiting on com.carrotsearch.randomizedtesting.RandomizedRunner$1@13f22fe7
> [junit4:junit4]   2>            at java.lang.Thread.join(Thread.java:1258)
> [junit4:junit4]   2>            at java.lang.Thread.join(Thread.java:1332)
> [junit4:junit4]   2>            at com.carrotsearch.randomizedtesting.RandomizedRunner.runSuite(RandomizedRunner.java:502)
> [junit4:junit4]   2>            at com.carrotsearch.randomizedtesting.RandomizedRunner.run(RandomizedRunner.java:399)
> [junit4:junit4]   2>            at com.carrotsearch.ant.tasks.junit4.slave.SlaveMain.execute(SlaveMain.java:180)
> [junit4:junit4]   2>            at com.carrotsearch.ant.tasks.junit4.slave.SlaveMain.main(SlaveMain.java:275)
> [junit4:junit4]   2>            at com.carrotsearch.ant.tasks.junit4.slave.SlaveMainSafe.main(SlaveMainSafe.java:12)
> [junit4:junit4]   2>
> [junit4:junit4]   2>    ^^==============================================
> [junit4:junit4]   2>
> [junit4:junit4]   2> NOTE: reproduce with: ant test  -Dtestcase=DocValuesTest -Dtests.method=testDocValuesMatch -Dtests.seed=9C7CF1122999BD17 -Dtests.slow=true -Dtests.locale=sr_RS -Dtests.timezone=Africa/Ndjamena -Dtests.file.encoding=UTF-8
> [junit4:junit4] ERROR   7198s | DocValuesTest.testDocValuesMatch <<<
> [junit4:junit4]    > Throwable #1: java.lang.Exception: Test abandoned because suite timeout was reached.
> [junit4:junit4]    >    at __randomizedtesting.SeedInfo.seed([9C7CF1122999BD17]:0)
> [junit4:junit4]   2> 7200168 T1731 ccr.ThreadLeakControl.checkThreadLeaks WARNING Will linger awaiting termination of 2 leaked thread(s).
> [junit4:junit4]   2> 7220242 T1731 ccr.ThreadLeakControl.checkThreadLeaks SEVERE 2 threads leaked from SUITE scope at org.apache.solr.schema.DocValuesTest:
> [junit4:junit4]   2>       1) Thread[id=1733, name=searcherExecutor-777-thread-1, state=WAITING, group=TGRP-DocValuesTest]
> [junit4:junit4]   2>            at sun.misc.Unsafe.park(Native Method)
> [junit4:junit4]   2>            at java.util.concurrent.locks.LockSupport.park(LockSupport.java:186)
> [junit4:junit4]   2>            at java.util.concurrent.locks.AbstractQueuedSynchronizer$ConditionObject.await(AbstractQueuedSynchronizer.java:2043)
> [junit4:junit4]   2>            at java.util.concurrent.LinkedBlockingQueue.take(LinkedBlockingQueue.java:442)
> [junit4:junit4]   2>            at java.util.concurrent.ThreadPoolExecutor.getTask(ThreadPoolExecutor.java:1068)
> [junit4:junit4]   2>            at java.util.concurrent.ThreadPoolExecutor.runWorker(ThreadPoolExecutor.java:1130)
> [junit4:junit4]   2>            at java.util.concurrent.ThreadPoolExecutor$Worker.run(ThreadPoolExecutor.java:615)
> [junit4:junit4]   2>            at java.lang.Thread.run(Thread.java:722)
> [junit4:junit4]   2>       2) Thread[id=1732, name=TEST-DocValuesTest.testDocValuesMatch-seed#[9C7CF1122999BD17], state=RUNNABLE, group=TGRP-DocValuesTest]
> [junit4:junit4]   2>            at org.apache.lucene.index.AutomatonTermsEnum.nextString(AutomatonTermsEnum.java:217)
> [junit4:junit4]   2>            at org.apache.lucene.index.AutomatonTermsEnum.nextSeekTerm(AutomatonTermsEnum.java:124)
> [junit4:junit4]   2>            at org.apache.lucene.index.FilteredTermsEnum.next(FilteredTermsEnum.java:221)
> [junit4:junit4]   2>            at org.apache.lucene.search.FieldCacheRewriteMethod$MultiTermQueryFieldCacheWrapperFilter.getDocIdSet(FieldCacheRewriteMethod.java:147)
> [junit4:junit4]   2>            at org.apache.lucene.search.ConstantScoreQuery$ConstantWeight.scorer(ConstantScoreQuery.java:131)
> [junit4:junit4]   2>            at org.apache.lucene.search.IndexSearcher.search(IndexSearcher.java:603)
> [junit4:junit4]   2>            at org.apache.lucene.search.IndexSearcher.search(IndexSearcher.java:297)
> [junit4:junit4]   2>            at org.apache.solr.search.SolrIndexSearcher.getDocListNC(SolrIndexSearcher.java:1429)
> [junit4:junit4]   2>            at org.apache.solr.search.SolrIndexSearcher.getDocListC(SolrIndexSearcher.java:1304)
> [junit4:junit4]   2>            at org.apache.solr.search.SolrIndexSearcher.search(SolrIndexSearcher.java:395)
> [junit4:junit4]   2>            at org.apache.solr.handler.component.QueryComponent.process(QueryComponent.java:410)
> [junit4:junit4]   2>            at org.apache.solr.handler.component.SearchHandler.handleRequestBody(SearchHandler.java:208)
> [junit4:junit4]   2>            at org.apache.solr.handler.RequestHandlerBase.handleRequest(RequestHandlerBase.java:135)
> [junit4:junit4]   2>            at org.apache.solr.core.SolrCore.execute(SolrCore.java:1811)
> [junit4:junit4]   2>            at org.apache.solr.util.TestHarness.query(TestHarness.java:277)
> [junit4:junit4]   2>            at org.apache.solr.util.TestHarness.query(TestHarness.java:259)
> [junit4:junit4]   2>            at org.apache.solr.SolrTestCaseJ4.assertQ(SolrTestCaseJ4.java:492)
> [junit4:junit4]   2>            at org.apache.solr.SolrTestCaseJ4.assertQ(SolrTestCaseJ4.java:485)
> [junit4:junit4]   2>            at org.apache.solr.schema.DocValuesTest.testDocValuesMatch(DocValuesTest.java:264)
> [junit4:junit4]   2>            at sun.reflect.NativeMethodAccessorImpl.invoke0(Native Method)
> [junit4:junit4]   2>            at sun.reflect.NativeMethodAccessorImpl.invoke(NativeMethodAccessorImpl.java:57)
> [junit4:junit4]   2>            at sun.reflect.DelegatingMethodAccessorImpl.invoke(DelegatingMethodAccessorImpl.java:43)
> [junit4:junit4]   2>            at java.lang.reflect.Method.invoke(Method.java:601)
> [junit4:junit4]   2>            at com.carrotsearch.randomizedtesting.RandomizedRunner.invoke(RandomizedRunner.java:1559)
> [junit4:junit4]   2>            at com.carrotsearch.randomizedtesting.RandomizedRunner.access$600(RandomizedRunner.java:79)
> [junit4:junit4]   2>            at com.carrotsearch.randomizedtesting.RandomizedRunner$6.evaluate(RandomizedRunner.java:737)
> [junit4:junit4]   2>            at com.carrotsearch.randomizedtesting.RandomizedRunner$7.evaluate(RandomizedRunner.java:773)
> [junit4:junit4]   2>            at com.carrotsearch.randomizedtesting.RandomizedRunner$8.evaluate(RandomizedRunner.java:787)
> [junit4:junit4]   2>            at com.carrotsearch.randomizedtesting.rules.SystemPropertiesRestoreRule$1.evaluate(SystemPropertiesRestoreRule.java:53)
> [junit4:junit4]   2>            at org.apache.lucene.util.TestRuleSetupTeardownChained$1.evaluate(TestRuleSetupTeardownChained.java:50)
> [junit4:junit4]   2>            at org.apache.lucene.util.TestRuleFieldCacheSanity$1.evaluate(TestRuleFieldCacheSanity.java:51)
> [junit4:junit4]   2>            at org.apache.lucene.util.AbstractBeforeAfterRule$1.evaluate(AbstractBeforeAfterRule.java:46)
> [junit4:junit4]   2>            at com.carrotsearch.randomizedtesting.rules.SystemPropertiesInvariantRule$1.evaluate(SystemPropertiesInvariantRule.java:55)
> [junit4:junit4]   2>            at org.apache.lucene.util.TestRuleThreadAndTestName$1.evaluate(TestRuleThreadAndTestName.java:49)
> [junit4:junit4]   2>            at org.apache.lucene.util.TestRuleIgnoreAfterMaxFailures$1.evaluate(TestRuleIgnoreAfterMaxFailures.java:70)
> [junit4:junit4]   2>            at org.apache.lucene.util.TestRuleMarkFailure$1.evaluate(TestRuleMarkFailure.java:48)
> [junit4:junit4]   2>            at com.carrotsearch.randomizedtesting.rules.StatementAdapter.evaluate(StatementAdapter.java:36)
> [junit4:junit4]   2>            at com.carrotsearch.randomizedtesting.ThreadLeakControl$StatementRunner.run(ThreadLeakControl.java:358)
> [junit4:junit4]   2>            at com.carrotsearch.randomizedtesting.ThreadLeakControl.forkTimeoutingTask(ThreadLeakControl.java:782)
> [junit4:junit4]   2>            at com.carrotsearch.randomizedtesting.ThreadLeakControl$3.evaluate(ThreadLeakControl.java:442)
> [junit4:junit4]   2>            at com.carrotsearch.randomizedtesting.RandomizedRunner.runSingleTest(RandomizedRunner.java:746)
> [junit4:junit4]   2>            at com.carrotsearch.randomizedtesting.RandomizedRunner$3.evaluate(RandomizedRunner.java:648)
> [junit4:junit4]   2>            at com.carrotsearch.randomizedtesting.RandomizedRunner$4.evaluate(RandomizedRunner.java:682)
> [junit4:junit4]   2>            at com.carrotsearch.randomizedtesting.RandomizedRunner$5.evaluate(RandomizedRunner.java:693)
> [junit4:junit4]   2>            at com.carrotsearch.randomizedtesting.rules.StatementAdapter.evaluate(StatementAdapter.java:36)
> [junit4:junit4]   2>            at com.carrotsearch.randomizedtesting.rules.SystemPropertiesRestoreRule$1.evaluate(SystemPropertiesRestoreRule.java:53)
> [junit4:junit4]   2>            at org.apache.lucene.util.AbstractBeforeAfterRule$1.evaluate(AbstractBeforeAfterRule.java:46)
> [junit4:junit4]   2>            at org.apache.lucene.util.TestRuleStoreClassName$1.evaluate(TestRuleStoreClassName.java:42)
> [junit4:junit4]   2>            at com.carrotsearch.randomizedtesting.rules.SystemPropertiesInvariantRule$1.evaluate(SystemPropertiesInvariantRule.java:55)
> [junit4:junit4]   2>            at com.carrotsearch.randomizedtesting.rules.NoShadowingOrOverridesOnMethodsRule$1.evaluate(NoShadowingOrOverridesOnMethodsRule.java:39)
> [junit4:junit4]   2>            at com.carrotsearch.randomizedtesting.rules.NoShadowingOrOverridesOnMethodsRule$1.evaluate(NoShadowingOrOverridesOnMethodsRule.java:39)
> [junit4:junit4]   2>            at com.carrotsearch.randomizedtesting.rules.StatementAdapter.evaluate(StatementAdapter.java:36)
> [junit4:junit4]   2>            at org.apache.lucene.util.TestRuleAssertionsRequired$1.evaluate(TestRuleAssertionsRequired.java:43)
> [junit4:junit4]   2>            at org.apache.lucene.util.TestRuleMarkFailure$1.evaluate(TestRuleMarkFailure.java:48)
> [junit4:junit4]   2>            at org.apache.lucene.util.TestRuleIgnoreAfterMaxFailures$1.evaluate(TestRuleIgnoreAfterMaxFailures.java:70)
> [junit4:junit4]   2>            at org.apache.lucene.util.TestRuleIgnoreTestSuites$1.evaluate(TestRuleIgnoreTestSuites.java:55)
> [junit4:junit4]   2>            at com.carrotsearch.randomizedtesting.rules.StatementAdapter.evaluate(StatementAdapter.java:36)
> [junit4:junit4]   2>            at com.carrotsearch.randomizedtesting.ThreadLeakControl$StatementRunner.run(ThreadLeakControl.java:358)
> [junit4:junit4]   2>            at java.lang.Thread.run(Thread.java:722)
> [junit4:junit4]   2> 7220244 T1731 ccr.ThreadLeakControl.tryToInterruptAll Starting to interrupt leaked threads:
> [junit4:junit4]   2>       1) Thread[id=1733, name=searcherExecutor-777-thread-1, state=WAITING, group=TGRP-DocValuesTest]
> [junit4:junit4]   2>       2) Thread[id=1732, name=TEST-DocValuesTest.testDocValuesMatch-seed#[9C7CF1122999BD17], state=RUNNABLE, group=TGRP-DocValuesTest]
> [junit4:junit4]   2> 7223263 T1731 ccr.ThreadLeakControl.tryToInterruptAll SEVERE There are still zombie threads that couldn't be terminated:
> [junit4:junit4]   2>       1) Thread[id=1733, name=searcherExecutor-777-thread-1, state=WAITING, group=TGRP-DocValuesTest]
> [junit4:junit4]   2>            at sun.misc.Unsafe.park(Native Method)
> [junit4:junit4]   2>            at java.util.concurrent.locks.LockSupport.park(LockSupport.java:186)
> [junit4:junit4]   2>            at java.util.concurrent.locks.AbstractQueuedSynchronizer$ConditionObject.await(AbstractQueuedSynchronizer.java:2043)
> [junit4:junit4]   2>            at java.util.concurrent.LinkedBlockingQueue.take(LinkedBlockingQueue.java:442)
> [junit4:junit4]   2>            at java.util.concurrent.ThreadPoolExecutor.getTask(ThreadPoolExecutor.java:1068)
> [junit4:junit4]   2>            at java.util.concurrent.ThreadPoolExecutor.runWorker(ThreadPoolExecutor.java:1130)
> [junit4:junit4]   2>            at java.util.concurrent.ThreadPoolExecutor$Worker.run(ThreadPoolExecutor.java:615)
> [junit4:junit4]   2>            at java.lang.Thread.run(Thread.java:722)
> [junit4:junit4]   2>       2) Thread[id=1732, name=TEST-DocValuesTest.testDocValuesMatch-seed#[9C7CF1122999BD17], state=RUNNABLE, group=TGRP-DocValuesTest]
> [junit4:junit4]   2>            at org.apache.lucene.util.fst.FST.readNextRealArc(FST.java:1030)
> [junit4:junit4]   2>            at org.apache.lucene.util.fst.FST.readNextArc(FST.java:965)
> [junit4:junit4]   2>            at org.apache.lucene.util.fst.FSTEnum.doSeekCeil(FSTEnum.java:251)
> [junit4:junit4]   2>            at org.apache.lucene.util.fst.BytesRefFSTEnum.seekCeil(BytesRefFSTEnum.java:65)
> [junit4:junit4]   2>            at org.apache.lucene.codecs.lucene42.Lucene42DocValuesProducer$FSTTermsEnum.seekCeil(Lucene42DocValuesProducer.java:451)
> [junit4:junit4]   2>            at org.apache.lucene.index.FilteredTermsEnum.next(FilteredTermsEnum.java:225)
> [junit4:junit4]   2>            at org.apache.lucene.search.FieldCacheRewriteMethod$MultiTermQueryFieldCacheWrapperFilter.getDocIdSet(FieldCacheRewriteMethod.java:147)
> [junit4:junit4]   2>            at org.apache.lucene.search.ConstantScoreQuery$ConstantWeight.scorer(ConstantScoreQuery.java:131)
> [junit4:junit4]   2>            at org.apache.lucene.search.IndexSearcher.search(IndexSearcher.java:603)
> [junit4:junit4]   2>            at org.apache.lucene.search.IndexSearcher.search(IndexSearcher.java:297)
> [junit4:junit4]   2>            at org.apache.solr.search.SolrIndexSearcher.getDocListNC(SolrIndexSearcher.java:1429)
> [junit4:junit4]   2>            at org.apache.solr.search.SolrIndexSearcher.getDocListC(SolrIndexSearcher.java:1304)
> [junit4:junit4]   2>            at org.apache.solr.search.SolrIndexSearcher.search(SolrIndexSearcher.java:395)
> [junit4:junit4]   2>            at org.apache.solr.handler.component.QueryComponent.process(QueryComponent.java:410)
> [junit4:junit4]   2>            at org.apache.solr.handler.component.SearchHandler.handleRequestBody(SearchHandler.java:208)
> [junit4:junit4]   2>            at org.apache.solr.handler.RequestHandlerBase.handleRequest(RequestHandlerBase.java:135)
> [junit4:junit4]   2>            at org.apache.solr.core.SolrCore.execute(SolrCore.java:1811)
> [junit4:junit4]   2>            at org.apache.solr.util.TestHarness.query(TestHarness.java:277)
> [junit4:junit4]   2>            at org.apache.solr.util.TestHarness.query(TestHarness.java:259)
> [junit4:junit4]   2>            at org.apache.solr.SolrTestCaseJ4.assertQ(SolrTestCaseJ4.java:492)
> [junit4:junit4]   2>            at org.apache.solr.SolrTestCaseJ4.assertQ(SolrTestCaseJ4.java:485)
> [junit4:junit4]   2>            at org.apache.solr.schema.DocValuesTest.testDocValuesMatch(DocValuesTest.java:264)
> [junit4:junit4]   2>            at sun.reflect.NativeMethodAccessorImpl.invoke0(Native Method)
> [junit4:junit4]   2>            at sun.reflect.NativeMethodAccessorImpl.invoke(NativeMethodAccessorImpl.java:57)
> [junit4:junit4]   2>            at sun.reflect.DelegatingMethodAccessorImpl.invoke(DelegatingMethodAccessorImpl.java:43)
> [junit4:junit4]   2>            at java.lang.reflect.Method.invoke(Method.java:601)
> [junit4:junit4]   2>            at com.carrotsearch.randomizedtesting.RandomizedRunner.invoke(RandomizedRunner.java:1559)
> [junit4:junit4]   2>            at com.carrotsearch.randomizedtesting.RandomizedRunner.access$600(RandomizedRunner.java:79)
> [junit4:junit4]   2>            at com.carrotsearch.randomizedtesting.RandomizedRunner$6.evaluate(RandomizedRunner.java:737)
> [junit4:junit4]   2>            at com.carrotsearch.randomizedtesting.RandomizedRunner$7.evaluate(RandomizedRunner.java:773)
> [junit4:junit4]   2>            at com.carrotsearch.randomizedtesting.RandomizedRunner$8.evaluate(RandomizedRunner.java:787)
> [junit4:junit4]   2>            at com.carrotsearch.randomizedtesting.rules.SystemPropertiesRestoreRule$1.evaluate(SystemPropertiesRestoreRule.java:53)
> [junit4:junit4]   2>            at org.apache.lucene.util.TestRuleSetupTeardownChained$1.evaluate(TestRuleSetupTeardownChained.java:50)
> [junit4:junit4]   2>            at org.apache.lucene.util.TestRuleFieldCacheSanity$1.evaluate(TestRuleFieldCacheSanity.java:51)
> [junit4:junit4]   2>            at org.apache.lucene.util.AbstractBeforeAfterRule$1.evaluate(AbstractBeforeAfterRule.java:46)
> [junit4:junit4]   2>            at com.carrotsearch.randomizedtesting.rules.SystemPropertiesInvariantRule$1.evaluate(SystemPropertiesInvariantRule.java:55)
> [junit4:junit4]   2>            at org.apache.lucene.util.TestRuleThreadAndTestName$1.evaluate(TestRuleThreadAndTestName.java:49)
> [junit4:junit4]   2>            at org.apache.lucene.util.TestRuleIgnoreAfterMaxFailures$1.evaluate(TestRuleIgnoreAfterMaxFailures.java:70)
> [junit4:junit4]   2>            at org.apache.lucene.util.TestRuleMarkFailure$1.evaluate(TestRuleMarkFailure.java:48)
> [junit4:junit4]   2>            at com.carrotsearch.randomizedtesting.rules.StatementAdapter.evaluate(StatementAdapter.java:36)
> [junit4:junit4]   2>            at com.carrotsearch.randomizedtesting.ThreadLeakControl$StatementRunner.run(ThreadLeakControl.java:358)
> [junit4:junit4]   2>            at com.carrotsearch.randomizedtesting.ThreadLeakControl.forkTimeoutingTask(ThreadLeakControl.java:782)
> [junit4:junit4]   2>            at com.carrotsearch.randomizedtesting.ThreadLeakControl$3.evaluate(ThreadLeakControl.java:442)
> [junit4:junit4]   2>            at com.carrotsearch.randomizedtesting.RandomizedRunner.runSingleTest(RandomizedRunner.java:746)
> [junit4:junit4]   2>            at com.carrotsearch.randomizedtesting.RandomizedRunner$3.evaluate(RandomizedRunner.java:648)
> [junit4:junit4]   2>            at com.carrotsearch.randomizedtesting.RandomizedRunner$4.evaluate(RandomizedRunner.java:682)
> [junit4:junit4]   2>            at com.carrotsearch.randomizedtesting.RandomizedRunner$5.evaluate(RandomizedRunner.java:693)
> [junit4:junit4]   2>            at com.carrotsearch.randomizedtesting.rules.StatementAdapter.evaluate(StatementAdapter.java:36)
> [junit4:junit4]   2>            at com.carrotsearch.randomizedtesting.rules.SystemPropertiesRestoreRule$1.evaluate(SystemPropertiesRestoreRule.java:53)
> [junit4:junit4]   2>            at org.apache.lucene.util.AbstractBeforeAfterRule$1.evaluate(AbstractBeforeAfterRule.java:46)
> [junit4:junit4]   2>            at org.apache.lucene.util.TestRuleStoreClassName$1.evaluate(TestRuleStoreClassName.java:42)
> [junit4:junit4]   2>            at com.carrotsearch.randomizedtesting.rules.SystemPropertiesInvariantRule$1.evaluate(SystemPropertiesInvariantRule.java:55)
> [junit4:junit4]   2>            at com.carrotsearch.randomizedtesting.rules.NoShadowingOrOverridesOnMethodsRule$1.evaluate(NoShadowingOrOverridesOnMethodsRule.java:39)
> [junit4:junit4]   2>            at com.carrotsearch.randomizedtesting.rules.NoShadowingOrOverridesOnMethodsRule$1.evaluate(NoShadowingOrOverridesOnMethodsRule.java:39)
> [junit4:junit4]   2>            at com.carrotsearch.randomizedtesting.rules.StatementAdapter.evaluate(StatementAdapter.java:36)
> [junit4:junit4]   2>            at org.apache.lucene.util.TestRuleAssertionsRequired$1.evaluate(TestRuleAssertionsRequired.java:43)
> [junit4:junit4]   2>            at org.apache.lucene.util.TestRuleMarkFailure$1.evaluate(TestRuleMarkFailure.java:48)
> [junit4:junit4]   2>            at org.apache.lucene.util.TestRuleIgnoreAfterMaxFailures$1.evaluate(TestRuleIgnoreAfterMaxFailures.java:70)
> [junit4:junit4]   2>            at org.apache.lucene.util.TestRuleIgnoreTestSuites$1.evaluate(TestRuleIgnoreTestSuites.java:55)
> [junit4:junit4]   2>            at com.carrotsearch.randomizedtesting.rules.StatementAdapter.evaluate(StatementAdapter.java:36)
> [junit4:junit4]   2>            at com.carrotsearch.randomizedtesting.ThreadLeakControl$StatementRunner.run(ThreadLeakControl.java:358)
> [junit4:junit4]   2>            at java.lang.Thread.run(Thread.java:722)
> [junit4:junit4]   2> NOTE: test params are: codec=Lucene42: {id=PostingsFormat(name=Asserting)}, docValues:{doubledv=DocValuesFormat(name=Lucene42), datedv=DocValuesFormat(name=Asserting), floatdv=DocValuesFormat(name=Disk), longdv=DocValuesFormat(name=Disk), intdv=DocValuesFormat(name=CheapBastard), stringdv=DocValuesFormat(name=Lucene42)}, sim=DefaultSimilarity, locale=sr_RS, timezone=Africa/Ndjamena
> [junit4:junit4]   2> NOTE: Mac OS X 10.8.2 x86_64/Oracle Corporation 1.7.0_15 (64-bit)/cpus=2,threads=3,free=32059232,total=108396544
> [junit4:junit4]   2> NOTE: All tests run in this JVM: [HighlighterConfigTest, SpatialFilterTest, ResourceLoaderTest, PingRequestHandlerTest, TestFastOutputStream, OverseerCollectionProcessorTest, MoreLikeThisHandlerTest, DocumentBuilderTest, SystemInfoHandlerTest, SpellPossibilityIteratorTest, TestDFRSimilarityFactory, BasicDistributedZk2Test, ChaosMonkeySafeLeaderTest, SolrCmdDistributorTest, SolrInfoMBeanTest, SpellCheckCollatorTest, IndexSchemaTest, TestFieldTypeResource, SolrCoreTest, PrimUtilsTest, TestPartialUpdateDeduplication, TestSolrDiscoveryProperties, IndexSchemaRuntimeFieldTest, LeaderElectionTest, TestSort, SampleTest, TestDistributedGrouping, AliasIntegrationTest, SliceStateUpdateTest, ConvertedLegacyTest, ShardRoutingTest, TestReversedWildcardFilterFactory, DocValuesTest]
> [junit4:junit4]   2> NOTE: reproduce with: ant test  -Dtestcase=DocValuesTest -Dtests.seed=9C7CF1122999BD17 -Dtests.slow=true -Dtests.locale=sr_RS -Dtests.timezone=Africa/Ndjamena -Dtests.file.encoding=UTF-8
> [junit4:junit4] ERROR   0.00s | DocValuesTest (suite) <<<
> [junit4:junit4]    > Throwable #1: java.lang.Exception: Suite timeout exceeded (>= 7200000 msec).
> [junit4:junit4]    >    at __randomizedtesting.SeedInfo.seed([9C7CF1122999BD17]:0)
> [junit4:junit4] Completed in 7223.35s, 4 tests, 2 errors <<< FAILURES!
>
> [...truncated 721 lines...]
> BUILD FAILED
> /Users/jenkins/jenkins-slave/workspace/Lucene-Solr-4.x-MacOSX/build.xml:381: The following error occurred while executing this line:
> /Users/jenkins/jenkins-slave/workspace/Lucene-Solr-4.x-MacOSX/build.xml:361: The following error occurred while executing this line:
> /Users/jenkins/jenkins-slave/workspace/Lucene-Solr-4.x-MacOSX/build.xml:39: The following error occurred while executing this line:
> /Users/jenkins/jenkins-slave/workspace/Lucene-Solr-4.x-MacOSX/solr/build.xml:183: The following error occurred while executing this line:
> /Users/jenkins/jenkins-slave/workspace/Lucene-Solr-4.x-MacOSX/solr/common-build.xml:449: The following error occurred while executing this line:
> /Users/jenkins/jenkins-slave/workspace/Lucene-Solr-4.x-MacOSX/lucene/common-build.xml:1213: The following error occurred while executing this line:
> /Users/jenkins/jenkins-slave/workspace/Lucene-Solr-4.x-MacOSX/lucene/common-build.xml:877: There were test failures: 271 suites, 1140 tests, 1 suite-level error, 1 error, 955 ignored
>
> Total time: 165 minutes 13 seconds
> Build step 'Invoke Ant' marked build as failure
> Archiving artifacts
> Recording test results
> Description set: Java: 64bit/jdk1.7.0 -XX:+UseConcMarkSweepGC
> Email was triggered for: Failure
> Sending email for trigger: Failure
>

---------------------------------------------------------------------
To unsubscribe, e-mail: dev-unsubscribe@lucene.apache.org
For additional commands, e-mail: dev-help@lucene.apache.org


Mime
View raw message