lucene-dev mailing list archives

Site index · List index
Message view « Date » · « Thread »
Top « Date » · « Thread »
From Robert Muir <rcm...@gmail.com>
Subject Re: [JENKINS] Lucene-Solr-trunk-Linux (32bit/ibm-j9-jdk7) - Build # 4658 - Still Failing!
Date Mon, 11 Mar 2013 01:02:48 GMT
this is the old ibm jvm fst.pack() bug. it seems now it only happens on 32-bit

On Sun, Mar 10, 2013 at 8:59 PM, Policeman Jenkins Server
<jenkins@thetaphi.de> wrote:
> Build: http://jenkins.thetaphi.de/job/Lucene-Solr-trunk-Linux/4658/
> Java: 32bit/ibm-j9-jdk7
>
> 5 tests failed.
> REGRESSION:  org.apache.lucene.codecs.perfield.TestPerFieldDocValuesFormat.testSortedSetVariableLengthVsUninvertedField
>
> Error Message:
>
>
> Stack Trace:
> java.lang.ArrayIndexOutOfBoundsException
>         at __randomizedtesting.SeedInfo.seed([CF4D3AC66612146:A557D4C98686A786]:0)
>         at org.apache.lucene.store.ByteArrayDataInput.readVInt(ByteArrayDataInput.java:104)
>         at org.apache.lucene.codecs.memory.MemoryPostingsFormat$FSTTermsEnum.decodeMetaData(MemoryPostingsFormat.java:641)
>         at org.apache.lucene.codecs.memory.MemoryPostingsFormat$FSTTermsEnum.docFreq(MemoryPostingsFormat.java:743)
>         at org.apache.lucene.index.DocTermOrds.uninvert(DocTermOrds.java:364)
>         at org.apache.lucene.index.DocTermOrds.<init>(DocTermOrds.java:198)
>         at org.apache.lucene.index.DocTermOrds.<init>(DocTermOrds.java:189)
>         at org.apache.lucene.index.DocTermOrds.<init>(DocTermOrds.java:177)
>         at org.apache.lucene.search.FieldCacheImpl$DocTermOrdsCache.createValue(FieldCacheImpl.java:1402)
>         at org.apache.lucene.search.FieldCacheImpl$Cache.get(FieldCacheImpl.java:212)
>         at org.apache.lucene.search.FieldCacheImpl.getDocTermOrds(FieldCacheImpl.java:1390)
>         at org.apache.lucene.index.BaseDocValuesFormatTestCase.doTestSortedSetVsUninvertedField(BaseDocValuesFormatTestCase.java:1848)
>         at org.apache.lucene.index.BaseDocValuesFormatTestCase.testSortedSetVariableLengthVsUninvertedField(BaseDocValuesFormatTestCase.java:1870)
>         at sun.reflect.NativeMethodAccessorImpl.invoke0(Native Method)
>         at sun.reflect.NativeMethodAccessorImpl.invoke(NativeMethodAccessorImpl.java:88)
>         at sun.reflect.DelegatingMethodAccessorImpl.invoke(DelegatingMethodAccessorImpl.java:55)
>         at java.lang.reflect.Method.invoke(Method.java:613)
>         at com.carrotsearch.randomizedtesting.RandomizedRunner.invoke(RandomizedRunner.java:1559)
>         at com.carrotsearch.randomizedtesting.RandomizedRunner.access$600(RandomizedRunner.java:79)
>         at com.carrotsearch.randomizedtesting.RandomizedRunner$6.evaluate(RandomizedRunner.java:737)
>         at com.carrotsearch.randomizedtesting.RandomizedRunner$7.evaluate(RandomizedRunner.java:773)
>         at com.carrotsearch.randomizedtesting.RandomizedRunner$8.evaluate(RandomizedRunner.java:787)
>         at org.apache.lucene.util.TestRuleSetupTeardownChained$1.evaluate(TestRuleSetupTeardownChained.java:50)
>         at org.apache.lucene.util.TestRuleFieldCacheSanity$1.evaluate(TestRuleFieldCacheSanity.java:51)
>         at org.apache.lucene.util.AbstractBeforeAfterRule$1.evaluate(AbstractBeforeAfterRule.java:46)
>         at com.carrotsearch.randomizedtesting.rules.SystemPropertiesInvariantRule$1.evaluate(SystemPropertiesInvariantRule.java:55)
>         at org.apache.lucene.util.TestRuleThreadAndTestName$1.evaluate(TestRuleThreadAndTestName.java:49)
>         at org.apache.lucene.util.TestRuleIgnoreAfterMaxFailures$1.evaluate(TestRuleIgnoreAfterMaxFailures.java:70)
>         at org.apache.lucene.util.TestRuleMarkFailure$1.evaluate(TestRuleMarkFailure.java:48)
>         at com.carrotsearch.randomizedtesting.rules.StatementAdapter.evaluate(StatementAdapter.java:36)
>         at com.carrotsearch.randomizedtesting.ThreadLeakControl$StatementRunner.run(ThreadLeakControl.java:358)
>         at com.carrotsearch.randomizedtesting.ThreadLeakControl.forkTimeoutingTask(ThreadLeakControl.java:782)
>         at com.carrotsearch.randomizedtesting.ThreadLeakControl$3.evaluate(ThreadLeakControl.java:442)
>         at com.carrotsearch.randomizedtesting.RandomizedRunner.runSingleTest(RandomizedRunner.java:746)
>         at com.carrotsearch.randomizedtesting.RandomizedRunner$3.evaluate(RandomizedRunner.java:648)
>         at com.carrotsearch.randomizedtesting.RandomizedRunner$4.evaluate(RandomizedRunner.java:682)
>         at com.carrotsearch.randomizedtesting.RandomizedRunner$5.evaluate(RandomizedRunner.java:693)
>         at org.apache.lucene.util.AbstractBeforeAfterRule$1.evaluate(AbstractBeforeAfterRule.java:46)
>         at org.apache.lucene.util.TestRuleStoreClassName$1.evaluate(TestRuleStoreClassName.java:42)
>         at com.carrotsearch.randomizedtesting.rules.SystemPropertiesInvariantRule$1.evaluate(SystemPropertiesInvariantRule.java:55)
>         at com.carrotsearch.randomizedtesting.rules.NoShadowingOrOverridesOnMethodsRule$1.evaluate(NoShadowingOrOverridesOnMethodsRule.java:39)
>         at com.carrotsearch.randomizedtesting.rules.NoShadowingOrOverridesOnMethodsRule$1.evaluate(NoShadowingOrOverridesOnMethodsRule.java:39)
>         at com.carrotsearch.randomizedtesting.rules.StatementAdapter.evaluate(StatementAdapter.java:36)
>         at org.apache.lucene.util.TestRuleAssertionsRequired$1.evaluate(TestRuleAssertionsRequired.java:43)
>         at org.apache.lucene.util.TestRuleMarkFailure$1.evaluate(TestRuleMarkFailure.java:48)
>         at org.apache.lucene.util.TestRuleIgnoreAfterMaxFailures$1.evaluate(TestRuleIgnoreAfterMaxFailures.java:70)
>         at org.apache.lucene.util.TestRuleIgnoreTestSuites$1.evaluate(TestRuleIgnoreTestSuites.java:55)
>         at com.carrotsearch.randomizedtesting.rules.StatementAdapter.evaluate(StatementAdapter.java:36)
>         at com.carrotsearch.randomizedtesting.ThreadLeakControl$StatementRunner.run(ThreadLeakControl.java:358)
>         at java.lang.Thread.run(Thread.java:780)
>
>
> REGRESSION:  org.apache.lucene.index.TestDuelingCodecs.testEquals
>
> Error Message:
> MockDirectoryWrapper: cannot close: there are still open files: {_2.fld=1, _2.vec=1}
>
> Stack Trace:
> java.lang.RuntimeException: MockDirectoryWrapper: cannot close: there are still open files: {_2.fld=1, _2.vec=1}
>         at org.apache.lucene.store.MockDirectoryWrapper.close(MockDirectoryWrapper.java:585)
>         at org.apache.lucene.index.TestDuelingCodecs.tearDown(TestDuelingCodecs.java:124)
>         at sun.reflect.GeneratedMethodAccessor9.invoke(Unknown Source)
>         at sun.reflect.DelegatingMethodAccessorImpl.invoke(DelegatingMethodAccessorImpl.java:55)
>         at java.lang.reflect.Method.invoke(Method.java:613)
>         at com.carrotsearch.randomizedtesting.RandomizedRunner.invoke(RandomizedRunner.java:1559)
>         at com.carrotsearch.randomizedtesting.RandomizedRunner.access$600(RandomizedRunner.java:79)
>         at com.carrotsearch.randomizedtesting.RandomizedRunner$8.evaluate(RandomizedRunner.java:795)
>         at org.apache.lucene.util.TestRuleSetupTeardownChained$1.evaluate(TestRuleSetupTeardownChained.java:50)
>         at org.apache.lucene.util.TestRuleFieldCacheSanity$1.evaluate(TestRuleFieldCacheSanity.java:51)
>         at org.apache.lucene.util.AbstractBeforeAfterRule$1.evaluate(AbstractBeforeAfterRule.java:46)
>         at com.carrotsearch.randomizedtesting.rules.SystemPropertiesInvariantRule$1.evaluate(SystemPropertiesInvariantRule.java:55)
>         at org.apache.lucene.util.TestRuleThreadAndTestName$1.evaluate(TestRuleThreadAndTestName.java:49)
>         at org.apache.lucene.util.TestRuleIgnoreAfterMaxFailures$1.evaluate(TestRuleIgnoreAfterMaxFailures.java:70)
>         at org.apache.lucene.util.TestRuleMarkFailure$1.evaluate(TestRuleMarkFailure.java:48)
>         at com.carrotsearch.randomizedtesting.rules.StatementAdapter.evaluate(StatementAdapter.java:36)
>         at com.carrotsearch.randomizedtesting.ThreadLeakControl$StatementRunner.run(ThreadLeakControl.java:358)
>         at com.carrotsearch.randomizedtesting.ThreadLeakControl.forkTimeoutingTask(ThreadLeakControl.java:782)
>         at com.carrotsearch.randomizedtesting.ThreadLeakControl$3.evaluate(ThreadLeakControl.java:442)
>         at com.carrotsearch.randomizedtesting.RandomizedRunner.runSingleTest(RandomizedRunner.java:746)
>         at com.carrotsearch.randomizedtesting.RandomizedRunner$3.evaluate(RandomizedRunner.java:648)
>         at com.carrotsearch.randomizedtesting.RandomizedRunner$4.evaluate(RandomizedRunner.java:682)
>         at com.carrotsearch.randomizedtesting.RandomizedRunner$5.evaluate(RandomizedRunner.java:693)
>         at org.apache.lucene.util.AbstractBeforeAfterRule$1.evaluate(AbstractBeforeAfterRule.java:46)
>         at org.apache.lucene.util.TestRuleStoreClassName$1.evaluate(TestRuleStoreClassName.java:42)
>         at com.carrotsearch.randomizedtesting.rules.SystemPropertiesInvariantRule$1.evaluate(SystemPropertiesInvariantRule.java:55)
>         at com.carrotsearch.randomizedtesting.rules.NoShadowingOrOverridesOnMethodsRule$1.evaluate(NoShadowingOrOverridesOnMethodsRule.java:39)
>         at com.carrotsearch.randomizedtesting.rules.NoShadowingOrOverridesOnMethodsRule$1.evaluate(NoShadowingOrOverridesOnMethodsRule.java:39)
>         at com.carrotsearch.randomizedtesting.rules.StatementAdapter.evaluate(StatementAdapter.java:36)
>         at org.apache.lucene.util.TestRuleAssertionsRequired$1.evaluate(TestRuleAssertionsRequired.java:43)
>         at org.apache.lucene.util.TestRuleMarkFailure$1.evaluate(TestRuleMarkFailure.java:48)
>         at org.apache.lucene.util.TestRuleIgnoreAfterMaxFailures$1.evaluate(TestRuleIgnoreAfterMaxFailures.java:70)
>         at org.apache.lucene.util.TestRuleIgnoreTestSuites$1.evaluate(TestRuleIgnoreTestSuites.java:55)
>         at com.carrotsearch.randomizedtesting.rules.StatementAdapter.evaluate(StatementAdapter.java:36)
>         at com.carrotsearch.randomizedtesting.ThreadLeakControl$StatementRunner.run(ThreadLeakControl.java:358)
>         at java.lang.Thread.run(Thread.java:780)
> Caused by: java.lang.RuntimeException: unclosed IndexOutput: _2.fld
>         at org.apache.lucene.store.MockDirectoryWrapper.addFileHandle(MockDirectoryWrapper.java:476)
>         at org.apache.lucene.store.MockDirectoryWrapper.createOutput(MockDirectoryWrapper.java:448)
>         at org.apache.lucene.store.TrackingDirectoryWrapper.createOutput(TrackingDirectoryWrapper.java:62)
>         at org.apache.lucene.codecs.simpletext.SimpleTextStoredFieldsWriter.<init>(SimpleTextStoredFieldsWriter.java:69)
>         at org.apache.lucene.codecs.simpletext.SimpleTextStoredFieldsFormat.fieldsWriter(SimpleTextStoredFieldsFormat.java:45)
>         at org.apache.lucene.index.StoredFieldsProcessor.initFieldsWriter(StoredFieldsProcessor.java:86)
>         at org.apache.lucene.index.StoredFieldsProcessor.finishDocument(StoredFieldsProcessor.java:119)
>         at org.apache.lucene.index.TwoStoredFieldsConsumers.finishDocument(TwoStoredFieldsConsumers.java:65)
>         at org.apache.lucene.index.DocFieldProcessor.finishDocument(DocFieldProcessor.java:287)
>         at org.apache.lucene.index.DocumentsWriterPerThread.updateDocument(DocumentsWriterPerThread.java:274)
>         at org.apache.lucene.index.DocumentsWriter.updateDocument(DocumentsWriter.java:376)
>         at org.apache.lucene.index.IndexWriter.updateDocument(IndexWriter.java:1471)
>         at org.apache.lucene.index.IndexWriter.addDocument(IndexWriter.java:1146)
>         at org.apache.lucene.index.RandomIndexWriter.addDocument(RandomIndexWriter.java:152)
>         at org.apache.lucene.index.RandomIndexWriter.addDocument(RandomIndexWriter.java:114)
>         at org.apache.lucene.index.TestDuelingCodecs.createRandomIndex(TestDuelingCodecs.java:151)
>         at org.apache.lucene.index.TestDuelingCodecs.setUp(TestDuelingCodecs.java:99)
>         at sun.reflect.GeneratedMethodAccessor8.invoke(Unknown Source)
>         at sun.reflect.DelegatingMethodAccessorImpl.invoke(DelegatingMethodAccessorImpl.java:55)
>         at java.lang.reflect.Method.invoke(Method.java:613)
>         at com.carrotsearch.randomizedtesting.RandomizedRunner.invoke(RandomizedRunner.java:1559)
>         at com.carrotsearch.randomizedtesting.RandomizedRunner.access$600(RandomizedRunner.java:79)
>         at com.carrotsearch.randomizedtesting.RandomizedRunner$7.evaluate(RandomizedRunner.java:771)
>         at com.carrotsearch.randomizedtesting.RandomizedRunner$8.evaluate(RandomizedRunner.java:787)
>         ... 28 more
>
>
> REGRESSION:  org.apache.lucene.index.TestTermVectorsFormat.testClone
>
> Error Message:
>
>
> Stack Trace:
> java.lang.AssertionError
>         at __randomizedtesting.SeedInfo.seed([CF4D3AC66612146:EA31A66603D52DAF]:0)
>         at org.apache.lucene.store.DataOutput.writeVLong(DataOutput.java:217)
>         at org.apache.lucene.util.fst.FST.pack(FST.java:1674)
>         at org.apache.lucene.util.fst.Builder.finish(Builder.java:477)
>         at org.apache.lucene.codecs.memory.MemoryPostingsFormat$TermsWriter.finish(MemoryPostingsFormat.java:274)
>         at org.apache.lucene.index.FreqProxTermsWriterPerField.flush(FreqProxTermsWriterPerField.java:548)
>         at org.apache.lucene.index.FreqProxTermsWriter.flush(FreqProxTermsWriter.java:85)
>         at org.apache.lucene.index.TermsHash.flush(TermsHash.java:116)
>         at org.apache.lucene.index.DocInverter.flush(DocInverter.java:53)
>         at org.apache.lucene.index.DocFieldProcessor.flush(DocFieldProcessor.java:81)
>         at org.apache.lucene.index.DocumentsWriterPerThread.flush(DocumentsWriterPerThread.java:494)
>         at org.apache.lucene.index.DocumentsWriter.doFlush(DocumentsWriter.java:422)
>         at org.apache.lucene.index.DocumentsWriter.flushAllThreads(DocumentsWriter.java:559)
>         at org.apache.lucene.index.IndexWriter.prepareCommitInternal(IndexWriter.java:2638)
>         at org.apache.lucene.index.IndexWriter.commitInternal(IndexWriter.java:2782)
>         at org.apache.lucene.index.IndexWriter.commit(IndexWriter.java:2762)
>         at org.apache.lucene.index.RandomIndexWriter.maybeCommit(RandomIndexWriter.java:163)
>         at org.apache.lucene.index.RandomIndexWriter.addDocument(RandomIndexWriter.java:155)
>         at org.apache.lucene.index.RandomIndexWriter.addDocument(RandomIndexWriter.java:114)
>         at org.apache.lucene.index.BaseTermVectorsFormatTestCase.testClone(BaseTermVectorsFormatTestCase.java:689)
>         at sun.reflect.NativeMethodAccessorImpl.invoke0(Native Method)
>         at sun.reflect.NativeMethodAccessorImpl.invoke(NativeMethodAccessorImpl.java:88)
>         at sun.reflect.DelegatingMethodAccessorImpl.invoke(DelegatingMethodAccessorImpl.java:55)
>         at java.lang.reflect.Method.invoke(Method.java:613)
>         at com.carrotsearch.randomizedtesting.RandomizedRunner.invoke(RandomizedRunner.java:1559)
>         at com.carrotsearch.randomizedtesting.RandomizedRunner.access$600(RandomizedRunner.java:79)
>         at com.carrotsearch.randomizedtesting.RandomizedRunner$6.evaluate(RandomizedRunner.java:737)
>         at com.carrotsearch.randomizedtesting.RandomizedRunner$7.evaluate(RandomizedRunner.java:773)
>         at com.carrotsearch.randomizedtesting.RandomizedRunner$8.evaluate(RandomizedRunner.java:787)
>         at org.apache.lucene.util.TestRuleSetupTeardownChained$1.evaluate(TestRuleSetupTeardownChained.java:50)
>         at org.apache.lucene.util.TestRuleFieldCacheSanity$1.evaluate(TestRuleFieldCacheSanity.java:51)
>         at org.apache.lucene.util.AbstractBeforeAfterRule$1.evaluate(AbstractBeforeAfterRule.java:46)
>         at com.carrotsearch.randomizedtesting.rules.SystemPropertiesInvariantRule$1.evaluate(SystemPropertiesInvariantRule.java:55)
>         at org.apache.lucene.util.TestRuleThreadAndTestName$1.evaluate(TestRuleThreadAndTestName.java:49)
>         at org.apache.lucene.util.TestRuleIgnoreAfterMaxFailures$1.evaluate(TestRuleIgnoreAfterMaxFailures.java:70)
>         at org.apache.lucene.util.TestRuleMarkFailure$1.evaluate(TestRuleMarkFailure.java:48)
>         at com.carrotsearch.randomizedtesting.rules.StatementAdapter.evaluate(StatementAdapter.java:36)
>         at com.carrotsearch.randomizedtesting.ThreadLeakControl$StatementRunner.run(ThreadLeakControl.java:358)
>         at com.carrotsearch.randomizedtesting.ThreadLeakControl.forkTimeoutingTask(ThreadLeakControl.java:782)
>         at com.carrotsearch.randomizedtesting.ThreadLeakControl$3.evaluate(ThreadLeakControl.java:442)
>         at com.carrotsearch.randomizedtesting.RandomizedRunner.runSingleTest(RandomizedRunner.java:746)
>         at com.carrotsearch.randomizedtesting.RandomizedRunner$3.evaluate(RandomizedRunner.java:648)
>         at com.carrotsearch.randomizedtesting.RandomizedRunner$4.evaluate(RandomizedRunner.java:682)
>         at com.carrotsearch.randomizedtesting.RandomizedRunner$5.evaluate(RandomizedRunner.java:693)
>         at org.apache.lucene.util.AbstractBeforeAfterRule$1.evaluate(AbstractBeforeAfterRule.java:46)
>         at org.apache.lucene.util.TestRuleStoreClassName$1.evaluate(TestRuleStoreClassName.java:42)
>         at com.carrotsearch.randomizedtesting.rules.SystemPropertiesInvariantRule$1.evaluate(SystemPropertiesInvariantRule.java:55)
>         at com.carrotsearch.randomizedtesting.rules.NoShadowingOrOverridesOnMethodsRule$1.evaluate(NoShadowingOrOverridesOnMethodsRule.java:39)
>         at com.carrotsearch.randomizedtesting.rules.NoShadowingOrOverridesOnMethodsRule$1.evaluate(NoShadowingOrOverridesOnMethodsRule.java:39)
>         at com.carrotsearch.randomizedtesting.rules.StatementAdapter.evaluate(StatementAdapter.java:36)
>         at org.apache.lucene.util.TestRuleAssertionsRequired$1.evaluate(TestRuleAssertionsRequired.java:43)
>         at org.apache.lucene.util.TestRuleMarkFailure$1.evaluate(TestRuleMarkFailure.java:48)
>         at org.apache.lucene.util.TestRuleIgnoreAfterMaxFailures$1.evaluate(TestRuleIgnoreAfterMaxFailures.java:70)
>         at org.apache.lucene.util.TestRuleIgnoreTestSuites$1.evaluate(TestRuleIgnoreTestSuites.java:55)
>         at com.carrotsearch.randomizedtesting.rules.StatementAdapter.evaluate(StatementAdapter.java:36)
>         at com.carrotsearch.randomizedtesting.ThreadLeakControl$StatementRunner.run(ThreadLeakControl.java:358)
>         at java.lang.Thread.run(Thread.java:780)
>
>
> REGRESSION:  org.apache.lucene.index.TestTermVectorsFormat.testLotsOfFields
>
> Error Message:
>
>
> Stack Trace:
> java.lang.AssertionError
>         at __randomizedtesting.SeedInfo.seed([CF4D3AC66612146:561A443AB9180756]:0)
>         at org.apache.lucene.store.DataOutput.writeVLong(DataOutput.java:217)
>         at org.apache.lucene.util.fst.FST.pack(FST.java:1674)
>         at org.apache.lucene.util.fst.Builder.finish(Builder.java:477)
>         at org.apache.lucene.codecs.memory.MemoryPostingsFormat$TermsWriter.finish(MemoryPostingsFormat.java:274)
>         at org.apache.lucene.index.FreqProxTermsWriterPerField.flush(FreqProxTermsWriterPerField.java:548)
>         at org.apache.lucene.index.FreqProxTermsWriter.flush(FreqProxTermsWriter.java:85)
>         at org.apache.lucene.index.TermsHash.flush(TermsHash.java:116)
>         at org.apache.lucene.index.DocInverter.flush(DocInverter.java:53)
>         at org.apache.lucene.index.DocFieldProcessor.flush(DocFieldProcessor.java:81)
>         at org.apache.lucene.index.DocumentsWriterPerThread.flush(DocumentsWriterPerThread.java:494)
>         at org.apache.lucene.index.DocumentsWriter.doFlush(DocumentsWriter.java:422)
>         at org.apache.lucene.index.DocumentsWriter.flushAllThreads(DocumentsWriter.java:559)
>         at org.apache.lucene.index.IndexWriter.prepareCommitInternal(IndexWriter.java:2638)
>         at org.apache.lucene.index.IndexWriter.commitInternal(IndexWriter.java:2782)
>         at org.apache.lucene.index.IndexWriter.commit(IndexWriter.java:2762)
>         at org.apache.lucene.index.RandomIndexWriter.getReader(RandomIndexWriter.java:315)
>         at org.apache.lucene.index.RandomIndexWriter.getReader(RandomIndexWriter.java:255)
>         at org.apache.lucene.index.BaseTermVectorsFormatTestCase.testLotsOfFields(BaseTermVectorsFormatTestCase.java:580)
>         at sun.reflect.NativeMethodAccessorImpl.invoke0(Native Method)
>         at sun.reflect.NativeMethodAccessorImpl.invoke(NativeMethodAccessorImpl.java:88)
>         at sun.reflect.DelegatingMethodAccessorImpl.invoke(DelegatingMethodAccessorImpl.java:55)
>         at java.lang.reflect.Method.invoke(Method.java:613)
>         at com.carrotsearch.randomizedtesting.RandomizedRunner.invoke(RandomizedRunner.java:1559)
>         at com.carrotsearch.randomizedtesting.RandomizedRunner.access$600(RandomizedRunner.java:79)
>         at com.carrotsearch.randomizedtesting.RandomizedRunner$6.evaluate(RandomizedRunner.java:737)
>         at com.carrotsearch.randomizedtesting.RandomizedRunner$7.evaluate(RandomizedRunner.java:773)
>         at com.carrotsearch.randomizedtesting.RandomizedRunner$8.evaluate(RandomizedRunner.java:787)
>         at org.apache.lucene.util.TestRuleSetupTeardownChained$1.evaluate(TestRuleSetupTeardownChained.java:50)
>         at org.apache.lucene.util.TestRuleFieldCacheSanity$1.evaluate(TestRuleFieldCacheSanity.java:51)
>         at org.apache.lucene.util.AbstractBeforeAfterRule$1.evaluate(AbstractBeforeAfterRule.java:46)
>         at com.carrotsearch.randomizedtesting.rules.SystemPropertiesInvariantRule$1.evaluate(SystemPropertiesInvariantRule.java:55)
>         at org.apache.lucene.util.TestRuleThreadAndTestName$1.evaluate(TestRuleThreadAndTestName.java:49)
>         at org.apache.lucene.util.TestRuleIgnoreAfterMaxFailures$1.evaluate(TestRuleIgnoreAfterMaxFailures.java:70)
>         at org.apache.lucene.util.TestRuleMarkFailure$1.evaluate(TestRuleMarkFailure.java:48)
>         at com.carrotsearch.randomizedtesting.rules.StatementAdapter.evaluate(StatementAdapter.java:36)
>         at com.carrotsearch.randomizedtesting.ThreadLeakControl$StatementRunner.run(ThreadLeakControl.java:358)
>         at com.carrotsearch.randomizedtesting.ThreadLeakControl.forkTimeoutingTask(ThreadLeakControl.java:782)
>         at com.carrotsearch.randomizedtesting.ThreadLeakControl$3.evaluate(ThreadLeakControl.java:442)
>         at com.carrotsearch.randomizedtesting.RandomizedRunner.runSingleTest(RandomizedRunner.java:746)
>         at com.carrotsearch.randomizedtesting.RandomizedRunner$3.evaluate(RandomizedRunner.java:648)
>         at com.carrotsearch.randomizedtesting.RandomizedRunner$4.evaluate(RandomizedRunner.java:682)
>         at com.carrotsearch.randomizedtesting.RandomizedRunner$5.evaluate(RandomizedRunner.java:693)
>         at org.apache.lucene.util.AbstractBeforeAfterRule$1.evaluate(AbstractBeforeAfterRule.java:46)
>         at org.apache.lucene.util.TestRuleStoreClassName$1.evaluate(TestRuleStoreClassName.java:42)
>         at com.carrotsearch.randomizedtesting.rules.SystemPropertiesInvariantRule$1.evaluate(SystemPropertiesInvariantRule.java:55)
>         at com.carrotsearch.randomizedtesting.rules.NoShadowingOrOverridesOnMethodsRule$1.evaluate(NoShadowingOrOverridesOnMethodsRule.java:39)
>         at com.carrotsearch.randomizedtesting.rules.NoShadowingOrOverridesOnMethodsRule$1.evaluate(NoShadowingOrOverridesOnMethodsRule.java:39)
>         at com.carrotsearch.randomizedtesting.rules.StatementAdapter.evaluate(StatementAdapter.java:36)
>         at org.apache.lucene.util.TestRuleAssertionsRequired$1.evaluate(TestRuleAssertionsRequired.java:43)
>         at org.apache.lucene.util.TestRuleMarkFailure$1.evaluate(TestRuleMarkFailure.java:48)
>         at org.apache.lucene.util.TestRuleIgnoreAfterMaxFailures$1.evaluate(TestRuleIgnoreAfterMaxFailures.java:70)
>         at org.apache.lucene.util.TestRuleIgnoreTestSuites$1.evaluate(TestRuleIgnoreTestSuites.java:55)
>         at com.carrotsearch.randomizedtesting.rules.StatementAdapter.evaluate(StatementAdapter.java:36)
>         at com.carrotsearch.randomizedtesting.ThreadLeakControl$StatementRunner.run(ThreadLeakControl.java:358)
>         at java.lang.Thread.run(Thread.java:780)
>
>
> REGRESSION:  org.apache.lucene.util.fst.TestFSTs.testRandomWords
>
> Error Message:
>
>
> Stack Trace:
> java.lang.AssertionError
>         at __randomizedtesting.SeedInfo.seed([CF4D3AC66612146:72656893AF6E8E83]:0)
>         at org.apache.lucene.store.DataOutput.writeVLong(DataOutput.java:217)
>         at org.apache.lucene.util.fst.FST.pack(FST.java:1674)
>         at org.apache.lucene.util.fst.Builder.finish(Builder.java:477)
>         at org.apache.lucene.util.fst.FSTTester.doTest(FSTTester.java:314)
>         at org.apache.lucene.util.fst.FSTTester.doTest(FSTTester.java:187)
>         at org.apache.lucene.util.fst.TestFSTs.doTest(TestFSTs.java:169)
>         at org.apache.lucene.util.fst.TestFSTs.testRandomWords(TestFSTs.java:280)
>         at org.apache.lucene.util.fst.TestFSTs.testRandomWords(TestFSTs.java:254)
>         at sun.reflect.NativeMethodAccessorImpl.invoke0(Native Method)
>         at sun.reflect.NativeMethodAccessorImpl.invoke(NativeMethodAccessorImpl.java:88)
>         at sun.reflect.DelegatingMethodAccessorImpl.invoke(DelegatingMethodAccessorImpl.java:55)
>         at java.lang.reflect.Method.invoke(Method.java:613)
>         at com.carrotsearch.randomizedtesting.RandomizedRunner.invoke(RandomizedRunner.java:1559)
>         at com.carrotsearch.randomizedtesting.RandomizedRunner.access$600(RandomizedRunner.java:79)
>         at com.carrotsearch.randomizedtesting.RandomizedRunner$6.evaluate(RandomizedRunner.java:737)
>         at com.carrotsearch.randomizedtesting.RandomizedRunner$7.evaluate(RandomizedRunner.java:773)
>         at com.carrotsearch.randomizedtesting.RandomizedRunner$8.evaluate(RandomizedRunner.java:787)
>         at org.apache.lucene.util.TestRuleSetupTeardownChained$1.evaluate(TestRuleSetupTeardownChained.java:50)
>         at org.apache.lucene.util.TestRuleFieldCacheSanity$1.evaluate(TestRuleFieldCacheSanity.java:51)
>         at org.apache.lucene.util.AbstractBeforeAfterRule$1.evaluate(AbstractBeforeAfterRule.java:46)
>         at com.carrotsearch.randomizedtesting.rules.SystemPropertiesInvariantRule$1.evaluate(SystemPropertiesInvariantRule.java:55)
>         at org.apache.lucene.util.TestRuleThreadAndTestName$1.evaluate(TestRuleThreadAndTestName.java:49)
>         at org.apache.lucene.util.TestRuleIgnoreAfterMaxFailures$1.evaluate(TestRuleIgnoreAfterMaxFailures.java:70)
>         at org.apache.lucene.util.TestRuleMarkFailure$1.evaluate(TestRuleMarkFailure.java:48)
>         at com.carrotsearch.randomizedtesting.rules.StatementAdapter.evaluate(StatementAdapter.java:36)
>         at com.carrotsearch.randomizedtesting.ThreadLeakControl$StatementRunner.run(ThreadLeakControl.java:358)
>         at com.carrotsearch.randomizedtesting.ThreadLeakControl.forkTimeoutingTask(ThreadLeakControl.java:782)
>         at com.carrotsearch.randomizedtesting.ThreadLeakControl$3.evaluate(ThreadLeakControl.java:442)
>         at com.carrotsearch.randomizedtesting.RandomizedRunner.runSingleTest(RandomizedRunner.java:746)
>         at com.carrotsearch.randomizedtesting.RandomizedRunner$3.evaluate(RandomizedRunner.java:648)
>         at com.carrotsearch.randomizedtesting.RandomizedRunner$4.evaluate(RandomizedRunner.java:682)
>         at com.carrotsearch.randomizedtesting.RandomizedRunner$5.evaluate(RandomizedRunner.java:693)
>         at org.apache.lucene.util.AbstractBeforeAfterRule$1.evaluate(AbstractBeforeAfterRule.java:46)
>         at org.apache.lucene.util.TestRuleStoreClassName$1.evaluate(TestRuleStoreClassName.java:42)
>         at com.carrotsearch.randomizedtesting.rules.SystemPropertiesInvariantRule$1.evaluate(SystemPropertiesInvariantRule.java:55)
>         at com.carrotsearch.randomizedtesting.rules.NoShadowingOrOverridesOnMethodsRule$1.evaluate(NoShadowingOrOverridesOnMethodsRule.java:39)
>         at com.carrotsearch.randomizedtesting.rules.NoShadowingOrOverridesOnMethodsRule$1.evaluate(NoShadowingOrOverridesOnMethodsRule.java:39)
>         at com.carrotsearch.randomizedtesting.rules.StatementAdapter.evaluate(StatementAdapter.java:36)
>         at org.apache.lucene.util.TestRuleAssertionsRequired$1.evaluate(TestRuleAssertionsRequired.java:43)
>         at org.apache.lucene.util.TestRuleMarkFailure$1.evaluate(TestRuleMarkFailure.java:48)
>         at org.apache.lucene.util.TestRuleIgnoreAfterMaxFailures$1.evaluate(TestRuleIgnoreAfterMaxFailures.java:70)
>         at org.apache.lucene.util.TestRuleIgnoreTestSuites$1.evaluate(TestRuleIgnoreTestSuites.java:55)
>         at com.carrotsearch.randomizedtesting.rules.StatementAdapter.evaluate(StatementAdapter.java:36)
>         at com.carrotsearch.randomizedtesting.ThreadLeakControl$StatementRunner.run(ThreadLeakControl.java:358)
>         at java.lang.Thread.run(Thread.java:780)
>
>
>
>
> Build Log:
> [...truncated 293 lines...]
> [junit4:junit4] Suite: org.apache.lucene.codecs.perfield.TestPerFieldDocValuesFormat
> [junit4:junit4]   2> NOTE: reproduce with: ant test  -Dtestcase=TestPerFieldDocValuesFormat -Dtests.method=testSortedSetVariableLengthVsUninvertedField -Dtests.seed=CF4D3AC66612146 -Dtests.multiplier=3 -Dtests.slow=true -Dtests.locale=es_MX -Dtests.timezone=Asia/Dacca -Dtests.file.encoding=US-ASCII
> [junit4:junit4] ERROR   26.8s J1 | TestPerFieldDocValuesFormat.testSortedSetVariableLengthVsUninvertedField <<<
> [junit4:junit4]    > Throwable #1: java.lang.ArrayIndexOutOfBoundsException
> [junit4:junit4]    >    at __randomizedtesting.SeedInfo.seed([CF4D3AC66612146:A557D4C98686A786]:0)
> [junit4:junit4]    >    at org.apache.lucene.store.ByteArrayDataInput.readVInt(ByteArrayDataInput.java:104)
> [junit4:junit4]    >    at org.apache.lucene.codecs.memory.MemoryPostingsFormat$FSTTermsEnum.decodeMetaData(MemoryPostingsFormat.java:641)
> [junit4:junit4]    >    at org.apache.lucene.codecs.memory.MemoryPostingsFormat$FSTTermsEnum.docFreq(MemoryPostingsFormat.java:743)
> [junit4:junit4]    >    at org.apache.lucene.index.DocTermOrds.uninvert(DocTermOrds.java:364)
> [junit4:junit4]    >    at org.apache.lucene.index.DocTermOrds.<init>(DocTermOrds.java:198)
> [junit4:junit4]    >    at org.apache.lucene.index.DocTermOrds.<init>(DocTermOrds.java:189)
> [junit4:junit4]    >    at org.apache.lucene.index.DocTermOrds.<init>(DocTermOrds.java:177)
> [junit4:junit4]    >    at org.apache.lucene.search.FieldCacheImpl$DocTermOrdsCache.createValue(FieldCacheImpl.java:1402)
> [junit4:junit4]    >    at org.apache.lucene.search.FieldCacheImpl$Cache.get(FieldCacheImpl.java:212)
> [junit4:junit4]    >    at org.apache.lucene.search.FieldCacheImpl.getDocTermOrds(FieldCacheImpl.java:1390)
> [junit4:junit4]    >    at org.apache.lucene.index.BaseDocValuesFormatTestCase.doTestSortedSetVsUninvertedField(BaseDocValuesFormatTestCase.java:1848)
> [junit4:junit4]    >    at org.apache.lucene.index.BaseDocValuesFormatTestCase.testSortedSetVariableLengthVsUninvertedField(BaseDocValuesFormatTestCase.java:1870)
> [junit4:junit4]    >    at sun.reflect.NativeMethodAccessorImpl.invoke0(Native Method)
> [junit4:junit4]    >    at sun.reflect.NativeMethodAccessorImpl.invoke(NativeMethodAccessorImpl.java:88)
> [junit4:junit4]    >    at sun.reflect.DelegatingMethodAccessorImpl.invoke(DelegatingMethodAccessorImpl.java:55)
> [junit4:junit4]    >    at java.lang.reflect.Method.invoke(Method.java:613)
> [junit4:junit4]    >    at com.carrotsearch.randomizedtesting.RandomizedRunner.invoke(RandomizedRunner.java:1559)
> [junit4:junit4]    >    at com.carrotsearch.randomizedtesting.RandomizedRunner.access$600(RandomizedRunner.java:79)
> [junit4:junit4]    >    at com.carrotsearch.randomizedtesting.RandomizedRunner$6.evaluate(RandomizedRunner.java:737)
> [junit4:junit4]    >    at com.carrotsearch.randomizedtesting.RandomizedRunner$7.evaluate(RandomizedRunner.java:773)
> [junit4:junit4]    >    at com.carrotsearch.randomizedtesting.RandomizedRunner$8.evaluate(RandomizedRunner.java:787)
> [junit4:junit4]    >    at org.apache.lucene.util.TestRuleSetupTeardownChained$1.evaluate(TestRuleSetupTeardownChained.java:50)
> [junit4:junit4]    >    at org.apache.lucene.util.TestRuleFieldCacheSanity$1.evaluate(TestRuleFieldCacheSanity.java:51)
> [junit4:junit4]    >    at org.apache.lucene.util.AbstractBeforeAfterRule$1.evaluate(AbstractBeforeAfterRule.java:46)
> [junit4:junit4]    >    at com.carrotsearch.randomizedtesting.rules.SystemPropertiesInvariantRule$1.evaluate(SystemPropertiesInvariantRule.java:55)
> [junit4:junit4]    >    at org.apache.lucene.util.TestRuleThreadAndTestName$1.evaluate(TestRuleThreadAndTestName.java:49)
> [junit4:junit4]    >    at org.apache.lucene.util.TestRuleIgnoreAfterMaxFailures$1.evaluate(TestRuleIgnoreAfterMaxFailures.java:70)
> [junit4:junit4]    >    at org.apache.lucene.util.TestRuleMarkFailure$1.evaluate(TestRuleMarkFailure.java:48)
> [junit4:junit4]    >    at com.carrotsearch.randomizedtesting.rules.StatementAdapter.evaluate(StatementAdapter.java:36)
> [junit4:junit4]    >    at com.carrotsearch.randomizedtesting.ThreadLeakControl$StatementRunner.run(ThreadLeakControl.java:358)
> [junit4:junit4]    >    at com.carrotsearch.randomizedtesting.ThreadLeakControl.forkTimeoutingTask(ThreadLeakControl.java:782)
> [junit4:junit4]    >    at com.carrotsearch.randomizedtesting.ThreadLeakControl$3.evaluate(ThreadLeakControl.java:442)
> [junit4:junit4]    >    at com.carrotsearch.randomizedtesting.RandomizedRunner.runSingleTest(RandomizedRunner.java:746)
> [junit4:junit4]    >    at com.carrotsearch.randomizedtesting.RandomizedRunner$3.evaluate(RandomizedRunner.java:648)
> [junit4:junit4]    >    at com.carrotsearch.randomizedtesting.RandomizedRunner$4.evaluate(RandomizedRunner.java:682)
> [junit4:junit4]    >    at com.carrotsearch.randomizedtesting.RandomizedRunner$5.evaluate(RandomizedRunner.java:693)
> [junit4:junit4]    >    at org.apache.lucene.util.AbstractBeforeAfterRule$1.evaluate(AbstractBeforeAfterRule.java:46)
> [junit4:junit4]    >    at org.apache.lucene.util.TestRuleStoreClassName$1.evaluate(TestRuleStoreClassName.java:42)
> [junit4:junit4]    >    at com.carrotsearch.randomizedtesting.rules.SystemPropertiesInvariantRule$1.evaluate(SystemPropertiesInvariantRule.java:55)
> [junit4:junit4]    >    at com.carrotsearch.randomizedtesting.rules.NoShadowingOrOverridesOnMethodsRule$1.evaluate(NoShadowingOrOverridesOnMethodsRule.java:39)
> [junit4:junit4]    >    at com.carrotsearch.randomizedtesting.rules.NoShadowingOrOverridesOnMethodsRule$1.evaluate(NoShadowingOrOverridesOnMethodsRule.java:39)
> [junit4:junit4]    >    at com.carrotsearch.randomizedtesting.rules.StatementAdapter.evaluate(StatementAdapter.java:36)
> [junit4:junit4]    >    at org.apache.lucene.util.TestRuleAssertionsRequired$1.evaluate(TestRuleAssertionsRequired.java:43)
> [junit4:junit4]    >    at org.apache.lucene.util.TestRuleMarkFailure$1.evaluate(TestRuleMarkFailure.java:48)
> [junit4:junit4]    >    at org.apache.lucene.util.TestRuleIgnoreAfterMaxFailures$1.evaluate(TestRuleIgnoreAfterMaxFailures.java:70)
> [junit4:junit4]    >    at org.apache.lucene.util.TestRuleIgnoreTestSuites$1.evaluate(TestRuleIgnoreTestSuites.java:55)
> [junit4:junit4]    >    at com.carrotsearch.randomizedtesting.rules.StatementAdapter.evaluate(StatementAdapter.java:36)
> [junit4:junit4]    >    at com.carrotsearch.randomizedtesting.ThreadLeakControl$StatementRunner.run(ThreadLeakControl.java:358)
> [junit4:junit4]    >    at java.lang.Thread.run(Thread.java:780)
> [junit4:junit4]   2> NOTE: test params are: codec=Asserting, sim=DefaultSimilarity, locale=es_MX, timezone=Asia/Dacca
> [junit4:junit4]   2> NOTE: Linux 3.2.0-38-generic x86/IBM Corporation 1.7.0 (32-bit)/cpus=8,threads=1,free=55144824,total=102105088
> [junit4:junit4]   2> NOTE: All tests run in this JVM: [TestConsistentFieldNumbers, TestSearchWithThreads, TestAttributeSource, TestSegmentMerger, TestIndexWriterOnJRECrash, TestBasics, TestCheckIndex, TestVersion, TestSimpleExplanationsOfNonMatches, TestFilteredQuery, TestOpenBitSet, TestPerFieldDocValuesFormat]
> [junit4:junit4] Completed on J1 in 106.33s, 53 tests, 1 error <<< FAILURES!
>
> [...truncated 190 lines...]
> [junit4:junit4] Suite: org.apache.lucene.index.TestTermVectorsFormat
> [junit4:junit4]   2> NOTE: reproduce with: ant test  -Dtestcase=TestTermVectorsFormat -Dtests.method=testClone -Dtests.seed=CF4D3AC66612146 -Dtests.multiplier=3 -Dtests.slow=true -Dtests.locale=cs_CZ -Dtests.timezone=Asia/Colombo -Dtests.file.encoding=US-ASCII
> [junit4:junit4] FAILURE 2.10s J1 | TestTermVectorsFormat.testClone <<<
> [junit4:junit4]    > Throwable #1: java.lang.AssertionError
> [junit4:junit4]    >    at __randomizedtesting.SeedInfo.seed([CF4D3AC66612146:EA31A66603D52DAF]:0)
> [junit4:junit4]    >    at org.apache.lucene.store.DataOutput.writeVLong(DataOutput.java:217)
> [junit4:junit4]    >    at org.apache.lucene.util.fst.FST.pack(FST.java:1674)
> [junit4:junit4]    >    at org.apache.lucene.util.fst.Builder.finish(Builder.java:477)
> [junit4:junit4]    >    at org.apache.lucene.codecs.memory.MemoryPostingsFormat$TermsWriter.finish(MemoryPostingsFormat.java:274)
> [junit4:junit4]    >    at org.apache.lucene.index.FreqProxTermsWriterPerField.flush(FreqProxTermsWriterPerField.java:548)
> [junit4:junit4]    >    at org.apache.lucene.index.FreqProxTermsWriter.flush(FreqProxTermsWriter.java:85)
> [junit4:junit4]    >    at org.apache.lucene.index.TermsHash.flush(TermsHash.java:116)
> [junit4:junit4]    >    at org.apache.lucene.index.DocInverter.flush(DocInverter.java:53)
> [junit4:junit4]    >    at org.apache.lucene.index.DocFieldProcessor.flush(DocFieldProcessor.java:81)
> [junit4:junit4]    >    at org.apache.lucene.index.DocumentsWriterPerThread.flush(DocumentsWriterPerThread.java:494)
> [junit4:junit4]    >    at org.apache.lucene.index.DocumentsWriter.doFlush(DocumentsWriter.java:422)
> [junit4:junit4]    >    at org.apache.lucene.index.DocumentsWriter.flushAllThreads(DocumentsWriter.java:559)
> [junit4:junit4]    >    at org.apache.lucene.index.IndexWriter.prepareCommitInternal(IndexWriter.java:2638)
> [junit4:junit4]    >    at org.apache.lucene.index.IndexWriter.commitInternal(IndexWriter.java:2782)
> [junit4:junit4]    >    at org.apache.lucene.index.IndexWriter.commit(IndexWriter.java:2762)
> [junit4:junit4]    >    at org.apache.lucene.index.RandomIndexWriter.maybeCommit(RandomIndexWriter.java:163)
> [junit4:junit4]    >    at org.apache.lucene.index.RandomIndexWriter.addDocument(RandomIndexWriter.java:155)
> [junit4:junit4]    >    at org.apache.lucene.index.RandomIndexWriter.addDocument(RandomIndexWriter.java:114)
> [junit4:junit4]    >    at org.apache.lucene.index.BaseTermVectorsFormatTestCase.testClone(BaseTermVectorsFormatTestCase.java:689)
> [junit4:junit4]    >    at sun.reflect.NativeMethodAccessorImpl.invoke0(Native Method)
> [junit4:junit4]    >    at sun.reflect.NativeMethodAccessorImpl.invoke(NativeMethodAccessorImpl.java:88)
> [junit4:junit4]    >    at sun.reflect.DelegatingMethodAccessorImpl.invoke(DelegatingMethodAccessorImpl.java:55)
> [junit4:junit4]    >    at java.lang.reflect.Method.invoke(Method.java:613)
> [junit4:junit4]    >    at com.carrotsearch.randomizedtesting.RandomizedRunner.invoke(RandomizedRunner.java:1559)
> [junit4:junit4]    >    at com.carrotsearch.randomizedtesting.RandomizedRunner.access$600(RandomizedRunner.java:79)
> [junit4:junit4]    >    at com.carrotsearch.randomizedtesting.RandomizedRunner$6.evaluate(RandomizedRunner.java:737)
> [junit4:junit4]    >    at com.carrotsearch.randomizedtesting.RandomizedRunner$7.evaluate(RandomizedRunner.java:773)
> [junit4:junit4]    >    at com.carrotsearch.randomizedtesting.RandomizedRunner$8.evaluate(RandomizedRunner.java:787)
> [junit4:junit4]    >    at org.apache.lucene.util.TestRuleSetupTeardownChained$1.evaluate(TestRuleSetupTeardownChained.java:50)
> [junit4:junit4]    >    at org.apache.lucene.util.TestRuleFieldCacheSanity$1.evaluate(TestRuleFieldCacheSanity.java:51)
> [junit4:junit4]    >    at org.apache.lucene.util.AbstractBeforeAfterRule$1.evaluate(AbstractBeforeAfterRule.java:46)
> [junit4:junit4]    >    at com.carrotsearch.randomizedtesting.rules.SystemPropertiesInvariantRule$1.evaluate(SystemPropertiesInvariantRule.java:55)
> [junit4:junit4]    >    at org.apache.lucene.util.TestRuleThreadAndTestName$1.evaluate(TestRuleThreadAndTestName.java:49)
> [junit4:junit4]    >    at org.apache.lucene.util.TestRuleIgnoreAfterMaxFailures$1.evaluate(TestRuleIgnoreAfterMaxFailures.java:70)
> [junit4:junit4]    >    at org.apache.lucene.util.TestRuleMarkFailure$1.evaluate(TestRuleMarkFailure.java:48)
> [junit4:junit4]    >    at com.carrotsearch.randomizedtesting.rules.StatementAdapter.evaluate(StatementAdapter.java:36)
> [junit4:junit4]    >    at com.carrotsearch.randomizedtesting.ThreadLeakControl$StatementRunner.run(ThreadLeakControl.java:358)
> [junit4:junit4]    >    at com.carrotsearch.randomizedtesting.ThreadLeakControl.forkTimeoutingTask(ThreadLeakControl.java:782)
> [junit4:junit4]    >    at com.carrotsearch.randomizedtesting.ThreadLeakControl$3.evaluate(ThreadLeakControl.java:442)
> [junit4:junit4]    >    at com.carrotsearch.randomizedtesting.RandomizedRunner.runSingleTest(RandomizedRunner.java:746)
> [junit4:junit4]    >    at com.carrotsearch.randomizedtesting.RandomizedRunner$3.evaluate(RandomizedRunner.java:648)
> [junit4:junit4]    >    at com.carrotsearch.randomizedtesting.RandomizedRunner$4.evaluate(RandomizedRunner.java:682)
> [junit4:junit4]    >    at com.carrotsearch.randomizedtesting.RandomizedRunner$5.evaluate(RandomizedRunner.java:693)
> [junit4:junit4]    >    at org.apache.lucene.util.AbstractBeforeAfterRule$1.evaluate(AbstractBeforeAfterRule.java:46)
> [junit4:junit4]    >    at org.apache.lucene.util.TestRuleStoreClassName$1.evaluate(TestRuleStoreClassName.java:42)
> [junit4:junit4]    >    at com.carrotsearch.randomizedtesting.rules.SystemPropertiesInvariantRule$1.evaluate(SystemPropertiesInvariantRule.java:55)
> [junit4:junit4]    >    at com.carrotsearch.randomizedtesting.rules.NoShadowingOrOverridesOnMethodsRule$1.evaluate(NoShadowingOrOverridesOnMethodsRule.java:39)
> [junit4:junit4]    >    at com.carrotsearch.randomizedtesting.rules.NoShadowingOrOverridesOnMethodsRule$1.evaluate(NoShadowingOrOverridesOnMethodsRule.java:39)
> [junit4:junit4]    >    at com.carrotsearch.randomizedtesting.rules.StatementAdapter.evaluate(StatementAdapter.java:36)
> [junit4:junit4]    >    at org.apache.lucene.util.TestRuleAssertionsRequired$1.evaluate(TestRuleAssertionsRequired.java:43)
> [junit4:junit4]    >    at org.apache.lucene.util.TestRuleMarkFailure$1.evaluate(TestRuleMarkFailure.java:48)
> [junit4:junit4]    >    at org.apache.lucene.util.TestRuleIgnoreAfterMaxFailures$1.evaluate(TestRuleIgnoreAfterMaxFailures.java:70)
> [junit4:junit4]    >    at org.apache.lucene.util.TestRuleIgnoreTestSuites$1.evaluate(TestRuleIgnoreTestSuites.java:55)
> [junit4:junit4]    >    at com.carrotsearch.randomizedtesting.rules.StatementAdapter.evaluate(StatementAdapter.java:36)
> [junit4:junit4]    >    at com.carrotsearch.randomizedtesting.ThreadLeakControl$StatementRunner.run(ThreadLeakControl.java:358)
> [junit4:junit4]    >    at java.lang.Thread.run(Thread.java:780)
> [junit4:junit4]   2> NOTE: reproduce with: ant test  -Dtestcase=TestTermVectorsFormat -Dtests.method=testLotsOfFields -Dtests.seed=CF4D3AC66612146 -Dtests.multiplier=3 -Dtests.slow=true -Dtests.locale=cs_CZ -Dtests.timezone=Asia/Colombo -Dtests.file.encoding=US-ASCII
> [junit4:junit4] FAILURE 0.06s J1 | TestTermVectorsFormat.testLotsOfFields <<<
> [junit4:junit4]    > Throwable #1: java.lang.AssertionError
> [junit4:junit4]    >    at __randomizedtesting.SeedInfo.seed([CF4D3AC66612146:561A443AB9180756]:0)
> [junit4:junit4]    >    at org.apache.lucene.store.DataOutput.writeVLong(DataOutput.java:217)
> [junit4:junit4]    >    at org.apache.lucene.util.fst.FST.pack(FST.java:1674)
> [junit4:junit4]    >    at org.apache.lucene.util.fst.Builder.finish(Builder.java:477)
> [junit4:junit4]    >    at org.apache.lucene.codecs.memory.MemoryPostingsFormat$TermsWriter.finish(MemoryPostingsFormat.java:274)
> [junit4:junit4]    >    at org.apache.lucene.index.FreqProxTermsWriterPerField.flush(FreqProxTermsWriterPerField.java:548)
> [junit4:junit4]    >    at org.apache.lucene.index.FreqProxTermsWriter.flush(FreqProxTermsWriter.java:85)
> [junit4:junit4]    >    at org.apache.lucene.index.TermsHash.flush(TermsHash.java:116)
> [junit4:junit4]    >    at org.apache.lucene.index.DocInverter.flush(DocInverter.java:53)
> [junit4:junit4]    >    at org.apache.lucene.index.DocFieldProcessor.flush(DocFieldProcessor.java:81)
> [junit4:junit4]    >    at org.apache.lucene.index.DocumentsWriterPerThread.flush(DocumentsWriterPerThread.java:494)
> [junit4:junit4]    >    at org.apache.lucene.index.DocumentsWriter.doFlush(DocumentsWriter.java:422)
> [junit4:junit4]    >    at org.apache.lucene.index.DocumentsWriter.flushAllThreads(DocumentsWriter.java:559)
> [junit4:junit4]    >    at org.apache.lucene.index.IndexWriter.prepareCommitInternal(IndexWriter.java:2638)
> [junit4:junit4]    >    at org.apache.lucene.index.IndexWriter.commitInternal(IndexWriter.java:2782)
> [junit4:junit4]    >    at org.apache.lucene.index.IndexWriter.commit(IndexWriter.java:2762)
> [junit4:junit4]    >    at org.apache.lucene.index.RandomIndexWriter.getReader(RandomIndexWriter.java:315)
> [junit4:junit4]    >    at org.apache.lucene.index.RandomIndexWriter.getReader(RandomIndexWriter.java:255)
> [junit4:junit4]    >    at org.apache.lucene.index.BaseTermVectorsFormatTestCase.testLotsOfFields(BaseTermVectorsFormatTestCase.java:580)
> [junit4:junit4]    >    at sun.reflect.NativeMethodAccessorImpl.invoke0(Native Method)
> [junit4:junit4]    >    at sun.reflect.NativeMethodAccessorImpl.invoke(NativeMethodAccessorImpl.java:88)
> [junit4:junit4]    >    at sun.reflect.DelegatingMethodAccessorImpl.invoke(DelegatingMethodAccessorImpl.java:55)
> [junit4:junit4]    >    at java.lang.reflect.Method.invoke(Method.java:613)
> [junit4:junit4]    >    at com.carrotsearch.randomizedtesting.RandomizedRunner.invoke(RandomizedRunner.java:1559)
> [junit4:junit4]    >    at com.carrotsearch.randomizedtesting.RandomizedRunner.access$600(RandomizedRunner.java:79)
> [junit4:junit4]    >    at com.carrotsearch.randomizedtesting.RandomizedRunner$6.evaluate(RandomizedRunner.java:737)
> [junit4:junit4]    >    at com.carrotsearch.randomizedtesting.RandomizedRunner$7.evaluate(RandomizedRunner.java:773)
> [junit4:junit4]    >    at com.carrotsearch.randomizedtesting.RandomizedRunner$8.evaluate(RandomizedRunner.java:787)
> [junit4:junit4]    >    at org.apache.lucene.util.TestRuleSetupTeardownChained$1.evaluate(TestRuleSetupTeardownChained.java:50)
> [junit4:junit4]    >    at org.apache.lucene.util.TestRuleFieldCacheSanity$1.evaluate(TestRuleFieldCacheSanity.java:51)
> [junit4:junit4]    >    at org.apache.lucene.util.AbstractBeforeAfterRule$1.evaluate(AbstractBeforeAfterRule.java:46)
> [junit4:junit4]    >    at com.carrotsearch.randomizedtesting.rules.SystemPropertiesInvariantRule$1.evaluate(SystemPropertiesInvariantRule.java:55)
> [junit4:junit4]    >    at org.apache.lucene.util.TestRuleThreadAndTestName$1.evaluate(TestRuleThreadAndTestName.java:49)
> [junit4:junit4]    >    at org.apache.lucene.util.TestRuleIgnoreAfterMaxFailures$1.evaluate(TestRuleIgnoreAfterMaxFailures.java:70)
> [junit4:junit4]    >    at org.apache.lucene.util.TestRuleMarkFailure$1.evaluate(TestRuleMarkFailure.java:48)
> [junit4:junit4]    >    at com.carrotsearch.randomizedtesting.rules.StatementAdapter.evaluate(StatementAdapter.java:36)
> [junit4:junit4]    >    at com.carrotsearch.randomizedtesting.ThreadLeakControl$StatementRunner.run(ThreadLeakControl.java:358)
> [junit4:junit4]    >    at com.carrotsearch.randomizedtesting.ThreadLeakControl.forkTimeoutingTask(ThreadLeakControl.java:782)
> [junit4:junit4]    >    at com.carrotsearch.randomizedtesting.ThreadLeakControl$3.evaluate(ThreadLeakControl.java:442)
> [junit4:junit4]    >    at com.carrotsearch.randomizedtesting.RandomizedRunner.runSingleTest(RandomizedRunner.java:746)
> [junit4:junit4]    >    at com.carrotsearch.randomizedtesting.RandomizedRunner$3.evaluate(RandomizedRunner.java:648)
> [junit4:junit4]    >    at com.carrotsearch.randomizedtesting.RandomizedRunner$4.evaluate(RandomizedRunner.java:682)
> [junit4:junit4]    >    at com.carrotsearch.randomizedtesting.RandomizedRunner$5.evaluate(RandomizedRunner.java:693)
> [junit4:junit4]    >    at org.apache.lucene.util.AbstractBeforeAfterRule$1.evaluate(AbstractBeforeAfterRule.java:46)
> [junit4:junit4]    >    at org.apache.lucene.util.TestRuleStoreClassName$1.evaluate(TestRuleStoreClassName.java:42)
> [junit4:junit4]    >    at com.carrotsearch.randomizedtesting.rules.SystemPropertiesInvariantRule$1.evaluate(SystemPropertiesInvariantRule.java:55)
> [junit4:junit4]    >    at com.carrotsearch.randomizedtesting.rules.NoShadowingOrOverridesOnMethodsRule$1.evaluate(NoShadowingOrOverridesOnMethodsRule.java:39)
> [junit4:junit4]    >    at com.carrotsearch.randomizedtesting.rules.NoShadowingOrOverridesOnMethodsRule$1.evaluate(NoShadowingOrOverridesOnMethodsRule.java:39)
> [junit4:junit4]    >    at com.carrotsearch.randomizedtesting.rules.StatementAdapter.evaluate(StatementAdapter.java:36)
> [junit4:junit4]    >    at org.apache.lucene.util.TestRuleAssertionsRequired$1.evaluate(TestRuleAssertionsRequired.java:43)
> [junit4:junit4]    >    at org.apache.lucene.util.TestRuleMarkFailure$1.evaluate(TestRuleMarkFailure.java:48)
> [junit4:junit4]    >    at org.apache.lucene.util.TestRuleIgnoreAfterMaxFailures$1.evaluate(TestRuleIgnoreAfterMaxFailures.java:70)
> [junit4:junit4]    >    at org.apache.lucene.util.TestRuleIgnoreTestSuites$1.evaluate(TestRuleIgnoreTestSuites.java:55)
> [junit4:junit4]    >    at com.carrotsearch.randomizedtesting.rules.StatementAdapter.evaluate(StatementAdapter.java:36)
> [junit4:junit4]    >    at com.carrotsearch.randomizedtesting.ThreadLeakControl$StatementRunner.run(ThreadLeakControl.java:358)
> [junit4:junit4]    >    at java.lang.Thread.run(Thread.java:780)
> [junit4:junit4]   2> NOTE: test params are: codec=Lucene42: {=Lucene41(blocksize=128), mabdowfi=PostingsFormat(name=Memory doPackFST= true), abwhfotwtx=Lucene41(blocksize=128), pwjk=Lucene41(blocksize=128), afmq=PostingsFormat(name=Memory doPackFST= true), nvvig=Lucene41(blocksize=128), wgdf=MockVariableIntBlock(baseBlockSize=127), sgnjg=PostingsFormat(name=TestBloomFilteredLucene41Postings), tgag=PostingsFormat(name=Memory doPackFST= true), aaxnq=PostingsFormat(name=TestBloomFilteredLucene41Postings), id=PostingsFormat(name=TestBloomFilteredLucene41Postings), hxdsff=PostingsFormat(name=TestBloomFilteredLucene41Postings), jshij=Lucene41(blocksize=128), anoowyo=MockVariableIntBlock(baseBlockSize=127), gmcvyjtby=PostingsFormat(name=Memory doPackFST= true), ko=Lucene41(blocksize=128), gqhcilm=PostingsFormat(name=Memory doPackFST= true), bpt=MockVariableIntBlock(baseBlockSize=127), zgzvfart=Lucene41(blocksize=128), afvgfy=PostingsFormat(name=Memory doPackFST= true), gbd=PostingsFormat(name=Memory doPackFST= true), aatnlqh=PostingsFormat(name=Memory doPackFST= true), qjsoqdpfl=Lucene41(blocksize=128), vfibzmm=PostingsFormat(name=Memory doPackFST= true), ejlfq=MockVariableIntBlock(baseBlockSize=127), aapnwk=Lucene41(blocksize=128), aapjiuvns=PostingsFormat(name=Memory doPackFST= true), abod=MockVariableIntBlock(baseBlockSize=127), v=MockVariableIntBlock(baseBlockSize=127), aeploikfk=MockVariableIntBlock(baseBlockSize=127), xjfsyder=PostingsFormat(name=TestBloomFilteredLucene41Postings), adbga=PostingsFormat(name=Memory doPackFST= true), dzybx=PostingsFormat(name=Memory doPackFST= true), abiqf=PostingsFormat(name=Memory doPackFST= true), vkskkcqj=Lucene41(blocksize=128)}, docValues:{}, sim=DefaultSimilarity, locale=cs_CZ, timezone=Asia/Colombo
> [junit4:junit4]   2> NOTE: Linux 3.2.0-38-generic x86/IBM Corporation 1.7.0 (32-bit)/cpus=8,threads=1,free=10102672,total=137887744
> [junit4:junit4]   2> NOTE: All tests run in this JVM: [TestConsistentFieldNumbers, TestSearchWithThreads, TestAttributeSource, TestSegmentMerger, TestIndexWriterOnJRECrash, TestBasics, TestCheckIndex, TestVersion, TestSimpleExplanationsOfNonMatches, TestFilteredQuery, TestOpenBitSet, TestPerFieldDocValuesFormat, TestParallelCompositeReader, TestNeverDelete, TestField, TestFieldMaskingSpanQuery, TestLongPostings, TestSizeBoundedForceMerge, TestDocumentsWriterDeleteQueue, TestMultiPhraseQuery, TestMergeSchedulerExternal, TestDocValuesScoring, TestMultiThreadTermVectors, TestDateSort, TestCustomSearcherSort, TestDocTermOrds, TestBooleanScorer, TestTerm, TestBooleanQuery, TestPositiveScoresOnlyCollector, MultiCollectorTest, TestBitVector, Nested, TestStressIndexing2, Test4GBStoredFields, TestBooleanMinShouldMatch, TestFieldValueFilter, TestIndexFileDeleter, TestByteBlockPool, TestDocCount, TestTermVectorsFormat]
> [junit4:junit4] Completed on J1 in 14.93s, 7 tests, 2 failures <<< FAILURES!
>
> [...truncated 7 lines...]
> [junit4:junit4] Suite: org.apache.lucene.util.fst.TestFSTs
> [junit4:junit4] IGNOR/A 0.01s J1 | TestFSTs.testBigSet
> [junit4:junit4]    > Assumption #1: 'nightly' test group is disabled (@Nightly)
> [junit4:junit4]   2> NOTE: reproduce with: ant test  -Dtestcase=TestFSTs -Dtests.method=testRandomWords -Dtests.seed=CF4D3AC66612146 -Dtests.multiplier=3 -Dtests.slow=true -Dtests.locale=ar_DZ -Dtests.timezone=GMT0 -Dtests.file.encoding=US-ASCII
> [junit4:junit4] FAILURE 0.03s J1 | TestFSTs.testRandomWords <<<
> [junit4:junit4]    > Throwable #1: java.lang.AssertionError
> [junit4:junit4]    >    at __randomizedtesting.SeedInfo.seed([CF4D3AC66612146:72656893AF6E8E83]:0)
> [junit4:junit4]    >    at org.apache.lucene.store.DataOutput.writeVLong(DataOutput.java:217)
> [junit4:junit4]    >    at org.apache.lucene.util.fst.FST.pack(FST.java:1674)
> [junit4:junit4]    >    at org.apache.lucene.util.fst.Builder.finish(Builder.java:477)
> [junit4:junit4]    >    at org.apache.lucene.util.fst.FSTTester.doTest(FSTTester.java:314)
> [junit4:junit4]    >    at org.apache.lucene.util.fst.FSTTester.doTest(FSTTester.java:187)
> [junit4:junit4]    >    at org.apache.lucene.util.fst.TestFSTs.doTest(TestFSTs.java:169)
> [junit4:junit4]    >    at org.apache.lucene.util.fst.TestFSTs.testRandomWords(TestFSTs.java:280)
> [junit4:junit4]    >    at org.apache.lucene.util.fst.TestFSTs.testRandomWords(TestFSTs.java:254)
> [junit4:junit4]    >    at sun.reflect.NativeMethodAccessorImpl.invoke0(Native Method)
> [junit4:junit4]    >    at sun.reflect.NativeMethodAccessorImpl.invoke(NativeMethodAccessorImpl.java:88)
> [junit4:junit4]    >    at sun.reflect.DelegatingMethodAccessorImpl.invoke(DelegatingMethodAccessorImpl.java:55)
> [junit4:junit4]    >    at java.lang.reflect.Method.invoke(Method.java:613)
> [junit4:junit4]    >    at com.carrotsearch.randomizedtesting.RandomizedRunner.invoke(RandomizedRunner.java:1559)
> [junit4:junit4]    >    at com.carrotsearch.randomizedtesting.RandomizedRunner.access$600(RandomizedRunner.java:79)
> [junit4:junit4]    >    at com.carrotsearch.randomizedtesting.RandomizedRunner$6.evaluate(RandomizedRunner.java:737)
> [junit4:junit4]    >    at com.carrotsearch.randomizedtesting.RandomizedRunner$7.evaluate(RandomizedRunner.java:773)
> [junit4:junit4]    >    at com.carrotsearch.randomizedtesting.RandomizedRunner$8.evaluate(RandomizedRunner.java:787)
> [junit4:junit4]    >    at org.apache.lucene.util.TestRuleSetupTeardownChained$1.evaluate(TestRuleSetupTeardownChained.java:50)
> [junit4:junit4]    >    at org.apache.lucene.util.TestRuleFieldCacheSanity$1.evaluate(TestRuleFieldCacheSanity.java:51)
> [junit4:junit4]    >    at org.apache.lucene.util.AbstractBeforeAfterRule$1.evaluate(AbstractBeforeAfterRule.java:46)
> [junit4:junit4]    >    at com.carrotsearch.randomizedtesting.rules.SystemPropertiesInvariantRule$1.evaluate(SystemPropertiesInvariantRule.java:55)
> [junit4:junit4]    >    at org.apache.lucene.util.TestRuleThreadAndTestName$1.evaluate(TestRuleThreadAndTestName.java:49)
> [junit4:junit4]    >    at org.apache.lucene.util.TestRuleIgnoreAfterMaxFailures$1.evaluate(TestRuleIgnoreAfterMaxFailures.java:70)
> [junit4:junit4]    >    at org.apache.lucene.util.TestRuleMarkFailure$1.evaluate(TestRuleMarkFailure.java:48)
> [junit4:junit4]    >    at com.carrotsearch.randomizedtesting.rules.StatementAdapter.evaluate(StatementAdapter.java:36)
> [junit4:junit4]    >    at com.carrotsearch.randomizedtesting.ThreadLeakControl$StatementRunner.run(ThreadLeakControl.java:358)
> [junit4:junit4]    >    at com.carrotsearch.randomizedtesting.ThreadLeakControl.forkTimeoutingTask(ThreadLeakControl.java:782)
> [junit4:junit4]    >    at com.carrotsearch.randomizedtesting.ThreadLeakControl$3.evaluate(ThreadLeakControl.java:442)
> [junit4:junit4]    >    at com.carrotsearch.randomizedtesting.RandomizedRunner.runSingleTest(RandomizedRunner.java:746)
> [junit4:junit4]    >    at com.carrotsearch.randomizedtesting.RandomizedRunner$3.evaluate(RandomizedRunner.java:648)
> [junit4:junit4]    >    at com.carrotsearch.randomizedtesting.RandomizedRunner$4.evaluate(RandomizedRunner.java:682)
> [junit4:junit4]    >    at com.carrotsearch.randomizedtesting.RandomizedRunner$5.evaluate(RandomizedRunner.java:693)
> [junit4:junit4]    >    at org.apache.lucene.util.AbstractBeforeAfterRule$1.evaluate(AbstractBeforeAfterRule.java:46)
> [junit4:junit4]    >    at org.apache.lucene.util.TestRuleStoreClassName$1.evaluate(TestRuleStoreClassName.java:42)
> [junit4:junit4]    >    at com.carrotsearch.randomizedtesting.rules.SystemPropertiesInvariantRule$1.evaluate(SystemPropertiesInvariantRule.java:55)
> [junit4:junit4]    >    at com.carrotsearch.randomizedtesting.rules.NoShadowingOrOverridesOnMethodsRule$1.evaluate(NoShadowingOrOverridesOnMethodsRule.java:39)
> [junit4:junit4]    >    at com.carrotsearch.randomizedtesting.rules.NoShadowingOrOverridesOnMethodsRule$1.evaluate(NoShadowingOrOverridesOnMethodsRule.java:39)
> [junit4:junit4]    >    at com.carrotsearch.randomizedtesting.rules.StatementAdapter.evaluate(StatementAdapter.java:36)
> [junit4:junit4]    >    at org.apache.lucene.util.TestRuleAssertionsRequired$1.evaluate(TestRuleAssertionsRequired.java:43)
> [junit4:junit4]    >    at org.apache.lucene.util.TestRuleMarkFailure$1.evaluate(TestRuleMarkFailure.java:48)
> [junit4:junit4]    >    at org.apache.lucene.util.TestRuleIgnoreAfterMaxFailures$1.evaluate(TestRuleIgnoreAfterMaxFailures.java:70)
> [junit4:junit4]    >    at org.apache.lucene.util.TestRuleIgnoreTestSuites$1.evaluate(TestRuleIgnoreTestSuites.java:55)
> [junit4:junit4]    >    at com.carrotsearch.randomizedtesting.rules.StatementAdapter.evaluate(StatementAdapter.java:36)
> [junit4:junit4]    >    at com.carrotsearch.randomizedtesting.ThreadLeakControl$StatementRunner.run(ThreadLeakControl.java:358)
> [junit4:junit4]    >    at java.lang.Thread.run(Thread.java:780)
> [junit4:junit4]   2> NOTE: test params are: codec=FastDecompressionCompressingStoredFields(storedFieldsFormat=CompressingStoredFieldsFormat(compressionMode=FAST_DECOMPRESSION, chunkSize=440), termVectorsFormat=CompressingTermVectorsFormat(compressionMode=FAST_DECOMPRESSION, chunkSize=440)), sim=RandomSimilarityProvider(queryNorm=true,coord=crazy): {titleTokenized=BM25(k1=1.2,b=0.75), body=DFR GB1}, locale=ar_DZ, timezone=GMT0
> [junit4:junit4]   2> NOTE: Linux 3.2.0-38-generic x86/IBM Corporation 1.7.0 (32-bit)/cpus=8,threads=1,free=86825456,total=137887744
> [junit4:junit4]   2> NOTE: All tests run in this JVM: [TestConsistentFieldNumbers, TestSearchWithThreads, TestAttributeSource, TestSegmentMerger, TestIndexWriterOnJRECrash, TestBasics, TestCheckIndex, TestVersion, TestSimpleExplanationsOfNonMatches, TestFilteredQuery, TestOpenBitSet, TestPerFieldDocValuesFormat, TestParallelCompositeReader, TestNeverDelete, TestField, TestFieldMaskingSpanQuery, TestLongPostings, TestSizeBoundedForceMerge, TestDocumentsWriterDeleteQueue, TestMultiPhraseQuery, TestMergeSchedulerExternal, TestDocValuesScoring, TestMultiThreadTermVectors, TestDateSort, TestCustomSearcherSort, TestDocTermOrds, TestBooleanScorer, TestTerm, TestBooleanQuery, TestPositiveScoresOnlyCollector, MultiCollectorTest, TestBitVector, Nested, TestStressIndexing2, Test4GBStoredFields, TestBooleanMinShouldMatch, TestFieldValueFilter, TestIndexFileDeleter, TestByteBlockPool, TestDocCount, TestTermVectorsFormat, TestFSTs]
> [junit4:junit4] Completed on J1 in 23.59s, 17 tests, 1 failure, 1 skipped <<< FAILURES!
>
> [...truncated 345 lines...]
> [junit4:junit4] Suite: org.apache.lucene.index.TestDuelingCodecs
> [junit4:junit4]   2> NOTE: reproduce with: ant test  -Dtestcase=TestDuelingCodecs -Dtests.method=testEquals -Dtests.seed=CF4D3AC66612146 -Dtests.multiplier=3 -Dtests.slow=true -Dtests.locale=el -Dtests.timezone=Indian/Christmas -Dtests.file.encoding=US-ASCII
> [junit4:junit4] ERROR   5.69s J1 | TestDuelingCodecs.testEquals <<<
> [junit4:junit4]    > Throwable #1: java.lang.AssertionError
> [junit4:junit4]    >    at org.apache.lucene.store.DataOutput.writeVLong(DataOutput.java:217)
> [junit4:junit4]    >    at org.apache.lucene.util.fst.FST.pack(FST.java:1674)
> [junit4:junit4]    >    at org.apache.lucene.util.fst.Builder.finish(Builder.java:477)
> [junit4:junit4]    >    at org.apache.lucene.codecs.memory.MemoryPostingsFormat$TermsWriter.finish(MemoryPostingsFormat.java:274)
> [junit4:junit4]    >    at org.apache.lucene.index.FreqProxTermsWriterPerField.flush(FreqProxTermsWriterPerField.java:548)
> [junit4:junit4]    >    at org.apache.lucene.index.FreqProxTermsWriter.flush(FreqProxTermsWriter.java:85)
> [junit4:junit4]    >    at org.apache.lucene.index.TermsHash.flush(TermsHash.java:116)
> [junit4:junit4]    >    at org.apache.lucene.index.DocInverter.flush(DocInverter.java:53)
> [junit4:junit4]    >    at org.apache.lucene.index.DocFieldProcessor.flush(DocFieldProcessor.java:81)
> [junit4:junit4]    >    at org.apache.lucene.index.DocumentsWriterPerThread.flush(DocumentsWriterPerThread.java:494)
> [junit4:junit4]    >    at org.apache.lucene.index.DocumentsWriter.doFlush(DocumentsWriter.java:422)
> [junit4:junit4]    >    at org.apache.lucene.index.DocumentsWriter.flushAllThreads(DocumentsWriter.java:559)
> [junit4:junit4]    >    at org.apache.lucene.index.IndexWriter.prepareCommitInternal(IndexWriter.java:2638)
> [junit4:junit4]    >    at org.apache.lucene.index.IndexWriter.commitInternal(IndexWriter.java:2782)
> [junit4:junit4]    >    at org.apache.lucene.index.IndexWriter.commit(IndexWriter.java:2762)
> [junit4:junit4]    >    at org.apache.lucene.index.RandomIndexWriter.maybeCommit(RandomIndexWriter.java:163)
> [junit4:junit4]    >    at org.apache.lucene.index.RandomIndexWriter.addDocument(RandomIndexWriter.java:155)
> [junit4:junit4]    >    at org.apache.lucene.index.RandomIndexWriter.addDocument(RandomIndexWriter.java:114)
> [junit4:junit4]    >    at org.apache.lucene.index.TestDuelingCodecs.createRandomIndex(TestDuelingCodecs.java:151)
> [junit4:junit4]    >    at org.apache.lucene.index.TestDuelingCodecs.setUp(TestDuelingCodecs.java:100)
> [junit4:junit4]    >    at sun.reflect.GeneratedMethodAccessor8.invoke(Unknown Source)
> [junit4:junit4]    >    at sun.reflect.DelegatingMethodAccessorImpl.invoke(DelegatingMethodAccessorImpl.java:55)
> [junit4:junit4]    >    at java.lang.reflect.Method.invoke(Method.java:613)
> [junit4:junit4]    >    at com.carrotsearch.randomizedtesting.RandomizedRunner.invoke(RandomizedRunner.java:1559)
> [junit4:junit4]    >    at com.carrotsearch.randomizedtesting.RandomizedRunner.access$600(RandomizedRunner.java:79)
> [junit4:junit4]    >    at com.carrotsearch.randomizedtesting.RandomizedRunner$7.evaluate(RandomizedRunner.java:771)
> [junit4:junit4]    >    at com.carrotsearch.randomizedtesting.RandomizedRunner$8.evaluate(RandomizedRunner.java:787)
> [junit4:junit4]    >    at org.apache.lucene.util.TestRuleSetupTeardownChained$1.evaluate(TestRuleSetupTeardownChained.java:50)
> [junit4:junit4]    >    at org.apache.lucene.util.TestRuleFieldCacheSanity$1.evaluate(TestRuleFieldCacheSanity.java:51)
> [junit4:junit4]    >    at org.apache.lucene.util.AbstractBeforeAfterRule$1.evaluate(AbstractBeforeAfterRule.java:46)
> [junit4:junit4]    >    at com.carrotsearch.randomizedtesting.rules.SystemPropertiesInvariantRule$1.evaluate(SystemPropertiesInvariantRule.java:55)
> [junit4:junit4]    >    at org.apache.lucene.util.TestRuleThreadAndTestName$1.evaluate(TestRuleThreadAndTestName.java:49)
> [junit4:junit4]    >    at org.apache.lucene.util.TestRuleIgnoreAfterMaxFailures$1.evaluate(TestRuleIgnoreAfterMaxFailures.java:70)
> [junit4:junit4]    >    at org.apache.lucene.util.TestRuleMarkFailure$1.evaluate(TestRuleMarkFailure.java:48)
> [junit4:junit4]    >    at com.carrotsearch.randomizedtesting.rules.StatementAdapter.evaluate(StatementAdapter.java:36)
> [junit4:junit4]    >    at com.carrotsearch.randomizedtesting.ThreadLeakControl$StatementRunner.run(ThreadLeakControl.java:358)
> [junit4:junit4]    >    at com.carrotsearch.randomizedtesting.ThreadLeakControl.forkTimeoutingTask(ThreadLeakControl.java:782)
> [junit4:junit4]    >    at com.carrotsearch.randomizedtesting.ThreadLeakControl$3.evaluate(ThreadLeakControl.java:442)
> [junit4:junit4]    >    at com.carrotsearch.randomizedtesting.RandomizedRunner.runSingleTest(RandomizedRunner.java:746)
> [junit4:junit4]    >    at com.carrotsearch.randomizedtesting.RandomizedRunner$3.evaluate(RandomizedRunner.java:648)
> [junit4:junit4]    >    at com.carrotsearch.randomizedtesting.RandomizedRunner$4.evaluate(RandomizedRunner.java:682)
> [junit4:junit4]    >    at com.carrotsearch.randomizedtesting.RandomizedRunner$5.evaluate(RandomizedRunner.java:693)
> [junit4:junit4]    >    at org.apache.lucene.util.AbstractBeforeAfterRule$1.evaluate(AbstractBeforeAfterRule.java:46)
> [junit4:junit4]    >    at org.apache.lucene.util.TestRuleStoreClassName$1.evaluate(TestRuleStoreClassName.java:42)
> [junit4:junit4]    >    at com.carrotsearch.randomizedtesting.rules.SystemPropertiesInvariantRule$1.evaluate(SystemPropertiesInvariantRule.java:55)
> [junit4:junit4]    >    at com.carrotsearch.randomizedtesting.rules.NoShadowingOrOverridesOnMethodsRule$1.evaluate(NoShadowingOrOverridesOnMethodsRule.java:39)
> [junit4:junit4]    >    at com.carrotsearch.randomizedtesting.rules.NoShadowingOrOverridesOnMethodsRule$1.evaluate(NoShadowingOrOverridesOnMethodsRule.java:39)
> [junit4:junit4]    >    at com.carrotsearch.randomizedtesting.rules.StatementAdapter.evaluate(StatementAdapter.java:36)
> [junit4:junit4]    >    at org.apache.lucene.util.TestRuleAssertionsRequired$1.evaluate(TestRuleAssertionsRequired.java:43)
> [junit4:junit4]    >    at org.apache.lucene.util.TestRuleMarkFailure$1.evaluate(TestRuleMarkFailure.java:48)
> [junit4:junit4]    >    at org.apache.lucene.util.TestRuleIgnoreAfterMaxFailures$1.evaluate(TestRuleIgnoreAfterMaxFailures.java:70)
> [junit4:junit4]    >    at org.apache.lucene.util.TestRuleIgnoreTestSuites$1.evaluate(TestRuleIgnoreTestSuites.java:55)
> [junit4:junit4]    >    at com.carrotsearch.randomizedtesting.rules.StatementAdapter.evaluate(StatementAdapter.java:36)
> [junit4:junit4]    >    at com.carrotsearch.randomizedtesting.ThreadLeakControl$StatementRunner.run(ThreadLeakControl.java:358)
> [junit4:junit4]    >    at java.lang.Thread.run(Thread.java:780)
> [junit4:junit4]    > Throwable #2: java.lang.RuntimeException: MockDirectoryWrapper: cannot close: there are still open files: {_2.fld=1, _2.vec=1}
> [junit4:junit4]    >    at org.apache.lucene.store.MockDirectoryWrapper.close(MockDirectoryWrapper.java:585)
> [junit4:junit4]    >    at org.apache.lucene.index.TestDuelingCodecs.tearDown(TestDuelingCodecs.java:124)
> [junit4:junit4]    >    at sun.reflect.GeneratedMethodAccessor9.invoke(Unknown Source)
> [junit4:junit4]    >    at sun.reflect.DelegatingMethodAccessorImpl.invoke(DelegatingMethodAccessorImpl.java:55)
> [junit4:junit4]    >    at java.lang.reflect.Method.invoke(Method.java:613)
> [junit4:junit4]    >    at com.carrotsearch.randomizedtesting.RandomizedRunner.invoke(RandomizedRunner.java:1559)
> [junit4:junit4]    >    at com.carrotsearch.randomizedtesting.RandomizedRunner.access$600(RandomizedRunner.java:79)
> [junit4:junit4]    >    at com.carrotsearch.randomizedtesting.RandomizedRunner$8.evaluate(RandomizedRunner.java:795)
> [junit4:junit4]    >    at org.apache.lucene.util.TestRuleSetupTeardownChained$1.evaluate(TestRuleSetupTeardownChained.java:50)
> [junit4:junit4]    >    at org.apache.lucene.util.TestRuleFieldCacheSanity$1.evaluate(TestRuleFieldCacheSanity.java:51)
> [junit4:junit4]    >    at org.apache.lucene.util.AbstractBeforeAfterRule$1.evaluate(AbstractBeforeAfterRule.java:46)
> [junit4:junit4]    >    at com.carrotsearch.randomizedtesting.rules.SystemPropertiesInvariantRule$1.evaluate(SystemPropertiesInvariantRule.java:55)
> [junit4:junit4]    >    at org.apache.lucene.util.TestRuleThreadAndTestName$1.evaluate(TestRuleThreadAndTestName.java:49)
> [junit4:junit4]    >    at org.apache.lucene.util.TestRuleIgnoreAfterMaxFailures$1.evaluate(TestRuleIgnoreAfterMaxFailures.java:70)
> [junit4:junit4]    >    at org.apache.lucene.util.TestRuleMarkFailure$1.evaluate(TestRuleMarkFailure.java:48)
> [junit4:junit4]    >    at com.carrotsearch.randomizedtesting.rules.StatementAdapter.evaluate(StatementAdapter.java:36)
> [junit4:junit4]    >    at com.carrotsearch.randomizedtesting.ThreadLeakControl$StatementRunner.run(ThreadLeakControl.java:358)
> [junit4:junit4]    >    at com.carrotsearch.randomizedtesting.ThreadLeakControl.forkTimeoutingTask(ThreadLeakControl.java:782)
> [junit4:junit4]    >    at com.carrotsearch.randomizedtesting.ThreadLeakControl$3.evaluate(ThreadLeakControl.java:442)
> [junit4:junit4]    >    at com.carrotsearch.randomizedtesting.RandomizedRunner.runSingleTest(RandomizedRunner.java:746)
> [junit4:junit4]    >    at com.carrotsearch.randomizedtesting.RandomizedRunner$3.evaluate(RandomizedRunner.java:648)
> [junit4:junit4]    >    at com.carrotsearch.randomizedtesting.RandomizedRunner$4.evaluate(RandomizedRunner.java:682)
> [junit4:junit4]    >    at com.carrotsearch.randomizedtesting.RandomizedRunner$5.evaluate(RandomizedRunner.java:693)
> [junit4:junit4]    >    at org.apache.lucene.util.AbstractBeforeAfterRule$1.evaluate(AbstractBeforeAfterRule.java:46)
> [junit4:junit4]    >    at org.apache.lucene.util.TestRuleStoreClassName$1.evaluate(TestRuleStoreClassName.java:42)
> [junit4:junit4]    >    at com.carrotsearch.randomizedtesting.rules.SystemPropertiesInvariantRule$1.evaluate(SystemPropertiesInvariantRule.java:55)
> [junit4:junit4]    >    at com.carrotsearch.randomizedtesting.rules.NoShadowingOrOverridesOnMethodsRule$1.evaluate(NoShadowingOrOverridesOnMethodsRule.java:39)
> [junit4:junit4]    >    at com.carrotsearch.randomizedtesting.rules.NoShadowingOrOverridesOnMethodsRule$1.evaluate(NoShadowingOrOverridesOnMethodsRule.java:39)
> [junit4:junit4]    >    at com.carrotsearch.randomizedtesting.rules.StatementAdapter.evaluate(StatementAdapter.java:36)
> [junit4:junit4]    >    at org.apache.lucene.util.TestRuleAssertionsRequired$1.evaluate(TestRuleAssertionsRequired.java:43)
> [junit4:junit4]    >    at org.apache.lucene.util.TestRuleMarkFailure$1.evaluate(TestRuleMarkFailure.java:48)
> [junit4:junit4]    >    at org.apache.lucene.util.TestRuleIgnoreAfterMaxFailures$1.evaluate(TestRuleIgnoreAfterMaxFailures.java:70)
> [junit4:junit4]    >    at org.apache.lucene.util.TestRuleIgnoreTestSuites$1.evaluate(TestRuleIgnoreTestSuites.java:55)
> [junit4:junit4]    >    at com.carrotsearch.randomizedtesting.rules.StatementAdapter.evaluate(StatementAdapter.java:36)
> [junit4:junit4]    >    at com.carrotsearch.randomizedtesting.ThreadLeakControl$StatementRunner.run(ThreadLeakControl.java:358)
> [junit4:junit4]    >    at java.lang.Thread.run(Thread.java:780)
> [junit4:junit4]    > Caused by: java.lang.RuntimeException: unclosed IndexOutput: _2.fld
> [junit4:junit4]    >    at org.apache.lucene.store.MockDirectoryWrapper.addFileHandle(MockDirectoryWrapper.java:476)
> [junit4:junit4]    >    at org.apache.lucene.store.MockDirectoryWrapper.createOutput(MockDirectoryWrapper.java:448)
> [junit4:junit4]    >    at org.apache.lucene.store.TrackingDirectoryWrapper.createOutput(TrackingDirectoryWrapper.java:62)
> [junit4:junit4]    >    at org.apache.lucene.codecs.simpletext.SimpleTextStoredFieldsWriter.<init>(SimpleTextStoredFieldsWriter.java:69)
> [junit4:junit4]    >    at org.apache.lucene.codecs.simpletext.SimpleTextStoredFieldsFormat.fieldsWriter(SimpleTextStoredFieldsFormat.java:45)
> [junit4:junit4]    >    at org.apache.lucene.index.StoredFieldsProcessor.initFieldsWriter(StoredFieldsProcessor.java:86)
> [junit4:junit4]    >    at org.apache.lucene.index.StoredFieldsProcessor.finishDocument(StoredFieldsProcessor.java:119)
> [junit4:junit4]    >    at org.apache.lucene.index.TwoStoredFieldsConsumers.finishDocument(TwoStoredFieldsConsumers.java:65)
> [junit4:junit4]    >    at org.apache.lucene.index.DocFieldProcessor.finishDocument(DocFieldProcessor.java:287)
> [junit4:junit4]    >    at org.apache.lucene.index.DocumentsWriterPerThread.updateDocument(DocumentsWriterPerThread.java:274)
> [junit4:junit4]    >    at org.apache.lucene.index.DocumentsWriter.updateDocument(DocumentsWriter.java:376)
> [junit4:junit4]    >    at org.apache.lucene.index.IndexWriter.updateDocument(IndexWriter.java:1471)
> [junit4:junit4]    >    at org.apache.lucene.index.IndexWriter.addDocument(IndexWriter.java:1146)
> [junit4:junit4]    >    at org.apache.lucene.index.RandomIndexWriter.addDocument(RandomIndexWriter.java:152)
> [junit4:junit4]    >    at org.apache.lucene.index.RandomIndexWriter.addDocument(RandomIndexWriter.java:114)
> [junit4:junit4]    >    at org.apache.lucene.index.TestDuelingCodecs.createRandomIndex(TestDuelingCodecs.java:151)
> [junit4:junit4]    >    at org.apache.lucene.index.TestDuelingCodecs.setUp(TestDuelingCodecs.java:99)
> [junit4:junit4]    >    at sun.reflect.GeneratedMethodAccessor8.invoke(Unknown Source)
> [junit4:junit4]    >    at sun.reflect.DelegatingMethodAccessorImpl.invoke(DelegatingMethodAccessorImpl.java:55)
> [junit4:junit4]    >    at java.lang.reflect.Method.invoke(Method.java:613)
> [junit4:junit4]    >    at com.carrotsearch.randomizedtesting.RandomizedRunner.invoke(RandomizedRunner.java:1559)
> [junit4:junit4]    >    at com.carrotsearch.randomizedtesting.RandomizedRunner.access$600(RandomizedRunner.java:79)
> [junit4:junit4]    >    at com.carrotsearch.randomizedtesting.RandomizedRunner$7.evaluate(RandomizedRunner.java:771)
> [junit4:junit4]    >    at com.carrotsearch.randomizedtesting.RandomizedRunner$8.evaluate(RandomizedRunner.java:787)
> [junit4:junit4]    >    ... 28 more
> [junit4:junit4]   2> NOTE: test params are: codec=Lucene42: {}, docValues:{}, sim=RandomSimilarityProvider(queryNorm=false,coord=crazy): {titleTokenized=DFR I(n)L3(800.0), body=DFR I(ne)LZ(0.3)}, locale=el, timezone=Indian/Christmas
> [junit4:junit4]   2> NOTE: Linux 3.2.0-38-generic x86/IBM Corporation 1.7.0 (32-bit)/cpus=8,threads=1,free=25249744,total=201392128
> [junit4:junit4]   2> NOTE: All tests run in this JVM: [TestConsistentFieldNumbers, TestSearchWithThreads, TestAttributeSource, TestSegmentMerger, TestIndexWriterOnJRECrash, TestBasics, TestCheckIndex, TestVersion, TestSimpleExplanationsOfNonMatches, TestFilteredQuery, TestOpenBitSet, TestPerFieldDocValuesFormat, TestParallelCompositeReader, TestNeverDelete, TestField, TestFieldMaskingSpanQuery, TestLongPostings, TestSizeBoundedForceMerge, TestDocumentsWriterDeleteQueue, TestMultiPhraseQuery, TestMergeSchedulerExternal, TestDocValuesScoring, TestMultiThreadTermVectors, TestDateSort, TestCustomSearcherSort, TestDocTermOrds, TestBooleanScorer, TestTerm, TestBooleanQuery, TestPositiveScoresOnlyCollector, MultiCollectorTest, TestBitVector, Nested, TestStressIndexing2, Test4GBStoredFields, TestBooleanMinShouldMatch, TestFieldValueFilter, TestIndexFileDeleter, TestByteBlockPool, TestDocCount, TestTermVectorsFormat, TestFSTs, TestPackedInts, TestFastCompressionMode, TestFilterAtomicReader, TestPagedBytes, Nested1, TestPostingsFormat, TestCharsRef, TestRollingBuffer, TestSpanSearchEquivalence, TestCachingWrapperFilter, TestByteSlices, TestAddIndexes, TestNRTCachingDirectory, TestGraphTokenizers, TestPrefixQuery, TestConcurrentMergeScheduler, TestNoMergePolicy, TestFuzzyQuery, TestAssertions, Nested1, TestNamedSPILoader, TestCodecHoldsOpenFiles, Before3, Before3, TestDisjunctionMaxQuery, TestPerFieldPostingsFormat, TestComplexExplanations, TestTopDocsCollector, TestSameScoresWithThreads, TestTransactionRollback, TestIntsRef, TestFixedBitSet, TestDeterminism, TestNewestSegment, TestWorstCaseTestBehavior, TestDirectory, TestDoc, TestDocTermOrdsRewriteMethod, TestUTF32ToUTF8, TestAtomicUpdate, TestVersionComparator, TestRecyclingIntBlockAllocator, TestTermdocPerf, TestNumericTokenStream, TestDocValuesFormat, TestLucene40TermVectorsFormat, TestIndexWriterWithThreads, TestNumericRangeQuery32, TestShardSearching, TestMultiMMap, TestIndexWriterMergePolicy, TestDuelingCodecs]
> [junit4:junit4] Completed on J1 in 5.70s, 1 test, 1 error <<< FAILURES!
>
> [...truncated 486 lines...]
> BUILD FAILED
> /mnt/ssd/jenkins/workspace/Lucene-Solr-trunk-Linux/build.xml:381: The following error occurred while executing this line:
> /mnt/ssd/jenkins/workspace/Lucene-Solr-trunk-Linux/build.xml:374: The following error occurred while executing this line:
> /mnt/ssd/jenkins/workspace/Lucene-Solr-trunk-Linux/build.xml:39: The following error occurred while executing this line:
> /mnt/ssd/jenkins/workspace/Lucene-Solr-trunk-Linux/lucene/build.xml:50: The following error occurred while executing this line:
> /mnt/ssd/jenkins/workspace/Lucene-Solr-trunk-Linux/lucene/common-build.xml:1213: The following error occurred while executing this line:
> /mnt/ssd/jenkins/workspace/Lucene-Solr-trunk-Linux/lucene/common-build.xml:877: There were test failures: 344 suites, 2142 tests, 2 errors, 3 failures, 58 ignored (46 assumptions)
>
> Total time: 10 minutes 32 seconds
> Build step 'Invoke Ant' marked build as failure
> Archiving artifacts
> Recording test results
> Description set: Java: 32bit/ibm-j9-jdk7
> Email was triggered for: Failure
> Sending email for trigger: Failure
>
>
>
>
> ---------------------------------------------------------------------
> To unsubscribe, e-mail: dev-unsubscribe@lucene.apache.org
> For additional commands, e-mail: dev-help@lucene.apache.org

---------------------------------------------------------------------
To unsubscribe, e-mail: dev-unsubscribe@lucene.apache.org
For additional commands, e-mail: dev-help@lucene.apache.org


Mime
View raw message