lucene-dev mailing list archives

Site index · List index
Message view « Date » · « Thread »
Top « Date » · « Thread »
From Steve Rowe <sar...@gmail.com>
Subject Re: [JENKINS] Lucene-Solr-trunk-Windows (32bit/jdk1.6.0_41) - Build # 2614 - Still Failing!
Date Sun, 03 Mar 2013 23:21:45 GMT
Hi Erick,

On Win7 64-bit, Oracle Java 1.6.0_21 64-bit, I check out trunk r1452152 and ran 'ant -Dtestcase=TestSolrDiscoveryProperties test', which succeeded.  I ran again with -Dtests.iters=10, and they all succeeded too.

I then did 'svn up -r1452114' and ran 'ant -Dtestcase=TestSolrDiscoveryProperties test' a few times, all of which failed.

So the fix looks good!

Steve
 
On Mar 3, 2013, at 2:55 PM, Erick Erickson <erickerickson@gmail.com> wrote:

> This is a test artifact I believe, I wasn't closing a file stream, then trying to delete it for the next test.
> 
> I just committed a change that will fix it I hope. "runs on my machine". Siiiigggghhhhh.
> 
> Anyone with a windows machine that could test before/after explicitly I'd appreciate it. 
> 
> ant -Dtestcase=TestSolrDiscoveryProperties testshould just fail before r: 1452115
> and succeed after if I've got the right fix (trunk).
> 
> Thanks,
> Erick
> 
> 
> On Sun, Mar 3, 2013 at 1:48 PM, Policeman Jenkins Server <jenkins@thetaphi.de> wrote:
> Build: http://jenkins.thetaphi.de/job/Lucene-Solr-trunk-Windows/2614/
> Java: 32bit/jdk1.6.0_41 -client -XX:+UseParallelGC
> 
> 3 tests failed.
> FAILED:  org.apache.solr.core.TestSolrDiscoveryProperties.testPersistTrue
> 
> Error Message:
> Unable to delete file: .\org.apache.solr.core.TestSolrProperties\solrHome\solr.properties
> 
> Stack Trace:
> java.io.IOException: Unable to delete file: .\org.apache.solr.core.TestSolrProperties\solrHome\solr.properties
>         at __randomizedtesting.SeedInfo.seed([58657AD342FF2DCF:B8CC21CF55A9490D]:0)
>         at org.apache.commons.io.FileUtils.forceDelete(FileUtils.java:1919)
>         at org.apache.commons.io.FileUtils.cleanDirectory(FileUtils.java:1399)
>         at org.apache.commons.io.FileUtils.deleteDirectory(FileUtils.java:1331)
>         at org.apache.solr.core.TestSolrDiscoveryProperties.after(TestSolrDiscoveryProperties.java:119)
>         at sun.reflect.NativeMethodAccessorImpl.invoke0(Native Method)
>         at sun.reflect.NativeMethodAccessorImpl.invoke(NativeMethodAccessorImpl.java:39)
>         at sun.reflect.DelegatingMethodAccessorImpl.invoke(DelegatingMethodAccessorImpl.java:25)
>         at java.lang.reflect.Method.invoke(Method.java:597)
>         at com.carrotsearch.randomizedtesting.RandomizedRunner.invoke(RandomizedRunner.java:1559)
>         at com.carrotsearch.randomizedtesting.RandomizedRunner.access$600(RandomizedRunner.java:79)
>         at com.carrotsearch.randomizedtesting.RandomizedRunner$8.evaluate(RandomizedRunner.java:795)
>         at com.carrotsearch.randomizedtesting.rules.SystemPropertiesRestoreRule$1.evaluate(SystemPropertiesRestoreRule.java:53)
>         at org.apache.lucene.util.TestRuleSetupTeardownChained$1.evaluate(TestRuleSetupTeardownChained.java:50)
>         at org.apache.lucene.util.TestRuleFieldCacheSanity$1.evaluate(TestRuleFieldCacheSanity.java:51)
>         at org.apache.lucene.util.AbstractBeforeAfterRule$1.evaluate(AbstractBeforeAfterRule.java:46)
>         at com.carrotsearch.randomizedtesting.rules.SystemPropertiesInvariantRule$1.evaluate(SystemPropertiesInvariantRule.java:55)
>         at org.apache.lucene.util.TestRuleThreadAndTestName$1.evaluate(TestRuleThreadAndTestName.java:49)
>         at org.apache.lucene.util.TestRuleIgnoreAfterMaxFailures$1.evaluate(TestRuleIgnoreAfterMaxFailures.java:70)
>         at org.apache.lucene.util.TestRuleMarkFailure$1.evaluate(TestRuleMarkFailure.java:48)
>         at com.carrotsearch.randomizedtesting.rules.StatementAdapter.evaluate(StatementAdapter.java:36)
>         at com.carrotsearch.randomizedtesting.ThreadLeakControl$StatementRunner.run(ThreadLeakControl.java:358)
>         at com.carrotsearch.randomizedtesting.ThreadLeakControl.forkTimeoutingTask(ThreadLeakControl.java:782)
>         at com.carrotsearch.randomizedtesting.ThreadLeakControl$3.evaluate(ThreadLeakControl.java:442)
>         at com.carrotsearch.randomizedtesting.RandomizedRunner.runSingleTest(RandomizedRunner.java:746)
>         at com.carrotsearch.randomizedtesting.RandomizedRunner$3.evaluate(RandomizedRunner.java:648)
>         at com.carrotsearch.randomizedtesting.RandomizedRunner$4.evaluate(RandomizedRunner.java:682)
>         at com.carrotsearch.randomizedtesting.RandomizedRunner$5.evaluate(RandomizedRunner.java:693)
>         at com.carrotsearch.randomizedtesting.rules.StatementAdapter.evaluate(StatementAdapter.java:36)
>         at com.carrotsearch.randomizedtesting.rules.SystemPropertiesRestoreRule$1.evaluate(SystemPropertiesRestoreRule.java:53)
>         at org.apache.lucene.util.AbstractBeforeAfterRule$1.evaluate(AbstractBeforeAfterRule.java:46)
>         at org.apache.lucene.util.TestRuleStoreClassName$1.evaluate(TestRuleStoreClassName.java:42)
>         at com.carrotsearch.randomizedtesting.rules.SystemPropertiesInvariantRule$1.evaluate(SystemPropertiesInvariantRule.java:55)
>         at com.carrotsearch.randomizedtesting.rules.NoShadowingOrOverridesOnMethodsRule$1.evaluate(NoShadowingOrOverridesOnMethodsRule.java:39)
>         at com.carrotsearch.randomizedtesting.rules.NoShadowingOrOverridesOnMethodsRule$1.evaluate(NoShadowingOrOverridesOnMethodsRule.java:39)
>         at com.carrotsearch.randomizedtesting.rules.StatementAdapter.evaluate(StatementAdapter.java:36)
>         at org.apache.lucene.util.TestRuleAssertionsRequired$1.evaluate(TestRuleAssertionsRequired.java:43)
>         at org.apache.lucene.util.TestRuleMarkFailure$1.evaluate(TestRuleMarkFailure.java:48)
>         at org.apache.lucene.util.TestRuleIgnoreAfterMaxFailures$1.evaluate(TestRuleIgnoreAfterMaxFailures.java:70)
>         at org.apache.lucene.util.TestRuleIgnoreTestSuites$1.evaluate(TestRuleIgnoreTestSuites.java:55)
>         at com.carrotsearch.randomizedtesting.rules.StatementAdapter.evaluate(StatementAdapter.java:36)
>         at com.carrotsearch.randomizedtesting.ThreadLeakControl$StatementRunner.run(ThreadLeakControl.java:358)
>         at java.lang.Thread.run(Thread.java:662)
> 
> 
> FAILED:  org.apache.solr.core.TestSolrDiscoveryProperties.testPersistFalse
> 
> Error Message:
> Unable to delete file: .\org.apache.solr.core.TestSolrProperties\solrHome\solr.properties
> 
> Stack Trace:
> java.io.IOException: Unable to delete file: .\org.apache.solr.core.TestSolrProperties\solrHome\solr.properties
>         at org.apache.commons.io.FileUtils.forceDelete(FileUtils.java:1919)
>         at org.apache.commons.io.FileUtils.cleanDirectory(FileUtils.java:1399)
>         at org.apache.commons.io.FileUtils.deleteDirectory(FileUtils.java:1331)
>         at org.apache.solr.core.TestSolrDiscoveryProperties.setMeUp(TestSolrDiscoveryProperties.java:46)
>         at org.apache.solr.core.TestSolrDiscoveryProperties.testPersistFalse(TestSolrDiscoveryProperties.java:245)
>         at sun.reflect.NativeMethodAccessorImpl.invoke0(Native Method)
>         at sun.reflect.NativeMethodAccessorImpl.invoke(NativeMethodAccessorImpl.java:39)
>         at sun.reflect.DelegatingMethodAccessorImpl.invoke(DelegatingMethodAccessorImpl.java:25)
>         at java.lang.reflect.Method.invoke(Method.java:597)
>         at com.carrotsearch.randomizedtesting.RandomizedRunner.invoke(RandomizedRunner.java:1559)
>         at com.carrotsearch.randomizedtesting.RandomizedRunner.access$600(RandomizedRunner.java:79)
>         at com.carrotsearch.randomizedtesting.RandomizedRunner$6.evaluate(RandomizedRunner.java:737)
>         at com.carrotsearch.randomizedtesting.RandomizedRunner$7.evaluate(RandomizedRunner.java:773)
>         at com.carrotsearch.randomizedtesting.RandomizedRunner$8.evaluate(RandomizedRunner.java:787)
>         at com.carrotsearch.randomizedtesting.rules.SystemPropertiesRestoreRule$1.evaluate(SystemPropertiesRestoreRule.java:53)
>         at org.apache.lucene.util.TestRuleSetupTeardownChained$1.evaluate(TestRuleSetupTeardownChained.java:50)
>         at org.apache.lucene.util.TestRuleFieldCacheSanity$1.evaluate(TestRuleFieldCacheSanity.java:51)
>         at org.apache.lucene.util.AbstractBeforeAfterRule$1.evaluate(AbstractBeforeAfterRule.java:46)
>         at com.carrotsearch.randomizedtesting.rules.SystemPropertiesInvariantRule$1.evaluate(SystemPropertiesInvariantRule.java:55)
>         at org.apache.lucene.util.TestRuleThreadAndTestName$1.evaluate(TestRuleThreadAndTestName.java:49)
>         at org.apache.lucene.util.TestRuleIgnoreAfterMaxFailures$1.evaluate(TestRuleIgnoreAfterMaxFailures.java:70)
>         at org.apache.lucene.util.TestRuleMarkFailure$1.evaluate(TestRuleMarkFailure.java:48)
>         at com.carrotsearch.randomizedtesting.rules.StatementAdapter.evaluate(StatementAdapter.java:36)
>         at com.carrotsearch.randomizedtesting.ThreadLeakControl$StatementRunner.run(ThreadLeakControl.java:358)
>         at com.carrotsearch.randomizedtesting.ThreadLeakControl.forkTimeoutingTask(ThreadLeakControl.java:782)
>         at com.carrotsearch.randomizedtesting.ThreadLeakControl$3.evaluate(ThreadLeakControl.java:442)
>         at com.carrotsearch.randomizedtesting.RandomizedRunner.runSingleTest(RandomizedRunner.java:746)
>         at com.carrotsearch.randomizedtesting.RandomizedRunner$3.evaluate(RandomizedRunner.java:648)
>         at com.carrotsearch.randomizedtesting.RandomizedRunner$4.evaluate(RandomizedRunner.java:682)
>         at com.carrotsearch.randomizedtesting.RandomizedRunner$5.evaluate(RandomizedRunner.java:693)
>         at com.carrotsearch.randomizedtesting.rules.StatementAdapter.evaluate(StatementAdapter.java:36)
>         at com.carrotsearch.randomizedtesting.rules.SystemPropertiesRestoreRule$1.evaluate(SystemPropertiesRestoreRule.java:53)
>         at org.apache.lucene.util.AbstractBeforeAfterRule$1.evaluate(AbstractBeforeAfterRule.java:46)
>         at org.apache.lucene.util.TestRuleStoreClassName$1.evaluate(TestRuleStoreClassName.java:42)
>         at com.carrotsearch.randomizedtesting.rules.SystemPropertiesInvariantRule$1.evaluate(SystemPropertiesInvariantRule.java:55)
>         at com.carrotsearch.randomizedtesting.rules.NoShadowingOrOverridesOnMethodsRule$1.evaluate(NoShadowingOrOverridesOnMethodsRule.java:39)
>         at com.carrotsearch.randomizedtesting.rules.NoShadowingOrOverridesOnMethodsRule$1.evaluate(NoShadowingOrOverridesOnMethodsRule.java:39)
>         at com.carrotsearch.randomizedtesting.rules.StatementAdapter.evaluate(StatementAdapter.java:36)
>         at org.apache.lucene.util.TestRuleAssertionsRequired$1.evaluate(TestRuleAssertionsRequired.java:43)
>         at org.apache.lucene.util.TestRuleMarkFailure$1.evaluate(TestRuleMarkFailure.java:48)
>         at org.apache.lucene.util.TestRuleIgnoreAfterMaxFailures$1.evaluate(TestRuleIgnoreAfterMaxFailures.java:70)
>         at org.apache.lucene.util.TestRuleIgnoreTestSuites$1.evaluate(TestRuleIgnoreTestSuites.java:55)
>         at com.carrotsearch.randomizedtesting.rules.StatementAdapter.evaluate(StatementAdapter.java:36)
>         at com.carrotsearch.randomizedtesting.ThreadLeakControl$StatementRunner.run(ThreadLeakControl.java:358)
>         at java.lang.Thread.run(Thread.java:662)
> 
> 
> FAILED:  org.apache.solr.core.TestSolrDiscoveryProperties.testBackCompatXml
> 
> Error Message:
> Unable to delete file: .\org.apache.solr.core.TestSolrProperties\solrHome\solr.properties
> 
> Stack Trace:
> java.io.IOException: Unable to delete file: .\org.apache.solr.core.TestSolrProperties\solrHome\solr.properties
>         at org.apache.commons.io.FileUtils.forceDelete(FileUtils.java:1919)
>         at org.apache.commons.io.FileUtils.cleanDirectory(FileUtils.java:1399)
>         at org.apache.commons.io.FileUtils.deleteDirectory(FileUtils.java:1331)
>         at org.apache.solr.core.TestSolrDiscoveryProperties.setMeUp(TestSolrDiscoveryProperties.java:46)
>         at org.apache.solr.core.TestSolrDiscoveryProperties.testBackCompatXml(TestSolrDiscoveryProperties.java:348)
>         at sun.reflect.NativeMethodAccessorImpl.invoke0(Native Method)
>         at sun.reflect.NativeMethodAccessorImpl.invoke(NativeMethodAccessorImpl.java:39)
>         at sun.reflect.DelegatingMethodAccessorImpl.invoke(DelegatingMethodAccessorImpl.java:25)
>         at java.lang.reflect.Method.invoke(Method.java:597)
>         at com.carrotsearch.randomizedtesting.RandomizedRunner.invoke(RandomizedRunner.java:1559)
>         at com.carrotsearch.randomizedtesting.RandomizedRunner.access$600(RandomizedRunner.java:79)
>         at com.carrotsearch.randomizedtesting.RandomizedRunner$6.evaluate(RandomizedRunner.java:737)
>         at com.carrotsearch.randomizedtesting.RandomizedRunner$7.evaluate(RandomizedRunner.java:773)
>         at com.carrotsearch.randomizedtesting.RandomizedRunner$8.evaluate(RandomizedRunner.java:787)
>         at com.carrotsearch.randomizedtesting.rules.SystemPropertiesRestoreRule$1.evaluate(SystemPropertiesRestoreRule.java:53)
>         at org.apache.lucene.util.TestRuleSetupTeardownChained$1.evaluate(TestRuleSetupTeardownChained.java:50)
>         at org.apache.lucene.util.TestRuleFieldCacheSanity$1.evaluate(TestRuleFieldCacheSanity.java:51)
>         at org.apache.lucene.util.AbstractBeforeAfterRule$1.evaluate(AbstractBeforeAfterRule.java:46)
>         at com.carrotsearch.randomizedtesting.rules.SystemPropertiesInvariantRule$1.evaluate(SystemPropertiesInvariantRule.java:55)
>         at org.apache.lucene.util.TestRuleThreadAndTestName$1.evaluate(TestRuleThreadAndTestName.java:49)
>         at org.apache.lucene.util.TestRuleIgnoreAfterMaxFailures$1.evaluate(TestRuleIgnoreAfterMaxFailures.java:70)
>         at org.apache.lucene.util.TestRuleMarkFailure$1.evaluate(TestRuleMarkFailure.java:48)
>         at com.carrotsearch.randomizedtesting.rules.StatementAdapter.evaluate(StatementAdapter.java:36)
>         at com.carrotsearch.randomizedtesting.ThreadLeakControl$StatementRunner.run(ThreadLeakControl.java:358)
>         at com.carrotsearch.randomizedtesting.ThreadLeakControl.forkTimeoutingTask(ThreadLeakControl.java:782)
>         at com.carrotsearch.randomizedtesting.ThreadLeakControl$3.evaluate(ThreadLeakControl.java:442)
>         at com.carrotsearch.randomizedtesting.RandomizedRunner.runSingleTest(RandomizedRunner.java:746)
>         at com.carrotsearch.randomizedtesting.RandomizedRunner$3.evaluate(RandomizedRunner.java:648)
>         at com.carrotsearch.randomizedtesting.RandomizedRunner$4.evaluate(RandomizedRunner.java:682)
>         at com.carrotsearch.randomizedtesting.RandomizedRunner$5.evaluate(RandomizedRunner.java:693)
>         at com.carrotsearch.randomizedtesting.rules.StatementAdapter.evaluate(StatementAdapter.java:36)
>         at com.carrotsearch.randomizedtesting.rules.SystemPropertiesRestoreRule$1.evaluate(SystemPropertiesRestoreRule.java:53)
>         at org.apache.lucene.util.AbstractBeforeAfterRule$1.evaluate(AbstractBeforeAfterRule.java:46)
>         at org.apache.lucene.util.TestRuleStoreClassName$1.evaluate(TestRuleStoreClassName.java:42)
>         at com.carrotsearch.randomizedtesting.rules.SystemPropertiesInvariantRule$1.evaluate(SystemPropertiesInvariantRule.java:55)
>         at com.carrotsearch.randomizedtesting.rules.NoShadowingOrOverridesOnMethodsRule$1.evaluate(NoShadowingOrOverridesOnMethodsRule.java:39)
>         at com.carrotsearch.randomizedtesting.rules.NoShadowingOrOverridesOnMethodsRule$1.evaluate(NoShadowingOrOverridesOnMethodsRule.java:39)
>         at com.carrotsearch.randomizedtesting.rules.StatementAdapter.evaluate(StatementAdapter.java:36)
>         at org.apache.lucene.util.TestRuleAssertionsRequired$1.evaluate(TestRuleAssertionsRequired.java:43)
>         at org.apache.lucene.util.TestRuleMarkFailure$1.evaluate(TestRuleMarkFailure.java:48)
>         at org.apache.lucene.util.TestRuleIgnoreAfterMaxFailures$1.evaluate(TestRuleIgnoreAfterMaxFailures.java:70)
>         at org.apache.lucene.util.TestRuleIgnoreTestSuites$1.evaluate(TestRuleIgnoreTestSuites.java:55)
>         at com.carrotsearch.randomizedtesting.rules.StatementAdapter.evaluate(StatementAdapter.java:36)
>         at com.carrotsearch.randomizedtesting.ThreadLeakControl$StatementRunner.run(ThreadLeakControl.java:358)
>         at java.lang.Thread.run(Thread.java:662)
> 
> 
> 
> 
> Build Log:
> [...truncated 8343 lines...]
> [junit4:junit4] Suite: org.apache.solr.core.TestSolrDiscoveryProperties
> [junit4:junit4]   2> 0 T2247 oas.SolrTestCaseJ4.initCore ####initCore
> [junit4:junit4]   2> Creating dataDir: C:\Users\JenkinsSlave\workspace\Lucene-Solr-trunk-Windows\solr\build\solr-core\test\J0\.\solrtest-TestSolrDiscoveryProperties-1362335229090
> [junit4:junit4]   2> 1 T2247 oas.SolrTestCaseJ4.initCore ####initCore end
> [junit4:junit4]   2> 3 T2247 oas.SolrTestCaseJ4.setUp ###Starting testPropertiesFile
> [junit4:junit4]   2> 31 T2247 oasc.SolrResourceLoader.locateSolrHome JNDI not configured for solr (NoInitialContextEx)
> [junit4:junit4]   2> 31 T2247 oasc.SolrResourceLoader.locateSolrHome using system property solr.solr.home: C:\Users\JenkinsSlave\workspace\Lucene-Solr-trunk-Windows\solr\build\solr-core\test\J0\.\org.apache.solr.core.TestSolrProperties\solrHome
> [junit4:junit4]   2> 31 T2247 oasc.CoreContainer$Initializer.initialize looking for solr config file: C:\Users\JenkinsSlave\workspace\Lucene-Solr-trunk-Windows\solr\build\solr-core\test\J0\.\org.apache.solr.core.TestSolrProperties\solrHome\solr.xml
> [junit4:junit4]   2> 31 T2247 oasc.CoreContainer.<init> New CoreContainer 32636552
> [junit4:junit4]   2> 33 T2247 oasc.CoreContainer.load Loading CoreContainer using Solr Home: 'C:\Users\JenkinsSlave\workspace\Lucene-Solr-trunk-Windows\solr\build\solr-core\test\J0\.\org.apache.solr.core.TestSolrProperties\solrHome\'
> [junit4:junit4]   2> 33 T2247 oasc.SolrResourceLoader.<init> new SolrResourceLoader for directory: 'C:\Users\JenkinsSlave\workspace\Lucene-Solr-trunk-Windows\solr\build\solr-core\test\J0\.\org.apache.solr.core.TestSolrProperties\solrHome\'
> [junit4:junit4]   2> 62 T2247 oasc.SolrProperties.walkFromHere Looking for cores in C:\Users\JenkinsSlave\workspace\Lucene-Solr-trunk-Windows\solr\build\solr-core\test\J0\.\org.apache.solr.core.TestSolrProperties\solrHome
> [junit4:junit4]   2> 63 T2247 oasc.SolrProperties.walkFromHere Discovered properties file C:\Users\JenkinsSlave\workspace\Lucene-Solr-trunk-Windows\solr\build\solr-core\test\J0\.\org.apache.solr.core.TestSolrProperties\solrHome\core1\core.properties, adding to cores
> [junit4:junit4]   2> 63 T2247 oasc.SolrProperties.walkFromHere Discovered properties file C:\Users\JenkinsSlave\workspace\Lucene-Solr-trunk-Windows\solr\build\solr-core\test\J0\.\org.apache.solr.core.TestSolrProperties\solrHome\core2\core.properties, adding to cores
> [junit4:junit4]   2> 63 T2247 oasc.SolrProperties.walkFromHere Discovered properties file C:\Users\JenkinsSlave\workspace\Lucene-Solr-trunk-Windows\solr\build\solr-core\test\J0\.\org.apache.solr.core.TestSolrProperties\solrHome\lazy1\core.properties, adding to cores
> [junit4:junit4]   2> 65 T2247 oasc.SolrProperties.walkFromHere Looking for cores in C:\Users\JenkinsSlave\workspace\Lucene-Solr-trunk-Windows\solr\build\solr-core\test\J0\.\org.apache.solr.core.TestSolrProperties\solrHome
> [junit4:junit4]   2> 66 T2247 oasc.SolrProperties.walkFromHere Discovered properties file C:\Users\JenkinsSlave\workspace\Lucene-Solr-trunk-Windows\solr\build\solr-core\test\J0\.\org.apache.solr.core.TestSolrProperties\solrHome\core1\core.properties, adding to cores
> [junit4:junit4]   2> 67 T2247 oasc.SolrProperties.walkFromHere Discovered properties file C:\Users\JenkinsSlave\workspace\Lucene-Solr-trunk-Windows\solr\build\solr-core\test\J0\.\org.apache.solr.core.TestSolrProperties\solrHome\core2\core.properties, adding to cores
> [junit4:junit4]   2> 67 T2247 oasc.SolrProperties.walkFromHere Discovered properties file C:\Users\JenkinsSlave\workspace\Lucene-Solr-trunk-Windows\solr\build\solr-core\test\J0\.\org.apache.solr.core.TestSolrProperties\solrHome\lazy1\core.properties, adding to cores
> [junit4:junit4]   2> 67 T2247 oashc.HttpShardHandlerFactory.getParameter Setting socketTimeout to: 0
> [junit4:junit4]   2> 68 T2247 oashc.HttpShardHandlerFactory.getParameter Setting urlScheme to: http://
> [junit4:junit4]   2> 68 T2247 oashc.HttpShardHandlerFactory.getParameter Setting connTimeout to: 0
> [junit4:junit4]   2> 68 T2247 oashc.HttpShardHandlerFactory.getParameter Setting maxConnectionsPerHost to: 20
> [junit4:junit4]   2> 69 T2247 oashc.HttpShardHandlerFactory.getParameter Setting corePoolSize to: 0
> [junit4:junit4]   2> 69 T2247 oashc.HttpShardHandlerFactory.getParameter Setting maximumPoolSize to: 2147483647
> [junit4:junit4]   2> 69 T2247 oashc.HttpShardHandlerFactory.getParameter Setting maxThreadIdleTime to: 5
> [junit4:junit4]   2> 69 T2247 oashc.HttpShardHandlerFactory.getParameter Setting sizeOfQueue to: -1
> [junit4:junit4]   2> 69 T2247 oashc.HttpShardHandlerFactory.getParameter Setting fairnessPolicy to: false
> [junit4:junit4]   2> 69 T2247 oascsi.HttpClientUtil.createClient Creating new http client, config:maxConnectionsPerHost=20&maxConnections=10000&socketTimeout=0&connTimeout=0&retry=false
> [junit4:junit4]   2> 77 T2247 oasc.CoreMaps.allocateLazyCores Allocating transient cache for 2 transient cores
> [junit4:junit4]   2> 77 T2247 oasc.CoreContainer.load Registering Log Listener
> [junit4:junit4]   2> 79 T2248 oasc.CoreContainer.create Creating SolrCore 'core1' using instanceDir: C:\Users\JenkinsSlave\workspace\Lucene-Solr-trunk-Windows\solr\build\solr-core\test\J0\.\org.apache.solr.core.TestSolrProperties\solrHome\core1
> [junit4:junit4]   2> 80 T2248 oasc.SolrResourceLoader.<init> new SolrResourceLoader for directory: 'C:\Users\JenkinsSlave\workspace\Lucene-Solr-trunk-Windows\solr\build\solr-core\test\J0\.\org.apache.solr.core.TestSolrProperties\solrHome\core1\'
> [junit4:junit4]   2> 138 T2248 oasc.SolrConfig.<init> Using Lucene MatchVersion: LUCENE_41
> [junit4:junit4]   2> 220 T2248 oasc.SolrConfig.<init> Loaded SolrConfig: solrconfig-minimal.xml
> [junit4:junit4]   2> 221 T2248 oass.IndexSchema.readSchema Reading Solr Schema
> [junit4:junit4]   2> 225 T2248 oass.IndexSchema.readSchema Schema name=tiny
> [junit4:junit4]   2> 254 T2248 oass.IndexSchema.readSchema unique key field: id
> [junit4:junit4]   2> 256 T2248 oasc.SolrCore.<init> [core1] Opening new SolrCore at C:\Users\JenkinsSlave\workspace\Lucene-Solr-trunk-Windows\solr\build\solr-core\test\J0\.\org.apache.solr.core.TestSolrProperties\solrHome\core1\, dataDir=C:\Users\JenkinsSlave\workspace\Lucene-Solr-trunk-Windows\solr\build\solr-core\test\J0\.\org.apache.solr.core.TestSolrProperties\solrHome\core1\stuffandnonsense\
> [junit4:junit4]   2> 256 T2248 oasc.JmxMonitoredMap.<init> JMX monitoring is enabled. Adding Solr mbeans to JMX Server: com.sun.jmx.mbeanserver.JmxMBeanServer@18d7ace
> [junit4:junit4]   2> 257 T2248 oasc.SolrCore.initDirectoryFactory org.apache.solr.core.MockDirectoryFactory
> [junit4:junit4]   2> 257 T2248 oasc.CachingDirectoryFactory.get return new directory for C:\Users\JenkinsSlave\workspace\Lucene-Solr-trunk-Windows\solr\build\solr-core\test\J0\.\org.apache.solr.core.TestSolrProperties\solrHome\core1\stuffandnonsense forceNew:false
> [junit4:junit4]   2> 258 T2248 oasc.CachingDirectoryFactory.close Releasing directory:C:\Users\JenkinsSlave\workspace\Lucene-Solr-trunk-Windows\solr\build\solr-core\test\J0\.\org.apache.solr.core.TestSolrProperties\solrHome\core1\stuffandnonsense
> [junit4:junit4]   2> 258 T2248 oasc.SolrCore.getNewIndexDir New index directory detected: old=null new=C:\Users\JenkinsSlave\workspace\Lucene-Solr-trunk-Windows\solr\build\solr-core\test\J0\.\org.apache.solr.core.TestSolrProperties\solrHome\core1\stuffandnonsense\index/
> [junit4:junit4]   2> 258 T2248 oasc.SolrCore.initIndex WARNING [core1] Solr index directory 'C:\Users\JenkinsSlave\workspace\Lucene-Solr-trunk-Windows\solr\build\solr-core\test\J0\.\org.apache.solr.core.TestSolrProperties\solrHome\core1\stuffandnonsense\index' doesn't exist. Creating new index...
> [junit4:junit4]   2> 264 T2248 oasc.CachingDirectoryFactory.get return new directory for C:\Users\JenkinsSlave\workspace\Lucene-Solr-trunk-Windows\solr\build\solr-core\test\J0\.\org.apache.solr.core.TestSolrProperties\solrHome\core1\stuffandnonsense\index forceNew:false
> [junit4:junit4]   2> 275 T2248 oasc.SolrDeletionPolicy.onCommit SolrDeletionPolicy.onCommit: commits:num=1
> [junit4:junit4]   2>            commit{dir=MockDirWrapper(org.apache.lucene.store.NIOFSDirectory@C:\Users\JenkinsSlave\workspace\Lucene-Solr-trunk-Windows\solr\build\solr-core\test\J0\index2191821926tmp lockFactory=org.apache.lucene.store.NativeFSLockFactory@160e4a9),segFN=segments_1,generation=1,filenames=[segments_1]
> [junit4:junit4]   2> 275 T2248 oasc.SolrDeletionPolicy.updateCommits newest commit = 1[segments_1]
> [junit4:junit4]   2> 277 T2248 oasc.CachingDirectoryFactory.close Releasing directory:C:\Users\JenkinsSlave\workspace\Lucene-Solr-trunk-Windows\solr\build\solr-core\test\J0\.\org.apache.solr.core.TestSolrProperties\solrHome\core1\stuffandnonsense\index
> [junit4:junit4]   2> 277 T2248 oasc.SolrCore.initWriters created json: solr.JSONResponseWriter
> [junit4:junit4]   2> 279 T2248 oasc.RequestHandlers.initHandlersFromConfig created /admin/: solr.admin.AdminHandlers
> [junit4:junit4]   2> 280 T2248 oasc.RequestHandlers.initHandlersFromConfig created /select: solr.SearchHandler
> [junit4:junit4]   2> 280 T2248 oasc.RequestHandlers.initHandlersFromConfig created /update: solr.UpdateRequestHandler
> [junit4:junit4]   2> 292 T2248 oashl.XMLLoader.init xsltCacheLifetimeSeconds=60
> [junit4:junit4]   2> 298 T2248 oasc.CachingDirectoryFactory.close Releasing directory:C:\Users\JenkinsSlave\workspace\Lucene-Solr-trunk-Windows\solr\build\solr-core\test\J0\.\org.apache.solr.core.TestSolrProperties\solrHome\core1\stuffandnonsense
> [junit4:junit4]   2> 300 T2248 oass.SolrIndexSearcher.<init> Opening Searcher@e11b6 main
> [junit4:junit4]   2> 301 T2248 oasc.SolrCore.registerSearcher [core1] Registered new searcher Searcher@e11b6 main{StandardDirectoryReader(segments_1:1)}
> [junit4:junit4]   2> 301 T2248 oasu.CommitTracker.<init> Hard AutoCommit: disabled
> [junit4:junit4]   2> 301 T2248 oasu.CommitTracker.<init> Soft AutoCommit: disabled
> [junit4:junit4]   2> 306 T2248 oasc.CoreContainer.registerCore registering core: core1
> [junit4:junit4]   2> 309 T2247 oasc.CoreContainer.create Creating SolrCore 'core2' using instanceDir: C:\Users\JenkinsSlave\workspace\Lucene-Solr-trunk-Windows\solr\build\solr-core\test\J0\.\org.apache.solr.core.TestSolrProperties\solrHome\core2
> [junit4:junit4]   2> 311 T2247 oasc.SolrResourceLoader.<init> new SolrResourceLoader for directory: 'C:\Users\JenkinsSlave\workspace\Lucene-Solr-trunk-Windows\solr\build\solr-core\test\J0\.\org.apache.solr.core.TestSolrProperties\solrHome\core2\'
> [junit4:junit4]   2> 393 T2247 oasc.SolrConfig.<init> Using Lucene MatchVersion: LUCENE_41
> [junit4:junit4]   2> 459 T2247 oasc.SolrConfig.<init> Loaded SolrConfig: solrconfig-minimal.xml
> [junit4:junit4]   2> 460 T2247 oass.IndexSchema.readSchema Reading Solr Schema
> [junit4:junit4]   2> 465 T2247 oass.IndexSchema.readSchema Schema name=tiny
> [junit4:junit4]   2> 495 T2247 oass.IndexSchema.readSchema unique key field: id
> [junit4:junit4]   2> 497 T2247 oasc.SolrCore.<init> [core2] Opening new SolrCore at C:\Users\JenkinsSlave\workspace\Lucene-Solr-trunk-Windows\solr\build\solr-core\test\J0\.\org.apache.solr.core.TestSolrProperties\solrHome\core2\, dataDir=C:\Users\JenkinsSlave\workspace\Lucene-Solr-trunk-Windows\solr\build\solr-core\test\J0\.\org.apache.solr.core.TestSolrProperties\solrHome\core2\stuffandnonsense\
> [junit4:junit4]   2> 498 T2247 oasc.JmxMonitoredMap.<init> JMX monitoring is enabled. Adding Solr mbeans to JMX Server: com.sun.jmx.mbeanserver.JmxMBeanServer@18d7ace
> [junit4:junit4]   2> 498 T2247 oasc.SolrCore.initDirectoryFactory org.apache.solr.core.MockDirectoryFactory
> [junit4:junit4]   2> 499 T2247 oasc.CachingDirectoryFactory.get return new directory for C:\Users\JenkinsSlave\workspace\Lucene-Solr-trunk-Windows\solr\build\solr-core\test\J0\.\org.apache.solr.core.TestSolrProperties\solrHome\core2\stuffandnonsense forceNew:false
> [junit4:junit4]   2> 499 T2247 oasc.CachingDirectoryFactory.close Releasing directory:C:\Users\JenkinsSlave\workspace\Lucene-Solr-trunk-Windows\solr\build\solr-core\test\J0\.\org.apache.solr.core.TestSolrProperties\solrHome\core2\stuffandnonsense
> [junit4:junit4]   2> 499 T2247 oasc.SolrCore.getNewIndexDir New index directory detected: old=null new=C:\Users\JenkinsSlave\workspace\Lucene-Solr-trunk-Windows\solr\build\solr-core\test\J0\.\org.apache.solr.core.TestSolrProperties\solrHome\core2\stuffandnonsense\index/
> [junit4:junit4]   2> 501 T2247 oasc.SolrCore.initIndex WARNING [core2] Solr index directory 'C:\Users\JenkinsSlave\workspace\Lucene-Solr-trunk-Windows\solr\build\solr-core\test\J0\.\org.apache.solr.core.TestSolrProperties\solrHome\core2\stuffandnonsense\index' doesn't exist. Creating new index...
> [junit4:junit4]   2> 502 T2247 oasc.CachingDirectoryFactory.get return new directory for C:\Users\JenkinsSlave\workspace\Lucene-Solr-trunk-Windows\solr\build\solr-core\test\J0\.\org.apache.solr.core.TestSolrProperties\solrHome\core2\stuffandnonsense\index forceNew:false
> [junit4:junit4]   2> 505 T2247 oasc.SolrDeletionPolicy.onCommit SolrDeletionPolicy.onCommit: commits:num=1
> [junit4:junit4]   2>            commit{dir=MockDirWrapper(org.apache.lucene.store.RAMDirectory@133745a lockFactory=org.apache.lucene.store.NativeFSLockFactory@108cc4b),segFN=segments_1,generation=1,filenames=[segments_1]
> [junit4:junit4]   2> 505 T2247 oasc.SolrDeletionPolicy.updateCommits newest commit = 1[segments_1]
> [junit4:junit4]   2> 507 T2247 oasc.CachingDirectoryFactory.close Releasing directory:C:\Users\JenkinsSlave\workspace\Lucene-Solr-trunk-Windows\solr\build\solr-core\test\J0\.\org.apache.solr.core.TestSolrProperties\solrHome\core2\stuffandnonsense\index
> [junit4:junit4]   2> 508 T2247 oasc.SolrCore.initWriters created json: solr.JSONResponseWriter
> [junit4:junit4]   2> 509 T2247 oasc.RequestHandlers.initHandlersFromConfig created /admin/: solr.admin.AdminHandlers
> [junit4:junit4]   2> 510 T2247 oasc.RequestHandlers.initHandlersFromConfig created /select: solr.SearchHandler
> [junit4:junit4]   2> 511 T2247 oasc.RequestHandlers.initHandlersFromConfig created /update: solr.UpdateRequestHandler
> [junit4:junit4]   2> 520 T2247 oashl.XMLLoader.init xsltCacheLifetimeSeconds=60
> [junit4:junit4]   2> 529 T2247 oasc.CachingDirectoryFactory.close Releasing directory:C:\Users\JenkinsSlave\workspace\Lucene-Solr-trunk-Windows\solr\build\solr-core\test\J0\.\org.apache.solr.core.TestSolrProperties\solrHome\core2\stuffandnonsense
> [junit4:junit4]   2> 530 T2247 oass.SolrIndexSearcher.<init> Opening Searcher@163e8d6 main
> [junit4:junit4]   2> 530 T2247 oasc.SolrCore.registerSearcher [core2] Registered new searcher Searcher@163e8d6 main{StandardDirectoryReader(segments_1:1)}
> [junit4:junit4]   2> 531 T2247 oasu.CommitTracker.<init> Hard AutoCommit: disabled
> [junit4:junit4]   2> 531 T2247 oasu.CommitTracker.<init> Soft AutoCommit: disabled
> [junit4:junit4]   2> 537 T2247 oasc.CoreContainer.registerCore registering core: core2
> [junit4:junit4]   2> 538 T2247 oasc.CoreContainer.create Creating SolrCore 'lazy1' using instanceDir: C:\Users\JenkinsSlave\workspace\Lucene-Solr-trunk-Windows\solr\build\solr-core\test\J0\.\org.apache.solr.core.TestSolrProperties\solrHome\lazy1
> [junit4:junit4]   2> 539 T2247 oasc.SolrResourceLoader.<init> new SolrResourceLoader for directory: 'C:\Users\JenkinsSlave\workspace\Lucene-Solr-trunk-Windows\solr\build\solr-core\test\J0\.\org.apache.solr.core.TestSolrProperties\solrHome\lazy1\'
> [junit4:junit4]   2> 614 T2247 oasc.SolrConfig.<init> Using Lucene MatchVersion: LUCENE_41
> [junit4:junit4]   2> 684 T2247 oasc.SolrConfig.<init> Loaded SolrConfig: solrconfig-minimal.xml
> [junit4:junit4]   2> 684 T2247 oass.IndexSchema.readSchema Reading Solr Schema
> [junit4:junit4]   2> 688 T2247 oass.IndexSchema.readSchema Schema name=tiny
> [junit4:junit4]   2> 722 T2247 oass.IndexSchema.readSchema unique key field: id
> [junit4:junit4]   2> 725 T2247 oasc.SolrCore.<init> [lazy1] Opening new SolrCore at C:\Users\JenkinsSlave\workspace\Lucene-Solr-trunk-Windows\solr\build\solr-core\test\J0\.\org.apache.solr.core.TestSolrProperties\solrHome\lazy1\, dataDir=C:\Users\JenkinsSlave\workspace\Lucene-Solr-trunk-Windows\solr\build\solr-core\test\J0\.\org.apache.solr.core.TestSolrProperties\solrHome\lazy1\stuffandnonsense\
> [junit4:junit4]   2> 725 T2247 oasc.JmxMonitoredMap.<init> JMX monitoring is enabled. Adding Solr mbeans to JMX Server: com.sun.jmx.mbeanserver.JmxMBeanServer@18d7ace
> [junit4:junit4]   2> 725 T2247 oasc.SolrCore.initDirectoryFactory org.apache.solr.core.MockDirectoryFactory
> [junit4:junit4]   2> 726 T2247 oasc.CachingDirectoryFactory.get return new directory for C:\Users\JenkinsSlave\workspace\Lucene-Solr-trunk-Windows\solr\build\solr-core\test\J0\.\org.apache.solr.core.TestSolrProperties\solrHome\lazy1\stuffandnonsense forceNew:false
> [junit4:junit4]   2> 726 T2247 oasc.CachingDirectoryFactory.close Releasing directory:C:\Users\JenkinsSlave\workspace\Lucene-Solr-trunk-Windows\solr\build\solr-core\test\J0\.\org.apache.solr.core.TestSolrProperties\solrHome\lazy1\stuffandnonsense
> [junit4:junit4]   2> 726 T2247 oasc.SolrCore.getNewIndexDir New index directory detected: old=null new=C:\Users\JenkinsSlave\workspace\Lucene-Solr-trunk-Windows\solr\build\solr-core\test\J0\.\org.apache.solr.core.TestSolrProperties\solrHome\lazy1\stuffandnonsense\index/
> [junit4:junit4]   2> 727 T2247 oasc.SolrCore.initIndex WARNING [lazy1] Solr index directory 'C:\Users\JenkinsSlave\workspace\Lucene-Solr-trunk-Windows\solr\build\solr-core\test\J0\.\org.apache.solr.core.TestSolrProperties\solrHome\lazy1\stuffandnonsense\index' doesn't exist. Creating new index...
> [junit4:junit4]   2> 728 T2247 oasc.CachingDirectoryFactory.get return new directory for C:\Users\JenkinsSlave\workspace\Lucene-Solr-trunk-Windows\solr\build\solr-core\test\J0\.\org.apache.solr.core.TestSolrProperties\solrHome\lazy1\stuffandnonsense\index forceNew:false
> [junit4:junit4]   2> 732 T2247 oasc.SolrDeletionPolicy.onCommit SolrDeletionPolicy.onCommit: commits:num=1
> [junit4:junit4]   2>            commit{dir=MockDirWrapper(org.apache.lucene.store.RAMDirectory@ec0731 lockFactory=org.apache.lucene.store.NativeFSLockFactory@103b26d),segFN=segments_1,generation=1,filenames=[segments_1]
> [junit4:junit4]   2> 733 T2247 oasc.SolrDeletionPolicy.updateCommits newest commit = 1[segments_1]
> [junit4:junit4]   2> 734 T2247 oasc.CachingDirectoryFactory.close Releasing directory:C:\Users\JenkinsSlave\workspace\Lucene-Solr-trunk-Windows\solr\build\solr-core\test\J0\.\org.apache.solr.core.TestSolrProperties\solrHome\lazy1\stuffandnonsense\index
> [junit4:junit4]   2> 735 T2247 oasc.SolrCore.initWriters created json: solr.JSONResponseWriter
> [junit4:junit4]   2> 737 T2247 oasc.RequestHandlers.initHandlersFromConfig created /admin/: solr.admin.AdminHandlers
> [junit4:junit4]   2> 737 T2247 oasc.RequestHandlers.initHandlersFromConfig created /select: solr.SearchHandler
> [junit4:junit4]   2> 738 T2247 oasc.RequestHandlers.initHandlersFromConfig created /update: solr.UpdateRequestHandler
> [junit4:junit4]   2> 745 T2247 oashl.XMLLoader.init xsltCacheLifetimeSeconds=60
> [junit4:junit4]   2> 752 T2247 oasc.CachingDirectoryFactory.close Releasing directory:C:\Users\JenkinsSlave\workspace\Lucene-Solr-trunk-Windows\solr\build\solr-core\test\J0\.\org.apache.solr.core.TestSolrProperties\solrHome\lazy1\stuffandnonsense
> [junit4:junit4]   2> 752 T2247 oass.SolrIndexSearcher.<init> Opening Searcher@13532ad main
> [junit4:junit4]   2> 753 T2247 oasc.SolrCore.registerSearcher [lazy1] Registered new searcher Searcher@13532ad main{StandardDirectoryReader(segments_1:1)}
> [junit4:junit4]   2> 754 T2247 oasu.CommitTracker.<init> Hard AutoCommit: disabled
> [junit4:junit4]   2> 754 T2247 oasu.CommitTracker.<init> Soft AutoCommit: disabled
> [junit4:junit4]   2> 758 T2247 oasc.CoreMaps.putTransientCore Opening transient core lazy1
> [junit4:junit4]   2> 758 T2247 oasc.CoreContainer.registerCore registering core: lazy1
> [junit4:junit4]   2> 759 T2247 oasc.CoreContainer.shutdown Shutting down CoreContainer instance=32636552
> [junit4:junit4]   2> 760 T2247 oasc.SolrCore.close [core1]  CLOSING SolrCore org.apache.solr.core.SolrCore@1f92fd0
> [junit4:junit4]   2> 764 T2247 oasu.DirectUpdateHandler2.close closing DirectUpdateHandler2{commits=0,autocommits=0,soft autocommits=0,optimizes=0,rollbacks=0,expungeDeletes=0,docsPending=0,adds=0,deletesById=0,deletesByQuery=0,errors=0,cumulative_adds=0,cumulative_deletesById=0,cumulative_deletesByQuery=0,cumulative_errors=0}
> [junit4:junit4]   2> 764 T2247 oasu.SolrCoreState.decrefSolrCoreState Closing SolrCoreState
> [junit4:junit4]   2> 764 T2247 oasu.DefaultSolrCoreState.closeIndexWriter SolrCoreState ref count has reached 0 - closing IndexWriter
> [junit4:junit4]   2> 764 T2247 oasu.DefaultSolrCoreState.closeIndexWriter closing IndexWriter with IndexWriterCloser
> [junit4:junit4]   2> 765 T2247 oasc.SolrCore.closeSearcher [core1] Closing main searcher on request.
> [junit4:junit4]   2> 765 T2247 oasc.CachingDirectoryFactory.close Releasing directory:C:\Users\JenkinsSlave\workspace\Lucene-Solr-trunk-Windows\solr\build\solr-core\test\J0\.\org.apache.solr.core.TestSolrProperties\solrHome\core1\stuffandnonsense\index
> [junit4:junit4]   2> 765 T2247 oasc.CachingDirectoryFactory.close Closing directory when closing factory:C:\Users\JenkinsSlave\workspace\Lucene-Solr-trunk-Windows\solr\build\solr-core\test\J0\.\org.apache.solr.core.TestSolrProperties\solrHome\core1\stuffandnonsense
> [junit4:junit4]   2> 766 T2247 oasc.CachingDirectoryFactory.closeDirectory Closing directory:C:\Users\JenkinsSlave\workspace\Lucene-Solr-trunk-Windows\solr\build\solr-core\test\J0\.\org.apache.solr.core.TestSolrProperties\solrHome\core1\stuffandnonsense
> [junit4:junit4]   2> 767 T2247 oasc.CachingDirectoryFactory.close Closing directory when closing factory:C:\Users\JenkinsSlave\workspace\Lucene-Solr-trunk-Windows\solr\build\solr-core\test\J0\.\org.apache.solr.core.TestSolrProperties\solrHome\core1\stuffandnonsense\index
> [junit4:junit4]   2> 767 T2247 oasc.CachingDirectoryFactory.closeDirectory Closing directory:C:\Users\JenkinsSlave\workspace\Lucene-Solr-trunk-Windows\solr\build\solr-core\test\J0\.\org.apache.solr.core.TestSolrProperties\solrHome\core1\stuffandnonsense\index
> [junit4:junit4]   2> 767 T2247 oasc.SolrCore.close [core2]  CLOSING SolrCore org.apache.solr.core.SolrCore@15da42f
> [junit4:junit4]   2> 772 T2247 oasu.DirectUpdateHandler2.close closing DirectUpdateHandler2{commits=0,autocommits=0,soft autocommits=0,optimizes=0,rollbacks=0,expungeDeletes=0,docsPending=0,adds=0,deletesById=0,deletesByQuery=0,errors=0,cumulative_adds=0,cumulative_deletesById=0,cumulative_deletesByQuery=0,cumulative_errors=0}
> [junit4:junit4]   2> 772 T2247 oasu.SolrCoreState.decrefSolrCoreState Closing SolrCoreState
> [junit4:junit4]   2> 772 T2247 oasu.DefaultSolrCoreState.closeIndexWriter SolrCoreState ref count has reached 0 - closing IndexWriter
> [junit4:junit4]   2> 772 T2247 oasu.DefaultSolrCoreState.closeIndexWriter closing IndexWriter with IndexWriterCloser
> [junit4:junit4]   2> 774 T2247 oasc.SolrCore.closeSearcher [core2] Closing main searcher on request.
> [junit4:junit4]   2> 775 T2247 oasc.CachingDirectoryFactory.close Releasing directory:C:\Users\JenkinsSlave\workspace\Lucene-Solr-trunk-Windows\solr\build\solr-core\test\J0\.\org.apache.solr.core.TestSolrProperties\solrHome\core2\stuffandnonsense\index
> [junit4:junit4]   2> 775 T2247 oasc.CachingDirectoryFactory.close Closing directory when closing factory:C:\Users\JenkinsSlave\workspace\Lucene-Solr-trunk-Windows\solr\build\solr-core\test\J0\.\org.apache.solr.core.TestSolrProperties\solrHome\core2\stuffandnonsense\index
> [junit4:junit4]   2> 775 T2247 oasc.CachingDirectoryFactory.closeDirectory Closing directory:C:\Users\JenkinsSlave\workspace\Lucene-Solr-trunk-Windows\solr\build\solr-core\test\J0\.\org.apache.solr.core.TestSolrProperties\solrHome\core2\stuffandnonsense\index
> [junit4:junit4]   2> 775 T2247 oasc.CachingDirectoryFactory.close Closing directory when closing factory:C:\Users\JenkinsSlave\workspace\Lucene-Solr-trunk-Windows\solr\build\solr-core\test\J0\.\org.apache.solr.core.TestSolrProperties\solrHome\core2\stuffandnonsense
> [junit4:junit4]   2> 775 T2247 oasc.CachingDirectoryFactory.closeDirectory Closing directory:C:\Users\JenkinsSlave\workspace\Lucene-Solr-trunk-Windows\solr\build\solr-core\test\J0\.\org.apache.solr.core.TestSolrProperties\solrHome\core2\stuffandnonsense
> [junit4:junit4]   2> 775 T2247 oasc.SolrCore.close [lazy1]  CLOSING SolrCore org.apache.solr.core.SolrCore@10c64d8
> [junit4:junit4]   2> 780 T2247 oasu.DirectUpdateHandler2.close closing DirectUpdateHandler2{commits=0,autocommits=0,soft autocommits=0,optimizes=0,rollbacks=0,expungeDeletes=0,docsPending=0,adds=0,deletesById=0,deletesByQuery=0,errors=0,cumulative_adds=0,cumulative_deletesById=0,cumulative_deletesByQuery=0,cumulative_errors=0}
> [junit4:junit4]   2> 780 T2247 oasu.SolrCoreState.decrefSolrCoreState Closing SolrCoreState
> [junit4:junit4]   2> 781 T2247 oasu.DefaultSolrCoreState.closeIndexWriter SolrCoreState ref count has reached 0 - closing IndexWriter
> [junit4:junit4]   2> 781 T2247 oasu.DefaultSolrCoreState.closeIndexWriter closing IndexWriter with IndexWriterCloser
> [junit4:junit4]   2> 782 T2247 oasc.SolrCore.closeSearcher [lazy1] Closing main searcher on request.
> [junit4:junit4]   2> 783 T2247 oasc.CachingDirectoryFactory.close Releasing directory:C:\Users\JenkinsSlave\workspace\Lucene-Solr-trunk-Windows\solr\build\solr-core\test\J0\.\org.apache.solr.core.TestSolrProperties\solrHome\lazy1\stuffandnonsense\index
> [junit4:junit4]   2> 783 T2247 oasc.CachingDirectoryFactory.close Closing directory when closing factory:C:\Users\JenkinsSlave\workspace\Lucene-Solr-trunk-Windows\solr\build\solr-core\test\J0\.\org.apache.solr.core.TestSolrProperties\solrHome\lazy1\stuffandnonsense\index
> [junit4:junit4]   2> 783 T2247 oasc.CachingDirectoryFactory.closeDirectory Closing directory:C:\Users\JenkinsSlave\workspace\Lucene-Solr-trunk-Windows\solr\build\solr-core\test\J0\.\org.apache.solr.core.TestSolrProperties\solrHome\lazy1\stuffandnonsense\index
> [junit4:junit4]   2> 783 T2247 oasc.CachingDirectoryFactory.close Closing directory when closing factory:C:\Users\JenkinsSlave\workspace\Lucene-Solr-trunk-Windows\solr\build\solr-core\test\J0\.\org.apache.solr.core.TestSolrProperties\solrHome\lazy1\stuffandnonsense
> [junit4:junit4]   2> 783 T2247 oasc.CachingDirectoryFactory.closeDirectory Closing directory:C:\Users\JenkinsSlave\workspace\Lucene-Solr-trunk-Windows\solr\build\solr-core\test\J0\.\org.apache.solr.core.TestSolrProperties\solrHome\lazy1\stuffandnonsense
> [junit4:junit4]   2> 827 T2247 oas.SolrTestCaseJ4.tearDown ###Ending testPropertiesFile
> [junit4:junit4]   2> 833 T2247 oas.SolrTestCaseJ4.setUp ###Starting testPersistTrue
> [junit4:junit4]   2> 880 T2247 oasc.SolrResourceLoader.locateSolrHome JNDI not configured for solr (NoInitialContextEx)
> [junit4:junit4]   2> 880 T2247 oasc.SolrResourceLoader.locateSolrHome using system property solr.solr.home: C:\Users\JenkinsSlave\workspace\Lucene-Solr-trunk-Windows\solr\build\solr-core\test\J0\.\org.apache.solr.core.TestSolrProperties\solrHome
> [junit4:junit4]   2> 880 T2247 oasc.CoreContainer$Initializer.initialize looking for solr config file: C:\Users\JenkinsSlave\workspace\Lucene-Solr-trunk-Windows\solr\build\solr-core\test\J0\.\org.apache.solr.core.TestSolrProperties\solrHome\solr.xml
> [junit4:junit4]   2> 880 T2247 oasc.CoreContainer.<init> New CoreContainer 31091782
> [junit4:junit4]   2> 882 T2247 oasc.CoreContainer.load Loading CoreContainer using Solr Home: 'C:\Users\JenkinsSlave\workspace\Lucene-Solr-trunk-Windows\solr\build\solr-core\test\J0\.\org.apache.solr.core.TestSolrProperties\solrHome\'
> [junit4:junit4]   2> 882 T2247 oasc.SolrResourceLoader.<init> new SolrResourceLoader for directory: 'C:\Users\JenkinsSlave\workspace\Lucene-Solr-trunk-Windows\solr\build\solr-core\test\J0\.\org.apache.solr.core.TestSolrProperties\solrHome\'
> [junit4:junit4]   2> 912 T2247 oasc.SolrProperties.walkFromHere Looking for cores in C:\Users\JenkinsSlave\workspace\Lucene-Solr-trunk-Windows\solr\build\solr-core\test\J0\.\org.apache.solr.core.TestSolrProperties\solrHome
> [junit4:junit4]   2> 912 T2247 oasc.SolrProperties.walkFromHere Discovered properties file C:\Users\JenkinsSlave\workspace\Lucene-Solr-trunk-Windows\solr\build\solr-core\test\J0\.\org.apache.solr.core.TestSolrProperties\solrHome\core1\core.properties, adding to cores
> [junit4:junit4]   2> 913 T2247 oasc.SolrProperties.walkFromHere Discovered properties file C:\Users\JenkinsSlave\workspace\Lucene-Solr-trunk-Windows\solr\build\solr-core\test\J0\.\org.apache.solr.core.TestSolrProperties\solrHome\core2\core.properties, adding to cores
> [junit4:junit4]   2> 913 T2247 oasc.SolrProperties.walkFromHere Discovered properties file C:\Users\JenkinsSlave\workspace\Lucene-Solr-trunk-Windows\solr\build\solr-core\test\J0\.\org.apache.solr.core.TestSolrProperties\solrHome\lazy1\core.properties, adding to cores
> [junit4:junit4]   2> 913 T2247 oasc.SolrProperties.walkFromHere Discovered properties file C:\Users\JenkinsSlave\workspace\Lucene-Solr-trunk-Windows\solr\build\solr-core\test\J0\.\org.apache.solr.core.TestSolrProperties\solrHome\lazy2\core.properties, adding to cores
> [junit4:junit4]   2> 914 T2247 oasc.SolrProperties.walkFromHere Discovered properties file C:\Users\JenkinsSlave\workspace\Lucene-Solr-trunk-Windows\solr\build\solr-core\test\J0\.\org.apache.solr.core.TestSolrProperties\solrHome\lazy3\core.properties, adding to cores
> [junit4:junit4]   2> 916 T2247 oasc.SolrProperties.walkFromHere Looking for cores in C:\Users\JenkinsSlave\workspace\Lucene-Solr-trunk-Windows\solr\build\solr-core\test\J0\.\org.apache.solr.core.TestSolrProperties\solrHome
> [junit4:junit4]   2> 916 T2247 oasc.SolrProperties.walkFromHere Discovered properties file C:\Users\JenkinsSlave\workspace\Lucene-Solr-trunk-Windows\solr\build\solr-core\test\J0\.\org.apache.solr.core.TestSolrProperties\solrHome\core1\core.properties, adding to cores
> [junit4:junit4]   2> 916 T2247 oasc.SolrProperties.walkFromHere Discovered properties file C:\Users\JenkinsSlave\workspace\Lucene-Solr-trunk-Windows\solr\build\solr-core\test\J0\.\org.apache.solr.core.TestSolrProperties\solrHome\core2\core.properties, adding to cores
> [junit4:junit4]   2> 916 T2247 oasc.SolrProperties.walkFromHere Discovered properties file C:\Users\JenkinsSlave\workspace\Lucene-Solr-trunk-Windows\solr\build\solr-core\test\J0\.\org.apache.solr.core.TestSolrProperties\solrHome\lazy1\core.properties, adding to cores
> [junit4:junit4]   2> 917 T2247 oasc.SolrProperties.walkFromHere Discovered properties file C:\Users\JenkinsSlave\workspace\Lucene-Solr-trunk-Windows\solr\build\solr-core\test\J0\.\org.apache.solr.core.TestSolrProperties\solrHome\lazy2\core.properties, adding to cores
> [junit4:junit4]   2> 917 T2247 oasc.SolrProperties.walkFromHere Discovered properties file C:\Users\JenkinsSlave\workspace\Lucene-Solr-trunk-Windows\solr\build\solr-core\test\J0\.\org.apache.solr.core.TestSolrProperties\solrHome\lazy3\core.properties, adding to cores
> [junit4:junit4]   2> 917 T2247 oashc.HttpShardHandlerFactory.getParameter Setting socketTimeout to: 0
> [junit4:junit4]   2> 918 T2247 oashc.HttpShardHandlerFactory.getParameter Setting urlScheme to: http://
> [junit4:junit4]   2> 918 T2247 oashc.HttpShardHandlerFactory.getParameter Setting connTimeout to: 0
> [junit4:junit4]   2> 918 T2247 oashc.HttpShardHandlerFactory.getParameter Setting maxConnectionsPerHost to: 20
> [junit4:junit4]   2> 919 T2247 oashc.HttpShardHandlerFactory.getParameter Setting corePoolSize to: 0
> [junit4:junit4]   2> 919 T2247 oashc.HttpShardHandlerFactory.getParameter Setting maximumPoolSize to: 2147483647
> [junit4:junit4]   2> 919 T2247 oashc.HttpShardHandlerFactory.getParameter Setting maxThreadIdleTime to: 5
> [junit4:junit4]   2> 919 T2247 oashc.HttpShardHandlerFactory.getParameter Setting sizeOfQueue to: -1
> [junit4:junit4]   2> 919 T2247 oashc.HttpShardHandlerFactory.getParameter Setting fairnessPolicy to: false
> [junit4:junit4]   2> 919 T2247 oascsi.HttpClientUtil.createClient Creating new http client, config:maxConnectionsPerHost=20&maxConnections=10000&socketTimeout=0&connTimeout=0&retry=false
> [junit4:junit4]   2> 928 T2247 oasc.CoreMaps.allocateLazyCores Allocating transient cache for 2 transient cores
> [junit4:junit4]   2> 928 T2247 oasc.CoreContainer.load Registering Log Listener
> [junit4:junit4]   2> 930 T2253 oasc.CoreContainer.create Creating SolrCore 'core1' using instanceDir: C:\Users\JenkinsSlave\workspace\Lucene-Solr-trunk-Windows\solr\build\solr-core\test\J0\.\org.apache.solr.core.TestSolrProperties\solrHome\core1
> [junit4:junit4]   2> 930 T2255 oasc.CoreContainer.create Creating SolrCore 'lazy1' using instanceDir: C:\Users\JenkinsSlave\workspace\Lucene-Solr-trunk-Windows\solr\build\solr-core\test\J0\.\org.apache.solr.core.TestSolrProperties\solrHome\lazy1
> [junit4:junit4]   2> 931 T2253 oasc.SolrResourceLoader.<init> new SolrResourceLoader for directory: 'C:\Users\JenkinsSlave\workspace\Lucene-Solr-trunk-Windows\solr\build\solr-core\test\J0\.\org.apache.solr.core.TestSolrProperties\solrHome\core1\'
> [junit4:junit4]   2> 932 T2255 oasc.SolrResourceLoader.<init> new SolrResourceLoader for directory: 'C:\Users\JenkinsSlave\workspace\Lucene-Solr-trunk-Windows\solr\build\solr-core\test\J0\.\org.apache.solr.core.TestSolrProperties\solrHome\lazy1\'
> [junit4:junit4]   2> 931 T2254 oasc.CoreContainer.create Creating SolrCore 'lazy2' using instanceDir: C:\Users\JenkinsSlave\workspace\Lucene-Solr-trunk-Windows\solr\build\solr-core\test\J0\.\org.apache.solr.core.TestSolrProperties\solrHome\lazy2
> [junit4:junit4]   2> 935 T2254 oasc.SolrResourceLoader.<init> new SolrResourceLoader for directory: 'C:\Users\JenkinsSlave\workspace\Lucene-Solr-trunk-Windows\solr\build\solr-core\test\J0\.\org.apache.solr.core.TestSolrProperties\solrHome\lazy2\'
> [junit4:junit4]   2> 985 T2253 oasc.SolrConfig.<init> Using Lucene MatchVersion: LUCENE_41
> [junit4:junit4]   2> 988 T2254 oasc.SolrConfig.<init> Using Lucene MatchVersion: LUCENE_41
> [junit4:junit4]   2> 1078 T2254 oasc.SolrConfig.<init> Loaded SolrConfig: solrconfig-minimal.xml
> [junit4:junit4]   2> 1078 T2254 oass.IndexSchema.readSchema Reading Solr Schema
> [junit4:junit4]   2> 1082 T2254 oass.IndexSchema.readSchema Schema name=tiny
> [junit4:junit4]   2> 1105 T2255 oasc.SolrConfig.<init> Using Lucene MatchVersion: LUCENE_41
> [junit4:junit4]   2> 1114 T2254 oass.IndexSchema.readSchema unique key field: id
> [junit4:junit4]   2> 1116 T2254 oasc.SolrCore.<init> [lazy2] Opening new SolrCore at C:\Users\JenkinsSlave\workspace\Lucene-Solr-trunk-Windows\solr\build\solr-core\test\J0\.\org.apache.solr.core.TestSolrProperties\solrHome\lazy2\, dataDir=C:\Users\JenkinsSlave\workspace\Lucene-Solr-trunk-Windows\solr\build\solr-core\test\J0\.\org.apache.solr.core.TestSolrProperties\solrHome\lazy2\stuffandnonsense\
> [junit4:junit4]   2> 1116 T2254 oasc.JmxMonitoredMap.<init> JMX monitoring is enabled. Adding Solr mbeans to JMX Server: com.sun.jmx.mbeanserver.JmxMBeanServer@18d7ace
> [junit4:junit4]   2> 1116 T2254 oasc.SolrCore.initDirectoryFactory org.apache.solr.core.MockDirectoryFactory
> [junit4:junit4]   2> 1117 T2254 oasc.CachingDirectoryFactory.get return new directory for C:\Users\JenkinsSlave\workspace\Lucene-Solr-trunk-Windows\solr\build\solr-core\test\J0\.\org.apache.solr.core.TestSolrProperties\solrHome\lazy2\stuffandnonsense forceNew:false
> [junit4:junit4]   2> 1117 T2254 oasc.CachingDirectoryFactory.close Releasing directory:C:\Users\JenkinsSlave\workspace\Lucene-Solr-trunk-Windows\solr\build\solr-core\test\J0\.\org.apache.solr.core.TestSolrProperties\solrHome\lazy2\stuffandnonsense
> [junit4:junit4]   2> 1117 T2254 oasc.SolrCore.getNewIndexDir New index directory detected: old=null new=C:\Users\JenkinsSlave\workspace\Lucene-Solr-trunk-Windows\solr\build\solr-core\test\J0\.\org.apache.solr.core.TestSolrProperties\solrHome\lazy2\stuffandnonsense\index/
> [junit4:junit4]   2> 1120 T2254 oasc.SolrCore.initIndex WARNING [lazy2] Solr index directory 'C:\Users\JenkinsSlave\workspace\Lucene-Solr-trunk-Windows\solr\build\solr-core\test\J0\.\org.apache.solr.core.TestSolrProperties\solrHome\lazy2\stuffandnonsense\index' doesn't exist. Creating new index...
> [junit4:junit4]   2> 1125 T2254 oasc.CachingDirectoryFactory.get return new directory for C:\Users\JenkinsSlave\workspace\Lucene-Solr-trunk-Windows\solr\build\solr-core\test\J0\.\org.apache.solr.core.TestSolrProperties\solrHome\lazy2\stuffandnonsense\index forceNew:false
> [junit4:junit4]   2> 1152 T2253 oasc.SolrConfig.<init> Loaded SolrConfig: solrconfig-minimal.xml
> [junit4:junit4]   2> 1152 T2253 oass.IndexSchema.readSchema Reading Solr Schema
> [junit4:junit4]   2> 1156 T2253 oass.IndexSchema.readSchema Schema name=tiny
> [junit4:junit4]   2> 1183 T2255 oasc.SolrConfig.<init> Loaded SolrConfig: solrconfig-minimal.xml
> [junit4:junit4]   2> 1184 T2255 oass.IndexSchema.readSchema Reading Solr Schema
> [junit4:junit4]   2> 1184 T2253 oass.IndexSchema.readSchema unique key field: id
> [junit4:junit4]   2> 1186 T2255 oass.IndexSchema.readSchema Schema name=tiny
> [junit4:junit4]   2> 1186 T2253 oasc.SolrCore.<init> [core1] Opening new SolrCore at C:\Users\JenkinsSlave\workspace\Lucene-Solr-trunk-Windows\solr\build\solr-core\test\J0\.\org.apache.solr.core.TestSolrProperties\solrHome\core1\, dataDir=C:\Users\JenkinsSlave\workspace\Lucene-Solr-trunk-Windows\solr\build\solr-core\test\J0\.\org.apache.solr.core.TestSolrProperties\solrHome\core1\stuffandnonsense\
> [junit4:junit4]   2> 1188 T2253 oasc.JmxMonitoredMap.<init> JMX monitoring is enabled. Adding Solr mbeans to JMX Server: com.sun.jmx.mbeanserver.JmxMBeanServer@18d7ace
> [junit4:junit4]   2> 1188 T2253 oasc.SolrCore.initDirectoryFactory org.apache.solr.core.MockDirectoryFactory
> [junit4:junit4]   2> 1188 T2253 oasc.CachingDirectoryFactory.get return new directory for C:\Users\JenkinsSlave\workspace\Lucene-Solr-trunk-Windows\solr\build\solr-core\test\J0\.\org.apache.solr.core.TestSolrProperties\solrHome\core1\stuffandnonsense forceNew:false
> [junit4:junit4]   2> 1188 T2253 oasc.CachingDirectoryFactory.close Releasing directory:C:\Users\JenkinsSlave\workspace\Lucene-Solr-trunk-Windows\solr\build\solr-core\test\J0\.\org.apache.solr.core.TestSolrProperties\solrHome\core1\stuffandnonsense
> [junit4:junit4]   2> 1189 T2253 oasc.SolrCore.getNewIndexDir New index directory detected: old=null new=C:\Users\JenkinsSlave\workspace\Lucene-Solr-trunk-Windows\solr\build\solr-core\test\J0\.\org.apache.solr.core.TestSolrProperties\solrHome\core1\stuffandnonsense\index/
> [junit4:junit4]   2> 1190 T2253 oasc.SolrCore.initIndex WARNING [core1] Solr index directory 'C:\Users\JenkinsSlave\workspace\Lucene-Solr-trunk-Windows\solr\build\solr-core\test\J0\.\org.apache.solr.core.TestSolrProperties\solrHome\core1\stuffandnonsense\index' doesn't exist. Creating new index...
> [junit4:junit4]   2> 1191 T2254 oasc.SolrDeletionPolicy.onCommit SolrDeletionPolicy.onCommit: commits:num=1
> [junit4:junit4]   2>            commit{dir=MockDirWrapper(org.apache.lucene.store.NIOFSDirectory@C:\Users\JenkinsSlave\workspace\Lucene-Solr-trunk-Windows\solr\build\solr-core\test\J0\index2191821927tmp lockFactory=org.apache.lucene.store.NativeFSLockFactory@ef4f26),segFN=segments_1,generation=1,filenames=[segments_1]
> [junit4:junit4]   2> 1191 T2254 oasc.SolrDeletionPolicy.updateCommits newest commit = 1[segments_1]
> [junit4:junit4]   2> 1193 T2254 oasc.CachingDirectoryFactory.close Releasing directory:C:\Users\JenkinsSlave\workspace\Lucene-Solr-trunk-Windows\solr\build\solr-core\test\J0\.\org.apache.solr.core.TestSolrProperties\solrHome\lazy2\stuffandnonsense\index
> [junit4:junit4]   2> 1193 T2254 oasc.SolrCore.initWriters created json: solr.JSONResponseWriter
> [junit4:junit4]   2> 1194 T2254 oasc.RequestHandlers.initHandlersFromConfig created /admin/: solr.admin.AdminHandlers
> [junit4:junit4]   2> 1195 T2254 oasc.RequestHandlers.initHandlersFromConfig created /select: solr.SearchHandler
> [junit4:junit4]   2> 1195 T2254 oasc.RequestHandlers.initHandlersFromConfig created /update: solr.UpdateRequestHandler
> [junit4:junit4]   2> 1201 T2253 oasc.CachingDirectoryFactory.get return new directory for C:\Users\JenkinsSlave\workspace\Lucene-Solr-trunk-Windows\solr\build\solr-core\test\J0\.\org.apache.solr.core.TestSolrProperties\solrHome\core1\stuffandnonsense\index forceNew:false
> [junit4:junit4]   2> 1210 T2254 oashl.XMLLoader.init xsltCacheLifetimeSeconds=60
> [junit4:junit4]   2> 1214 T2254 oasc.CachingDirectoryFactory.close Releasing directory:C:\Users\JenkinsSlave\workspace\Lucene-Solr-trunk-Windows\solr\build\solr-core\test\J0\.\org.apache.solr.core.TestSolrProperties\solrHome\lazy2\stuffandnonsense
> [junit4:junit4]   2> 1217 T2254 oass.SolrIndexSearcher.<init> Opening Searcher@16deeaf main
> [junit4:junit4]   2> 1217 T2254 oasc.SolrCore.registerSearcher [lazy2] Registered new searcher Searcher@16deeaf main{StandardDirectoryReader(segments_1:1)}
> [junit4:junit4]   2> 1218 T2254 oasu.CommitTracker.<init> Hard AutoCommit: disabled
> [junit4:junit4]   2> 1218 T2254 oasu.CommitTracker.<init> Soft AutoCommit: disabled
> [junit4:junit4]   2> 1218 T2253 oasc.SolrDeletionPolicy.onCommit SolrDeletionPolicy.onCommit: commits:num=1
> [junit4:junit4]   2>            commit{dir=MockDirWrapper(org.apache.lucene.store.NIOFSDirectory@C:\Users\JenkinsSlave\workspace\Lucene-Solr-trunk-Windows\solr\build\solr-core\test\J0\index2191821928tmp lockFactory=org.apache.lucene.store.NativeFSLockFactory@1b81596),segFN=segments_1,generation=1,filenames=[segments_1]
> [junit4:junit4]   2> 1220 T2253 oasc.SolrDeletionPolicy.updateCommits newest commit = 1[segments_1]
> [junit4:junit4]   2> 1222 T2254 oasc.CoreMaps.putTransientCore Opening transient core lazy2
> [junit4:junit4]   2> 1220 T2255 oass.IndexSchema.readSchema unique key field: id
> [junit4:junit4]   2> 1222 T2253 oasc.CachingDirectoryFactory.close Releasing directory:C:\Users\JenkinsSlave\workspace\Lucene-Solr-trunk-Windows\solr\build\solr-core\test\J0\.\org.apache.solr.core.TestSolrProperties\solrHome\core1\stuffandnonsense\index
> [junit4:junit4]   2> 1222 T2253 oasc.SolrCore.initWriters created json: solr.JSONResponseWriter
> [junit4:junit4]   2> 1224 T2253 oasc.RequestHandlers.initHandlersFromConfig created /admin/: solr.admin.AdminHandlers
> [junit4:junit4]   2> 1224 T2253 oasc.RequestHandlers.initHandlersFromConfig created /select: solr.SearchHandler
> [junit4:junit4]   2> 1225 T2253 oasc.RequestHandlers.initHandlersFromConfig created /update: solr.UpdateRequestHandler
> [junit4:junit4]   2> 1222 T2254 oasc.CoreContainer.registerCore registering core: lazy2
> [junit4:junit4]   2> 1227 T2255 oasc.SolrCore.<init> [lazy1] Opening new SolrCore at C:\Users\JenkinsSlave\workspace\Lucene-Solr-trunk-Windows\solr\build\solr-core\test\J0\.\org.apache.solr.core.TestSolrProperties\solrHome\lazy1\, dataDir=C:\Users\JenkinsSlave\workspace\Lucene-Solr-trunk-Windows\solr\build\solr-core\test\J0\.\org.apache.solr.core.TestSolrProperties\solrHome\lazy1\stuffandnonsense\
> [junit4:junit4]   2> 1227 T2255 oasc.JmxMonitoredMap.<init> JMX monitoring is enabled. Adding Solr mbeans to JMX Server: com.sun.jmx.mbeanserver.JmxMBeanServer@18d7ace
> [junit4:junit4]   2> 1227 T2255 oasc.SolrCore.initDirectoryFactory org.apache.solr.core.MockDirectoryFactory
> [junit4:junit4]   2> 1228 T2255 oasc.CachingDirectoryFactory.get return new directory for C:\Users\JenkinsSlave\workspace\Lucene-Solr-trunk-Windows\solr\build\solr-core\test\J0\.\org.apache.solr.core.TestSolrProperties\solrHome\lazy1\stuffandnonsense forceNew:false
> [junit4:junit4]   2> 1228 T2255 oasc.CachingDirectoryFactory.close Releasing directory:C:\Users\JenkinsSlave\workspace\Lucene-Solr-trunk-Windows\solr\build\solr-core\test\J0\.\org.apache.solr.core.TestSolrProperties\solrHome\lazy1\stuffandnonsense
> [junit4:junit4]   2> 1228 T2255 oasc.SolrCore.getNewIndexDir New index directory detected: old=null new=C:\Users\JenkinsSlave\workspace\Lucene-Solr-trunk-Windows\solr\build\solr-core\test\J0\.\org.apache.solr.core.TestSolrProperties\solrHome\lazy1\stuffandnonsense\index/
> [junit4:junit4]   2> 1233 T2253 oashl.XMLLoader.init xsltCacheLifetimeSeconds=60
> [junit4:junit4]   2> 1233 T2255 oasc.SolrCore.initIndex WARNING [lazy1] Solr index directory 'C:\Users\JenkinsSlave\workspace\Lucene-Solr-trunk-Windows\solr\build\solr-core\test\J0\.\org.apache.solr.core.TestSolrProperties\solrHome\lazy1\stuffandnonsense\index' doesn't exist. Creating new index...
> [junit4:junit4]   2> 1235 T2255 oasc.CachingDirectoryFactory.get return new directory for C:\Users\JenkinsSlave\workspace\Lucene-Solr-trunk-Windows\solr\build\solr-core\test\J0\.\org.apache.solr.core.TestSolrProperties\solrHome\lazy1\stuffandnonsense\index forceNew:false
> [junit4:junit4]   2> 1243 T2253 oasc.CachingDirectoryFactory.close Releasing directory:C:\Users\JenkinsSlave\workspace\Lucene-Solr-trunk-Windows\solr\build\solr-core\test\J0\.\org.apache.solr.core.TestSolrProperties\solrHome\core1\stuffandnonsense
> [junit4:junit4]   2> 1245 T2253 oass.SolrIndexSearcher.<init> Opening Searcher@95a32b main
> [junit4:junit4]   2> 1246 T2253 oasc.SolrCore.registerSearcher [core1] Registered new searcher Searcher@95a32b main{StandardDirectoryReader(segments_1:1)}
> [junit4:junit4]   2> 1246 T2253 oasu.CommitTracker.<init> Hard AutoCommit: disabled
> [junit4:junit4]   2> 1246 T2253 oasu.CommitTracker.<init> Soft AutoCommit: disabled
> [junit4:junit4]   2> 1251 T2253 oasc.CoreContainer.registerCore registering core: core1
> [junit4:junit4]   2> 1251 T2255 oasc.SolrDeletionPolicy.onCommit SolrDeletionPolicy.onCommit: commits:num=1
> [junit4:junit4]   2>            commit{dir=MockDirWrapper(org.apache.lucene.store.NIOFSDirectory@C:\Users\JenkinsSlave\workspace\Lucene-Solr-trunk-Windows\solr\build\solr-core\test\J0\index2191821929tmp lockFactory=org.apache.lucene.store.NativeFSLockFactory@11375fc),segFN=segments_1,generation=1,filenames=[segments_1]
> [junit4:junit4]   2> 1251 T2255 oasc.SolrDeletionPolicy.updateCommits newest commit = 1[segments_1]
> [junit4:junit4]   2> 1252 T2255 oasc.CachingDirectoryFactory.close Releasing directory:C:\Users\JenkinsSlave\workspace\Lucene-Solr-trunk-Windows\solr\build\solr-core\test\J0\.\org.apache.solr.core.TestSolrProperties\solrHome\lazy1\stuffandnonsense\index
> [junit4:junit4]   2> 1253 T2255 oasc.SolrCore.initWriters created json: solr.JSONResponseWriter
> [junit4:junit4]   2> 1254 T2255 oasc.RequestHandlers.initHandlersFromConfig created /admin/: solr.admin.AdminHandlers
> [junit4:junit4]   2> 1255 T2255 oasc.RequestHandlers.initHandlersFromConfig created /select: solr.SearchHandler
> [junit4:junit4]   2> 1255 T2255 oasc.RequestHandlers.initHandlersFromConfig created /update: solr.UpdateRequestHandler
> [junit4:junit4]   2> 1263 T2255 oashl.XMLLoader.init xsltCacheLifetimeSeconds=60
> [junit4:junit4]   2> 1270 T2255 oasc.CachingDirectoryFactory.close Releasing directory:C:\Users\JenkinsSlave\workspace\Lucene-Solr-trunk-Windows\solr\build\solr-core\test\J0\.\org.apache.solr.core.TestSolrProperties\solrHome\lazy1\stuffandnonsense
> [junit4:junit4]   2> 1271 T2255 oass.SolrIndexSearcher.<init> Opening Searcher@d336ae main
> [junit4:junit4]   2> 1272 T2255 oasc.SolrCore.registerSearcher [lazy1] Registered new searcher Searcher@d336ae main{StandardDirectoryReader(segments_1:1)}
> [junit4:junit4]   2> 1273 T2255 oasu.CommitTracker.<init> Hard AutoCommit: disabled
> [junit4:junit4]   2> 1273 T2255 oasu.CommitTracker.<init> Soft AutoCommit: disabled
> [junit4:junit4]   2> 1275 T2255 oasc.CoreMaps.putTransientCore Opening transient core lazy1
> [junit4:junit4]   2> 1275 T2255 oasc.CoreContainer.registerCore registering core: lazy1
> [junit4:junit4]   2> 1277 T2247 oasc.CoreContainer.create Creating SolrCore 'core2' using instanceDir: C:\Users\JenkinsSlave\workspace\Lucene-Solr-trunk-Windows\solr\build\solr-core\test\J0\.\org.apache.solr.core.TestSolrProperties\solrHome\core2
> [junit4:junit4]   2> 1278 T2247 oasc.SolrResourceLoader.<init> new SolrResourceLoader for directory: 'C:\Users\JenkinsSlave\workspace\Lucene-Solr-trunk-Windows\solr\build\solr-core\test\J0\.\org.apache.solr.core.TestSolrProperties\solrHome\core2\'
> [junit4:junit4]   2> 1345 T2247 oasc.SolrConfig.<init> Using Lucene MatchVersion: LUCENE_41
> [junit4:junit4]   2> 1412 T2247 oasc.SolrConfig.<init> Loaded SolrConfig: solrconfig-minimal.xml
> [junit4:junit4]   2> 1413 T2247 oass.IndexSchema.readSchema Reading Solr Schema
> [junit4:junit4]   2> 1416 T2247 oass.IndexSchema.readSchema Schema name=tiny
> [junit4:junit4]   2> 1446 T2247 oass.IndexSchema.readSchema unique key field: id
> [junit4:junit4]   2> 1448 T2247 oasc.SolrCore.<init> [core2] Opening new SolrCore at C:\Users\JenkinsSlave\workspace\Lucene-Solr-trunk-Windows\solr\build\solr-core\test\J0\.\org.apache.solr.core.TestSolrProperties\solrHome\core2\, dataDir=C:\Users\JenkinsSlave\workspace\Lucene-Solr-trunk-Windows\solr\build\solr-core\test\J0\.\org.apache.solr.core.TestSolrProperties\solrHome\core2\stuffandnonsense\
> [junit4:junit4]   2> 1448 T2247 oasc.JmxMonitoredMap.<init> JMX monitoring is enabled. Adding Solr mbeans to JMX Server: com.sun.jmx.mbeanserver.JmxMBeanServer@18d7ace
> [junit4:junit4]   2> 1449 T2247 oasc.SolrCore.initDirectoryFactory org.apache.solr.core.MockDirectoryFactory
> [junit4:junit4]   2> 1449 T2247 oasc.CachingDirectoryFactory.get return new directory for C:\Users\JenkinsSlave\workspace\Lucene-Solr-trunk-Windows\solr\build\solr-core\test\J0\.\org.apache.solr.core.TestSolrProperties\solrHome\core2\stuffandnonsense forceNew:false
> [junit4:junit4]   2> 1449 T2247 oasc.CachingDirectoryFactory.close Releasing directory:C:\Users\JenkinsSlave\workspace\Lucene-Solr-trunk-Windows\solr\build\solr-core\test\J0\.\org.apache.solr.core.TestSolrProperties\solrHome\core2\stuffandnonsense
> [junit4:junit4]   2> 1450 T2247 oasc.SolrCore.getNewIndexDir New index directory detected: old=null new=C:\Users\JenkinsSlave\workspace\Lucene-Solr-trunk-Windows\solr\build\solr-core\test\J0\.\org.apache.solr.core.TestSolrProperties\solrHome\core2\stuffandnonsense\index/
> [junit4:junit4]   2> 1451 T2247 oasc.SolrCore.initIndex WARNING [core2] Solr index directory 'C:\Users\JenkinsSlave\workspace\Lucene-Solr-trunk-Windows\solr\build\solr-core\test\J0\.\org.apache.solr.core.TestSolrProperties\solrHome\core2\stuffandnonsense\index' doesn't exist. Creating new index...
> [junit4:junit4]   2> 1452 T2247 oasc.CachingDirectoryFactory.get return new directory for C:\Users\JenkinsSlave\workspace\Lucene-Solr-trunk-Windows\solr\build\solr-core\test\J0\.\org.apache.solr.core.TestSolrProperties\solrHome\core2\stuffandnonsense\index forceNew:false
> [junit4:junit4]   2> 1454 T2247 oasc.SolrDeletionPolicy.onCommit SolrDeletionPolicy.onCommit: commits:num=1
> [junit4:junit4]   2>            commit{dir=MockDirWrapper(org.apache.lucene.store.RAMDirectory@179f9e8 lockFactory=org.apache.lucene.store.NativeFSLockFactory@15dc903),segFN=segments_1,generation=1,filenames=[segments_1]
> [junit4:junit4]   2> 1454 T2247 oasc.SolrDeletionPolicy.updateCommits newest commit = 1[segments_1]
> [junit4:junit4]   2> 1456 T2247 oasc.CachingDirectoryFactory.close Releasing directory:C:\Users\JenkinsSlave\workspace\Lucene-Solr-trunk-Windows\solr\build\solr-core\test\J0\.\org.apache.solr.core.TestSolrProperties\solrHome\core2\stuffandnonsense\index
> [junit4:junit4]   2> 1456 T2247 oasc.SolrCore.initWriters created json: solr.JSONResponseWriter
> [junit4:junit4]   2> 1458 T2247 oasc.RequestHandlers.initHandlersFromConfig created /admin/: solr.admin.AdminHandlers
> [junit4:junit4]   2> 1458 T2247 oasc.RequestHandlers.initHandlersFromConfig created /select: solr.SearchHandler
> [junit4:junit4]   2> 1459 T2247 oasc.RequestHandlers.initHandlersFromConfig created /update: solr.UpdateRequestHandler
> [junit4:junit4]   2> 1467 T2247 oashl.XMLLoader.init xsltCacheLifetimeSeconds=60
> [junit4:junit4]   2> 1474 T2247 oasc.CachingDirectoryFactory.close Releasing directory:C:\Users\JenkinsSlave\workspace\Lucene-Solr-trunk-Windows\solr\build\solr-core\test\J0\.\org.apache.solr.core.TestSolrProperties\solrHome\core2\stuffandnonsense
> [junit4:junit4]   2> 1474 T2247 oass.SolrIndexSearcher.<init> Opening Searcher@84d58e main
> [junit4:junit4]   2> 1475 T2247 oasc.SolrCore.registerSearcher [core2] Registered new searcher Searcher@84d58e main{StandardDirectoryReader(segments_1:1)}
> [junit4:junit4]   2> 1475 T2247 oasu.CommitTracker.<init> Hard AutoCommit: disabled
> [junit4:junit4]   2> 1475 T2247 oasu.CommitTracker.<init> Soft AutoCommit: disabled
> [junit4:junit4]   2> 1479 T2247 oasc.CoreContainer.registerCore registering core: core2
> [junit4:junit4]   2> 1480 T2247 oasc.CoreContainer.create Creating SolrCore 'lazy3' using instanceDir: C:\Users\JenkinsSlave\workspace\Lucene-Solr-trunk-Windows\solr\build\solr-core\test\J0\.\org.apache.solr.core.TestSolrProperties\solrHome\lazy3
> [junit4:junit4]   2> 1481 T2247 oasc.SolrResourceLoader.<init> new SolrResourceLoader for directory: 'C:\Users\JenkinsSlave\workspace\Lucene-Solr-trunk-Windows\solr\build\solr-core\test\J0\.\org.apache.solr.core.TestSolrProperties\solrHome\lazy3\'
> [junit4:junit4]   2> 1546 T2247 oasc.SolrConfig.<init> Using Lucene MatchVersion: LUCENE_41
> [junit4:junit4]   2> 1623 T2247 oasc.SolrConfig.<init> Loaded SolrConfig: solrconfig-minimal.xml
> [junit4:junit4]   2> 1624 T2247 oass.IndexSchema.readSchema Reading Solr Schema
> [junit4:junit4]   2> 1628 T2247 oass.IndexSchema.readSchema Schema name=tiny
> [junit4:junit4]   2> 1655 T2247 oass.IndexSchema.readSchema unique key field: id
> [junit4:junit4]   2> 1658 T2247 oasc.SolrCore.<init> [lazy3] Opening new SolrCore at C:\Users\JenkinsSlave\workspace\Lucene-Solr-trunk-Windows\solr\build\solr-core\test\J0\.\org.apache.solr.core.TestSolrProperties\solrHome\lazy3\, dataDir=C:\Users\JenkinsSlave\workspace\Lucene-Solr-trunk-Windows\solr\build\solr-core\test\J0\.\org.apache.solr.core.TestSolrProperties\solrHome\lazy3\stuffandnonsense\
> [junit4:junit4]   2> 1658 T2247 oasc.JmxMonitoredMap.<init> JMX monitoring is enabled. Adding Solr mbeans to JMX Server: com.sun.jmx.mbeanserver.JmxMBeanServer@18d7ace
> [junit4:junit4]   2> 1659 T2247 oasc.SolrCore.initDirectoryFactory org.apache.solr.core.MockDirectoryFactory
> [junit4:junit4]   2> 1661 T2247 oasc.CachingDirectoryFactory.get return new directory for C:\Users\JenkinsSlave\workspace\Lucene-Solr-trunk-Windows\solr\build\solr-core\test\J0\.\org.apache.solr.core.TestSolrProperties\solrHome\lazy3\stuffandnonsense forceNew:false
> [junit4:junit4]   2> 1662 T2247 oasc.CachingDirectoryFactory.close Releasing directory:C:\Users\JenkinsSlave\workspace\Lucene-Solr-trunk-Windows\solr\build\solr-core\test\J0\.\org.apache.solr.core.TestSolrProperties\solrHome\lazy3\stuffandnonsense
> [junit4:junit4]   2> 1662 T2247 oasc.SolrCore.getNewIndexDir New index directory detected: old=null new=C:\Users\JenkinsSlave\workspace\Lucene-Solr-trunk-Windows\solr\build\solr-core\test\J0\.\org.apache.solr.core.TestSolrProperties\solrHome\lazy3\stuffandnonsense\index/
> [junit4:junit4]   2> 1663 T2247 oasc.SolrCore.initIndex WARNING [lazy3] Solr index directory 'C:\Users\JenkinsSlave\workspace\Lucene-Solr-trunk-Windows\solr\build\solr-core\test\J0\.\org.apache.solr.core.TestSolrProperties\solrHome\lazy3\stuffandnonsense\index' doesn't exist. Creating new index...
> [junit4:junit4]   2> 1664 T2247 oasc.CachingDirectoryFactory.get return new directory for C:\Users\JenkinsSlave\workspace\Lucene-Solr-trunk-Windows\solr\build\solr-core\test\J0\.\org.apache.solr.core.TestSolrProperties\solrHome\lazy3\stuffandnonsense\index forceNew:false
> [junit4:junit4]   2> 1670 T2247 oasc.SolrDeletionPolicy.onCommit SolrDeletionPolicy.onCommit: commits:num=1
> [junit4:junit4]   2>            commit{dir=MockDirWrapper(org.apache.lucene.store.RAMDirectory@9b0f9f lockFactory=org.apache.lucene.store.NativeFSLockFactory@86b7f),segFN=segments_1,generation=1,filenames=[segments_1]
> [junit4:junit4]   2> 1670 T2247 oasc.SolrDeletionPolicy.updateCommits newest commit = 1[segments_1]
> [junit4:junit4]   2> 1673 T2247 oasc.CachingDirectoryFactory.close Releasing directory:C:\Users\JenkinsSlave\workspace\Lucene-Solr-trunk-Windows\solr\build\solr-core\test\J0\.\org.apache.solr.core.TestSolrProperties\solrHome\lazy3\stuffandnonsense\index
> [junit4:junit4]   2> 1674 T2247 oasc.SolrCore.initWriters created json: solr.JSONResponseWriter
> [junit4:junit4]   2> 1676 T2247 oasc.RequestHandlers.initHandlersFromConfig created /admin/: solr.admin.AdminHandlers
> [junit4:junit4]   2> 1677 T2247 oasc.RequestHandlers.initHandlersFromConfig created /select: solr.SearchHandler
> [junit4:junit4]   2> 1678 T2247 oasc.RequestHandlers.initHandlersFromConfig created /update: solr.UpdateRequestHandler
> [junit4:junit4]   2> 1686 T2247 oashl.XMLLoader.init xsltCacheLifetimeSeconds=60
> [junit4:junit4]   2> 1694 T2247 oasc.CachingDirectoryFactory.close Releasing directory:C:\Users\JenkinsSlave\workspace\Lucene-Solr-trunk-Windows\solr\build\solr-core\test\J0\.\org.apache.solr.core.TestSolrProperties\solrHome\lazy3\stuffandnonsense
> [junit4:junit4]   2> 1694 T2247 oass.SolrIndexSearcher.<init> Opening Searcher@140f703 main
> [junit4:junit4]   2> 1695 T2247 oasc.SolrCore.registerSearcher [lazy3] Registered new searcher Searcher@140f703 main{StandardDirectoryReader(segments_1:1)}
> [junit4:junit4]   2> 1696 T2247 oasu.CommitTracker.<init> Hard AutoCommit: disabled
> [junit4:junit4]   2> 1697 T2247 oasu.CommitTracker.<init> Soft AutoCommit: disabled
> [junit4:junit4]   2> 1702 T2247 oasc.CoreMaps.putTransientCore Opening transient core lazy3
> [junit4:junit4]   2> 1703 T2247 oasc.CoreContainer.registerCore registering core: lazy3
> [junit4:junit4]   2> 1704 T2247 oasc.CoreContainer.persistFile Persisting cores config to C:\Users\JenkinsSlave\workspace\Lucene-Solr-trunk-Windows\solr\build\solr-core\test\J0\.\org.apache.solr.core.TestSolrProperties\solrHome\solr.properties
> [junit4:junit4]   2> 1717 T2247 oasc.SolrCore.close [lazy1]  CLOSING SolrCore org.apache.solr.core.SolrCore@3d81a
> [junit4:junit4]   2> 1722 T2247 oasu.DirectUpdateHandler2.close closing DirectUpdateHandler2{commits=0,autocommits=0,soft autocommits=0,optimizes=0,rollbacks=0,expungeDeletes=0,docsPending=0,adds=0,deletesById=0,deletesByQuery=0,errors=0,cumulative_adds=0,cumulative_deletesById=0,cumulative_deletesByQuery=0,cumulative_errors=0}
> [junit4:junit4]   2> 1722 T2247 oasu.SolrCoreState.decrefSolrCoreState Closing SolrCoreState
> [junit4:junit4]   2> 1722 T2247 oasu.DefaultSolrCoreState.closeIndexWriter SolrCoreState ref count has reached 0 - closing IndexWriter
> [junit4:junit4]   2> 1723 T2247 oasu.DefaultSolrCoreState.closeIndexWriter closing IndexWriter with IndexWriterCloser
> [junit4:junit4]   2> 1723 T2247 oasc.SolrCore.closeSearcher [lazy1] Closing main searcher on request.
> [junit4:junit4]   2> 1723 T2247 oasc.CachingDirectoryFactory.close Releasing directory:C:\Users\JenkinsSlave\workspace\Lucene-Solr-trunk-Windows\solr\build\solr-core\test\J0\.\org.apache.solr.core.TestSolrProperties\solrHome\lazy1\stuffandnonsense\index
> [junit4:junit4]   2> 1724 T2247 oasc.CachingDirectoryFactory.close Closing directory when closing factory:C:\Users\JenkinsSlave\workspace\Lucene-Solr-trunk-Windows\solr\build\solr-core\test\J0\.\org.apache.solr.core.TestSolrProperties\solrHome\lazy1\stuffandnonsense
> [junit4:junit4]   2> 1724 T2247 oasc.CachingDirectoryFactory.closeDirectory Closing directory:C:\Users\JenkinsSlave\workspace\Lucene-Solr-trunk-Windows\solr\build\solr-core\test\J0\.\org.apache.solr.core.TestSolrProperties\solrHome\lazy1\stuffandnonsense
> [junit4:junit4]   2> 1724 T2247 oasc.CachingDirectoryFactory.close Closing directory when closing factory:C:\Users\JenkinsSlave\workspace\Lucene-Solr-trunk-Windows\solr\build\solr-core\test\J0\.\org.apache.solr.core.TestSolrProperties\solrHome\lazy1\stuffandnonsense\index
> [junit4:junit4]   2> 1724 T2247 oasc.CachingDirectoryFactory.closeDirectory Closing directory:C:\Users\JenkinsSlave\workspace\Lucene-Solr-trunk-Windows\solr\build\solr-core\test\J0\.\org.apache.solr.core.TestSolrProperties\solrHome\lazy1\stuffandnonsense\index
> [junit4:junit4]   2> 1724 T2247 oasc.CoreContainer.shutdown Shutting down CoreContainer instance=31091782
> [junit4:junit4]   2> 1726 T2247 oasc.SolrCore.close [core1]  CLOSING SolrCore org.apache.solr.core.SolrCore@44a83
> [junit4:junit4]   2> 1736 T2247 oasu.DirectUpdateHandler2.close closing DirectUpdateHandler2{commits=0,autocommits=0,soft autocommits=0,optimizes=0,rollbacks=0,expungeDeletes=0,docsPending=0,adds=0,deletesById=0,deletesByQuery=0,errors=0,cumulative_adds=0,cumulative_deletesById=0,cumulative_deletesByQuery=0,cumulative_errors=0}
> [junit4:junit4]   2> 1737 T2247 oasu.SolrCoreState.decrefSolrCoreState Closing SolrCoreState
> [junit4:junit4]   2> 1737 T2247 oasu.DefaultSolrCoreState.closeIndexWriter SolrCoreState ref count has reached 0 - closing IndexWriter
> [junit4:junit4]   2> 1737 T2247 oasu.DefaultSolrCoreState.closeIndexWriter closing IndexWriter with IndexWriterCloser
> [junit4:junit4]   2> 1738 T2247 oasc.SolrCore.closeSearcher [core1] Closing main searcher on request.
> [junit4:junit4]   2> 1739 T2247 oasc.CachingDirectoryFactory.close Releasing directory:C:\Users\JenkinsSlave\workspace\Lucene-Solr-trunk-Windows\solr\build\solr-core\test\J0\.\org.apache.solr.core.TestSolrProperties\solrHome\core1\stuffandnonsense\index
> [junit4:junit4]   2> 1739 T2247 oasc.CachingDirectoryFactory.close Closing directory when closing factory:C:\Users\JenkinsSlave\workspace\Lucene-Solr-trunk-Windows\solr\build\solr-core\test\J0\.\org.apache.solr.core.TestSolrProperties\solrHome\core1\stuffandnonsense\index
> [junit4:junit4]   2> 1739 T2247 oasc.CachingDirectoryFactory.closeDirectory Closing directory:C:\Users\JenkinsSlave\workspace\Lucene-Solr-trunk-Windows\solr\build\solr-core\test\J0\.\org.apache.solr.core.TestSolrProperties\solrHome\core1\stuffandnonsense\index
> [junit4:junit4]   2> 1740 T2247 oasc.CachingDirectoryFactory.close Closing directory when closing factory:C:\Users\JenkinsSlave\workspace\Lucene-Solr-trunk-Windows\solr\build\solr-core\test\J0\.\org.apache.solr.core.TestSolrProperties\solrHome\core1\stuffandnonsense
> [junit4:junit4]   2> 1740 T2247 oasc.CachingDirectoryFactory.closeDirectory Closing directory:C:\Users\JenkinsSlave\workspace\Lucene-Solr-trunk-Windows\solr\build\solr-core\test\J0\.\org.apache.solr.core.TestSolrProperties\solrHome\core1\stuffandnonsense
> [junit4:junit4]   2> 1740 T2247 oasc.SolrCore.close [core2]  CLOSING SolrCore org.apache.solr.core.SolrCore@c3b82c
> [junit4:junit4]   2> 1744 T2247 oasu.DirectUpdateHandler2.close closing DirectUpdateHandler2{commits=0,autocommits=0,soft autocommits=0,optimizes=0,rollbacks=0,expungeDeletes=0,docsPending=0,adds=0,deletesById=0,deletesByQuery=0,errors=0,cumulative_adds=0,cumulative_deletesById=0,cumulative_deletesByQuery=0,cumulative_errors=0}
> [junit4:junit4]   2> 1744 T2247 oasu.SolrCoreState.decrefSolrCoreState Closing SolrCoreState
> [junit4:junit4]   2> 1745 T2247 oasu.DefaultSolrCoreState.closeIndexWriter SolrCoreState ref count has reached 0 - closing IndexWriter
> [junit4:junit4]   2> 1745 T2247 oasu.DefaultSolrCoreState.closeIndexWriter closing IndexWriter with IndexWriterCloser
> [junit4:junit4]   2> 1746 T2247 oasc.SolrCore.closeSearcher [core2] Closing main searcher on request.
> [junit4:junit4]   2> 1746 T2247 oasc.CachingDirectoryFactory.close Releasing directory:C:\Users\JenkinsSlave\workspace\Lucene-Solr-trunk-Windows\solr\build\solr-core\test\J0\.\org.apache.solr.core.TestSolrProperties\solrHome\core2\stuffandnonsense\index
> [junit4:junit4]   2> 1746 T2247 oasc.CachingDirectoryFactory.close Closing directory when closing factory:C:\Users\JenkinsSlave\workspace\Lucene-Solr-trunk-Windows\solr\build\solr-core\test\J0\.\org.apache.solr.core.TestSolrProperties\solrHome\core2\stuffandnonsense\index
> [junit4:junit4]   2> 1746 T2247 oasc.CachingDirectoryFactory.closeDirectory Closing directory:C:\Users\JenkinsSlave\workspace\Lucene-Solr-trunk-Windows\solr\build\solr-core\test\J0\.\org.apache.solr.core.TestSolrProperties\solrHome\core2\stuffandnonsense\index
> [junit4:junit4]   2> 1746 T2247 oasc.CachingDirectoryFactory.close Closing directory when closing factory:C:\Users\JenkinsSlave\workspace\Lucene-Solr-trunk-Windows\solr\build\solr-core\test\J0\.\org.apache.solr.core.TestSolrProperties\solrHome\core2\stuffandnonsense
> [junit4:junit4]   2> 1747 T2247 oasc.CachingDirectoryFactory.closeDirectory Closing directory:C:\Users\JenkinsSlave\workspace\Lucene-Solr-trunk-Windows\solr\build\solr-core\test\J0\.\org.apache.solr.core.TestSolrProperties\solrHome\core2\stuffandnonsense
> [junit4:junit4]   2> 1747 T2247 oasc.SolrCore.close [lazy2]  CLOSING SolrCore org.apache.solr.core.SolrCore@1037f5b
> [junit4:junit4]   2> 1752 T2247 oasu.DirectUpdateHandler2.close closing DirectUpdateHandler2{commits=0,autocommits=0,soft autocommits=0,optimizes=0,rollbacks=0,expungeDeletes=0,docsPending=0,adds=0,deletesById=0,deletesByQuery=0,errors=0,cumulative_adds=0,cumulative_deletesById=0,cumulative_deletesByQuery=0,cumulative_errors=0}
> [junit4:junit4]   2> 1752 T2247 oasu.SolrCoreState.decrefSolrCoreState Closing SolrCoreState
> [junit4:junit4]   2> 1753 T2247 oasu.DefaultSolrCoreState.closeIndexWriter SolrCoreState ref count has reached 0 - closing IndexWriter
> [junit4:junit4]   2> 1753 T2247 oasu.DefaultSolrCoreState.closeIndexWriter closing IndexWriter with IndexWriterCloser
> [junit4:junit4]   2> 1754 T2247 oasc.SolrCore.closeSearcher [lazy2] Closing main searcher on request.
> [junit4:junit4]   2> 1755 T2247 oasc.CachingDirectoryFactory.close Releasing directory:C:\Users\JenkinsSlave\workspace\Lucene-Solr-trunk-Windows\solr\build\solr-core\test\J0\.\org.apache.solr.core.TestSolrProperties\solrHome\lazy2\stuffandnonsense\index
> [junit4:junit4]   2> 1755 T2247 oasc.CachingDirectoryFactory.close Closing directory when closing factory:C:\Users\JenkinsSlave\workspace\Lucene-Solr-trunk-Windows\solr\build\solr-core\test\J0\.\org.apache.solr.core.TestSolrProperties\solrHome\lazy2\stuffandnonsense
> [junit4:junit4]   2> 1755 T2247 oasc.CachingDirectoryFactory.closeDirectory Closing directory:C:\Users\JenkinsSlave\workspace\Lucene-Solr-trunk-Windows\solr\build\solr-core\test\J0\.\org.apache.solr.core.TestSolrProperties\solrHome\lazy2\stuffandnonsense
> [junit4:junit4]   2> 1755 T2247 oasc.CachingDirectoryFactory.close Closing directory when closing factory:C:\Users\JenkinsSlave\workspace\Lucene-Solr-trunk-Windows\solr\build\solr-core\test\J0\.\org.apache.solr.core.TestSolrProperties\solrHome\lazy2\stuffandnonsense\index
> [junit4:junit4]   2> 1755 T2247 oasc.CachingDirectoryFactory.closeDirectory Closing directory:C:\Users\JenkinsSlave\workspace\Lucene-Solr-trunk-Windows\solr\build\solr-core\test\J0\.\org.apache.solr.core.TestSolrProperties\solrHome\lazy2\stuffandnonsense\index
> [junit4:junit4]   2> 1756 T2247 oasc.SolrCore.close [lazy3]  CLOSING SolrCore org.apache.solr.core.SolrCore@17e4166
> [junit4:junit4]   2> 1761 T2247 oasu.DirectUpdateHandler2.close closing DirectUpdateHandler2{commits=0,autocommits=0,soft autocommits=0,optimizes=0,rollbacks=0,expungeDeletes=0,docsPending=0,adds=0,deletesById=0,deletesByQuery=0,errors=0,cumulative_adds=0,cumulative_deletesById=0,cumulative_deletesByQuery=0,cumulative_errors=0}
> [junit4:junit4]   2> 1761 T2247 oasu.SolrCoreState.decrefSolrCoreState Closing SolrCoreState
> [junit4:junit4]   2> 1761 T2247 oasu.DefaultSolrCoreState.closeIndexWriter SolrCoreState ref count has reached 0 - closing IndexWriter
> [junit4:junit4]   2> 1762 T2247 oasu.DefaultSolrCoreState.closeIndexWriter closing IndexWriter with IndexWriterCloser
> [junit4:junit4]   2> 1763 T2247 oasc.SolrCore.closeSearcher [lazy3] Closing main searcher on request.
> [junit4:junit4]   2> 1763 T2247 oasc.CachingDirectoryFactory.close Releasing directory:C:\Users\JenkinsSlave\workspace\Lucene-Solr-trunk-Windows\solr\build\solr-core\test\J0\.\org.apache.solr.core.TestSolrProperties\solrHome\lazy3\stuffandnonsense\index
> [junit4:junit4]   2> 1763 T2247 oasc.CachingDirectoryFactory.close Closing directory when closing factory:C:\Users\JenkinsSlave\workspace\Lucene-Solr-trunk-Windows\solr\build\solr-core\test\J0\.\org.apache.solr.core.TestSolrProperties\solrHome\lazy3\stuffandnonsense
> [junit4:junit4]   2> 1764 T2247 oasc.CachingDirectoryFactory.closeDirectory Closing directory:C:\Users\JenkinsSlave\workspace\Lucene-Solr-trunk-Windows\solr\build\solr-core\test\J0\.\org.apache.solr.core.TestSolrProperties\solrHome\lazy3\stuffandnonsense
> [junit4:junit4]   2> 1764 T2247 oasc.CachingDirectoryFactory.close Closing directory when closing factory:C:\Users\JenkinsSlave\workspace\Lucene-Solr-trunk-Windows\solr\build\solr-core\test\J0\.\org.apache.solr.core.TestSolrProperties\solrHome\lazy3\stuffandnonsense\index
> [junit4:junit4]   2> 1764 T2247 oasc.CachingDirectoryFactory.closeDirectory Closing directory:C:\Users\JenkinsSlave\workspace\Lucene-Solr-trunk-Windows\solr\build\solr-core\test\J0\.\org.apache.solr.core.TestSolrProperties\solrHome\lazy3\stuffandnonsense\index
> [junit4:junit4]   2> 1827 T2247 oas.SolrTestCaseJ4.tearDown ###Ending testPersistTrue
> [junit4:junit4]   2> NOTE: reproduce with: ant test  -Dtestcase=TestSolrDiscoveryProperties -Dtests.method=testPersistTrue -Dtests.seed=58657AD342FF2DCF -Dtests.slow=true -Dtests.locale=en_AU -Dtests.timezone=America/Vancouver -Dtests.file.encoding=US-ASCII
> [junit4:junit4] ERROR   1.02s | TestSolrDiscoveryProperties.testPersistTrue <<<
> [junit4:junit4]    > Throwable #1: java.io.IOException: Unable to delete file: .\org.apache.solr.core.TestSolrProperties\solrHome\solr.properties
> [junit4:junit4]    >    at __randomizedtesting.SeedInfo.seed([58657AD342FF2DCF:B8CC21CF55A9490D]:0)
> [junit4:junit4]    >    at org.apache.commons.io.FileUtils.forceDelete(FileUtils.java:1919)
> [junit4:junit4]    >    at org.apache.commons.io.FileUtils.cleanDirectory(FileUtils.java:1399)
> [junit4:junit4]    >    at org.apache.commons.io.FileUtils.deleteDirectory(FileUtils.java:1331)
> [junit4:junit4]    >    at org.apache.solr.core.TestSolrDiscoveryProperties.after(TestSolrDiscoveryProperties.java:119)
> [junit4:junit4]    >    at sun.reflect.NativeMethodAccessorImpl.invoke0(Native Method)
> [junit4:junit4]    >    at sun.reflect.NativeMethodAccessorImpl.invoke(NativeMethodAccessorImpl.java:39)
> [junit4:junit4]    >    at sun.reflect.DelegatingMethodAccessorImpl.invoke(DelegatingMethodAccessorImpl.java:25)
> [junit4:junit4]    >    at java.lang.reflect.Method.invoke(Method.java:597)
> [junit4:junit4]    >    at com.carrotsearch.randomizedtesting.RandomizedRunner.invoke(RandomizedRunner.java:1559)
> [junit4:junit4]    >    at com.carrotsearch.randomizedtesting.RandomizedRunner.access$600(RandomizedRunner.java:79)
> [junit4:junit4]    >    at com.carrotsearch.randomizedtesting.RandomizedRunner$8.evaluate(RandomizedRunner.java:795)
> [junit4:junit4]    >    at com.carrotsearch.randomizedtesting.rules.SystemPropertiesRestoreRule$1.evaluate(SystemPropertiesRestoreRule.java:53)
> [junit4:junit4]    >    at org.apache.lucene.util.TestRuleSetupTeardownChained$1.evaluate(TestRuleSetupTeardownChained.java:50)
> [junit4:junit4]    >    at org.apache.lucene.util.TestRuleFieldCacheSanity$1.evaluate(TestRuleFieldCacheSanity.java:51)
> [junit4:junit4]    >    at org.apache.lucene.util.AbstractBeforeAfterRule$1.evaluate(AbstractBeforeAfterRule.java:46)
> [junit4:junit4]    >    at com.carrotsearch.randomizedtesting.rules.SystemPropertiesInvariantRule$1.evaluate(SystemPropertiesInvariantRule.java:55)
> [junit4:junit4]    >    at org.apache.lucene.util.TestRuleThreadAndTestName$1.evaluate(TestRuleThreadAndTestName.java:49)
> [junit4:junit4]    >    at org.apache.lucene.util.TestRuleIgnoreAfterMaxFailures$1.evaluate(TestRuleIgnoreAfterMaxFailures.java:70)
> [junit4:junit4]    >    at org.apache.lucene.util.TestRuleMarkFailure$1.evaluate(TestRuleMarkFailure.java:48)
> [junit4:junit4]    >    at com.carrotsearch.randomizedtesting.rules.StatementAdapter.evaluate(StatementAdapter.java:36)
> [junit4:junit4]    >    at com.carrotsearch.randomizedtesting.ThreadLeakControl$StatementRunner.run(ThreadLeakControl.java:358)
> [junit4:junit4]    >    at com.carrotsearch.randomizedtesting.ThreadLeakControl.forkTimeoutingTask(ThreadLeakControl.java:782)
> [junit4:junit4]    >    at com.carrotsearch.randomizedtesting.ThreadLeakControl$3.evaluate(ThreadLeakControl.java:442)
> [junit4:junit4]    >    at com.carrotsearch.randomizedtesting.RandomizedRunner.runSingleTest(RandomizedRunner.java:746)
> [junit4:junit4]    >    at com.carrotsearch.randomizedtesting.RandomizedRunner$3.evaluate(RandomizedRunner.java:648)
> [junit4:junit4]    >    at com.carrotsearch.randomizedtesting.RandomizedRunner$4.evaluate(RandomizedRunner.java:682)
> [junit4:junit4]    >    at com.carrotsearch.randomizedtesting.RandomizedRunner$5.evaluate(RandomizedRunner.java:693)
> [junit4:junit4]    >    at com.carrotsearch.randomizedtesting.rules.StatementAdapter.evaluate(StatementAdapter.java:36)
> [junit4:junit4]    >    at com.carrotsearch.randomizedtesting.rules.SystemPropertiesRestoreRule$1.evaluate(SystemPropertiesRestoreRule.java:53)
> [junit4:junit4]    >    at org.apache.lucene.util.AbstractBeforeAfterRule$1.evaluate(AbstractBeforeAfterRule.java:46)
> [junit4:junit4]    >    at org.apache.lucene.util.TestRuleStoreClassName$1.evaluate(TestRuleStoreClassName.java:42)
> [junit4:junit4]    >    at com.carrotsearch.randomizedtesting.rules.SystemPropertiesInvariantRule$1.evaluate(SystemPropertiesInvariantRule.java:55)
> [junit4:junit4]    >    at com.carrotsearch.randomizedtesting.rules.NoShadowingOrOverridesOnMethodsRule$1.evaluate(NoShadowingOrOverridesOnMethodsRule.java:39)
> [junit4:junit4]    >    at com.carrotsearch.randomizedtesting.rules.NoShadowingOrOverridesOnMethodsRule$1.evaluate(NoShadowingOrOverridesOnMethodsRule.java:39)
> [junit4:junit4]    >    at com.carrotsearch.randomizedtesting.rules.StatementAdapter.evaluate(StatementAdapter.java:36)
> [junit4:junit4]    >    at org.apache.lucene.util.TestRuleAssertionsRequired$1.evaluate(TestRuleAssertionsRequired.java:43)
> [junit4:junit4]    >    at org.apache.lucene.util.TestRuleMarkFailure$1.evaluate(TestRuleMarkFailure.java:48)
> [junit4:junit4]    >    at org.apache.lucene.util.TestRuleIgnoreAfterMaxFailures$1.evaluate(TestRuleIgnoreAfterMaxFailures.java:70)
> [junit4:junit4]    >    at org.apache.lucene.util.TestRuleIgnoreTestSuites$1.evaluate(TestRuleIgnoreTestSuites.java:55)
> [junit4:junit4]    >    at com.carrotsearch.randomizedtesting.rules.StatementAdapter.evaluate(StatementAdapter.java:36)
> [junit4:junit4]    >    at com.carrotsearch.randomizedtesting.ThreadLeakControl$StatementRunner.run(ThreadLeakControl.java:358)
> [junit4:junit4]    >    at java.lang.Thread.run(Thread.java:662)
> [junit4:junit4]   2> 1847 T2247 oas.SolrTestCaseJ4.setUp ###Starting testPersistFalse
> [junit4:junit4]   2> 1875 T2247 oas.SolrTestCaseJ4.tearDown ###Ending testPersistFalse
> [junit4:junit4]   2> NOTE: reproduce with: ant test  -Dtestcase=TestSolrDiscoveryProperties -Dtests.method=testPersistFalse -Dtests.seed=58657AD342FF2DCF -Dtests.slow=true -Dtests.locale=en_AU -Dtests.timezone=America/Vancouver -Dtests.file.encoding=US-ASCII
> [junit4:junit4] ERROR   0.04s | TestSolrDiscoveryProperties.testPersistFalse <<<
> [junit4:junit4]    > Throwable #1: java.io.IOException: Unable to delete file: .\org.apache.solr.core.TestSolrProperties\solrHome\solr.properties
> [junit4:junit4]    >    at org.apache.commons.io.FileUtils.forceDelete(FileUtils.java:1919)
> [junit4:junit4]    >    at org.apache.commons.io.FileUtils.cleanDirectory(FileUtils.java:1399)
> [junit4:junit4]    >    at org.apache.commons.io.FileUtils.deleteDirectory(FileUtils.java:1331)
> [junit4:junit4]    >    at org.apache.solr.core.TestSolrDiscoveryProperties.setMeUp(TestSolrDiscoveryProperties.java:46)
> [junit4:junit4]    >    at org.apache.solr.core.TestSolrDiscoveryProperties.testPersistFalse(TestSolrDiscoveryProperties.java:245)
> [junit4:junit4]    >    at sun.reflect.NativeMethodAccessorImpl.invoke0(Native Method)
> [junit4:junit4]    >    at sun.reflect.NativeMethodAccessorImpl.invoke(NativeMethodAccessorImpl.java:39)
> [junit4:junit4]    >    at sun.reflect.DelegatingMethodAccessorImpl.invoke(DelegatingMethodAccessorImpl.java:25)
> [junit4:junit4]    >    at java.lang.reflect.Method.invoke(Method.java:597)
> [junit4:junit4]    >    at com.carrotsearch.randomizedtesting.RandomizedRunner.invoke(RandomizedRunner.java:1559)
> [junit4:junit4]    >    at com.carrotsearch.randomizedtesting.RandomizedRunner.access$600(RandomizedRunner.java:79)
> [junit4:junit4]    >    at com.carrotsearch.randomizedtesting.RandomizedRunner$6.evaluate(RandomizedRunner.java:737)
> [junit4:junit4]    >    at com.carrotsearch.randomizedtesting.RandomizedRunner$7.evaluate(RandomizedRunner.java:773)
> [junit4:junit4]    >    at com.carrotsearch.randomizedtesting.RandomizedRunner$8.evaluate(RandomizedRunner.java:787)
> [junit4:junit4]    >    at com.carrotsearch.randomizedtesting.rules.SystemPropertiesRestoreRule$1.evaluate(SystemPropertiesRestoreRule.java:53)
> [junit4:junit4]    >    at org.apache.lucene.util.TestRuleSetupTeardownChained$1.evaluate(TestRuleSetupTeardownChained.java:50)
> [junit4:junit4]    >    at org.apache.lucene.util.TestRuleFieldCacheSanity$1.evaluate(TestRuleFieldCacheSanity.java:51)
> [junit4:junit4]    >    at org.apache.lucene.util.AbstractBeforeAfterRule$1.evaluate(AbstractBeforeAfterRule.java:46)
> [junit4:junit4]    >    at com.carrotsearch.randomizedtesting.rules.SystemPropertiesInvariantRule$1.evaluate(SystemPropertiesInvariantRule.java:55)
> [junit4:junit4]    >    at org.apache.lucene.util.TestRuleThreadAndTestName$1.evaluate(TestRuleThreadAndTestName.java:49)
> [junit4:junit4]    >    at org.apache.lucene.util.TestRuleIgnoreAfterMaxFailures$1.evaluate(TestRuleIgnoreAfterMaxFailures.java:70)
> [junit4:junit4]    >    at org.apache.lucene.util.TestRuleMarkFailure$1.evaluate(TestRuleMarkFailure.java:48)
> [junit4:junit4]    >    at com.carrotsearch.randomizedtesting.rules.StatementAdapter.evaluate(StatementAdapter.java:36)
> [junit4:junit4]    >    at com.carrotsearch.randomizedtesting.ThreadLeakControl$StatementRunner.run(ThreadLeakControl.java:358)
> [junit4:junit4]    >    at com.carrotsearch.randomizedtesting.ThreadLeakControl.forkTimeoutingTask(ThreadLeakControl.java:782)
> [junit4:junit4]    >    at com.carrotsearch.randomizedtesting.ThreadLeakControl$3.evaluate(ThreadLeakControl.java:442)
> [junit4:junit4]    >    at com.carrotsearch.randomizedtesting.RandomizedRunner.runSingleTest(RandomizedRunner.java:746)
> [junit4:junit4]    >    at com.carrotsearch.randomizedtesting.RandomizedRunner$3.evaluate(RandomizedRunner.java:648)
> [junit4:junit4]    >    at com.carrotsearch.randomizedtesting.RandomizedRunner$4.evaluate(RandomizedRunner.java:682)
> [junit4:junit4]    >    at com.carrotsearch.randomizedtesting.RandomizedRunner$5.evaluate(RandomizedRunner.java:693)
> [junit4:junit4]    >    at com.carrotsearch.randomizedtesting.rules.StatementAdapter.evaluate(StatementAdapter.java:36)
> [junit4:junit4]    >    at com.carrotsearch.randomizedtesting.rules.SystemPropertiesRestoreRule$1.evaluate(SystemPropertiesRestoreRule.java:53)
> [junit4:junit4]    >    at org.apache.lucene.util.AbstractBeforeAfterRule$1.evaluate(AbstractBeforeAfterRule.java:46)
> [junit4:junit4]    >    at org.apache.lucene.util.TestRuleStoreClassName$1.evaluate(TestRuleStoreClassName.java:42)
> [junit4:junit4]    >    at com.carrotsearch.randomizedtesting.rules.SystemPropertiesInvariantRule$1.evaluate(SystemPropertiesInvariantRule.java:55)
> [junit4:junit4]    >    at com.carrotsearch.randomizedtesting.rules.NoShadowingOrOverridesOnMethodsRule$1.evaluate(NoShadowingOrOverridesOnMethodsRule.java:39)
> [junit4:junit4]    >    at com.carrotsearch.randomizedtesting.rules.NoShadowingOrOverridesOnMethodsRule$1.evaluate(NoShadowingOrOverridesOnMethodsRule.java:39)
> [junit4:junit4]    >    at com.carrotsearch.randomizedtesting.rules.StatementAdapter.evaluate(StatementAdapter.java:36)
> [junit4:junit4]    >    at org.apache.lucene.util.TestRuleAssertionsRequired$1.evaluate(TestRuleAssertionsRequired.java:43)
> [junit4:junit4]    >    at org.apache.lucene.util.TestRuleMarkFailure$1.evaluate(TestRuleMarkFailure.java:48)
> [junit4:junit4]    >    at org.apache.lucene.util.TestRuleIgnoreAfterMaxFailures$1.evaluate(TestRuleIgnoreAfterMaxFailures.java:70)
> [junit4:junit4]    >    at org.apache.lucene.util.TestRuleIgnoreTestSuites$1.evaluate(TestRuleIgnoreTestSuites.java:55)
> [junit4:junit4]    >    at com.carrotsearch.randomizedtesting.rules.StatementAdapter.evaluate(StatementAdapter.java:36)
> [junit4:junit4]    >    at com.carrotsearch.randomizedtesting.ThreadLeakControl$StatementRunner.run(ThreadLeakControl.java:358)
> [junit4:junit4]    >    at java.lang.Thread.run(Thread.java:662)
> [junit4:junit4]    > Throwable #2: java.io.IOException: Unable to delete file: .\org.apache.solr.core.TestSolrProperties\solrHome\solr.properties
> [junit4:junit4]    >    at org.apache.commons.io.FileUtils.forceDelete(FileUtils.java:1919)
> [junit4:junit4]    >    at org.apache.commons.io.FileUtils.cleanDirectory(FileUtils.java:1399)
> [junit4:junit4]    >    at org.apache.commons.io.FileUtils.deleteDirectory(FileUtils.java:1331)
> [junit4:junit4]    >    at org.apache.solr.core.TestSolrDiscoveryProperties.after(TestSolrDiscoveryProperties.java:119)
> [junit4:junit4]    >    at sun.reflect.NativeMethodAccessorImpl.invoke0(Native Method)
> [junit4:junit4]    >    at sun.reflect.NativeMethodAccessorImpl.invoke(NativeMethodAccessorImpl.java:39)
> [junit4:junit4]    >    at sun.reflect.DelegatingMethodAccessorImpl.invoke(DelegatingMethodAccessorImpl.java:25)
> [junit4:junit4]    >    at java.lang.reflect.Method.invoke(Method.java:597)
> [junit4:junit4]    >    at com.carrotsearch.randomizedtesting.RandomizedRunner.invoke(RandomizedRunner.java:1559)
> [junit4:junit4]    >    at com.carrotsearch.randomizedtesting.RandomizedRunner.access$600(RandomizedRunner.java:79)
> [junit4:junit4]    >    at com.carrotsearch.randomizedtesting.RandomizedRunner$8.evaluate(RandomizedRunner.java:795)
> [junit4:junit4]    >    at com.carrotsearch.randomizedtesting.rules.SystemPropertiesRestoreRule$1.evaluate(SystemPropertiesRestoreRule.java:53)
> [junit4:junit4]    >    at org.apache.lucene.util.TestRuleSetupTeardownChained$1.evaluate(TestRuleSetupTeardownChained.java:50)
> [junit4:junit4]    >    at org.apache.lucene.util.TestRuleFieldCacheSanity$1.evaluate(TestRuleFieldCacheSanity.java:51)
> [junit4:junit4]    >    at org.apache.lucene.util.AbstractBeforeAfterRule$1.evaluate(AbstractBeforeAfterRule.java:46)
> [junit4:junit4]    >    at com.carrotsearch.randomizedtesting.rules.SystemPropertiesInvariantRule$1.evaluate(SystemPropertiesInvariantRule.java:55)
> [junit4:junit4]    >    at org.apache.lucene.util.TestRuleThreadAndTestName$1.evaluate(TestRuleThreadAndTestName.java:49)
> [junit4:junit4]    >    at org.apache.lucene.util.TestRuleIgnoreAfterMaxFailures$1.evaluate(TestRuleIgnoreAfterMaxFailures.java:70)
> [junit4:junit4]    >    at org.apache.lucene.util.TestRuleMarkFailure$1.evaluate(TestRuleMarkFailure.java:48)
> [junit4:junit4]    >    at com.carrotsearch.randomizedtesting.rules.StatementAdapter.evaluate(StatementAdapter.java:36)
> [junit4:junit4]    >    at com.carrotsearch.randomizedtesting.ThreadLeakControl$StatementRunner.run(ThreadLeakControl.java:358)
> [junit4:junit4]    >    at com.carrotsearch.randomizedtesting.ThreadLeakControl.forkTimeoutingTask(ThreadLeakControl.java:782)
> [junit4:junit4]    >    at com.carrotsearch.randomizedtesting.ThreadLeakControl$3.evaluate(ThreadLeakControl.java:442)
> [junit4:junit4]    >    at com.carrotsearch.randomizedtesting.RandomizedRunner.runSingleTest(RandomizedRunner.java:746)
> [junit4:junit4]    >    at com.carrotsearch.randomizedtesting.RandomizedRunner$3.evaluate(RandomizedRunner.java:648)
> [junit4:junit4]    >    at com.carrotsearch.randomizedtesting.RandomizedRunner$4.evaluate(RandomizedRunner.java:682)
> [junit4:junit4]    >    at com.carrotsearch.randomizedtesting.RandomizedRunner$5.evaluate(RandomizedRunner.java:693)
> [junit4:junit4]    >    at com.carrotsearch.randomizedtesting.rules.StatementAdapter.evaluate(StatementAdapter.java:36)
> [junit4:junit4]    >    at com.carrotsearch.randomizedtesting.rules.SystemPropertiesRestoreRule$1.evaluate(SystemPropertiesRestoreRule.java:53)
> [junit4:junit4]    >    at org.apache.lucene.util.AbstractBeforeAfterRule$1.evaluate(AbstractBeforeAfterRule.java:46)
> [junit4:junit4]    >    at org.apache.lucene.util.TestRuleStoreClassName$1.evaluate(TestRuleStoreClassName.java:42)
> [junit4:junit4]    >    at com.carrotsearch.randomizedtesting.rules.SystemPropertiesInvariantRule$1.evaluate(SystemPropertiesInvariantRule.java:55)
> [junit4:junit4]    >    at com.carrotsearch.randomizedtesting.rules.NoShadowingOrOverridesOnMethodsRule$1.evaluate(NoShadowingOrOverridesOnMethodsRule.java:39)
> [junit4:junit4]    >    at com.carrotsearch.randomizedtesting.rules.NoShadowingOrOverridesOnMethodsRule$1.evaluate(NoShadowingOrOverridesOnMethodsRule.java:39)
> [junit4:junit4]    >    at com.carrotsearch.randomizedtesting.rules.StatementAdapter.evaluate(StatementAdapter.java:36)
> [junit4:junit4]    >    at org.apache.lucene.util.TestRuleAssertionsRequired$1.evaluate(TestRuleAssertionsRequired.java:43)
> [junit4:junit4]    >    at org.apache.lucene.util.TestRuleMarkFailure$1.evaluate(TestRuleMarkFailure.java:48)
> [junit4:junit4]    >    at org.apache.lucene.util.TestRuleIgnoreAfterMaxFailures$1.evaluate(TestRuleIgnoreAfterMaxFailures.java:70)
> [junit4:junit4]    >    at org.apache.lucene.util.TestRuleIgnoreTestSuites$1.evaluate(TestRuleIgnoreTestSuites.java:55)
> [junit4:junit4]    >    at com.carrotsearch.randomizedtesting.rules.StatementAdapter.evaluate(StatementAdapter.java:36)
> [junit4:junit4]    >    at com.carrotsearch.randomizedtesting.ThreadLeakControl$StatementRunner.run(ThreadLeakControl.java:358)
> [junit4:junit4]    >    at java.lang.Thread.run(Thread.java:662)
> [junit4:junit4]   2> 1883 T2247 oas.SolrTestCaseJ4.setUp ###Starting testBackCompatXml
> [junit4:junit4]   2> 1911 T2247 oas.SolrTestCaseJ4.tearDown ###Ending testBackCompatXml
> [junit4:junit4]   2> NOTE: reproduce with: ant test  -Dtestcase=TestSolrDiscoveryProperties -Dtests.method=testBackCompatXml -Dtests.seed=58657AD342FF2DCF -Dtests.slow=true -Dtests.locale=en_AU -Dtests.timezone=America/Vancouver -Dtests.file.encoding=US-ASCII
> [junit4:junit4] ERROR   0.04s | TestSolrDiscoveryProperties.testBackCompatXml <<<
> [junit4:junit4]    > Throwable #1: java.io.IOException: Unable to delete file: .\org.apache.solr.core.TestSolrProperties\solrHome\solr.properties
> [junit4:junit4]    >    at org.apache.commons.io.FileUtils.forceDelete(FileUtils.java:1919)
> [junit4:junit4]    >    at org.apache.commons.io.FileUtils.cleanDirectory(FileUtils.java:1399)
> [junit4:junit4]    >    at org.apache.commons.io.FileUtils.deleteDirectory(FileUtils.java:1331)
> [junit4:junit4]    >    at org.apache.solr.core.TestSolrDiscoveryProperties.setMeUp(TestSolrDiscoveryProperties.java:46)
> [junit4:junit4]    >    at org.apache.solr.core.TestSolrDiscoveryProperties.testBackCompatXml(TestSolrDiscoveryProperties.java:348)
> [junit4:junit4]    >    at sun.reflect.NativeMethodAccessorImpl.invoke0(Native Method)
> [junit4:junit4]    >    at sun.reflect.NativeMethodAccessorImpl.invoke(NativeMethodAccessorImpl.java:39)
> [junit4:junit4]    >    at sun.reflect.DelegatingMethodAccessorImpl.invoke(DelegatingMethodAccessorImpl.java:25)
> [junit4:junit4]    >    at java.lang.reflect.Method.invoke(Method.java:597)
> [junit4:junit4]    >    at com.carrotsearch.randomizedtesting.RandomizedRunner.invoke(RandomizedRunner.java:1559)
> [junit4:junit4]    >    at com.carrotsearch.randomizedtesting.RandomizedRunner.access$600(RandomizedRunner.java:79)
> [junit4:junit4]    >    at com.carrotsearch.randomizedtesting.RandomizedRunner$6.evaluate(RandomizedRunner.java:737)
> [junit4:junit4]    >    at com.carrotsearch.randomizedtesting.RandomizedRunner$7.evaluate(RandomizedRunner.java:773)
> [junit4:junit4]    >    at com.carrotsearch.randomizedtesting.RandomizedRunner$8.evaluate(RandomizedRunner.java:787)
> [junit4:junit4]    >    at com.carrotsearch.randomizedtesting.rules.SystemPropertiesRestoreRule$1.evaluate(SystemPropertiesRestoreRule.java:53)
> [junit4:junit4]    >    at org.apache.lucene.util.TestRuleSetupTeardownChained$1.evaluate(TestRuleSetupTeardownChained.java:50)
> [junit4:junit4]    >    at org.apache.lucene.util.TestRuleFieldCacheSanity$1.evaluate(TestRuleFieldCacheSanity.java:51)
> [junit4:junit4]    >    at org.apache.lucene.util.AbstractBeforeAfterRule$1.evaluate(AbstractBeforeAfterRule.java:46)
> [junit4:junit4]    >    at com.carrotsearch.randomizedtesting.rules.SystemPropertiesInvariantRule$1.evaluate(SystemPropertiesInvariantRule.java:55)
> [junit4:junit4]    >    at org.apache.lucene.util.TestRuleThreadAndTestName$1.evaluate(TestRuleThreadAndTestName.java:49)
> [junit4:junit4]    >    at org.apache.lucene.util.TestRuleIgnoreAfterMaxFailures$1.evaluate(TestRuleIgnoreAfterMaxFailures.java:70)
> [junit4:junit4]    >    at org.apache.lucene.util.TestRuleMarkFailure$1.evaluate(TestRuleMarkFailure.java:48)
> [junit4:junit4]    >    at com.carrotsearch.randomizedtesting.rules.StatementAdapter.evaluate(StatementAdapter.java:36)
> [junit4:junit4]    >    at com.carrotsearch.randomizedtesting.ThreadLeakControl$StatementRunner.run(ThreadLeakControl.java:358)
> [junit4:junit4]    >    at com.carrotsearch.randomizedtesting.ThreadLeakControl.forkTimeoutingTask(ThreadLeakControl.java:782)
> [junit4:junit4]    >    at com.carrotsearch.randomizedtesting.ThreadLeakControl$3.evaluate(ThreadLeakControl.java:442)
> [junit4:junit4]    >    at com.carrotsearch.randomizedtesting.RandomizedRunner.runSingleTest(RandomizedRunner.java:746)
> [junit4:junit4]    >    at com.carrotsearch.randomizedtesting.RandomizedRunner$3.evaluate(RandomizedRunner.java:648)
> [junit4:junit4]    >    at com.carrotsearch.randomizedtesting.RandomizedRunner$4.evaluate(RandomizedRunner.java:682)
> [junit4:junit4]    >    at com.carrotsearch.randomizedtesting.RandomizedRunner$5.evaluate(RandomizedRunner.java:693)
> [junit4:junit4]    >    at com.carrotsearch.randomizedtesting.rules.StatementAdapter.evaluate(StatementAdapter.java:36)
> [junit4:junit4]    >    at com.carrotsearch.randomizedtesting.rules.SystemPropertiesRestoreRule$1.evaluate(SystemPropertiesRestoreRule.java:53)
> [junit4:junit4]    >    at org.apache.lucene.util.AbstractBeforeAfterRule$1.evaluate(AbstractBeforeAfterRule.java:46)
> [junit4:junit4]    >    at org.apache.lucene.util.TestRuleStoreClassName$1.evaluate(TestRuleStoreClassName.java:42)
> [junit4:junit4]    >    at com.carrotsearch.randomizedtesting.rules.SystemPropertiesInvariantRule$1.evaluate(SystemPropertiesInvariantRule.java:55)
> [junit4:junit4]    >    at com.carrotsearch.randomizedtesting.rules.NoShadowingOrOverridesOnMethodsRule$1.evaluate(NoShadowingOrOverridesOnMethodsRule.java:39)
> [junit4:junit4]    >    at com.carrotsearch.randomizedtesting.rules.NoShadowingOrOverridesOnMethodsRule$1.evaluate(NoShadowingOrOverridesOnMethodsRule.java:39)
> [junit4:junit4]    >    at com.carrotsearch.randomizedtesting.rules.StatementAdapter.evaluate(StatementAdapter.java:36)
> [junit4:junit4]    >    at org.apache.lucene.util.TestRuleAssertionsRequired$1.evaluate(TestRuleAssertionsRequired.java:43)
> [junit4:junit4]    >    at org.apache.lucene.util.TestRuleMarkFailure$1.evaluate(TestRuleMarkFailure.java:48)
> [junit4:junit4]    >    at org.apache.lucene.util.TestRuleIgnoreAfterMaxFailures$1.evaluate(TestRuleIgnoreAfterMaxFailures.java:70)
> [junit4:junit4]    >    at org.apache.lucene.util.TestRuleIgnoreTestSuites$1.evaluate(TestRuleIgnoreTestSuites.java:55)
> [junit4:junit4]    >    at com.carrotsearch.randomizedtesting.rules.StatementAdapter.evaluate(StatementAdapter.java:36)
> [junit4:junit4]    >    at com.carrotsearch.randomizedtesting.ThreadLeakControl$StatementRunner.run(ThreadLeakControl.java:358)
> [junit4:junit4]    >    at java.lang.Thread.run(Thread.java:662)
> [junit4:junit4]    > Throwable #2: java.io.IOException: Unable to delete file: .\org.apache.solr.core.TestSolrProperties\solrHome\solr.properties
> [junit4:junit4]    >    at org.apache.commons.io.FileUtils.forceDelete(FileUtils.java:1919)
> [junit4:junit4]    >    at org.apache.commons.io.FileUtils.cleanDirectory(FileUtils.java:1399)
> [junit4:junit4]    >    at org.apache.commons.io.FileUtils.deleteDirectory(FileUtils.java:1331)
> [junit4:junit4]    >    at org.apache.solr.core.TestSolrDiscoveryProperties.after(TestSolrDiscoveryProperties.java:119)
> [junit4:junit4]    >    at sun.reflect.NativeMethodAccessorImpl.invoke0(Native Method)
> [junit4:junit4]    >    at sun.reflect.NativeMethodAccessorImpl.invoke(NativeMethodAccessorImpl.java:39)
> [junit4:junit4]    >    at sun.reflect.DelegatingMethodAccessorImpl.invoke(DelegatingMethodAccessorImpl.java:25)
> [junit4:junit4]    >    at java.lang.reflect.Method.invoke(Method.java:597)
> [junit4:junit4]    >    at com.carrotsearch.randomizedtesting.RandomizedRunner.invoke(RandomizedRunner.java:1559)
> [junit4:junit4]    >    at com.carrotsearch.randomizedtesting.RandomizedRunner.access$600(RandomizedRunner.java:79)
> [junit4:junit4]    >    at com.carrotsearch.randomizedtesting.RandomizedRunner$8.evaluate(RandomizedRunner.java:795)
> [junit4:junit4]    >    at com.carrotsearch.randomizedtesting.rules.SystemPropertiesRestoreRule$1.evaluate(SystemPropertiesRestoreRule.java:53)
> [junit4:junit4]    >    at org.apache.lucene.util.TestRuleSetupTeardownChained$1.evaluate(TestRuleSetupTeardownChained.java:50)
> [junit4:junit4]    >    at org.apache.lucene.util.TestRuleFieldCacheSanity$1.evaluate(TestRuleFieldCacheSanity.java:51)
> [junit4:junit4]    >    at org.apache.lucene.util.AbstractBeforeAfterRule$1.evaluate(AbstractBeforeAfterRule.java:46)
> [junit4:junit4]    >    at com.carrotsearch.randomizedtesting.rules.SystemPropertiesInvariantRule$1.evaluate(SystemPropertiesInvariantRule.java:55)
> [junit4:junit4]    >    at org.apache.lucene.util.TestRuleThreadAndTestName$1.evaluate(TestRuleThreadAndTestName.java:49)
> [junit4:junit4]    >    at org.apache.lucene.util.TestRuleIgnoreAfterMaxFailures$1.evaluate(TestRuleIgnoreAfterMaxFailures.java:70)
> [junit4:junit4]    >    at org.apache.lucene.util.TestRuleMarkFailure$1.evaluate(TestRuleMarkFailure.java:48)
> [junit4:junit4]    >    at com.carrotsearch.randomizedtesting.rules.StatementAdapter.evaluate(StatementAdapter.java:36)
> [junit4:junit4]    >    at com.carrotsearch.randomizedtesting.ThreadLeakControl$StatementRunner.run(ThreadLeakControl.java:358)
> [junit4:junit4]    >    at com.carrotsearch.randomizedtesting.ThreadLeakControl.forkTimeoutingTask(ThreadLeakControl.java:782)
> [junit4:junit4]    >    at com.carrotsearch.randomizedtesting.ThreadLeakControl$3.evaluate(ThreadLeakControl.java:442)
> [junit4:junit4]    >    at com.carrotsearch.randomizedtesting.RandomizedRunner.runSingleTest(RandomizedRunner.java:746)
> [junit4:junit4]    >    at com.carrotsearch.randomizedtesting.RandomizedRunner$3.evaluate(RandomizedRunner.java:648)
> [junit4:junit4]    >    at com.carrotsearch.randomizedtesting.RandomizedRunner$4.evaluate(RandomizedRunner.java:682)
> [junit4:junit4]    >    at com.carrotsearch.randomizedtesting.RandomizedRunner$5.evaluate(RandomizedRunner.java:693)
> [junit4:junit4]    >    at com.carrotsearch.randomizedtesting.rules.StatementAdapter.evaluate(StatementAdapter.java:36)
> [junit4:junit4]    >    at com.carrotsearch.randomizedtesting.rules.SystemPropertiesRestoreRule$1.evaluate(SystemPropertiesRestoreRule.java:53)
> [junit4:junit4]    >    at org.apache.lucene.util.AbstractBeforeAfterRule$1.evaluate(AbstractBeforeAfterRule.java:46)
> [junit4:junit4]    >    at org.apache.lucene.util.TestRuleStoreClassName$1.evaluate(TestRuleStoreClassName.java:42)
> [junit4:junit4]    >    at com.carrotsearch.randomizedtesting.rules.SystemPropertiesInvariantRule$1.evaluate(SystemPropertiesInvariantRule.java:55)
> [junit4:junit4]    >    at com.carrotsearch.randomizedtesting.rules.NoShadowingOrOverridesOnMethodsRule$1.evaluate(NoShadowingOrOverridesOnMethodsRule.java:39)
> [junit4:junit4]    >    at com.carrotsearch.randomizedtesting.rules.NoShadowingOrOverridesOnMethodsRule$1.evaluate(NoShadowingOrOverridesOnMethodsRule.java:39)
> [junit4:junit4]    >    at com.carrotsearch.randomizedtesting.rules.StatementAdapter.evaluate(StatementAdapter.java:36)
> [junit4:junit4]    >    at org.apache.lucene.util.TestRuleAssertionsRequired$1.evaluate(TestRuleAssertionsRequired.java:43)
> [junit4:junit4]    >    at org.apache.lucene.util.TestRuleMarkFailure$1.evaluate(TestRuleMarkFailure.java:48)
> [junit4:junit4]    >    at org.apache.lucene.util.TestRuleIgnoreAfterMaxFailures$1.evaluate(TestRuleIgnoreAfterMaxFailures.java:70)
> [junit4:junit4]    >    at org.apache.lucene.util.TestRuleIgnoreTestSuites$1.evaluate(TestRuleIgnoreTestSuites.java:55)
> [junit4:junit4]    >    at com.carrotsearch.randomizedtesting.rules.StatementAdapter.evaluate(StatementAdapter.java:36)
> [junit4:junit4]    >    at com.carrotsearch.randomizedtesting.ThreadLeakControl$StatementRunner.run(ThreadLeakControl.java:358)
> [junit4:junit4]    >    at java.lang.Thread.run(Thread.java:662)
> [junit4:junit4]   2> 1918 T2247 oas.SolrTestCaseJ4.deleteCore ###deleteCore
> [junit4:junit4]   2> NOTE: test params are: codec=Lucene42: {}, docValues:{}, sim=DefaultSimilarity, locale=en_AU, timezone=America/Vancouver
> [junit4:junit4]   2> NOTE: Windows 7 6.1 x86/Sun Microsystems Inc. 1.6.0_41 (32-bit)/cpus=2,threads=1,free=81611736,total=268500992
> [junit4:junit4]   2> NOTE: All tests run in this JVM: [PrimUtilsTest, TestRemoteStreaming, TestRangeQuery, DocumentAnalysisRequestHandlerTest, FieldAnalysisRequestHandlerTest, ClusterStateUpdateTest, TestZkChroot, PathHierarchyTokenizerFactoryTest, LegacyHTMLStripCharFilterTest, UUIDFieldTest, BasicZkTest, ClusterStateTest, HighlighterConfigTest, TestOmitPositions, TermsComponentTest, TermVectorComponentDistributedTest, TestLuceneMatchVersion, SimplePostToolTest, SpellCheckComponentTest, SystemInfoHandlerTest, BasicDistributedZkTest, TestPseudoReturnFields, TestDocSet, DirectSolrSpellCheckerTest, TestLMJelinekMercerSimilarityFactory, TestQueryTypes, URLClassifyProcessorTest, RegexBoostProcessorTest, ConvertedLegacyTest, TestMultiCoreConfBootstrap, LoggingHandlerTest, SuggesterWFSTTest, SolrRequestParserTest, TestExtendedDismaxParser, TestCodecSupport, TestIndexSearcher, TestBinaryField, TermVectorComponentTest, TestSolrCoreProperties, SliceStateUpdateTest, SolrCoreCheckLockOnStartupTest, TestConfig, PolyFieldTest, SoftAutoCommitTest, HighlighterTest, TestSolrDeletionPolicy2, AnalysisAfterCoreReloadTest, AutoCommitTest, SortByFunctionTest, TestFaceting, OpenCloseCoreStressTest, ZkControllerTest, TestStressRecovery, TestRandomDVFaceting, TestRealTimeGet, CollectionsAPIDistributedZkTest, SynonymTokenizerTest, OverseerTest, TestSolrJ, BasicFunctionalityTest, SchemaVersionSpecificBehaviorTest, DefaultValueUpdateProcessorTest, TestMergePolicyConfig, FastVectorHighlighterTest, ZkNodePropsTest, TestCSVLoader, TestUpdate, TestAnalyzedSuggestions, TestFoldingMultitermQuery, TestSolrDiscoveryProperties]
> [junit4:junit4] Completed in 1.94s, 4 tests, 3 errors <<< FAILURES!
> 
> [...truncated 587 lines...]
> BUILD FAILED
> C:\Users\JenkinsSlave\workspace\Lucene-Solr-trunk-Windows\build.xml:381: The following error occurred while executing this line:
> C:\Users\JenkinsSlave\workspace\Lucene-Solr-trunk-Windows\build.xml:361: The following error occurred while executing this line:
> C:\Users\JenkinsSlave\workspace\Lucene-Solr-trunk-Windows\build.xml:39: The following error occurred while executing this line:
> C:\Users\JenkinsSlave\workspace\Lucene-Solr-trunk-Windows\solr\build.xml:183: The following error occurred while executing this line:
> C:\Users\JenkinsSlave\workspace\Lucene-Solr-trunk-Windows\solr\common-build.xml:449: The following error occurred while executing this line:
> C:\Users\JenkinsSlave\workspace\Lucene-Solr-trunk-Windows\lucene\common-build.xml:1207: The following error occurred while executing this line:
> C:\Users\JenkinsSlave\workspace\Lucene-Solr-trunk-Windows\lucene\common-build.xml:870: There were test failures: 261 suites, 1101 tests, 3 errors, 18 ignored (12 assumptions)
> 
> Total time: 60 minutes 28 seconds
> Build step 'Invoke Ant' marked build as failure
> Archiving artifacts
> Recording test results
> Description set: Java: 32bit/jdk1.6.0_41 -client -XX:+UseParallelGC
> Email was triggered for: Failure
> Sending email for trigger: Failure
> 
> 
> 
> 
> ---------------------------------------------------------------------
> To unsubscribe, e-mail: dev-unsubscribe@lucene.apache.org
> For additional commands, e-mail: dev-help@lucene.apache.org
> 


---------------------------------------------------------------------
To unsubscribe, e-mail: dev-unsubscribe@lucene.apache.org
For additional commands, e-mail: dev-help@lucene.apache.org


Mime
View raw message