lucene-dev mailing list archives

Site index · List index
Message view « Date » · « Thread »
Top « Date » · « Thread »
From Apache Jenkins Server <jenk...@builds.apache.org>
Subject [JENKINS] Lucene-Solr-NightlyTests-trunk - Build # 219 - Still Failing
Date Wed, 27 Mar 2013 04:07:23 GMT
Build: https://builds.apache.org/job/Lucene-Solr-NightlyTests-trunk/219/

3 tests failed.
FAILED:  org.apache.solr.core.OpenCloseCoreStressTest.test10MinutesNew

Error Message:
Core 00016_core bad! expected:<508> but was:<506>

Stack Trace:
java.lang.AssertionError: Core 00016_core bad! expected:<508> but was:<506>
	at __randomizedtesting.SeedInfo.seed([C2B58CD1CD26B912:F89034F0BFE853A6]:0)
	at org.junit.Assert.fail(Assert.java:93)
	at org.junit.Assert.failNotEquals(Assert.java:647)
	at org.junit.Assert.assertEquals(Assert.java:128)
	at org.junit.Assert.assertEquals(Assert.java:472)
	at org.apache.solr.core.OpenCloseCoreStressTest.checkResults(OpenCloseCoreStressTest.java:303)
	at org.apache.solr.core.OpenCloseCoreStressTest.doStress(OpenCloseCoreStressTest.java:201)
	at org.apache.solr.core.OpenCloseCoreStressTest.test10MinutesNew(OpenCloseCoreStressTest.java:133)
	at sun.reflect.NativeMethodAccessorImpl.invoke0(Native Method)
	at sun.reflect.NativeMethodAccessorImpl.invoke(NativeMethodAccessorImpl.java:57)
	at sun.reflect.DelegatingMethodAccessorImpl.invoke(DelegatingMethodAccessorImpl.java:43)
	at java.lang.reflect.Method.invoke(Method.java:601)
	at com.carrotsearch.randomizedtesting.RandomizedRunner.invoke(RandomizedRunner.java:1559)
	at com.carrotsearch.randomizedtesting.RandomizedRunner.access$600(RandomizedRunner.java:79)
	at com.carrotsearch.randomizedtesting.RandomizedRunner$6.evaluate(RandomizedRunner.java:737)
	at com.carrotsearch.randomizedtesting.RandomizedRunner$7.evaluate(RandomizedRunner.java:773)
	at com.carrotsearch.randomizedtesting.RandomizedRunner$8.evaluate(RandomizedRunner.java:787)
	at com.carrotsearch.randomizedtesting.rules.SystemPropertiesRestoreRule$1.evaluate(SystemPropertiesRestoreRule.java:53)
	at org.apache.lucene.util.TestRuleSetupTeardownChained$1.evaluate(TestRuleSetupTeardownChained.java:50)
	at org.apache.lucene.util.TestRuleFieldCacheSanity$1.evaluate(TestRuleFieldCacheSanity.java:51)
	at org.apache.lucene.util.AbstractBeforeAfterRule$1.evaluate(AbstractBeforeAfterRule.java:46)
	at com.carrotsearch.randomizedtesting.rules.SystemPropertiesInvariantRule$1.evaluate(SystemPropertiesInvariantRule.java:55)
	at org.apache.lucene.util.TestRuleThreadAndTestName$1.evaluate(TestRuleThreadAndTestName.java:49)
	at org.apache.lucene.util.TestRuleIgnoreAfterMaxFailures$1.evaluate(TestRuleIgnoreAfterMaxFailures.java:70)
	at org.apache.lucene.util.TestRuleMarkFailure$1.evaluate(TestRuleMarkFailure.java:48)
	at com.carrotsearch.randomizedtesting.rules.StatementAdapter.evaluate(StatementAdapter.java:36)
	at com.carrotsearch.randomizedtesting.ThreadLeakControl$StatementRunner.run(ThreadLeakControl.java:358)
	at com.carrotsearch.randomizedtesting.ThreadLeakControl.forkTimeoutingTask(ThreadLeakControl.java:782)
	at com.carrotsearch.randomizedtesting.ThreadLeakControl$3.evaluate(ThreadLeakControl.java:442)
	at com.carrotsearch.randomizedtesting.RandomizedRunner.runSingleTest(RandomizedRunner.java:746)
	at com.carrotsearch.randomizedtesting.RandomizedRunner$3.evaluate(RandomizedRunner.java:648)
	at com.carrotsearch.randomizedtesting.RandomizedRunner$4.evaluate(RandomizedRunner.java:682)
	at com.carrotsearch.randomizedtesting.RandomizedRunner$5.evaluate(RandomizedRunner.java:693)
	at com.carrotsearch.randomizedtesting.rules.StatementAdapter.evaluate(StatementAdapter.java:36)
	at com.carrotsearch.randomizedtesting.rules.SystemPropertiesRestoreRule$1.evaluate(SystemPropertiesRestoreRule.java:53)
	at org.apache.lucene.util.AbstractBeforeAfterRule$1.evaluate(AbstractBeforeAfterRule.java:46)
	at org.apache.lucene.util.TestRuleStoreClassName$1.evaluate(TestRuleStoreClassName.java:42)
	at com.carrotsearch.randomizedtesting.rules.SystemPropertiesInvariantRule$1.evaluate(SystemPropertiesInvariantRule.java:55)
	at com.carrotsearch.randomizedtesting.rules.NoShadowingOrOverridesOnMethodsRule$1.evaluate(NoShadowingOrOverridesOnMethodsRule.java:39)
	at com.carrotsearch.randomizedtesting.rules.NoShadowingOrOverridesOnMethodsRule$1.evaluate(NoShadowingOrOverridesOnMethodsRule.java:39)
	at com.carrotsearch.randomizedtesting.rules.StatementAdapter.evaluate(StatementAdapter.java:36)
	at org.apache.lucene.util.TestRuleAssertionsRequired$1.evaluate(TestRuleAssertionsRequired.java:43)
	at org.apache.lucene.util.TestRuleMarkFailure$1.evaluate(TestRuleMarkFailure.java:48)
	at org.apache.lucene.util.TestRuleIgnoreAfterMaxFailures$1.evaluate(TestRuleIgnoreAfterMaxFailures.java:70)
	at org.apache.lucene.util.TestRuleIgnoreTestSuites$1.evaluate(TestRuleIgnoreTestSuites.java:55)
	at com.carrotsearch.randomizedtesting.rules.StatementAdapter.evaluate(StatementAdapter.java:36)
	at com.carrotsearch.randomizedtesting.ThreadLeakControl$StatementRunner.run(ThreadLeakControl.java:358)
	at java.lang.Thread.run(Thread.java:722)


FAILED:  org.apache.solr.handler.TestReplicationHandler.doTestStressReplication

Error Message:
expected:<null> but was:<[0][id][0]:4524!=0>

Stack Trace:
java.lang.AssertionError: expected:<null> but was:<[0][id][0]:4524!=0>
	at __randomizedtesting.SeedInfo.seed([C2B58CD1CD26B912:191E8C17C80ED0A1]:0)
	at org.junit.Assert.fail(Assert.java:93)
	at org.junit.Assert.failNotEquals(Assert.java:647)
	at org.junit.Assert.assertEquals(Assert.java:128)
	at org.junit.Assert.assertEquals(Assert.java:147)
	at org.apache.solr.handler.TestReplicationHandler.doTestStressReplication(TestReplicationHandler.java:733)
	at sun.reflect.NativeMethodAccessorImpl.invoke0(Native Method)
	at sun.reflect.NativeMethodAccessorImpl.invoke(NativeMethodAccessorImpl.java:57)
	at sun.reflect.DelegatingMethodAccessorImpl.invoke(DelegatingMethodAccessorImpl.java:43)
	at java.lang.reflect.Method.invoke(Method.java:601)
	at com.carrotsearch.randomizedtesting.RandomizedRunner.invoke(RandomizedRunner.java:1559)
	at com.carrotsearch.randomizedtesting.RandomizedRunner.access$600(RandomizedRunner.java:79)
	at com.carrotsearch.randomizedtesting.RandomizedRunner$6.evaluate(RandomizedRunner.java:737)
	at com.carrotsearch.randomizedtesting.RandomizedRunner$7.evaluate(RandomizedRunner.java:773)
	at com.carrotsearch.randomizedtesting.RandomizedRunner$8.evaluate(RandomizedRunner.java:787)
	at com.carrotsearch.randomizedtesting.rules.SystemPropertiesRestoreRule$1.evaluate(SystemPropertiesRestoreRule.java:53)
	at org.apache.lucene.util.TestRuleSetupTeardownChained$1.evaluate(TestRuleSetupTeardownChained.java:50)
	at org.apache.lucene.util.TestRuleFieldCacheSanity$1.evaluate(TestRuleFieldCacheSanity.java:51)
	at org.apache.lucene.util.AbstractBeforeAfterRule$1.evaluate(AbstractBeforeAfterRule.java:46)
	at com.carrotsearch.randomizedtesting.rules.SystemPropertiesInvariantRule$1.evaluate(SystemPropertiesInvariantRule.java:55)
	at org.apache.lucene.util.TestRuleThreadAndTestName$1.evaluate(TestRuleThreadAndTestName.java:49)
	at org.apache.lucene.util.TestRuleIgnoreAfterMaxFailures$1.evaluate(TestRuleIgnoreAfterMaxFailures.java:70)
	at org.apache.lucene.util.TestRuleMarkFailure$1.evaluate(TestRuleMarkFailure.java:48)
	at com.carrotsearch.randomizedtesting.rules.StatementAdapter.evaluate(StatementAdapter.java:36)
	at com.carrotsearch.randomizedtesting.ThreadLeakControl$StatementRunner.run(ThreadLeakControl.java:358)
	at com.carrotsearch.randomizedtesting.ThreadLeakControl.forkTimeoutingTask(ThreadLeakControl.java:782)
	at com.carrotsearch.randomizedtesting.ThreadLeakControl$3.evaluate(ThreadLeakControl.java:442)
	at com.carrotsearch.randomizedtesting.RandomizedRunner.runSingleTest(RandomizedRunner.java:746)
	at com.carrotsearch.randomizedtesting.RandomizedRunner$3.evaluate(RandomizedRunner.java:648)
	at com.carrotsearch.randomizedtesting.RandomizedRunner$4.evaluate(RandomizedRunner.java:682)
	at com.carrotsearch.randomizedtesting.RandomizedRunner$5.evaluate(RandomizedRunner.java:693)
	at com.carrotsearch.randomizedtesting.rules.StatementAdapter.evaluate(StatementAdapter.java:36)
	at com.carrotsearch.randomizedtesting.rules.SystemPropertiesRestoreRule$1.evaluate(SystemPropertiesRestoreRule.java:53)
	at org.apache.lucene.util.AbstractBeforeAfterRule$1.evaluate(AbstractBeforeAfterRule.java:46)
	at org.apache.lucene.util.TestRuleStoreClassName$1.evaluate(TestRuleStoreClassName.java:42)
	at com.carrotsearch.randomizedtesting.rules.SystemPropertiesInvariantRule$1.evaluate(SystemPropertiesInvariantRule.java:55)
	at com.carrotsearch.randomizedtesting.rules.NoShadowingOrOverridesOnMethodsRule$1.evaluate(NoShadowingOrOverridesOnMethodsRule.java:39)
	at com.carrotsearch.randomizedtesting.rules.NoShadowingOrOverridesOnMethodsRule$1.evaluate(NoShadowingOrOverridesOnMethodsRule.java:39)
	at com.carrotsearch.randomizedtesting.rules.StatementAdapter.evaluate(StatementAdapter.java:36)
	at org.apache.lucene.util.TestRuleAssertionsRequired$1.evaluate(TestRuleAssertionsRequired.java:43)
	at org.apache.lucene.util.TestRuleMarkFailure$1.evaluate(TestRuleMarkFailure.java:48)
	at org.apache.lucene.util.TestRuleIgnoreAfterMaxFailures$1.evaluate(TestRuleIgnoreAfterMaxFailures.java:70)
	at org.apache.lucene.util.TestRuleIgnoreTestSuites$1.evaluate(TestRuleIgnoreTestSuites.java:55)
	at com.carrotsearch.randomizedtesting.rules.StatementAdapter.evaluate(StatementAdapter.java:36)
	at com.carrotsearch.randomizedtesting.ThreadLeakControl$StatementRunner.run(ThreadLeakControl.java:358)
	at java.lang.Thread.run(Thread.java:722)


FAILED:  org.apache.solr.handler.TestReplicationHandler.doTestIndexAndConfigReplication

Error Message:
expected:<0> but was:<1364356522940>

Stack Trace:
java.lang.AssertionError: expected:<0> but was:<1364356522940>
	at __randomizedtesting.SeedInfo.seed([C2B58CD1CD26B912:D6FDD784EE21040C]:0)
	at org.junit.Assert.fail(Assert.java:93)
	at org.junit.Assert.failNotEquals(Assert.java:647)
	at org.junit.Assert.assertEquals(Assert.java:128)
	at org.junit.Assert.assertEquals(Assert.java:147)
	at org.apache.solr.handler.TestReplicationHandler.assertVersions(TestReplicationHandler.java:887)
	at org.apache.solr.handler.TestReplicationHandler.doTestIndexAndConfigReplication(TestReplicationHandler.java:467)
	at sun.reflect.NativeMethodAccessorImpl.invoke0(Native Method)
	at sun.reflect.NativeMethodAccessorImpl.invoke(NativeMethodAccessorImpl.java:57)
	at sun.reflect.DelegatingMethodAccessorImpl.invoke(DelegatingMethodAccessorImpl.java:43)
	at java.lang.reflect.Method.invoke(Method.java:601)
	at com.carrotsearch.randomizedtesting.RandomizedRunner.invoke(RandomizedRunner.java:1559)
	at com.carrotsearch.randomizedtesting.RandomizedRunner.access$600(RandomizedRunner.java:79)
	at com.carrotsearch.randomizedtesting.RandomizedRunner$6.evaluate(RandomizedRunner.java:737)
	at com.carrotsearch.randomizedtesting.RandomizedRunner$7.evaluate(RandomizedRunner.java:773)
	at com.carrotsearch.randomizedtesting.RandomizedRunner$8.evaluate(RandomizedRunner.java:787)
	at com.carrotsearch.randomizedtesting.rules.SystemPropertiesRestoreRule$1.evaluate(SystemPropertiesRestoreRule.java:53)
	at org.apache.lucene.util.TestRuleSetupTeardownChained$1.evaluate(TestRuleSetupTeardownChained.java:50)
	at org.apache.lucene.util.TestRuleFieldCacheSanity$1.evaluate(TestRuleFieldCacheSanity.java:51)
	at org.apache.lucene.util.AbstractBeforeAfterRule$1.evaluate(AbstractBeforeAfterRule.java:46)
	at com.carrotsearch.randomizedtesting.rules.SystemPropertiesInvariantRule$1.evaluate(SystemPropertiesInvariantRule.java:55)
	at org.apache.lucene.util.TestRuleThreadAndTestName$1.evaluate(TestRuleThreadAndTestName.java:49)
	at org.apache.lucene.util.TestRuleIgnoreAfterMaxFailures$1.evaluate(TestRuleIgnoreAfterMaxFailures.java:70)
	at org.apache.lucene.util.TestRuleMarkFailure$1.evaluate(TestRuleMarkFailure.java:48)
	at com.carrotsearch.randomizedtesting.rules.StatementAdapter.evaluate(StatementAdapter.java:36)
	at com.carrotsearch.randomizedtesting.ThreadLeakControl$StatementRunner.run(ThreadLeakControl.java:358)
	at com.carrotsearch.randomizedtesting.ThreadLeakControl.forkTimeoutingTask(ThreadLeakControl.java:782)
	at com.carrotsearch.randomizedtesting.ThreadLeakControl$3.evaluate(ThreadLeakControl.java:442)
	at com.carrotsearch.randomizedtesting.RandomizedRunner.runSingleTest(RandomizedRunner.java:746)
	at com.carrotsearch.randomizedtesting.RandomizedRunner$3.evaluate(RandomizedRunner.java:648)
	at com.carrotsearch.randomizedtesting.RandomizedRunner$4.evaluate(RandomizedRunner.java:682)
	at com.carrotsearch.randomizedtesting.RandomizedRunner$5.evaluate(RandomizedRunner.java:693)
	at com.carrotsearch.randomizedtesting.rules.StatementAdapter.evaluate(StatementAdapter.java:36)
	at com.carrotsearch.randomizedtesting.rules.SystemPropertiesRestoreRule$1.evaluate(SystemPropertiesRestoreRule.java:53)
	at org.apache.lucene.util.AbstractBeforeAfterRule$1.evaluate(AbstractBeforeAfterRule.java:46)
	at org.apache.lucene.util.TestRuleStoreClassName$1.evaluate(TestRuleStoreClassName.java:42)
	at com.carrotsearch.randomizedtesting.rules.SystemPropertiesInvariantRule$1.evaluate(SystemPropertiesInvariantRule.java:55)
	at com.carrotsearch.randomizedtesting.rules.NoShadowingOrOverridesOnMethodsRule$1.evaluate(NoShadowingOrOverridesOnMethodsRule.java:39)
	at com.carrotsearch.randomizedtesting.rules.NoShadowingOrOverridesOnMethodsRule$1.evaluate(NoShadowingOrOverridesOnMethodsRule.java:39)
	at com.carrotsearch.randomizedtesting.rules.StatementAdapter.evaluate(StatementAdapter.java:36)
	at org.apache.lucene.util.TestRuleAssertionsRequired$1.evaluate(TestRuleAssertionsRequired.java:43)
	at org.apache.lucene.util.TestRuleMarkFailure$1.evaluate(TestRuleMarkFailure.java:48)
	at org.apache.lucene.util.TestRuleIgnoreAfterMaxFailures$1.evaluate(TestRuleIgnoreAfterMaxFailures.java:70)
	at org.apache.lucene.util.TestRuleIgnoreTestSuites$1.evaluate(TestRuleIgnoreTestSuites.java:55)
	at com.carrotsearch.randomizedtesting.rules.StatementAdapter.evaluate(StatementAdapter.java:36)
	at com.carrotsearch.randomizedtesting.ThreadLeakControl$StatementRunner.run(ThreadLeakControl.java:358)
	at java.lang.Thread.run(Thread.java:722)




Build Log:
[...truncated 9293 lines...]
[junit4:junit4] Suite: org.apache.solr.core.OpenCloseCoreStressTest
[junit4:junit4]   2> 6 T2948 oas.SolrTestCaseJ4.setUp ###Starting test10MinutesOld
[junit4:junit4]   2> 76 T2948 oejs.Server.doStart jetty-8.1.8.v20121106
[junit4:junit4]   2> 80 T2948 oejs.AbstractConnector.doStart Started SocketConnector@127.0.0.1:46568
[junit4:junit4]   2> 81 T2948 oass.SolrDispatchFilter.init SolrDispatchFilter.init()
[junit4:junit4]   2> 81 T2948 oasc.SolrResourceLoader.locateSolrHome JNDI not configured for solr (NoInitialContextEx)
[junit4:junit4]   2> 82 T2948 oasc.SolrResourceLoader.locateSolrHome using system property solr.solr.home: /usr/home/hudson/hudson-slave/workspace/Lucene-Solr-NightlyTests-trunk/solr/build/solr-core/test/J0/./OpenCloseCoreStressTest_
[junit4:junit4]   2> 82 T2948 oasc.CoreContainer$Initializer.initialize looking for solr config file: /usr/home/hudson/hudson-slave/workspace/Lucene-Solr-NightlyTests-trunk/solr/build/solr-core/test/J0/./OpenCloseCoreStressTest_/solr.xml
[junit4:junit4]   2> 82 T2948 oasc.CoreContainer.<init> New CoreContainer 640927654
[junit4:junit4]   2> 83 T2948 oasc.CoreContainer.load Loading CoreContainer using Solr Home: '/usr/home/hudson/hudson-slave/workspace/Lucene-Solr-NightlyTests-trunk/solr/build/solr-core/test/J0/./OpenCloseCoreStressTest_/'
[junit4:junit4]   2> 83 T2948 oasc.SolrResourceLoader.<init> new SolrResourceLoader for directory: '/usr/home/hudson/hudson-slave/workspace/Lucene-Solr-NightlyTests-trunk/solr/build/solr-core/test/J0/./OpenCloseCoreStressTest_/'
[junit4:junit4]   2> 148 T2948 oashc.HttpShardHandlerFactory.getParameter Setting socketTimeout to: 120000
[junit4:junit4]   2> 149 T2948 oashc.HttpShardHandlerFactory.getParameter Setting urlScheme to: http://
[junit4:junit4]   2> 149 T2948 oashc.HttpShardHandlerFactory.getParameter Setting connTimeout to: 15000
[junit4:junit4]   2> 150 T2948 oashc.HttpShardHandlerFactory.getParameter Setting maxConnectionsPerHost to: 20
[junit4:junit4]   2> 150 T2948 oashc.HttpShardHandlerFactory.getParameter Setting corePoolSize to: 0
[junit4:junit4]   2> 150 T2948 oashc.HttpShardHandlerFactory.getParameter Setting maximumPoolSize to: 2147483647
[junit4:junit4]   2> 151 T2948 oashc.HttpShardHandlerFactory.getParameter Setting maxThreadIdleTime to: 5
[junit4:junit4]   2> 151 T2948 oashc.HttpShardHandlerFactory.getParameter Setting sizeOfQueue to: -1
[junit4:junit4]   2> 152 T2948 oashc.HttpShardHandlerFactory.getParameter Setting fairnessPolicy to: false
[junit4:junit4]   2> 152 T2948 oascsi.HttpClientUtil.createClient Creating new http client, config:maxConnectionsPerHost=20&maxConnections=10000&socketTimeout=120000&connTimeout=15000&retry=false
[junit4:junit4]   2> 174 T2948 oasc.CoreContainer.load Registering Log Listener
[junit4:junit4]   2> 199 T2958 oasc.CoreContainer.create Creating SolrCore '00000_core' using instanceDir: /usr/home/hudson/hudson-slave/workspace/Lucene-Solr-NightlyTests-trunk/solr/build/solr-core/test/J0/./OpenCloseCoreStressTest_/00000_core
[junit4:junit4]   2> 200 T2958 oasc.SolrResourceLoader.<init> new SolrResourceLoader for directory: '/usr/home/hudson/hudson-slave/workspace/Lucene-Solr-NightlyTests-trunk/solr/build/solr-core/test/J0/./OpenCloseCoreStressTest_/00000_core/'
[junit4:junit4]   2> 248 T2958 oasc.SolrConfig.<init> Using Lucene MatchVersion: LUCENE_41
[junit4:junit4]   2> 310 T2958 oasc.SolrConfig.<init> Loaded SolrConfig: solrconfig-minimal.xml
[junit4:junit4]   2> 311 T2958 oass.IndexSchema.readSchema Reading Solr Schema
[junit4:junit4]   2> 315 T2958 oass.IndexSchema.readSchema Schema name=tiny
[junit4:junit4]   2> 343 T2958 oass.IndexSchema.readSchema unique key field: id
[junit4:junit4]   2> 345 T2958 oasc.SolrCore.initDirectoryFactory org.apache.solr.core.MockFSDirectoryFactory
[junit4:junit4]   2> 345 T2958 oasc.SolrCore.<init> [00000_core] Opening new SolrCore at /usr/home/hudson/hudson-slave/workspace/Lucene-Solr-NightlyTests-trunk/solr/build/solr-core/test/J0/./OpenCloseCoreStressTest_/00000_core/, dataDir=/usr/home/hudson/hudson-slave/workspace/Lucene-Solr-NightlyTests-trunk/solr/build/solr-core/test/J0/OpenCloseCoreStressTest_/00000_core/data/
[junit4:junit4]   2> 345 T2958 oasc.JmxMonitoredMap.<init> JMX monitoring is enabled. Adding Solr mbeans to JMX Server: com.sun.jmx.mbeanserver.JmxMBeanServer@1320e2db
[junit4:junit4]   2> 346 T2958 oasc.SolrCore.initDirectoryFactory org.apache.solr.core.MockFSDirectoryFactory
[junit4:junit4]   2> 347 T2958 oasc.CachingDirectoryFactory.get return new directory for /usr/home/hudson/hudson-slave/workspace/Lucene-Solr-NightlyTests-trunk/solr/build/solr-core/test/J0/OpenCloseCoreStressTest_/00000_core/data
[junit4:junit4]   2> 348 T2958 oasc.SolrCore.getNewIndexDir New index directory detected: old=null new=/usr/home/hudson/hudson-slave/workspace/Lucene-Solr-NightlyTests-trunk/solr/build/solr-core/test/J0/OpenCloseCoreStressTest_/00000_core/data/index/
[junit4:junit4]   2> 348 T2958 oasc.SolrCore.initIndex WARNING [00000_core] Solr index directory '/usr/home/hudson/hudson-slave/workspace/Lucene-Solr-NightlyTests-trunk/solr/build/solr-core/test/J0/OpenCloseCoreStressTest_/00000_core/data/index' doesn't exist. Creating new index...
[junit4:junit4]   2> 349 T2958 oasc.CachingDirectoryFactory.get return new directory for /usr/home/hudson/hudson-slave/workspace/Lucene-Solr-NightlyTests-trunk/solr/build/solr-core/test/J0/OpenCloseCoreStressTest_/00000_core/data/index
[junit4:junit4]   2> 398 T2958 oasc.SolrDeletionPolicy.onCommit SolrDeletionPolicy.onCommit: commits:num=1
[junit4:junit4]   2> 		commit{dir=MockDirWrapper(RateLimitedDirectoryWrapper(org.apache.lucene.store.SimpleFSDirectory@/usr/home/hudson/hudson-slave/workspace/Lucene-Solr-NightlyTests-trunk/solr/build/solr-core/test/J0/OpenCloseCoreStressTest_/00000_core/data/index lockFactory=org.apache.lucene.store.NativeFSLockFactory@2b0f4069)),segFN=segments_1,generation=1,filenames=[segments_1]
[junit4:junit4]   2> 399 T2958 oasc.SolrDeletionPolicy.updateCommits newest commit = 1[segments_1]
[junit4:junit4]   2> 400 T2958 oasc.SolrCore.initWriters created json: solr.JSONResponseWriter
[junit4:junit4]   2> 402 T2958 oasc.RequestHandlers.initHandlersFromConfig created /admin/: solr.admin.AdminHandlers
[junit4:junit4]   2> 402 T2958 oasc.RequestHandlers.initHandlersFromConfig created /select: solr.SearchHandler
[junit4:junit4]   2> 403 T2958 oasc.RequestHandlers.initHandlersFromConfig created /update: solr.UpdateRequestHandler
[junit4:junit4]   2> 416 T2958 oashl.XMLLoader.init xsltCacheLifetimeSeconds=60
[junit4:junit4]   2> 424 T2958 oass.SolrIndexSearcher.<init> Opening Searcher@4d7d4f9b main
[junit4:junit4]   2> 424 T2958 oasc.SolrCore.registerSearcher [00000_core] Registered new searcher Searcher@4d7d4f9b main{StandardDirectoryReader(segments_1:1)}
[junit4:junit4]   2> 425 T2958 oasu.CommitTracker.<init> Hard AutoCommit: disabled
[junit4:junit4]   2> 425 T2958 oasu.CommitTracker.<init> Soft AutoCommit: disabled
[junit4:junit4]   2> 429 T2958 oasc.CoreContainer.registerCore registering core: 00000_core
[junit4:junit4]   2> 430 T2948 oass.SolrDispatchFilter.init user.dir=/usr/home/hudson/hudson-slave/workspace/Lucene-Solr-NightlyTests-trunk/solr/build/solr-core/test/J0
[junit4:junit4]   2> 430 T2948 oass.SolrDispatchFilter.init SolrDispatchFilter.init() done
[junit4:junit4]   2> 431 T2948 oascsi.HttpClientUtil.createClient Creating new http client, config:maxConnections=128&maxConnectionsPerHost=32&followRedirects=false
[junit4:junit4]   2> 446 T2948 oascsi.HttpClientUtil.createClient Creating new http client, config:maxConnections=128&maxConnectionsPerHost=32&followRedirects=false
[junit4:junit4]   2> 457 T2948 oascsi.HttpClientUtil.createClient Creating new http client, config:maxConnections=128&maxConnectionsPerHost=32&followRedirects=false
[junit4:junit4]   2> 469 T2948 oascsi.HttpClientUtil.createClient Creating new http client, config:maxConnections=128&maxConnectionsPerHost=32&followRedirects=false
[junit4:junit4]   2> 480 T2948 oascsi.HttpClientUtil.createClient Creating new http client, config:maxConnections=128&maxConnectionsPerHost=32&followRedirects=false
[junit4:junit4]   2> 491 T2948 oascsi.HttpClientUtil.createClient Creating new http client, config:maxConnections=128&maxConnectionsPerHost=32&followRedirects=false
[junit4:junit4]   2> 502 T2948 oascsi.HttpClientUtil.createClient Creating new http client, config:maxConnections=128&maxConnectionsPerHost=32&followRedirects=false
[junit4:junit4]   2> 513 T2948 oascsi.HttpClientUtil.createClient Creating new http client, config:maxConnections=128&maxConnectionsPerHost=32&followRedirects=false
[junit4:junit4]   2> 524 T2948 oascsi.HttpClientUtil.createClient Creating new http client, config:maxConnections=128&maxConnectionsPerHost=32&followRedirects=false
[junit4:junit4]   2> 535 T2948 oascsi.HttpClientUtil.createClient Creating new http client, config:maxConnections=128&maxConnectionsPerHost=32&followRedirects=false
[junit4:junit4]   2> 546 T2948 oascsi.HttpClientUtil.createClient Creating new http client, config:maxConnections=128&maxConnectionsPerHost=32&followRedirects=false
[junit4:junit4]   2> 557 T2948 oascsi.HttpClientUtil.createClient Creating new http client, config:maxConnections=128&maxConnectionsPerHost=32&followRedirects=false
[junit4:junit4]   2> 568 T2948 oascsi.HttpClientUtil.createClient Creating new http client, config:maxConnections=128&maxConnectionsPerHost=32&followRedirects=false
[junit4:junit4]   2> 579 T2948 oascsi.HttpClientUtil.createClient Creating new http client, config:maxConnections=128&maxConnectionsPerHost=32&followRedirects=false
[junit4:junit4]   2> 590 T2948 oascsi.HttpClientUtil.createClient Creating new http client, config:maxConnections=128&maxConnectionsPerHost=32&followRedirects=false
[junit4:junit4]   2> 608 T2948 oascsi.HttpClientUtil.createClient Creating new http client, config:maxConnections=128&maxConnectionsPerHost=32&followRedirects=false
[junit4:junit4]   2> 619 T2948 oascsi.HttpClientUtil.createClient Creating new http client, config:maxConnections=128&maxConnectionsPerHost=32&followRedirects=false
[junit4:junit4]   2> 630 T2948 oascsi.HttpClientUtil.createClient Creating new http client, config:maxConnections=128&maxConnectionsPerHost=32&followRedirects=false
[junit4:junit4]   2> 641 T2948 oascsi.HttpClientUtil.createClient Creating new http client, config:maxConnections=128&maxConnectionsPerHost=32&followRedirects=false
[junit4:junit4]   2> 652 T2948 oascsi.HttpClientUtil.createClient Creating new http client, config:maxConnections=128&maxConnectionsPerHost=32&followRedirects=false
[junit4:junit4]   2> 663 T2948 oascsi.HttpClientUtil.createClient Creating new http client, config:maxConnections=128&maxConnectionsPerHost=32&followRedirects=false
[junit4:junit4]   2> 674 T2948 oascsi.HttpClientUtil.createClient Creating new http client, config:maxConnections=128&maxConnectionsPerHost=32&followRedirects=false
[junit4:junit4]   2> 685 T2948 oascsi.HttpClientUtil.createClient Creating new http client, config:maxConnections=128&maxConnectionsPerHost=32&followRedirects=false
[junit4:junit4]   2> 696 T2948 oascsi.HttpClientUtil.createClient Creating new http client, config:maxConnections=128&maxConnectionsPerHost=32&followRedirects=false
[junit4:junit4]   2> 706 T2948 oascsi.HttpClientUtil.createClient Creating new http client, config:maxConnections=128&maxConnectionsPerHost=32&followRedirects=false
[junit4:junit4]   2> 717 T2948 oascsi.HttpClientUtil.createClient Creating new http client, config:maxConnections=128&maxConnectionsPerHost=32&followRedirects=false
[junit4:junit4]   2> 728 T2948 oascsi.HttpClientUtil.createClient Creating new http client, config:maxConnections=128&maxConnectionsPerHost=32&followRedirects=false
[junit4:junit4]   2> 739 T2948 oascsi.HttpClientUtil.createClient Creating new http client, config:maxConnections=128&maxConnectionsPerHost=32&followRedirects=false
[junit4:junit4]   2> 750 T2948 oascsi.HttpClientUtil.createClient Creating new http client, config:maxConnections=128&maxConnectionsPerHost=32&followRedirects=false
[junit4:junit4]   2> 761 T2948 oascsi.HttpClientUtil.createClient Creating new http client, config:maxConnections=128&maxConnectionsPerHost=32&followRedirects=false
[junit4:junit4]   2> 772 T2948 oasc.OpenCloseCoreStressTest.doStress Starting indexing and querying
[junit4:junit4]   2> 773 T2948 oasc.OpenCloseCoreStressTest.doStress 
[junit4:junit4]   2> 	
[junit4:junit4]   2> 	
[junit4:junit4]   2> 	
[junit4:junit4]   2> 	
[junit4:junit4]   2> 	Starting a 300 second cycle, seconds left: 300. Seconds run so far: 0.
[junit4:junit4]   2> 775 T2962 oasc.OneIndexer.run Starting indexing thread: 2962
[junit4:junit4]   2> 776 T2963 oasc.OneIndexer.run Starting indexing thread: 2963
[junit4:junit4]   2> 776 T2965 oasc.OneIndexer.run Starting indexing thread: 2965
[junit4:junit4]   2> 775 T2961 oasc.OneIndexer.run Starting indexing thread: 2961
[junit4:junit4]   2> 776 T2966 oasc.OneIndexer.run Starting indexing thread: 2966
[junit4:junit4]   2> 776 T2964 oasc.OneIndexer.run Starting indexing thread: 2964
[junit4:junit4]   2> 778 T2970 oasc.OneIndexer.run Starting indexing thread: 2970
[junit4:junit4]   2> 777 T2969 oasc.OneIndexer.run Starting indexing thread: 2969
[junit4:junit4]   2> 780 T2973 oasc.OneIndexer.run Starting indexing thread: 2973
[junit4:junit4]   2> 780 T2974 oasc.OneIndexer.run Starting indexing thread: 2974
[junit4:junit4]   2> 777 T2968 oasc.OneIndexer.run Starting indexing thread: 2968
[junit4:junit4]   2> 777 T2967 oasc.OneIndexer.run Starting indexing thread: 2967
[junit4:junit4]   2> 780 T2975 oasc.OneIndexer.run Starting indexing thread: 2975
[junit4:junit4]   2> 779 T2972 oasc.OneIndexer.run Starting indexing thread: 2972
[junit4:junit4]   2> 779 T2971 oasc.OneIndexer.run Starting indexing thread: 2971
[junit4:junit4]   2> 785 T2976 oasc.OneQuery.run Starting query thread: 2976
[junit4:junit4]   2> 784 T2951 oasc.CoreContainer.create Creating SolrCore '00006_core' using instanceDir: /usr/home/hudson/hudson-slave/workspace/Lucene-Solr-NightlyTests-trunk/solr/build/solr-core/test/J0/./OpenCloseCoreStressTest_/00006_core
[junit4:junit4]   2> 786 T2955 oasc.CoreContainer.create Creating SolrCore '00001_core' using instanceDir: /usr/home/hudson/hudson-slave/workspace/Lucene-Solr-NightlyTests-trunk/solr/build/solr-core/test/J0/./OpenCloseCoreStressTest_/00001_core
[junit4:junit4]   2> 786 T2981 oasc.OneQuery.run Starting query thread: 2981
[junit4:junit4]   2> 787 T2983 oasc.OneQuery.run Starting query thread: 2983
[junit4:junit4]   2> 787 T2984 oasc.OneQuery.run Starting query thread: 2984
[junit4:junit4]   2> 787 T2951 oasc.SolrResourceLoader.<init> new SolrResourceLoader for directory: '/usr/home/hudson/hudson-slave/workspace/Lucene-Solr-NightlyTests-trunk/solr/build/solr-core/test/J0/./OpenCloseCoreStressTest_/00006_core/'
[junit4:junit4]   2> 788 T2987 oasc.OneQuery.run Starting query thread: 2987
[junit4:junit4]   2> 786 T2980 oasc.OneQuery.run Starting query thread: 2980
[junit4:junit4]   2> 788 T2988 oasc.OneQuery.run Starting query thread: 2988
[junit4:junit4]   2> 786 T2979 oasc.OneQuery.run Starting query thread: 2979
[junit4:junit4]   2> 785 T2953 oasc.CoreContainer.create Creating SolrCore '00008_core' using instanceDir: /usr/home/hudson/hudson-slave/workspace/Lucene-Solr-NightlyTests-trunk/solr/build/solr-core/test/J0/./OpenCloseCoreStressTest_/00008_core
[junit4:junit4]   2> 788 T2992 oasc.OneQuery.run Starting query thread: 2992
[junit4:junit4]   2> 785 T2978 oasc.OneQuery.run Starting query thread: 2978
[junit4:junit4]   2> 785 T2954 oasc.CoreContainer.create Creating SolrCore '00019_core' using instanceDir: /usr/home/hudson/hudson-slave/workspace/Lucene-Solr-NightlyTests-trunk/solr/build/solr-core/test/J0/./OpenCloseCoreStressTest_/00019_core
[junit4:junit4]   2> 785 T2977 oasc.OneQuery.run Starting query thread: 2977
[junit4:junit4]   2> 784 T2952 oasc.CoreContainer.create Creating SolrCore '00012_core' using instanceDir: /usr/home/hudson/hudson-slave/workspace/Lucene-Solr-NightlyTests-trunk/solr/build/solr-core/test/J0/./OpenCloseCoreStressTest_/00012_core
[junit4:junit4]   2> 789 T2994 oasc.CoreContainer.create Creating SolrCore '00018_core' using instanceDir: /usr/home/hudson/hudson-slave/workspace/Lucene-Solr-NightlyTests-trunk/solr/build/solr-core/test/J0/./OpenCloseCoreStressTest_/00018_core
[junit4:junit4]   2> 789 T2953 oasc.SolrResourceLoader.<init> new SolrResourceLoader for directory: '/usr/home/hudson/hudson-slave/workspace/Lucene-Solr-NightlyTests-trunk/solr/build/solr-core/test/J0/./OpenCloseCoreStressTest_/00008_core/'
[junit4:junit4]   2> 789 T2993 oasc.CoreContainer.create Creating SolrCore '00013_core' using instanceDir: /usr/home/hudson/hudson-slave/workspace/Lucene-Solr-NightlyTests-trunk/solr/build/solr-core/test/J0/./OpenCloseCoreStressTest_/00013_core
[junit4:junit4]   2> 791 T2952 oasc.SolrResourceLoader.<init> new SolrResourceLoader for directory: '/usr/home/hudson/hudson-slave/workspace/Lucene-Solr-NightlyTests-trunk/solr/build/solr-core/test/J0/./OpenCloseCoreStressTest_/00012_core/'
[junit4:junit4]   2> 788 T2991 oasc.OneQuery.run Starting query thread: 2991
[junit4:junit4]   2> 792 T2994 oasc.SolrResourceLoader.<init> new SolrResourceLoader for directory: '/usr/home/hudson/hudson-slave/workspace/Lucene-Solr-NightlyTests-trunk/solr/build/solr-core/test/J0/./OpenCloseCoreStressTest_/00018_core/'
[junit4:junit4]   2> 788 T2990 oasc.OneQuery.run Starting query thread: 2990
[junit4:junit4]   2> 787 T2986 oasc.OneQuery.run Starting query thread: 2986
[junit4:junit4]   2> 787 T2957 oasc.CoreContainer.create Creating SolrCore '00010_core' using instanceDir: /usr/home/hudson/hudson-slave/workspace/Lucene-Solr-NightlyTests-trunk/solr/build/solr-core/test/J0/./OpenCloseCoreStressTest_/00010_core
[junit4:junit4]   2> 787 T2956 oasc.CoreContainer.create Creating SolrCore '00003_core' using instanceDir: /usr/home/hudson/hudson-slave/workspace/Lucene-Solr-NightlyTests-trunk/solr/build/solr-core/test/J0/./OpenCloseCoreStressTest_/00003_core
[junit4:junit4]   2> 787 T2982 oasc.OneQuery.run Starting query thread: 2982
[junit4:junit4]   2> 792 T2993 oasc.SolrResourceLoader.<init> new SolrResourceLoader for directory: '/usr/home/hudson/hudson-slave/workspace/Lucene-Solr-NightlyTests-trunk/solr/build/solr-core/test/J0/./OpenCloseCoreStressTest_/00013_core/'
[junit4:junit4]   2> 793 T2957 oasc.SolrResourceLoader.<init> new SolrResourceLoader for directory: '/usr/home/hudson/hudson-slave/workspace/Lucene-Solr-NightlyTests-trunk/solr/build/solr-core/test/J0/./OpenCloseCoreStressTest_/00010_core/'
[junit4:junit4]   2> 792 T2998 oasc.CoreContainer.create Creating SolrCore '00005_core' using instanceDir: /usr/home/hudson/hudson-slave/workspace/Lucene-Solr-NightlyTests-trunk/solr/build/solr-core/test/J0/./OpenCloseCoreStressTest_/00005_core
[junit4:junit4]   2> 793 T2956 oasc.SolrResourceLoader.<init> new SolrResourceLoader for directory: '/usr/home/hudson/hudson-slave/workspace/Lucene-Solr-NightlyTests-trunk/solr/build/solr-core/test/J0/./OpenCloseCoreStressTest_/00003_core/'
[junit4:junit4]   2> 793 T2955 oasc.SolrResourceLoader.<init> new SolrResourceLoader for directory: '/usr/home/hudson/hudson-slave/workspace/Lucene-Solr-NightlyTests-trunk/solr/build/solr-core/test/J0/./OpenCloseCoreStressTest_/00001_core/'
[junit4:junit4]   2> 791 T2996 oasc.CoreContainer.create Creating SolrCore '00014_core' using instanceDir: /usr/home/hudson/hudson-slave/workspace/Lucene-Solr-NightlyTests-trunk/solr/build/solr-core/test/J0/./OpenCloseCoreStressTest_/00014_core
[junit4:junit4]   2> 791 T2954 oasc.SolrResourceLoader.<init> new SolrResourceLoader for directory: '/usr/home/hudson/hudson-slave/workspace/Lucene-Solr-NightlyTests-trunk/solr/build/solr-core/test/J0/./OpenCloseCoreStressTest_/00019_core/'
[junit4:junit4]   2> 791 T2995 oasc.CoreContainer.create Creating SolrCore '00017_core' using instanceDir: /usr/home/hudson/hudson-slave/workspace/Lucene-Solr-NightlyTests-trunk/solr/build/solr-core/test/J0/./OpenCloseCoreStressTest_/00017_core
[junit4:junit4]   2> 794 T2998 oasc.SolrResourceLoader.<init> new SolrResourceLoader for directory: '/usr/home/hudson/hudson-slave/workspace/Lucene-Solr-NightlyTests-trunk/solr/build/solr-core/test/J0/./OpenCloseCoreStressTest_/00005_core/'
[junit4:junit4]   2> 795 T2996 oasc.SolrResourceLoader.<init> new SolrResourceLoader for directory: '/usr/home/hudson/hudson-slave/workspace/Lucene-Solr-NightlyTests-trunk/solr/build/solr-core/test/J0/./OpenCloseCoreStressTest_/00014_core/'
[junit4:junit4]   2> 795 T2995 oasc.SolrResourceLoader.<init> new SolrResourceLoader for directory: '/usr/home/hudson/hudson-slave/workspace/Lucene-Solr-NightlyTests-trunk/solr/build/solr-core/test/J0/./OpenCloseCoreStressTest_/00017_core/'
[junit4:junit4]   2> 892 T3001 oasc.CoreContainer.create Creating SolrCore '00015_core' using instanceDir: /usr/home/hudson/hudson-slave/workspace/Lucene-Solr-NightlyTests-trunk/solr/build/solr-core/test/J0/./OpenCloseCoreStressTest_/00015_core
[junit4:junit4]   2> 896 T3001 oasc.SolrResourceLoader.<init> new SolrResourceLoader for directory: '/usr/home/hudson/hudson-slave/workspace/Lucene-Solr-NightlyTests-trunk/solr/build/solr-core/test/J0/./OpenCloseCoreStressTest_/00015_core/'
[junit4:junit4]   2> 896 T3005 oasc.CoreContainer.create Creating SolrCore '00011_core' using instanceDir: /usr/home/hudson/hudson-slave/workspace/Lucene-Solr-NightlyTests-trunk/solr/build/solr-core/test/J0/./OpenCloseCoreStressTest_/00011_core
[junit4:junit4]   2> 898 T3007 oasc.CoreContainer.create Creating SolrCore '00007_core' using instanceDir: /usr/home/hudson/hudson-slave/workspace/Lucene-Solr-NightlyTests-trunk/solr/build/solr-core/test/J0/./OpenCloseCoreStressTest_/00007_core
[junit4:junit4]   2> 899 T3005 oasc.SolrResourceLoader.<init> new SolrResourceLoader for directory: '/usr/home/hudson/hudson-slave/workspace/Lucene-Solr-NightlyTests-trunk/solr/build/solr-core/test/J0/./OpenCloseCoreStressTest_/00011_core/'
[junit4:junit4]   2> 900 T3007 oasc.SolrResourceLoader.<init> new SolrResourceLoader for directory: '/usr/home/hudson/hudson-slave/workspace/Lucene-Solr-NightlyTests-trunk/solr/build/solr-core/test/J0/./OpenCloseCoreStressTest_/00007_core/'
[junit4:junit4]   2> 903 T3010 oasc.CoreContainer.create Creating SolrCore '00016_core' using instanceDir: /usr/home/hudson/hudson-slave/workspace/Lucene-Solr-NightlyTests-trunk/solr/build/solr-core/test/J0/./OpenCloseCoreStressTest_/00016_core
[junit4:junit4]   2> 904 T3010 oasc.SolrResourceLoader.<init> new SolrResourceLoader for directory: '/usr/home/hudson/hudson-slave/workspace/Lucene-Solr-NightlyTests-trunk/solr/build/solr-core/test/J0/./OpenCloseCoreStressTest_/00016_core/'
[junit4:junit4]   2> ASYNC  NEW_CORE C146 name=00000_core org.apache.solr.core.SolrCore@338ecf48
[junit4:junit4]   2> 911 T3002 C146 REQ [00000_core] webapp=/solr path=/select params={q=*:*&wt=javabin&qt=/select&version=2} hits=0 status=0 QTime=0 
[junit4:junit4]   2> 931 T2998 oasc.SolrConfig.<init> Using Lucene MatchVersion: LUCENE_41
[junit4:junit4]   2> 933 T2956 oasc.SolrConfig.<init> Using Lucene MatchVersion: LUCENE_41
[junit4:junit4]   2> 934 T2951 oasc.SolrConfig.<init> Using Lucene MatchVersion: LUCENE_41
[junit4:junit4]   2> 939 T2995 oasc.SolrConfig.<init> Using Lucene MatchVersion: LUCENE_41
[junit4:junit4]   2> 940 T2996 oasc.SolrConfig.<init> Using Lucene MatchVersion: LUCENE_41
[junit4:junit4]   2> 943 T2953 oasc.SolrConfig.<init> Using Lucene MatchVersion: LUCENE_41
[junit4:junit4]   2> 953 T2955 oasc.SolrConfig.<init> Using Lucene MatchVersion: LUCENE_41
[junit4:junit4]   2> 954 T2957 oasc.SolrConfig.<init> Using Lucene MatchVersion: LUCENE_41
[junit4:junit4]   2> 966 T2993 oasc.SolrConfig.<init> Using Lucene MatchVersion: LUCENE_41
[junit4:junit4]   2> 982 T2994 oasc.SolrConfig.<init> Using Lucene MatchVersion: LUCENE_41
[junit4:junit4]   2> 990 T2952 oasc.SolrConfig.<init> Using Lucene MatchVersion: LUCENE_41
[junit4:junit4]   2> 1006 T2954 oasc.SolrConfig.<init> Using Lucene MatchVersion: LUCENE_41
[junit4:junit4]   2> 1057 T3007 oasc.SolrConfig.<init> Using Lucene MatchVersion: LUCENE_41
[junit4:junit4]   2> 1063 T3001 oasc.SolrConfig.<init> Using Lucene MatchVersion: LUCENE_41
[junit4:junit4]   2> 1078 T3010 oasc.SolrConfig.<init> Using Lucene MatchVersion: LUCENE_41
[junit4:junit4]   2> 1099 T3005 oasc.SolrConfig.<init> Using Lucene MatchVersion: LUCENE_41
[junit4:junit4]   2> 1164 T2998 oasc.SolrConfig.<init> Loaded SolrConfig: solrconfig-minimal.xml
[junit4:junit4]   2> 1167 T2998 oass.IndexSchema.readSchema Reading Solr Schema
[junit4:junit4]   2> 1175 T2956 oasc.SolrConfig.<init> Loaded SolrConfig: solrconfig-minimal.xml
[junit4:junit4]   2> 1177 T2998 oass.IndexSchema.readSchema Schema name=tiny
[junit4:junit4]   2> 1179 T2956 oass.IndexSchema.readSchema Reading Solr Schema
[junit4:junit4]   2> 1179 T2995 oasc.SolrConfig.<init> Loaded SolrConfig: solrconfig-minimal.xml
[junit4:junit4]   2> 1179 T2953 oasc.SolrConfig.<init> Loaded SolrConfig: solrconfig-minimal.xml
[junit4:junit4]   2> 1181 T2951 oasc.SolrConfig.<init> Loaded SolrConfig: solrconfig-minimal.xml
[junit4:junit4]   2> 1182 T2953 oass.IndexSchema.readSchema Reading Solr Schema
[junit4:junit4]   2> 1182 T2995 oass.IndexSchema.readSchema Reading Solr Schema
[junit4:junit4]   2> 1184 T2951 oass.IndexSchema.readSchema Reading Solr Schema
[junit4:junit4]   2> 1186 T2996 oasc.SolrConfig.<init> Loaded SolrConfig: solrconfig-minimal.xml
[junit4:junit4]   2> 1189 T2996 oass.IndexSchema.readSchema Reading Solr Schema
[junit4:junit4]   2> 1193 T2995 oass.IndexSchema.readSchema Schema name=tiny
[junit4:junit4]   2> 1194 T2956 oass.IndexSchema.readSchema Schema name=tiny
[junit4:junit4]   2> 1194 T2953 oass.IndexSchema.readSchema Schema name=tiny
[junit4:junit4]   2> 1195 T2951 oass.IndexSchema.readSchema Schema name=tiny
[junit4:junit4]   2> 1201 T2996 oass.IndexSchema.readSchema Schema name=tiny
[junit4:junit4]   2> 1207 T2957 oasc.SolrConfig.<init> Loaded SolrConfig: solrconfig-minimal.xml
[junit4:junit4]   2> 1211 T2993 oasc.SolrConfig.<init> Loaded SolrConfig: solrconfig-minimal.xml
[junit4:junit4]   2> 1211 T2957 oass.IndexSchema.readSchema Reading Solr Schema
[junit4:junit4]   2> 1215 T2993 oass.IndexSchema.readSchema Reading Solr Schema
[junit4:junit4]   2> 1227 T2955 oasc.SolrConfig.<init> Loaded SolrConfig: solrconfig-minimal.xml
[junit4:junit4]   2> 1227 T2993 oass.IndexSchema.readSchema Schema name=tiny
[junit4:junit4]   2> 1228 T2994 oasc.SolrConfig.<init> Loaded SolrConfig: solrconfig-minimal.xml
[junit4:junit4]   2> 1229 T2957 oass.IndexSchema.readSchema Schema name=tiny
[junit4:junit4]   2> 1229 T2955 oass.IndexSchema.readSchema Reading Solr Schema
[junit4:junit4]   2> 1229 T2994 oass.IndexSchema.readSchema Reading Solr Schema
[junit4:junit4]   2> 1247 T2994 oass.IndexSchema.readSchema Schema name=tiny
[junit4:junit4]   2> 1248 T2955 oass.IndexSchema.readSchema Schema name=tiny
[junit4:junit4]   2> 1251 T2952 oasc.SolrConfig.<init> Loaded SolrConfig: solrconfig-minimal.xml
[junit4:junit4]   2> 1253 T2952 oass.IndexSchema.readSchema Reading Solr Schema
[junit4:junit4]   2> 1266 T2952 oass.IndexSchema.readSchema Schema name=tiny
[junit4:junit4]   2> 1277 T2954 oasc.SolrConfig.<init> Loaded SolrConfig: solrconfig-minimal.xml
[junit4:junit4]   2> 1280 T2954 oass.IndexSchema.readSchema Reading Solr Schema
[junit4:junit4]   2> 1290 T2995 oass.IndexSchema.readSchema unique key field: id
[junit4:junit4]   2> 1293 T2951 oass.IndexSchema.readSchema unique key field: id
[junit4:junit4]   2> 1295 T2954 oass.IndexSchema.readSchema Schema name=tiny
[junit4:junit4]   2> 1296 T2995 oasc.SolrCore.initDirectoryFactory org.apache.solr.core.MockFSDirectoryFactory
[junit4:junit4]   2> 1296 T2953 oass.IndexSchema.readSchema unique key field: id
[junit4:junit4]   2> 1296 T2951 oasc.SolrCore.initDirectoryFactory org.apache.solr.core.MockFSDirectoryFactory
[junit4:junit4]   2> 1298 T2995 oasc.SolrCore.<init> [00017_core] Opening new SolrCore at /usr/home/hudson/hudson-slave/workspace/Lucene-Solr-NightlyTests-trunk/solr/build/solr-core/test/J0/./OpenCloseCoreStressTest_/00017_core/, dataDir=/usr/home/hudson/hudson-slave/workspace/Lucene-Solr-NightlyTests-trunk/solr/build/solr-core/test/J0/OpenCloseCoreStressTest_/00017_core/data/
[junit4:junit4]   2> 1298 T2951 oasc.SolrCore.<init> [00006_core] Opening new SolrCore at /usr/home/hudson/hudson-slave/workspace/Lucene-Solr-NightlyTests-trunk/solr/build/solr-core/test/J0/./OpenCloseCoreStressTest_/00006_core/, dataDir=/usr/home/hudson/hudson-slave/workspace/Lucene-Solr-NightlyTests-trunk/solr/build/solr-core/test/J0/OpenCloseCoreStressTest_/00006_core/data/
[junit4:junit4]   2> 1298 T2995 oasc.JmxMonitoredMap.<init> JMX monitoring is enabled. Adding Solr mbeans to JMX Server: com.sun.jmx.mbeanserver.JmxMBeanServer@1320e2db
[junit4:junit4]   2> 1299 T2951 oasc.JmxMonitoredMap.<init> JMX monitoring is enabled. Adding Solr mbeans to JMX Server: com.sun.jmx.mbeanserver.JmxMBeanServer@1320e2db
[junit4:junit4]   2> 1299 T2996 oass.IndexSchema.readSchema unique key field: id
[junit4:junit4]   2> 1299 T2995 oasc.SolrCore.initDirectoryFactory org.apache.solr.core.MockFSDirectoryFactory
[junit4:junit4]   2> 1299 T2951 oasc.SolrCore.initDirectoryFactory org.apache.solr.core.MockFSDirectoryFactory
[junit4:junit4]   2> 1299 T2956 oass.IndexSchema.readSchema unique key field: id
[junit4:junit4]   2> 1301 T2953 oasc.SolrCore.initDirectoryFactory org.apache.solr.core.MockFSDirectoryFactory
[junit4:junit4]   2> 1301 T2995 oasc.CachingDirectoryFactory.get return new directory for /usr/home/hudson/hudson-slave/workspace/Lucene-Solr-NightlyTests-trunk/solr/build/solr-core/test/J0/OpenCloseCoreStressTest_/00017_core/data
[junit4:junit4]   2> 1303 T2996 oasc.SolrCore.initDirectoryFactory org.apache.solr.core.MockFSDirectoryFactory
[junit4:junit4]   2> 1304 T2998 oass.IndexSchema.readSchema unique key field: id
[junit4:junit4]   2> 1304 T2996 oasc.SolrCore.<init> [00014_core] Opening new SolrCore at /usr/home/hudson/hudson-slave/workspace/Lucene-Solr-NightlyTests-trunk/solr/build/solr-core/test/J0/./OpenCloseCoreStressTest_/00014_core/, dataDir=/usr/home/hudson/hudson-slave/workspace/Lucene-Solr-NightlyTests-trunk/solr/build/solr-core/test/J0/OpenCloseCoreStressTest_/00014_core/data/
[junit4:junit4]   2> 1304 T2953 oasc.SolrCore.<init> [00008_core] Opening new SolrCore at /usr/home/hudson/hudson-slave/workspace/Lucene-Solr-NightlyTests-trunk/solr/build/solr-core/test/J0/./OpenCloseCoreStressTest_/00008_core/, dataDir=/usr/home/hudson/hudson-slave/workspace/Lucene-Solr-NightlyTests-trunk/solr/build/solr-core/test/J0/OpenCloseCoreStressTest_/00008_core/data/
[junit4:junit4]   2> 1305 T2996 oasc.JmxMonitoredMap.<init> JMX monitoring is enabled. Adding Solr mbeans to JMX Server: com.sun.jmx.mbeanserver.JmxMBeanServer@1320e2db
[junit4:junit4]   2> 1304 T2951 oasc.CachingDirectoryFactory.get return new directory for /usr/home/hudson/hudson-slave/workspace/Lucene-Solr-NightlyTests-trunk/solr/build/solr-core/test/J0/OpenCloseCoreStressTest_/00006_core/data
[junit4:junit4]   2> 1305 T2953 oasc.JmxMonitoredMap.<init> JMX monitoring is enabled. Adding Solr mbeans to JMX Server: com.sun.jmx.mbeanserver.JmxMBeanServer@1320e2db
[junit4:junit4]   2> 1305 T2956 oasc.SolrCore.initDirectoryFactory org.apache.solr.core.MockFSDirectoryFactory
[junit4:junit4]   2> 1305 T2995 oasc.SolrCore.getNewIndexDir New index directory detected: old=null new=/usr/home/hudson/hudson-slave/workspace/Lucene-Solr-NightlyTests-trunk/solr/build/solr-core/test/J0/OpenCloseCoreStressTest_/00017_core/data/index/
[junit4:junit4]   2> 1306 T2996 oasc.SolrCore.initDirectoryFactory org.apache.solr.core.MockFSDirectoryFactory
[junit4:junit4]   2> 1306 T2953 oasc.SolrCore.initDirectoryFactory org.apache.solr.core.MockFSDirectoryFactory
[junit4:junit4]   2> 1308 T2951 oasc.SolrCore.getNewIndexDir New index directory detected: old=null new=/usr/home/hudson/hudson-slave/workspace/Lucene-Solr-NightlyTests-trunk/solr/build/solr-core/test/J0/OpenCloseCoreStressTest_/00006_core/data/index/
[junit4:junit4]   2> 1309 T2998 oasc.SolrCore.initDirectoryFactory org.apache.solr.core.MockFSDirectoryFactory
[junit4:junit4]   2> 1310 T2995 oasc.SolrCore.initIndex WARNING [00017_core] Solr index directory '/usr/home/hudson/hudson-slave/workspace/Lucene-Solr-NightlyTests-trunk/solr/build/solr-core/test/J0/OpenCloseCoreStressTest_/00017_core/data/index' doesn't exist. Creating new index...
[junit4:junit4]   2> 1311 T2956 oasc.SolrCore.<init> [00003_core] Opening new SolrCore at /usr/home/hudson/hudson-slave/workspace/Lucene-Solr-NightlyTests-trunk/solr/build/solr-core/test/J0/./OpenCloseCoreStressTest_/00003_core/, dataDir=/usr/home/hudson/hudson-slave/workspace/Lucene-Solr-NightlyTests-trunk/solr/build/solr-core/test/J0/OpenCloseCoreStressTest_/00003_core/data/
[junit4:junit4]   2> 1312 T2995 oasc.CachingDirectoryFactory.get return new directory for /usr/home/hudson/hudson-slave/workspace/Lucene-Solr-NightlyTests-trunk/solr/build/solr-core/test/J0/OpenCloseCoreStressTest_/00017_core/data/index
[junit4:junit4]   2> 1313 T2956 oasc.JmxMonitoredMap.<init> JMX monitoring is enabled. Adding Solr mbeans to JMX Server: com.sun.jmx.mbeanserver.JmxMBeanServer@1320e2db
[junit4:junit4]   2> 1312 T2953 oasc.CachingDirectoryFactory.get return new directory for /usr/home/hudson/hudson-slave/workspace/Lucene-Solr-NightlyTests-trunk/solr/build/solr-core/test/J0/OpenCloseCoreStressTest_/00008_core/data
[junit4:junit4]   2> 1312 T2951 oasc.SolrCore.initIndex WARNING [00006_core] Solr index directory '/usr/home/hudson/hudson-slave/workspace/Lucene-Solr-NightlyTests-trunk/solr/build/solr-core/test/J0/OpenCloseCoreStressTest_/00006_core/data/index' doesn't exist. Creating new index...
[junit4:junit4]   2> 1312 T2996 oasc.CachingDirectoryFactory.get return new directory for /usr/home/hudson/hudson-slave/workspace/Lucene-Solr-NightlyTests-trunk/solr/build/solr-core/test/J0/OpenCloseCoreStressTest_/00014_core/data
[junit4:junit4]   2> 1314 T2951 oasc.CachingDirectoryFactory.get return new directory for /usr/home/hudson/hudson-slave/workspace/Lucene-Solr-NightlyTests-trunk/solr/build/solr-core/test/J0/OpenCloseCoreStressTest_/00006_core/data/index
[junit4:junit4]   2> 1312 T2998 oasc.SolrCore.<init> [00005_core] Opening new SolrCore at /usr/home/hudson/hudson-slave/workspace/Lucene-Solr-NightlyTests-trunk/solr/build/solr-core/test/J0/./OpenCloseCoreStressTest_/00005_core/, dataDir=/usr/home/hudson/hudson-slave/workspace/Lucene-Solr-NightlyTests-trunk/solr/build/solr-core/test/J0/OpenCloseCoreStressTest_/00005_core/data/
[junit4:junit4]   2> 1313 T2956 oasc.SolrCore.initDirectoryFactory org.apache.solr.core.MockFSDirectoryFactory
[junit4:junit4]   2> 1316 T2953 oasc.SolrCore.getNewIndexDir New index directory detected: old=null new=/usr/home/hudson/hudson-slave/workspace/Lucene-Solr-NightlyTests-trunk/solr/build/solr-core/test/J0/OpenCloseCoreStressTest_/00008_core/data/index/
[junit4:junit4]   2> 1315 T2998 oasc.JmxMonitoredMap.<init> JMX monitoring is enabled. Adding Solr mbeans to JMX Server: com.sun.jmx.mbeanserver.JmxMBeanServer@1320e2db
[junit4:junit4]   2> 1316 T2998 oasc.SolrCore.initDirectoryFactory org.apache.solr.core.MockFSDirectoryFactory
[junit4:junit4]   2> 1318 T2996 oasc.SolrCore.getNewIndexDir New index directory detected: old=null new=/usr/home/hudson/hudson-slave/workspace/Lucene-Solr-NightlyTests-trunk/solr/build/solr-core/test/J0/OpenCloseCoreStressTest_/00014_core/data/index/
[junit4:junit4]   2> 1319 T2956 oasc.CachingDirectoryFactory.get return new directory for /usr/home/hudson/hudson-slave/workspace/Lucene-Solr-NightlyTests-trunk/solr/build/solr-core/test/J0/OpenCloseCoreStressTest_/00003_core/data
[junit4:junit4]   2> 1319 T2953 oasc.SolrCore.initIndex WARNING [00008_core] Solr index directory '/usr/home/hudson/hudson-slave/workspace/Lucene-Solr-NightlyTests-trunk/solr/build/solr-core/test/J0/OpenCloseCoreStressTest_/00008_core/data/index' doesn't exist. Creating new index...
[junit4:junit4]   2> 1319 T2998 oasc.CachingDirectoryFactory.get return new directory for /usr/home/hudson/hudson-slave/workspace/Lucene-Solr-NightlyTests-trunk/solr/build/solr-core/test/J0/OpenCloseCoreStressTest_/00005_core/data
[junit4:junit4]   2> 1320 T2953 oasc.CachingDirectoryFactory.get return new directory for /usr/home/hudson/hudson-slave/workspace/Lucene-Solr-NightlyTests-trunk/solr/build/solr-core/test/J0/OpenCloseCoreStressTest_/00008_core/data/index
[junit4:junit4]   2> 1321 T3001 oasc.SolrConfig.<init> Loaded SolrConfig: solrconfig-minimal.xml
[junit4:junit4]   2> 1322 T2993 oass.IndexSchema.readSchema unique key field: id
[junit4:junit4]   2> 1323 T2956 oasc.SolrCore.getNewIndexDir New index directory detected: old=null new=/usr/home/hudson/hudson-slave/workspace/Lucene-Solr-NightlyTests-trunk/solr/build/solr-core/test/J0/OpenCloseCoreStressTest_/00003_core/data/index/
[junit4:junit4]   2> 1324 T2998 oasc.SolrCore.getNewIndexDir New index directory detected: old=null new=/usr/home/hudson/hudson-slave/workspace/Lucene-Solr-NightlyTests-trunk/solr/build/solr-core/test/J0/OpenCloseCoreStressTest_/00005_core/data/index/
[junit4:junit4]   2> 1324 T2957 oass.IndexSchema.readSchema unique key field: id
[junit4:junit4]   2> 1325 T2996 oasc.SolrCore.initIndex WARNING [00014_core] Solr index directory '/usr/home/hudson/hudson-slave/workspace/Lucene-Solr-NightlyTests-trunk/solr/build/solr-core/test/J0/OpenCloseCoreStressTest_/00014_core/data/index' doesn't exist. Creating new index...
[junit4:junit4]   2> 1325 T3007 oasc.SolrConfig.<init> Loaded SolrConfig: solrconfig-minimal.xml
[junit4:junit4]   2> 1326 T2996 oasc.CachingDirectoryFactory.get return new directory for /usr/home/hudson/hudson-slave/workspace/Lucene-Solr-NightlyTests-trunk/solr/build/solr-core/test/J0/OpenCloseCoreStressTest_/00014_core/data/index
[junit4:junit4]   2> 1327 T2956 oasc.SolrCore.initIndex WARNING [00003_core] Solr index directory '/usr/home/hudson/hudson-slave/workspace/Lucene-Solr-NightlyTests-trunk/solr/build/solr-core/test/J0/OpenCloseCoreStressTest_/00003_core/data/index' doesn't exist. Creating new index...
[junit4:junit4]   2> 1327 T3007 oass.IndexSchema.readSchema Reading Solr Schema
[junit4:junit4]   2> 1328 T2993 oasc.SolrCore.initDirectoryFactory org.apache.solr.core.MockFSDirectoryFactory
[junit4:junit4]   2> 1328 T2998 oasc.SolrCore.initIndex WARNING [00005_core] Solr index directory '/usr/home/hudson/hudson-slave/workspace/Lucene-Solr-NightlyTests-trunk/solr/build/solr-core/test/J0/OpenCloseCoreStressTest_/00005_core/data/index' doesn't exist. Creating new index...
[junit4:junit4]   2> 1329 T2956 oasc.CachingDirectoryFactory.get return new directory for /usr/home/hudson/hudson-slave/workspace/Lucene-Solr-NightlyTests-trunk/solr/build/solr-core/test/J0/OpenCloseCoreStressTest_/00003_core/data/index
[junit4:junit4]   2> 1329 T2957 oasc.SolrCore.initDirectoryFactory org.apache.solr.core.MockFSDirectoryFactory
[junit4:junit4]   2> 1329 T3001 oass.IndexSchema.readSchema Reading Solr Schema
[junit4:junit4]   2> 1329 T2993 oasc.SolrCore.<init> [00013_core] Opening new SolrCore at /usr/home/hudson/hudson-slave/workspace/Lucene-Solr-NightlyTests-trunk/solr/build/solr-core/test/J0/./OpenCloseCoreStressTest_/00013_core/, dataDir=/usr/home/hudson/hudson-slave/workspace/Lucene-Solr-NightlyTests-trunk/solr/build/solr-core/test/J0/OpenCloseCoreStressTest_/00013_core/data/
[junit4:junit4]   2> 1329 T2998 oasc.CachingDirectoryFactory.get return new directory for /usr/home/hudson/hudson-slave/workspace/Lucene-Solr-NightlyTests-trunk/solr/build/solr-core/test/J0/OpenCloseCoreStressTest_/00005_core/data/index
[junit4:junit4]   2> 1330 T2993 oasc.JmxMonitoredMap.<init> JMX monitoring is enabled. Adding Solr mbeans to JMX Server: com.sun.jmx.mbeanserver.JmxMBeanServer@1320e2db
[junit4:junit4]   2> 1331 T2993 oasc.SolrCore.initDirectoryFactory org.apache.solr.core.MockFSDirectoryFactory
[junit4:junit4]   2> 1331 T2957 oasc.SolrCore.<init> [00010_core] Opening new SolrCore at /usr/home/hudson/hudson-slave/workspace/Lucene-Solr-NightlyTests-trunk/solr/build/solr-core/test/J0/./OpenCloseCoreStressTest_/00010_core/, dataDir=/usr/home/hudson/hudson-slave/workspace/Lucene-Solr-NightlyTests-trunk/solr/build/solr-core/test/J0/OpenCloseCoreStressTest_/00010_core/data/
[junit4:junit4]   2> 1332 T2957 oasc.JmxMonitoredMap.<init> JMX monitoring is enabled. Adding Solr mbeans to JMX Server: com.sun.jmx.mbeanserver.JmxMBeanServer@1320e2db
[junit4:junit4]   2> 1332 T2957 oasc.SolrCore.initDirectoryFactory org.apache.solr.core.MockFSDirectoryFactory
[junit4:junit4]   2> 1334 T2993 oasc.CachingDirectoryFactory.get return new directory for /usr/home/hudson/hudson-slave/workspace/Lucene-Solr-NightlyTests-trunk/solr/build/solr-core/test/J0/OpenCloseCoreStressTest_/00013_core/data
[junit4:junit4]   2> 1336 T2957 oasc.CachingDirectoryFactory.get return new directory for /usr/home/hudson/hudson-slave/workspace/Lucene-Solr-NightlyTests-trunk/solr/build/solr-core/test/J0/OpenCloseCoreStressTest_/00010_core/data
[junit4:junit4]   2> 1340 T2993 oasc.SolrCore.getNewIndexDir New index directory detected: old=null new=/usr/home/hudson/hudson-slave/workspace/Lucene-Solr-NightlyTests-trunk/solr/build/solr-core/test/J0/OpenCloseCoreStressTest_/00013_core/data/index/
[junit4:junit4]   2> 1342 T2957 oasc.SolrCore.getNewIndexDir New index directory detected: old=null new=/usr/home/hudson/hudson-slave/workspace/Lucene-Solr-NightlyTests-trunk/solr/build/solr-core/test/J0/OpenCloseCoreStressTest_/00010_core/data/index/
[junit4:junit4]   2> 1346 T2993 oasc.SolrCore.initIndex WARNING [00013_core] Solr index directory '/usr/home/hudson/hudson-slave/workspace/Lucene-Solr-NightlyTests-trunk/solr/build/solr-core/test/J0/OpenCloseCoreStressTest_/00013_core/data/index' doesn't exist. Creating new index...
[junit4:junit4]   2> 1347 T2993 oasc.CachingDirectoryFactory.get return new directory for /usr/home/hudson/hudson-slave/workspace/Lucene-Solr-NightlyTests-trunk/solr/build/solr-core/test/J0/OpenCloseCoreStressTest_/00013_core/data/index
[junit4:junit4]   2> 1348 T2957 oasc.SolrCore.initIndex WARNING [00010_core] Solr index directory '/usr/home/hudson/hudson-slave/workspace/Lucene-Solr-NightlyTests-trunk/solr/build/solr-core/test/J0/OpenCloseCoreStressTest_/00010_core/data/index' doesn't exist. Creating new index...
[junit4:junit4]   2> 1349 T2957 oasc.CachingDirectoryFactory.get return new directory for /usr/home/hudson/hudson-slave/workspace/Lucene-Solr-NightlyTests-trunk/solr/build/solr-core/test/J0/OpenCloseCoreStressTest_/00010_core/data/index
[junit4:junit4]   2> 1362 T2955 oass.IndexSchema.readSchema unique key field: id
[junit4:junit4]   2> 1362 T2994 oass.IndexSchema.readSchema unique key field: id
[junit4:junit4]   2> 1362 T3007 oass.IndexSchema.readSchema Schema name=tiny
[junit4:junit4]   2> 1363 T3001 oass.IndexSchema.readSchema Schema name=tiny
[junit4:junit4]   2> 1364 T2955 oasc.SolrCore.initDirectoryFactory org.apache.solr.core.MockFSDirectoryFactory
[junit4:junit4]   2> 1365 T2994 oasc.SolrCore.initDirectoryFactory org.apache.solr.core.MockFSDirectoryFactory
[junit4:junit4]   2> 1365 T2955 oasc.SolrCore.<init> [00001_core] Opening new SolrCore at /usr/home/hudson/hudson-slave/workspace/Lucene-Solr-NightlyTests-trunk/solr/build/solr-core/test/J0/./OpenCloseCoreStressTest_/00001_core/, dataDir=/usr/home/hudson/hudson-slave/workspace/Lucene-Solr-NightlyTests-trunk/solr/build/solr-core/test/J0/OpenCloseCoreStressTest_/00001_core/data/
[junit4:junit4]   2> 1365 T2955 oasc.JmxMonitoredMap.<init> JMX monitoring is enabled. Adding Solr mbeans to JMX Server: com.sun.jmx.mbeanserver.JmxMBeanServer@1320e2db
[junit4:junit4]   2> 1366 T2994 oasc.SolrCore.<init> [00018_core] Opening new SolrCore at /usr/home/hudson/hudson-slave/workspace/Lucene-Solr-NightlyTests-trunk/solr/build/solr-core/test/J0/./OpenCloseCoreStressTest_/00018_core/, dataDir=/usr/home/hudson/hudson-slave/workspace/Lucene-Solr-NightlyTests-trunk/solr/build/solr-core/test/J0/OpenCloseCoreStressTest_/00018_core/data/
[junit4:junit4]   2> 1366 T3010 oasc.SolrConfig.<init> Loaded SolrConfig: solrconfig-minimal.xml
[junit4:junit4]   2> 1366 T2955 oasc.SolrCore.initDirectoryFactory org.apache.solr.core.MockFSDirectoryFactory
[junit4:junit4]   2> 1366 T2994 oasc.JmxMonitoredMap.<init> JMX monitoring is enabled. Adding Solr mbeans to JMX Server: com.sun.jmx.mbeanserver.JmxMBeanServer@1320e2db
[junit4:junit4]   2> 1367 T2994 oasc.SolrCore.initDirectoryFactory org.apache.solr.core.MockFSDirectoryFactory
[junit4:junit4]   2> 1367 T3010 oass.IndexSchema.readSchema Reading Solr Schema
[junit4:junit4]   2> 1368 T2955 oasc.CachingDirectoryFactory.get return new directory for /usr/home/hudson/hudson-slave/workspace/Lucene-Solr-NightlyTests-trunk/solr/build/solr-core/test/J0/OpenCloseCoreStressTest_/00001_core/data
[junit4:junit4]   2> 1369 T2955 oasc.SolrCore.getNewIndexDir New index directory detected: old=null new=/usr/home/hudson/hudson-slave/workspace/Lucene-Solr-NightlyTests-trunk/solr/build/solr-core/test/J0/OpenCloseCoreStressTest_/00001_core/data/index/
[junit4:junit4]   2> 1369 T2994 oasc.CachingDirectoryFactory.get return new directory for /usr/home/hudson/hudson-slave/workspace/Lucene-Solr-NightlyTests-trunk/solr/build/solr-core/test/J0/OpenCloseCoreStressTest_/00018_core/data
[junit4:junit4]   2> 1370 T2955 oasc.SolrCore.initIndex WARNING [00001_core] Solr index directory '/usr/home/hudson/hudson-slave/workspace/Lucene-Solr-NightlyTests-trunk/solr/build/solr-core/test/J0/OpenCloseCoreStressTest_/00001_core/data/index' doesn't exist. Creating new index...
[junit4:junit4]   2> 1370 T2994 oasc.SolrCore.getNewIndexDir New index directory detected: old=null new=/usr/home/hudson/hudson-slave/workspace/Lucene-Solr-NightlyTests-trunk/solr/build/solr-core/test/J0/OpenCloseCoreStressTest_/00018_core/data/index/
[junit4:junit4]   2> 1371 T2955 oasc.CachingDirectoryFactory.get return new directory for /usr/home/hudson/hudson-slave/workspace/Lucene-Solr-NightlyTests-trunk/solr/build/solr-core/test/J0/OpenCloseCoreStressTest_/00001_core/data/index
[junit4:junit4]   2> 1371 T2995 oasc.SolrDeletionPolicy.onCommit SolrDeletionPolicy.onCommit: commits:num=1
[junit4:junit4]   2> 		commit{dir=MockDirWrapper(RateLimitedDirectoryWrapper(org.apache.lucene.store.SimpleFSDirectory@/usr/home/hudson/hudson-slave/workspace/Lucene-Solr-NightlyTests-trunk/solr/build/solr-core/test/J0/OpenCloseCoreStressTest_/00017_core/data/index lockFactory=org.apache.lucene.store.NativeFSLockFactory@33530123)),segFN=segments_1,generation=1,filenames=[segments_1]
[junit4:junit4]   2> 1372 T2995 oasc.SolrDeletionPolicy.updateCommits newest commit = 1[segments_1]
[junit4:junit4]   2> 1372 T2952 oass.IndexSchema.readSchema unique key field: id
[junit4:junit4]   2> 1372 T2994 oasc.SolrCore.initIndex WARNING [00018_core] Solr index directory '/usr/home/hudson/hudson-slave/workspace/Lucene-Solr-NightlyTests-trunk/solr/build/solr-core/test/J0/OpenCloseCoreStressTest_/00018_core/data/index' doesn't exist. Creating new index...
[junit4:junit4]   2> 1374 T2994 oasc.CachingDirectoryFactory.get return new directory for /usr/home/hudson/hudson-slave/workspace/Lucene-Solr-NightlyTests-trunk/solr/build/solr-core/test/J0/OpenCloseCoreStressTest_/00018_core/data/index
[junit4:junit4]   2> 1374 T2951 oasc.SolrDeletionPolicy.onCommit SolrDeletionPolicy.onCommit: commits:num=1
[junit4:junit4]   2> 		commit{dir=MockDirWrapper(RateLimitedDirectoryWrapper(org.apache.lucene.store.SimpleFSDirectory@/usr/home/hudson/hudson-slave/workspace/Lucene-Solr-NightlyTests-trunk/solr/build/solr-core/test/J0/OpenCloseCoreStressTest_/00006_core/data/index lockFactory=org.apache.lucene.store.NativeFSLockFactory@22f50882)),segFN=segments_1,generation=1,filenames=[segments_1]
[junit4:junit4]   2> 1374 T2953 oasc.SolrDeletionPolicy.onCommit SolrDeletionPolicy.onCommit: commits:num=1
[junit4:junit4]   2> 		commit{dir=MockDirWrapper(RateLimitedDirectoryWrapper(org.apache.lucene.store.SimpleFSDirectory@/usr/home/hudson/hudson-slave/workspace/Lucene-Solr-NightlyTests-trunk/solr/build/solr-core/test/J0/OpenCloseCoreStressTest_/00008_core/data/index lockFactory=org.apache.lucene.store.NativeFSLockFactory@32c37e1a)),segFN=segments_1,generation=1,filenames=[segments_1]
[junit4:junit4]   2> 1375 T2951 oasc.SolrDeletionPolicy.updateCommits newest commit = 1[segments_1]
[junit4:junit4]   2> 1375 T2953 oasc.SolrDeletionPolicy.updateCommits newest commit = 1[segments_1]
[junit4:junit4]   2> 1380 T2951 oasc.SolrCore.initWriters created json: solr.JSONResponseWriter
[junit4:junit4]   2> 1382 T2951 oasc.RequestHandlers.initHandlersFromConfig created /admin/: solr.admin.AdminHandlers
[junit4:junit4]   2> 1382 T2951 oasc.RequestHandlers.initHandlersFromConfig created /select: solr.SearchHandler
[junit4:junit4]   2> 1383 T2951 oasc.RequestHandlers.initHandlersFromConfig created /update: solr.UpdateRequestHandler
[junit4:junit4]   2> 1385 T2995 oasc.SolrCore.initWriters created json: solr.JSONResponseWriter
[junit4:junit4]   2> 1387 T2995 oasc.RequestHandlers.initHandlersFromConfig created /admin/: solr.admin.AdminHandlers
[junit4:junit4]   2> 1388 T2995 oasc.RequestHandlers.initHandlersFromConfig created /select: solr.SearchHandler
[junit4:junit4]   2> 1389 T2995 oasc.RequestHandlers.initHandlersFromConfig created /update: solr.UpdateRequestHandler
[junit4:junit4]   2> 1390 T2953 oasc.SolrCore.initWriters created json: solr.JSONResponseWriter
[junit4:junit4]   2> 1391 T3010 oass.IndexSchema.readSchema Schema name=tiny
[junit4:junit4]   2> 1392 T2953 oasc.RequestHandlers.initHandlersFromConfig created /admin/: solr.admin.AdminHandlers
[junit4:junit4]   2> 1393 T2953 oasc.RequestHandlers.initHandlersFromConfig created /select: solr.SearchHandler
[junit4:junit4]   2> 1394 T2953 oasc.RequestHandlers.initHandlersFromConfig created /update: solr.UpdateRequestHandler
[junit4:junit4]   2> 1394 T3005 oasc.SolrConfig.<init> Loaded SolrConfig: solrconfig-minimal.xml
[junit4:junit4]   2> 1394 T2952 oasc.SolrCore.initDirectoryFactory org.apache.solr.core.MockFSDirectoryFactory
[junit4:junit4]   2> 1396 T2952 oasc.SolrCore.<init> [00012_core] Opening new SolrCore at /usr/home/hudson/hudson-slave/workspace/Lucene-Solr-NightlyTests-trunk/solr/build/solr-core/test/J0/./OpenCloseCoreStressTest_/00012_core/, dataDir=/usr/home/hudson/hudson-slave/workspace/Lucene-Solr-NightlyTests-trunk/solr/build/solr-core/test/J0/OpenCloseCoreStressTest_/00012_core/data/
[junit4:junit4]   2> 1396 T3005 oass.IndexSchema.readSchema Reading Solr Schema
[junit4:junit4]   2> 1396 T2952 oasc.JmxMonitoredMap.<init> JMX monitoring is enabled. Adding Solr mbeans to JMX Server: com.sun.jmx.mbeanserver.JmxMBeanServer@1320e2db
[junit4:junit4]   2> 1397 T2952 oasc.SolrCore.initDirectoryFactory org.apache.solr.core.MockFSDirectoryFactory
[junit4:junit4]   2> 1399 T2952 oasc.CachingDirectoryFactory.get return new directory for /usr/home/hudson/hudson-slave/workspace/Lucene-Solr-NightlyTests-trunk/solr/build/solr-core/test/J0/OpenCloseCoreStressTest_/00012_core/data
[junit4:junit4]   2> 1400 T2952 oasc.SolrCore.getNewIndexDir New index directory detected: old=null new=/usr/home/hudson/hudson-slave/workspace/Lucene-Solr-NightlyTests-trunk/solr/build/solr-core/test/J0/OpenCloseCoreStressTest_/00012_core/data/index/
[junit4:junit4]   2> 1403 T2952 oasc.SolrCore.initIndex WARNING [00012_core] Solr index directory '/usr/home/hudson/hudson-slave/workspace/Lucene-Solr-NightlyTests-trunk/solr/build/solr-core/test/J0/OpenCloseCoreStressTest_/00012_core/data/index' doesn't exist. Creating new index...
[junit4:junit4]   2> 1403 T2952 oasc.CachingDirectoryFactory.get return new directory for /usr/home/hudson/hudson-slave/workspace/Lucene-Solr-NightlyTests-trunk/solr/build/solr-core/test/J0/OpenCloseCoreStressTest_/00012_core/data/index
[junit4:junit4]   2> 1403 T2954 oass.IndexSchema.readSchema unique key field: id
[junit4:junit4]   2> 1407 T2954 oasc.SolrCore.initDirectoryFactory org.apache.solr.core.MockFSDirectoryFactory
[junit4:junit4]   2> 1408 T2954 oasc.SolrCore.<init> [00019_core] Opening new SolrCore at /usr/home/hudson/hudson-slave/workspace/Lucene-Solr-NightlyTests-trunk/solr/build/solr-core/test/J0/./OpenCloseCoreStressTest_/00019_core/, dataDir=/usr/home/hudson/hudson-slave/workspace/Lucene-Solr-NightlyTests-trunk/solr/build/solr-core/test/J0/OpenCloseCoreStressTest_/00019_core/data/
[junit4:junit4]   2> 1409 T2954 oasc.JmxMonitoredMap.<init> JMX monitoring is enabled. Adding Solr mbeans to JMX Server: com.sun.jmx.mbeanserver.JmxMBeanServer@1320e2db
[junit4:junit4]   2> 1409 T2954 oasc.SolrCore.initDirectoryFactory org.apache.solr.core.MockFSDirectoryFactory
[junit4:junit4]   2> 1411 T2954 oasc.CachingDirectoryFactory.get return new directory for /usr/home/hudson/hudson-slave/workspace/Lucene-Solr-NightlyTests-trunk/solr/build/solr-core/test/J0/OpenCloseCoreStressTest_/00019_core/data
[junit4:junit4]   2> 1413 T2954 oasc.SolrCore.getNewIndexDir New index directory detected: old=null new=/usr/home/hudson/hudson-slave/workspace/Lucene-Solr-NightlyTests-trunk/solr/build/solr-core/test/J0/OpenCloseCoreStressTest_/00019_core/data/index/
[junit4:junit4]   2> 1414 T2954 oasc.SolrCore.initIndex WARNING [00019_core] Solr index directory '/usr/home/hudson/hudson-slave/workspace/Lucene-Solr-NightlyTests-trunk/solr/build/solr-core/test/J0/OpenCloseCoreStressTest_/00019_core/data/index' doesn't exist. Creating new index...
[junit4:junit4]   2> 1415 T2954 oasc.CachingDirectoryFactory.get return new directory for /usr/home/hudson/hudson-slave/workspace/Lucene-Solr-NightlyTests-trunk/solr/build/solr-core/test/J0/OpenCloseCoreStressTest_/00019_core/data/index
[junit4:junit4]   2> 1421 T2998 oasc.SolrDeletionPolicy.onCommit SolrDeletionPolicy.onCommit: commits:num=1
[junit4:junit4]   2> 		commit{dir=MockDirWrapper(RateLimitedDirectoryWrapper(org.apache.lucene.store.SimpleFSDirectory@/usr/home/hudson/hudson-slave/workspace/Lucene-Solr-NightlyTests-trunk/solr/build/solr-core/test/J0/OpenCloseCoreStressTest_/00005_core/data/index lockFactory=org.apache.lucene.store.NativeFSLockFactory@23fc0468)),segFN=segments_1,generation=1,filenames=[segments_1]
[junit4:junit4]   2> 1421 T2956 oasc.SolrDeletionPolicy.onCommit SolrDeletionPolicy.onCommit: commits:num=1
[junit4:junit4]   2> 		commit{dir=MockDirWrapper(RateLimitedDirectoryWrapper(org.apache.lucene.store.SimpleFSDirectory@/usr/home/hudson/hudson-slave/workspace/Lucene-Solr-NightlyTests-trunk/solr/build/solr-core/test/J0/OpenCloseCoreStressTest_/00003_core/data/index lockFactory=org.apache.lucene.store.NativeFSLockFactory@2246090c)),segFN=segments_1,generation=1,filenames=[segments_1]
[junit4:junit4]   2> 1421 T2996 oasc.SolrDeletionPolicy.onCommit SolrDeletionPolicy.onCommit: commits:num=1
[junit4:junit4]   2> 		commit{dir=MockDirWrapper(RateLimitedDirectoryWrapper(org.apache.lucene.store.SimpleFSDirectory@/usr/home/hudson/hudson-slave/workspace/Lucene-Solr-NightlyTests-trunk/solr/build/solr-core/test/J0/OpenCloseCoreStressTest_/00014_core/data/index lockFactory=org.apache.lucene.store.NativeFSLockFactory@7805463b)),segFN=segments_1,generation=1,filenames=[segments_1]
[junit4:junit4]   2> 1421 T2957 oasc.SolrDeletionPolicy.onCommit SolrDeletionPolicy.onCommit: commits:num=1
[junit4:junit4]   2> 		commit{dir=MockDirWrapper(RateLimitedDirectoryWrapper(org.apache.lucene.store.SimpleFSDirectory@/usr/home/hudson/hudson-slave/workspace/Lucene-Solr-NightlyTests-trunk/solr/build/solr-core/test/J0/OpenCloseCoreStressTest_/00010_core/data/index lockFactory=org.apache.lucene.store.NativeFSLockFactory@66edefe7)),segFN=segments_1,generation=1,filenames=[segments_1]
[junit4:junit4]   2> 1422 T2996 oasc.SolrDeletionPolicy.updateCommits newest commit = 1[segments_1]
[junit4:junit4]   2> 1423 T2957 oasc.SolrDeletionPolicy.updateCommits newest commit = 1[segments_1]
[junit4:junit4]   2> 1423 T2993 oasc.SolrDeletionPolicy.onCommit SolrDeletionPolicy.onCommit: commits:num=1
[junit4:junit4]   2> 		commit{dir=MockDirWrapper(RateLimitedDirectoryWrapper(org.apache.lucene.store.SimpleFSDirectory@/usr/home/hudson/hudson-slave/workspace/Lucene-Solr-NightlyTests-trunk/solr/build/solr-core/test/J0/OpenCloseCoreStressTest_/00013_core/data/index lockFactory=org.apache.lucene.store.NativeFSLockFactory@9a9bdd5)),segFN=segments_1,generation=1,filenames=[segments_1]
[junit4:junit4]   2> 1422 T2956 oasc.SolrDeletionPolicy.updateCommits newest commit = 1[segments_1]
[junit4:junit4]   2> 1423 T2998 oasc.SolrDeletionPolicy.updateCommits newest commit = 1[segments_1]
[junit4:junit4]   2> 1424 T2993 oasc.SolrDeletionPolicy.updateCommits newest commit = 1[segments_1]
[junit4:junit4]   2> 1429 T2998 oasc.SolrCore.initWriters created json: solr.JSONResponseWriter
[junit4:junit4]   2> 1431 T2998 oasc.RequestHandlers.initHandlersFromConfig created /admin/: solr.admin.AdminHandlers
[junit4:junit4]   2> 1432 T2998 oasc.RequestHandlers.initHandlersFromConfig created /select: solr.SearchHandler
[junit4:junit4]   2> 1433 T2998 oasc.RequestHandlers.initHandlersFromConfig created /update: solr.UpdateRequestHandler
[junit4:junit4]   2> 1433 T2957 oasc.SolrCore.initWriters created json: solr.JSONResponseWriter
[junit4:junit4]   2> 1433 T2996 oasc.SolrCore.initWriters created json: solr.JSONResponseWriter
[junit4:junit4]   2> 1436 T2957 oasc.RequestHandlers.initHandlersFromConfig created /admin/: solr.admin.AdminHandlers
[junit4:junit4]   2> 1436 T2996 oasc.RequestHandlers.initHandlersFromConfig created /admin/: solr.admin.AdminHandlers
[junit4:junit4]   2> 1437 T2957 oasc.RequestHandlers.initHandlersFromConfig created /select: solr.SearchHandler
[junit4:junit4]   2> 1437 T2996 oasc.RequestHandlers.initHandlersFromConfig created /select: solr.SearchHandler
[junit4:junit4]   2> 1437 T2956 oasc.SolrCore.initWriters created json: solr.JSONResponseWriter
[junit4:junit4]   2> 1437 T2993 oasc.SolrCore.initWriters created json: solr.JSONResponseWriter
[junit4:junit4]   2> 1438 T2957 oasc.RequestHandlers.initHandlersFromConfig created /update: solr.UpdateRequestHandler
[junit4:junit4]   2> 1438 T2996 oasc.RequestHandlers.initHandlersFromConfig created /update: solr.UpdateRequestHandler
[junit4:junit4]   2> 1439 T2956 oasc.RequestHandlers.initHandlersFromConfig created /admin/: solr.admin.AdminHandlers
[junit4:junit4]   2> 1439 T2993 oasc.RequestHandlers.initHandlersFromConfig created /admin/: solr.admin.AdminHandlers
[junit4:junit4]   2> 1440 T2956 oasc.RequestHandlers.initHandlersFromConfig created /select: solr.SearchHandler
[junit4:junit4]   2> 1440 T2993 oasc.RequestHandlers.initHandlersFromConfig created /select: solr.SearchHandler
[junit4:junit4]   2> 1441 T2956 oasc.RequestHandlers.initHandlersFromConfig created /update: solr.UpdateRequestHandler
[junit4:junit4]   2> 1441 T2993 oasc.RequestHandlers.initHandlersFromConfig created /update: solr.UpdateRequestHandler
[junit4:junit4]   2> 1442 T2995 oashl.XMLLoader.init xsltCacheLifetimeSeconds=60
[junit4:junit4]   2> 1443 T2951 oashl.XMLLoader.init xsltCacheLifetimeSeconds=60
[junit4:junit4]   2> 1448 T2953 oashl.XMLLoader.init xsltCacheLifetimeSeconds=60
[junit4:junit4]   2> 1449 T3005 oass.IndexSchema.readSchema Schema name=tiny
[junit4:junit4]   2> 1455 T2952 oasc.SolrDeletionPolicy.onCommit SolrDeletionPolicy.onCommit: commits:num=1
[junit4:junit4]   2> 		commit{dir=MockDirWrapper(RateLimitedDirectoryWrapper(org.apache.lucene.store.SimpleFSDirectory@/usr/home/hudson/hudson-slave/workspace/Lucene-Solr-NightlyTests-trunk/solr/build/solr-core/test/J0/OpenCloseCoreStressTest_/00012_core/data/index lockFactory=org.apache.lucene.store.NativeFSLockFactory@b4c9830)),segFN=segments_1,generation=1,filenames=[segments_1]
[junit4:junit4]   2> 1455 T3007 oass.IndexSchema.readSchema unique key field: id
[junit4:junit4]   2> 1455 T2955 oasc.SolrDeletionPolicy.onCommit SolrDeletionPolicy.onCommit: commits:num=1
[junit4:junit4]   2> 		commit{dir=MockDirWrapper(RateLimitedDirectoryWrapper(org.apache.lucene.store.SimpleFSDirectory@/usr/home/hudson/hudson-slave/workspace/Lucene-Solr-NightlyTests-trunk/solr/build/solr-core/test/J0/OpenCloseCoreStressTest_/00001_core/data/index lockFactory=org.apache.lucene.store.NativeFSLockFactory@7e90f16f)),segFN=segments_1,generation=1,filenames=[segments_1]
[junit4:junit4]   2> 1455 T2994 oasc.SolrDeletionPolicy.onCommit SolrDeletionPolicy.onCommit: commits:num=1
[junit4:junit4]   2> 		commit{dir=MockDirWrapper(RateLimitedDirectoryWrapper(org.apache.lucene.store.SimpleFSDirectory@/usr/home/hudson/hudson-slave/workspace/Lucene-Solr-NightlyTests-trunk/solr/build/solr-core/test/J0/OpenCloseCoreStressTest_/00018_core/data/index lockFactory=org.apache.lucene.store.NativeFSLockFactory@4f672c5a)),segFN=segments_1,generation=1,filenames=[segments_1]
[junit4:junit4]   2> 1455 T2952 oasc.SolrDeletionPolicy.updateCommits newest commit = 1[segments_1]
[junit4:junit4]   2> 1458 T2994 oasc.SolrDeletionPolicy.updateCommits newest commit = 1[segments_1]
[junit4:junit4]   2> 1457 T2955 oasc.SolrDeletionPolicy.updateCommits newest commit = 1[segments_1]
[junit4:junit4]   2> 1460 T3001 oass.IndexSchema.readSchema unique key field: id
[junit4:junit4]   2> 1462 T3007 oasc.SolrCore.initDirectoryFactory org.apache.solr.core.MockFSDirectoryFactory
[junit4:junit4]   2> 1465 T3007 oasc.SolrCore.<init> [00007_core] Opening new SolrCore at /usr/home/hudson/hudson-slave/workspace/Lucene-Solr-NightlyTests-trunk/solr/build/solr-core/test/J0/./OpenCloseCoreStressTest_/00007_core/, dataDir=/usr/home/hudson/hudson-slave/workspace/Lucene-Solr-NightlyTests-trunk/solr/build/solr-core/test/J0/OpenCloseCoreStressTest_/00007_core/data/
[junit4:junit4]   2> 1465 T3007 oasc.JmxMonitoredMap.<init> JMX monitoring is enabled. Adding Solr mbeans to JMX Server: com.sun.jmx.mbeanserver.JmxMBeanServer@1320e2db
[junit4:junit4]   2> 1466 T3007 oasc.SolrCore.initDirectoryFactory org.apache.solr.core.MockFSDirectoryFactory
[junit4:junit4]   2> 1470 T2952 oasc.SolrCore.initWriters created json: solr.JSONResponseWriter
[junit4:junit4]   2> 1471 T3007 oasc.CachingDirectoryFactory.get return new directory for /usr/home/hudson/hudson-slave/workspace/Lucene-Solr-NightlyTests-trunk/solr/build/solr-core/test/J0/OpenCloseCoreStressTest_/00007_core/data
[junit4:junit4]   2> 1470 T2955 oasc.SolrCore.initWriters created json: solr.JSONResponseWriter
[junit4:junit4]   2> 1473 T2952 oasc.RequestHandlers.initHandlersFromConfig created /admin/: solr.admin.AdminHandlers
[junit4:junit4]   2> 1473 T2955 oasc.RequestHandlers.initHandlersFromConfig created /admin/: solr.admin.AdminHandlers
[junit4:junit4]   2> 1474 T2952 oasc.RequestHandlers.initHandlersFromConfig created /select: solr.SearchHandler
[junit4:junit4]   2> 1474 T2955 oasc.RequestHandlers.initHandlersFromConfig created /select: solr.SearchHandler
[junit4:junit4]   2> 1475 T2952 oasc.RequestHandlers.initHandlersFromConfig created /update: solr.UpdateRequestHandler
[junit4:junit4]   2> 1475 T2955 oasc.RequestHandlers.initHandlersFromConfig created /update: solr.UpdateRequestHandler
[junit4:junit4]   2> 1476 T3007 oasc.SolrCore.getNewIndexDir New index directory detected: old=null new=/usr/home/hudson/hudson-slave/workspace/Lucene-Solr-NightlyTests-trunk/solr/build/solr-core/test/J0/OpenCloseCoreStressTest_/00007_core/data/index/
[junit4:junit4]   2> 1479 T2994 oasc.SolrCore.initWriters created json: solr.JSONResponseWriter
[junit4:junit4]   2> 1480 T2954 oasc.SolrDeletionPolicy.onCommit SolrDeletionPolicy.onCommit: commits:num=1
[junit4:junit4]   2> 		commit{dir=MockDirWrapper(RateLimitedDirectoryWrapper(org.apache.lucene.store.SimpleFSDirectory@/usr/home/hudson/hudson-slave/workspace/Lucene-Solr-NightlyTests-trunk/solr/build/solr-core/test/J0/OpenCloseCoreStressTest_/00019_core/data/index lockFactory=org.apache.lucene.store.NativeFSLockFactory@22399265)),segFN=segments_1,generation=1,filenames=[segments_1]
[junit4:junit4]   2> 1479 T2951 oass.SolrIndexSearcher.<init> Opening Searcher@421e7dce main
[junit4:junit4]   2> 1481 T2954 oasc.SolrDeletionPolicy.updateCommits newest commit = 1[segments_1]
[junit4:junit4]   2> 1479 T2995 oass.SolrIndexSearcher.<init> Opening Searcher@3a1b9414 main
[junit4:junit4]   2> 1481 T3007 oasc.SolrCore.initIndex WARNING [00007_core] Solr index directory '/usr/home/hudson/hudson-slave/workspace/Lucene-Solr-NightlyTests-trunk/solr/build/solr-core/test/J0/OpenCloseCoreStressTest_/00007_core/data/index' doesn't exist. Creating new index...
[junit4:junit4]   2> 1482 T2951 oasc.SolrCore.registerSearcher [00006_core] Registered new searcher Searcher@421e7dce main{StandardDirectoryReader(segments_1:1)}
[junit4:junit4]   2> 1482 T2994 oasc.RequestHandlers.initHandlersFromConfig created /admin/: solr.admin.AdminHandlers
[junit4:junit4]   2> 1483 T2951 oasu.CommitTracker.<init> Hard AutoCommit: disabled
[junit4:junit4]   2> 1483 T2994 oasc.RequestHandlers.initHandlersFromConfig created /select: solr.SearchHandler
[junit4:junit4]   2> 1483 T2995 oasc.SolrCore.registerSearcher [00017_core] Registered new searcher Searcher@3a1b9414 main{StandardDirectoryReader(segments_1:1)}
[junit4:junit4]   2> 1484 T3007 oasc.CachingDirectoryFactory.get return new directory for /usr/home/hudson/hudson-slave/workspace/Lucene-Solr-NightlyTests-trunk/solr/build/solr-core/test/J0/OpenCloseCoreStressTest_/00007_core/data/index
[junit4:junit4]   2> 1484 T2994 oasc.RequestHandlers.initHandlersFromConfig created /update: solr.UpdateRequestHandler
[junit4:junit4]   2> 1483 T2953 oass.SolrIndexSearcher.<init> Opening Searcher@3287d9bd main
[junit4:junit4]   2> 1483 T2951 oasu.CommitTracker.<init> Soft AutoCommit: disabled
[junit4:junit4]   2> 1484 T2995 oasu.CommitTracker.<init> Hard AutoCommit: disabled
[junit4:junit4]   2> 1487 T2995 oasu.CommitTracker.<init> Soft AutoCommit: disabled
[junit4:junit4]   2> 1487 T2953 oasc.SolrCore.registerSearcher [00008_core] Registered new searcher Searcher@3287d9bd main{StandardDirectoryReader(segments_1:1)}
[junit4:junit4]   2> 1488 T2953 oasu.CommitTracker.<init> Hard AutoCommit: disabled
[junit4:junit4]   2> 1489 T2953 oasu.CommitTracker.<init> Soft AutoCommit: disabled
[junit4:junit4]   2> 1494 T2951 oasc.CoreMaps.putTransientCore Opening transient core 00006_core
[junit4:junit4]   2> 1495 T2951 oasc.CoreContainer.registerCore registering core: 00006_core
[junit4:junit4]   2> 1497 T2995 oasc.CoreMaps.putTransientCore Opening transient core 00017_core
[junit4:junit4]   2> 1497 T2953 oasc.CoreMaps.putTransientCore Opening transient core 00008_core
[junit4:junit4]   2> 1498 T2995 oasc.CoreContainer.registerCore registering core: 00017_core
[junit4:junit4]   2> 1498 T2953 oasc.CoreContainer.registerCore registering core: 00008_core
[junit4:junit4]   2> 1507 T2954 oasc.SolrCore.initWriters created json: solr.JSONResponseWriter
[junit4:junit4]   2> 1510 T2954 oasc.RequestHandlers.initHandlersFromConfig created /admin/: solr.admin.AdminHandlers
[junit4:junit4]   2> 1510 T2954 oasc.RequestHandlers.initHandlersFromConfig created /select: solr.SearchHandler
[junit4:junit4]   2> 1511 T2954 oasc.RequestHandlers.initHandlersFromConfig created /update: solr.UpdateRequestHandler
[junit4:junit4]   2> 1516 T3001 oasc.SolrCore.initDirectoryFactory org.apache.solr.core.MockFSDirectoryFactory
[junit4:junit4]   2> 1518 T3001 oasc.SolrCore.<init> [00015_core] Opening new SolrCore at /usr/home/hudson/hudson-slave/workspace/Lucene-Solr-NightlyTests-trunk/solr/build/solr-core/test/J0/./OpenCloseCoreStressTest_/00015_core/, dataDir=/usr/home/hudson/hudson-slave/workspace/Lucene-Solr-NightlyTests-trunk/solr/build/solr-core/test/J0/OpenCloseCoreStressTest_/00015_core/data/
[junit4:junit4]   2> 1525 T3007 oasc.SolrDeletionPolicy.onCommit SolrDeletionPolicy.onCommit: commits:num=1
[junit4:junit4]   2> 		commit{dir=MockDirWrapper(RateLimitedDirectoryWrapper(org.apache.lucene.store.SimpleFSDirectory@/usr/home/hudson/hudson-slave/workspace/Lucene-Solr-NightlyTests-trunk/solr/build/solr-core/test/J0/OpenCloseCoreStressTest_/00007_core/data/index lockFactory=org.apache.lucene.store.NativeFSLockFactory@48ef57d)),segFN=segments_1,generation=1,filenames=[segments_1]
[junit4:junit4]   2> 1526 T3001 oasc.JmxMonitoredMap.<init> JMX monitoring is enabled. Adding Solr mbeans to JMX Server: com.sun.jmx.mbeanserver.JmxMBeanServer@1320e2db
[junit4:junit4]   2> 1526 T3007 oasc.SolrDeletionPolicy.updateCommits newest commit = 1[segments_1]
[junit4:junit4]   2> 1526 T3001 oasc.SolrCore.initDirectoryFactory org.apache.solr.core.MockFSDirectoryFactory
[junit4:junit4]   2> 1531 T3001 oasc.CachingDirectoryFactory.get return new directory for /usr/home/hudson/hudson-slave/workspace/Lucene-Solr-NightlyTests-trunk/solr/build/solr-core/test/J0/OpenCloseCoreStressTest_/00015_core/data
[junit4:junit4]   2> 1534 T3007 oasc.SolrCore.initWriters created json: solr.JSONResponseWriter
[junit4:junit4]   2> 1536 T3007 oasc.RequestHandlers.initHandlersFromConfig created /admin/: solr.admin.AdminHandlers
[junit4:junit4]   2> 1537 T3007 oasc.RequestHandlers.initHandlersFromConfig created /select: solr.SearchHandler
[junit4:junit4]   2> 1538 T3007 oasc.RequestHandlers.initHandlersFromConfig created /update: solr.UpdateRequestHandler
[junit4:junit4]   2> 1539 T3001 oasc.SolrCore.getNewIndexDir New index directory detected: old=null new=/usr/home/hudson/hudson-slave/workspace/Lucene-Solr-NightlyTests-trunk/solr/build/solr-core/test/J0/OpenCloseCoreStressTest_/00015_core/data/index/
[junit4:junit4]   2> 1548 T3001 oasc.SolrCore.initIndex WARNING [00015_core] Solr index directory '/usr/home/hudson/hudson-slave/workspace/Lucene-Solr-NightlyTests-trunk/solr/build/solr-core/test/J0/OpenCloseCoreStressTest_/00015_core/data/index' doesn't exist. Creating new index...
[junit4:junit4]   2> 1550 T3001 oasc.CachingDirectoryFactory.get return new directory for /usr/home/hudson/hudson-slave/workspace/Lucene-Solr-NightlyTests-trunk/solr/build/solr-core/test/J0/OpenCloseCoreStressTest_/00015_core/data/index
[junit4:junit4]   2> 1563 T2957 oashl.XMLLoader.init xsltCacheLifetimeSeconds=60
[junit4:junit4]   2> 1565 T2996 oashl.XMLLoader.init xsltCacheLifetimeSeconds=60
[junit4:junit4]   2> 1567 T3010 oass.IndexSchema.readSchema unique key field: id
[junit4:junit4]   2> 1563 T2956 oashl.XMLLoader.init xsltCacheLifetimeSeconds=60
[junit4:junit4]   2> 1571 T2998 oashl.XMLLoader.init xsltCacheLifetimeSeconds=60
[junit4:junit4]   2> ASYNC  NEW_CORE C147 name=00008_core org.apache.solr.core.SolrCore@6868339b
[junit4:junit4]   2> 1572 T3000 C147 REQ [00008_core] webapp=/solr path=/select params={q=*:*&wt=javabin&qt=/select&version=2} hits=0 status=0 QTime=0 
[junit4:junit4]   2> ASYNC  NEW_CORE C148 name=00006_core org.apache.solr.core.SolrCore@75634c34
[junit4:junit4]   2> 1572 T3006 C148 REQ [00006_core] webapp=/solr path=/select params={q=*:*&wt=javabin&qt=/select&version=2} hits=0 status=0 QTime=1 
[junit4:junit4]   2> 1573 T3010 oasc.SolrCore.initDirectoryFactory org.apache.solr.core.MockFSDirectoryFactory
[junit4:junit4]   2> 1575 T3010 oasc.SolrCore.<init> [00016_core] Opening new SolrCore at /usr/home/hudson/hudson-slave/workspace/Lucene-Solr-NightlyTests-trunk/solr/build/solr-core/test/J0/./OpenCloseCoreStressTest_/00016_core/, dataDir=/usr/home/hudson/hudson-slave/workspace/Lucene-Solr-NightlyTests-trunk/solr/build/solr-core/test/J0/OpenCloseCoreStressTest_/00016_core/data/
[junit4:junit4]   2> 1576 T3010 oasc.JmxMonitoredMap.<init> JMX monitoring is enabled. Adding Solr mbeans to JMX Server: com.sun.jmx.mbeanserver.JmxMBeanServer@1320e2db
[junit4:junit4]   2> 1576 T3010 oasc.SolrCore.initDirectoryFactory org.apache.solr.core.MockFSDirectoryFactory
[junit4:junit4]   2> 1578 T2993 oashl.XMLLoader.init xsltCacheLifetimeSeconds=60
[junit4:junit4]   2> 1580 T3010 oasc.CachingDirectoryFactory.get return new directory for /usr/home/hudson/hudson-slave/workspace/Lucene-Solr-NightlyTests-trunk/solr/build/solr-core/test/J0/OpenCloseCoreStressTest_/00016_core/data
[junit4:junit4]   2> 1587 T3010 oasc.SolrCore.getNewIndexDir New index directory detected: old=null new=/usr/home/hudson/hudson-slave/workspace/Lucene-Solr-NightlyTests-trunk/solr/build/solr-core/test/J0/OpenCloseCoreStressTest_/00016_core/data/index/
[junit4:junit4]   2> 1594 T3010 oasc.SolrCore.initIndex WARNING [00016_core] Solr index directory '/usr/home/hudson/hudson-slave/workspace/Lucene-Solr-NightlyTests-trunk/solr/build/solr-core/test/J0/OpenCloseCoreStressTest_/00016_core/data/index' doesn't exist. Creating new index...
[junit4:junit4]   2> 1594 T3001 oasc.SolrDeletionPolicy.onCommit SolrDeletionPolicy.onCommit: commits:num=1
[junit4:junit4]   2> 		commit{dir=MockDirWrapper(RateLimitedDirectoryWrapper(org.apache.lucene.store.SimpleFSDirectory@/usr/home/hudson/hudson-slave/workspace/Lucene-Solr-NightlyTests-trunk/solr/build/solr-core/test/J0/OpenCloseCoreStressTest_/00015_core/data/index lockFactory=org.apache.lucene.store.NativeFSLockFactory@544df234)),segFN=segments_1,generation=1,filenames=[segments_1]
[junit4:junit4]   2> 1594 T3001 oasc.SolrDeletionPolicy.updateCommits newest commit = 1[segments_1]
[junit4:junit4]   2> 1595 T3010 oasc.CachingDirectoryFactory.get return new directory for /usr/home/hudson/hudson-slave/workspace/Lucene-Solr-NightlyTests-trunk/solr/build/solr-core/test/J0/OpenCloseCoreStressTest_/00016_core/data/index
[junit4:junit4]   2> 1603 T3001 oasc.SolrCore.initWriters created json: solr.JSONResponseWriter
[junit4:junit4]   2> 1603 T2956 oass.SolrIndexSearcher.<init> Opening Searcher@2b0614c3 main
[junit4:junit4]   2> 1605 T2957 oass.SolrIndexSearcher.<init> Opening Searcher@186786aa main
[junit4:junit4]   2> 1606 T3001 oasc.RequestHandlers.initHandlersFromConfig created /admin/: solr.admin.AdminHandlers
[junit4:junit4]   2> 1606 T2996 oass.SolrIndexSearcher.<init> Opening Searcher@7ee1ecd5 main
[junit4:junit4]   2> 1606 T2998 oass.SolrIndexSearcher.<init> Opening Searcher@7d16d044 main
[junit4:junit4]   2> 1606 T2957 oasc.SolrCore.registerSearcher [00010_core] Registered new searcher Searcher@186786aa main{StandardDirectoryReader(segments_1:1)}
[junit4:junit4]   2> 1607 T3001 oasc.RequestHandlers.initHandlersFromConfig created /select: solr.SearchHandler
[junit4:junit4]   2> 1607 T2996 oasc.SolrCore.registerSearcher [00014_core] Registered new searcher Searcher@7ee1ecd5 main{StandardDirectoryReader(segments_1:1)}
[junit4:junit4]   2> 1607 T2998 oasc.SolrCore.registerSearcher [00005_core] Registered new searcher Searcher@7d16d044 main{StandardDirectoryReader(segments_1:1)}
[junit4:junit4]   2> 1607 T2957 oasu.CommitTracker.<init> Hard AutoCommit: disabled
[junit4:junit4]   2> 1608 T2996 oasu.CommitTracker.<init> Hard AutoCommit: disabled
[junit4:junit4]   2> 1608 T3001 oasc.RequestHandlers.initHandlersFromConfig created /update: solr.UpdateRequestHandler
[junit4:junit4]   2> 1608 T2957 oasu.CommitTracker.<init> Soft AutoCommit: disabled
[junit4:junit4]   2> 1608 T2996 oasu.CommitTracker.<init> Soft AutoCommit: disabled
[junit4:junit4]   2> 1607 T2956 oasc.SolrCore.registerSearcher [00003_core] Registered new searcher Searcher@2b0614c3 main{StandardDirectoryReader(segments_1:1)}
[junit4:junit4]   2> 1609 T2956 oasu.CommitTracker.<init> Hard AutoCommit: disabled
[junit4:junit4]   2> 1608 T2998 oasu.CommitTracker.<init> Hard AutoCommit: disabled
[junit4:junit4]   2> 1610 T2956 oasu.CommitTracker.<init> Soft AutoCommit: disabled
[junit4:junit4]   2> 1610 T2998 oasu.CommitTracker.<init> Soft AutoCommit: disabled
[junit4:junit4]   2> 1612 T2953 C147 oasc.SolrDeletionPolicy.onInit SolrDeletionPolicy.onInit: commits:num=1
[junit4:junit4]   2> 		commit{dir=MockDirWrapper(RateLimitedDirectoryWrapper(org.apache.lucene.store.SimpleFSDirectory@/usr/home/hudson/hudson-slave/workspace/Lucene-Solr-NightlyTests-trunk/solr/build/solr-core/test/J0/OpenCloseCoreStressTest_/00008_core/data/index lockFactory=org.apache.lucene.store.NativeFSLockFactory@32c37e1a)),segFN=segments_1,generation=1,filenames=[segments_1]
[junit4:junit4]   2> 1615 T2953 C147 oasc.SolrDeletionPolicy.updateCommits newest commit = 1[segments_1]
[junit4:junit4]   2> 1615 T2997 C148 oasc.SolrDeletionPolicy.onInit SolrDeletionPolicy.onInit: commits:num=1
[junit4:junit4]   2> 		commit{dir=MockDirWrapper(RateLimitedDirectoryWrapper(org.apache.lucene.store.SimpleFSDirectory@/usr/home/hudson/hudson-slave/workspace/Lucene-Solr-NightlyTests-trunk/solr/build/solr-core/test/J0/OpenCloseCoreStressTest_/00006_core/data/index lockFactory=org.apache.lucene.store.NativeFSLockFactory@22f50882)),segFN=segments_1,generation=1,filenames=[segments_1]
[junit4:junit4]   2> ASYNC  NEW_CORE C149 name=00017_core org.apache.solr.core.SolrCore@27bb3c0c
[junit4:junit4]   2> 1615 T2995 C149 oasc.SolrDeletionPolicy.onInit SolrDeletionPolicy.onInit: commits:num=1
[junit4:junit4]   2> 		commit{dir=MockDirWrapper(RateLimitedDirectoryWrapper(org.apache.lucene.store.SimpleFSDirectory@/usr/home/hudson/hudson-slave/workspace/Lucene-Solr-NightlyTests-trunk/solr/build/solr-core/test/J0/OpenCloseCoreStressTest_/00017_core/data/index lockFactory=org.apache.lucene.store.NativeFSLockFactory@33530123)),segFN=segments_1,generation=1,filenames=[segments_1]
[junit4:junit4]   2> 1616 T2993 oass.SolrIndexSearcher.<init> Opening Searcher@1b032464 main
[junit4:junit4]   2> 1617 T2957 oasc.CoreMaps.putTransientCore Opening transient core 00010_core
[junit4:junit4]   2> 1617 T2995 C149 oasc.SolrDeletionPolicy.updateCommits newest commit = 1[segments_1]
[junit4:junit4]   2> 1617 T2997 C148 oasc.SolrDeletionPolicy.updateCommits newest commit = 1[segments_1]
[junit4:junit4]   2> 1617 T2957 oasc.CoreContainer.registerCore registering core: 00010_core
[junit4:junit4]   2> 1619 T2956 oasc.CoreMaps.putTransientCore Opening transient core 00003_core
[junit4:junit4]   2> 1616 T2996 oasc.CoreMaps.putTransientCore Opening transient core 00014_core
[junit4:junit4]   2> 1619 T2956 oasc.CoreContainer.registerCore registering core: 00003_core
[junit4:junit4]   2> 1619 T2996 oasc.CoreContainer.registerCore registering core: 00014_core
[junit4:junit4]   2> 1619 T2993 oasc.SolrCore.registerSearcher [00013_core] Registered new searcher Searcher@1b032464 main{StandardDirectoryReader(segments_1:1)}
[junit4:junit4]   2> 1624 T2993 oasu.CommitTracker.<init> Hard AutoCommit: disabled
[junit4:junit4]   2> 1625 T2993 oasu.CommitTracker.<init> Soft AutoCommit: disabled
[junit4:junit4]   2> 1625 T2995 C149 UPDATE [00017_core] webapp=/solr path=/update params={wt=javabin&version=2} {add=[id12]} 0 48
[junit4:junit4]   2> 1619 T2998 oasc.CoreMaps.putTransientCore Opening transient core 00005_core
[junit4:junit4]   2> 1626 T2998 oasc.CoreContainer.registerCore registering core: 00005_core
[junit4:junit4]   2> 1619 T2953 C147 UPDATE [00008_core] webapp=/solr path=/update params={wt=javabin&version=2} {add=[id1]} 0 48
[junit4:junit4]   2> 1631 T2993 oasc.CoreMaps.putTransientCore Opening transient core 00013_core
[junit4:junit4]   2> 1631 T2993 oasc.CoreContainer.registerCore registering core: 00013_core
[junit4:junit4]   2> 1636 T3010 oasc.SolrDeletionPolicy.onCommit SolrDeletionPolicy.onCommit: commits:num=1
[junit4:junit4]   2> 		commit{dir=MockDirWrapper(RateLimitedDirectoryWrapper(org.apache.lucene.store.SimpleFSDirectory@/usr/home/hudson/hudson-slave/workspace/Lucene-Solr-NightlyTests-trunk/solr/build/solr-core/test/J0/OpenCloseCoreStressTest_/00016_core/data/index lockFactory=org.apache.lucene.store.NativeFSLockFactory@76fff18d)),segFN=segments_1,generation=1,filenames=[segments_1]
[junit4:junit4]   2> 1636 T2997 C148 UPDATE [00006_core] webapp=/solr path=/update params={wt=javabin&version=2} {add=[id13]} 0 64
[junit4:junit4]   2> 1637 T2994 oashl.XMLLoader.init xsltCacheLifetimeSeconds=60
[junit4:junit4]   2> 1636 T3010 oasc.SolrDeletionPolicy.updateCommits newest commit = 1[segments_1]
[junit4:junit4]   2> 1639 T2954 oashl.XMLLoader.init xsltCacheLifetimeSeconds=60
[junit4:junit4]   2> 1638 T2955 oashl.XMLLoader.init xsltCacheLifetimeSeconds=60
[junit4:junit4]   2> 1638 T2952 oashl.XMLLoader.init xsltCacheLifetimeSeconds=60
[junit4:junit4]   2> 1638 T2951 C148 UPDATE [00006_core] webapp=/solr path=/update params={wt=javabin&version=2} {add=[id4]} 0 63
[junit4:junit4]   2> 1644 T2997 C147 UPDATE [00008_core] webapp=/solr path=/update params={wt=javabin&version=2} {add=[id18]} 0 1
[junit4:junit4]   2> 1650 T3010 oasc.SolrCore.initWriters created json: solr.JSONResponseWriter
[junit4:junit4]   2> 1653 T3010 oasc.RequestHandlers.initHandlersFromConfig created /admin/: solr.admin.AdminHandlers
[junit4:junit4]   2> 1653 T3010 oasc.RequestHandlers.initHandlersFromConfig created /select: solr.SearchHandler
[junit4:junit4]   2> 1654 T3010 oasc.RequestHandlers.initHandlersFromConfig created /update: solr.UpdateRequestHandler
[junit4:junit4]   2> ASYNC  NEW_CORE C150 name=00005_core org.apache.solr.core.SolrCore@4a5a6051
[junit4:junit4]   2> 1669 T3012 C150 REQ [00005_core] webapp=/solr path=/select params={q=*:*&wt=javabin&qt=/select&version=2} hits=0 status=0 QTime=0 
[junit4:junit4]   2> ASYNC  NEW_CORE C151 name=00003_core org.apache.solr.core.SolrCore@4200873b
[junit4:junit4]   2> 1672 T3004 C151 REQ [00003_core] webapp=/solr path=/select params={q=*:*&wt=javabin&qt=/select&version=2} hits=0 status=0 QTime=0 
[junit4:junit4]   2> ASYNC  NEW_CORE C152 name=00010_core org.apache.solr.core.SolrCore@59ca3022
[junit4:junit4]   2> 1677 T3002 C152 REQ [00010_core] webapp=/solr path=/select params={q=*:*&wt=javabin&qt=/select&version=2} hits=0 status=0 QTime=1 
[junit4:junit4]   2> 1677 T3000 C152 REQ [00010_core] webapp=/solr path=/select params={q=*:*&wt=javabin&qt=/select&version=2} hits=0 status=0 QTime=0 
[junit4:junit4]   2> 1678 T3008 C151 REQ [00003_core] webapp=/solr path=/select params={q=*:*&wt=javabin&qt=/select&version=2} hits=0 status=0 QTime=0 
[junit4:junit4]   2> 1679 T3003 C150 REQ [00005_core] webapp=/solr path=/select params={q=*:*&wt=javabin&qt=/select&version=2} hits=0 status=0 QTime=0 
[junit4:junit4]   2> ASYNC  NEW_CORE C153 name=00013_core org.apache.solr.core.SolrCore@2c7031cf
[junit4:junit4]   2> 1680 T2999 C153 REQ [00013_core] webapp=/solr path=/select params={q=*:*&wt=javabin&qt=/select&version=2} hits=0 status=0 QTime=0 
[junit4:junit4]   2> 1688 T2954 oass.SolrIndexSearcher.<init> Opening Searcher@377fa37a main
[junit4:junit4]   2> 1689 T2954 oasc.SolrCore.registerSearcher [00019_core] Registered new searcher Searcher@377fa37a main{StandardDirectoryReader(segments_1:1)}
[junit4:junit4]   2> 1690 T2954 oasu.CommitTracker.<init> Hard AutoCommit: disabled
[junit4:junit4]   2> 1690 T2954 oasu.CommitTracker.<init> Soft AutoCommit: disabled
[junit4:junit4]   2> 1691 T2952 oass.SolrIndexSearcher.<init> Opening Searcher@3c98973a main
[junit4:junit4]   2> 1691 T2994 oass.SolrIndexSearcher.<init> Opening Searcher@6b328d91 main
[junit4:junit4]   2> 1692 T2955 oass.SolrIndexSearcher.<init> Opening Searcher@389e291e main
[junit4:junit4]   2> 1692 T2952 oasc.SolrCore.registerSearcher [00012_core] Registered new searcher Searcher@3c98973a main{StandardDirectoryReader(segments_1:1)}
[junit4:junit4]   2> 1692 T2994 oasc.SolrCore.registerSearcher [00018_core] Registered new searcher Searcher@6b328d91 main{StandardDirectoryReader(segments_1:1)}
[junit4:junit4]   2> 1693 T2952 oasu.CommitTracker.<init> Hard AutoCommit: disabled
[junit4:junit4]   2> 1693 T2994 oasu.CommitTracker.<init> Hard AutoCommit: disabled
[junit4:junit4]   2> 1693 T2955 oasc.SolrCore.registerSearcher [00001_core] Registered new searcher Searcher@389e291e main{StandardDirectoryReader(segments_1:1)}
[junit4:junit4]   2> 1693 T2994 oasu.CommitTracker.<init> Soft AutoCommit: disabled
[junit4:junit4]   2> 1693 T2952 oasu.CommitTracker.<init> Soft AutoCommit: disabled
[junit4:junit4]   2> 1694 T2955 oasu.CommitTracker.<init> Hard AutoCommit: disabled
[junit4:junit4]   2> 1694 T2955 oasu.CommitTracker.<init> Soft AutoCommit: disabled
[junit4:junit4]   2> 1696 T3005 oass.IndexSchema.readSchema unique key field: id
[junit4:junit4]   2> 1697 T2954 oasc.CoreMaps.putTransientCore Opening transient core 00019_core
[junit4:junit4]   2> 1697 T2954 oasc.CoreContainer.registerCore registering core: 00019_core
[junit4:junit4]   2> 1699 T2952 oasc.CoreMaps.putTransientCore Opening transient core 00012_core
[junit4:junit4]   2> 1699 T2952 oasc.CoreContainer.registerCore registering core: 00012_core
[junit4:junit4]   2> 1700 T3005 oasc.SolrCore.initDirectoryFactory org.apache.solr.core.MockFSDirectoryFactory
[junit4:junit4]   2> 1700 T2994 oasc.CoreMaps.putTransientCore Opening transient core 00018_core
[junit4:junit4]   2> 1701 T2994 oasc.CoreContainer.registerCore registering core: 00018_core
[junit4:junit4]   2> 1701 T2955 oasc.CoreMaps.putTransientCore Opening transient core 00001_core
[junit4:junit4]   2> 1701 T2955 oasc.CoreContainer.registerCore registering core: 00001_core
[junit4:junit4]   2> 1702 T2957 C152 oasc.SolrDeletionPolicy.onInit SolrDeletionPolicy.onInit: commits:num=1
[junit4:junit4]   2> 		commit{dir=MockDirWrapper(RateLimitedDirectoryWrapper(org.apache.lucene.store.SimpleFSDirectory@/usr/home/hudson/hudson-slave/workspace/Lucene-Solr-NightlyTests-trunk/solr/build/solr-core/test/J0/OpenCloseCoreStressTest_/00010_core/data/index lockFactory=org.apache.lucene.store.NativeFSLockFactory@66edefe7)),segFN=segments_1,generation=1,filenames=[segments_1]
[junit4:junit4]   2> 1700 T2956 C151 oasc.SolrDeletionPolicy.onInit SolrDeletionPolicy.onInit: commits:num=1
[junit4:junit4]   2> 		commit{dir=MockDirWrapper(RateLimitedDirectoryWrapper(org.apache.lucene.store.SimpleFSDirectory@/usr/home/hudson/hudson-slave/workspace/Lucene-Solr-NightlyTests-trunk/solr/build/solr-core/test/J0/OpenCloseCoreStressTest_/00003_core/data/index lockFactory=org.apache.lucene.store.NativeFSLockFactory@2246090c)),segFN=segments_1,generation=1,filenames=[segments_1]
[junit4:junit4]   2> 1703 T3005 oasc.SolrCore.<init> [00011_core] Opening new SolrCore at /usr/home/hudson/hudson-slave/workspace/Lucene-Solr-NightlyTests-trunk/solr/build/solr-core/test/J0/./OpenCloseCoreStressTest_/00011_core/, dataDir=/usr/home/hudson/hudson-slave/workspace/Lucene-Solr-NightlyTests-trunk/solr/build/solr-core/test/J0/OpenCloseCoreStressTest_/00011_core/data/
[junit4:junit4]   2> 1703 T2957 C152 oasc.SolrDeletionPolicy.updateCommits newest commit = 1[segments_1]
[junit4:junit4]   2> 1704 T2956 C151 oasc.SolrDeletionPolicy.updateCommits newest commit = 1[segments_1]
[junit4:junit4]   2> 1705 T3005 oasc.JmxMonitoredMap.<init> JMX monitoring is enabled. Adding Solr mbeans to JMX Server: com.sun.jmx.mbeanserver.JmxMBeanServer@1320e2db
[junit4:junit4]   2> 1705 T3007 oashl.XMLLoader.init xsltCacheLifetimeSeconds=60
[junit4:junit4]   2> 1705 T3005 oasc.SolrCore.initDirectoryFactory org.apache.solr.core.MockFSDirectoryFactory
[junit4:junit4]   2> ASYNC  NEW_CORE C154 name=00014_core org.apache.solr.core.SolrCore@5a96e453
[junit4:junit4]   2> 1706 T2996 C154 oasc.SolrDeletionPolicy.onInit SolrDeletionPolicy.onInit: commits:num=1
[junit4:junit4]   2> 		commit{dir=MockDirWrapper(RateLimitedDirectoryWrapper(org.apache.lucene.store.SimpleFSDirectory@/usr/home/hudson/hudson-slave/workspace/Lucene-Solr-NightlyTests-trunk/solr/build/solr-core/test/J0/OpenCloseCoreStressTest_/00014_core/data/index lockFactory=org.apache.lucene.store.NativeFSLockFactory@7805463b)),segFN=segments_1,generation=1,filenames=[segments_1]
[junit4:junit4]   2> 1707 T2996 C154 oasc.SolrDeletionPolicy.updateCommits newest commit = 1[segments_1]
[junit4:junit4]   2> 1707 T2998 C150 oasc.SolrDeletionPolicy.onInit SolrDeletionPolicy.onInit: commits:num=1
[junit4:junit4]   2> 		commit{dir=MockDirWrapper(RateLimitedDirectoryWrapper(org.apache.lucene.store.SimpleFSDirectory@/usr/home/hudson/hudson-slave/workspace/Lucene-Solr-NightlyTests-trunk/solr/build/solr-core/test/J0/OpenCloseCoreStressTest_/00005_core/data/index lockFactory=org.apache.lucene.store.NativeFSLockFactory@23fc0468)),segFN=segments_1,generation=1,filenames=[segments_1]
[junit4:junit4]   2> 1707 T3001 oashl.XMLLoader.init xsltCacheLifetimeSeconds=60
[junit4:junit4]   2> 1708 T2998 C150 oasc.SolrDeletionPolicy.updateCommits newest commit = 1[segments_1]
[junit4:junit4]   2> 1709 T3005 oasc.CachingDirectoryFactory.get return new directory for /usr/home/hudson/hudson-slave/workspace/Lucene-Solr-NightlyTests-trunk/solr/build/solr-core/test/J0/OpenCloseCoreStressTest_/00011_core/data
[junit4:junit4]   2> 1712 T2957 C152 UPDATE [00010_core] webapp=/solr path=/update params={wt=javabin&version=2} {add=[id7]} 0 29
[junit4:junit4]   2> 1714 T3005 oasc.SolrCore.getNewIndexDir New index directory detected: old=null new=/usr/home/hudson/hudson-slave/workspace/Lucene-Solr-NightlyTests-trunk/solr/build/solr-core/test/J0/OpenCloseCoreStressTest_/00011_core/data/index/
[junit4:junit4]   2> 1714 T2956 C151 UPDATE [00003_core] webapp=/solr path=/update params={wt=javabin&version=2} {add=[id3]} 0 36
[junit4:junit4]   2> 1714 T3010 oashl.XMLLoader.init xsltCacheLifetimeSeconds=60
[junit4:junit4]   2> 1714 T2993 C153 oasc.SolrDeletionPolicy.onInit SolrDeletionPolicy.onInit: commits:num=1
[junit4:junit4]   2> 		commit{dir=MockDirWrapper(RateLimitedDirectoryWrapper(org.apache.lucene.store.SimpleFSDirectory@/usr/home/hudson/hudson-slave/workspace/Lucene-Solr-NightlyTests-trunk/solr/build/solr-core/test/J0/OpenCloseCoreStressTest_/00013_core/data/index lockFactory=org.apache.lucene.store.NativeFSLockFactory@9a9bdd5)),segFN=segments_1,generation=1,filenames=[segments_1]
[junit4:junit4]   2> 1714 T2998 C150 UPDATE [00005_core] webapp=/solr path=/update params={wt=javabin&version=2} {add=[id15]} 0 28
[junit4:junit4]   2> 1715 T2996 C154 UPDATE [00014_core] webapp=/solr path=/update params={wt=javabin&version=2} {add=[id14]} 0 32
[junit4:junit4]   2> 1716 T2993 C153 oasc.SolrDeletionPolicy.updateCommits newest commit = 1[segments_1]
[junit4:junit4]   2> 1717 T3005 oasc.SolrCore.initIndex WARNING [00011_core] Solr index directory '/usr/home/hudson/hudson-slave/workspace/Lucene-Solr-NightlyTests-trunk/solr/build/solr-core/test/J0/OpenCloseCoreStressTest_/00011_core/data/index' doesn't exist. Creating new index...
[junit4:junit4]   2> ASYNC  NEW_CORE C155 name=00019_core org.apache.solr.core.SolrCore@34084680
[junit4:junit4]   2> 1718 T3009 C155 REQ [00019_core] webapp=/solr path=/select params={q=*:*&wt=javabin&qt=/select&version=2} hits=0 status=0 QTime=1 
[junit4:junit4]   2> 1718 T3005 oasc.CachingDirectoryFactory.get return new directory for /usr/home/hudson/hudson-slave/workspace/Lucene-Solr-NightlyTests-trunk/solr/build/solr-core/test/J0/OpenCloseCoreStressTest_/00011_core/data/index
[junit4:junit4]   2> 1719 T2998 oasc.CoreContainer.create Creating SolrCore '00004_core' using instanceDir: /usr/home/hudson/hudson-slave/workspace/Lucene-Solr-NightlyTests-trunk/solr/build/solr-core/test/J0/./OpenCloseCoreStressTest_/00004_core
[junit4:junit4]   2> 1720 T2956 C154 UPDATE [00014_core] webapp=/solr path=/update params={wt=javabin&version=2} {add=[id21]} 0 2
[junit4:junit4]   2> 1721 T2998 oasc.SolrResourceLoader.<init> new SolrResourceLoader for directory: '/usr/home/hudson/hudson-slave/workspace/Lucene-Solr-NightlyTests-trunk/solr/build/solr-core/test/J0/./OpenCloseCoreStressTest_/00004_core/'
[junit4:junit4]   2> 1721 T2993 C153 UPDATE [00013_core] webapp=/solr path=/update params={wt=javabin&version=2} {add=[id11]} 0 35
[junit4:junit4]   2> ASYNC  NEW_CORE C156 name=00012_core org.apache.solr.core.SolrCore@647d1620
[junit4:junit4]   2> 1723 T3006 C156 REQ [00012_core] webapp=/solr path=/select params={q=*:*&wt=javabin&qt=/select&version=2} hits=0 status=0 QTime=0 
[junit4:junit4]   2> 1725 T2956 C153 UPDATE [00013_core] webapp=/solr path=/update params={wt=javabin&version=2} {add=[id25]} 0 2
[junit4:junit4]   2> 1726 T2954 C155 oasc.SolrDeletionPolicy.onInit SolrDeletionPolicy.onInit: commits:num=1
[junit4:junit4]   2> 		commit{dir=MockDirWrapper(RateLimitedDirectoryWrapper(org.apache.lucene.store.SimpleFSDirectory@/usr/home/hudson/hudson-slave/workspace/Lucene-Solr-NightlyTests-trunk/solr/build/solr-core/test/J0/OpenCloseCoreStressTest_/00019_core/data/index lockFactory=org.apache.lucene.store.NativeFSLockFactory@22399265)),segFN=segments_1,generation=1,filenames=[segments_1]
[junit4:junit4]   2> 1727 T3001 oass.SolrIndexSearcher.<init> Opening Searcher@6e933f2e main
[junit4:junit4]   2> 1727 T2954 C155 oasc.SolrDeletionPolicy.updateCommits newest commit = 1[segments_1]
[junit4:junit4]   2> 1736 T3001 oasc.SolrCore.registerSearcher [00015_core] Registered new searcher Searcher@6e933f2e main{StandardDirectoryReader(segments_1:1)}
[junit4:junit4]   2> ASYNC  NEW_CORE C157 name=00018_core org.apache.solr.core.SolrCore@221b208
[junit4:junit4]   2> 1737 T3011 C157 REQ [00018_core] webapp=/solr path=/select params={q=*:*&wt=javabin&qt=/select&version=2} hits=0 status=0 QTime=0 
[junit4:junit4]   2> 1736 T3001 oasu.CommitTracker.<init> Hard AutoCommit: disabled
[junit4:junit4]   2> 1737 T3001 oasu.CommitTracker.<init> Soft AutoCommit: disabled
[junit4:junit4]   2> 1740 T3007 oass.SolrIndexSearcher.<init> Opening Searcher@798da9be main
[junit4:junit4]   2> 1741 T3010 oass.SolrIndexSearcher.<init> Opening Searcher@5c48dff5 main
[junit4:junit4]   2> 1741 T3007 oasc.SolrCore.registerSearcher [00007_core] Registered new searcher Searcher@798da9be main{StandardDirectoryReader(segments_1:1)}
[junit4:junit4]   2> ASYNC  NEW_CORE C158 name=00001_core org.apache.solr.core.SolrCore@8c6b5e8
[junit4:junit4]   2> 1741 T2985 C158 oasc.SolrDeletionPolicy.onInit SolrDeletionPolicy.onInit: commits:num=1
[junit4:junit4]   2> 		commit{dir=MockDirWrapper(RateLimitedDirectoryWrapper(org.apache.lucene.store.SimpleFSDirectory@/usr/home/hudson/hudson-slave/workspace/Lucene-Solr-NightlyTests-trunk/solr/build/solr-core/test/J0/OpenCloseCoreStressTest_/00001_core/data/index lockFactory=org.apache.lucene.store.NativeFSLockFactory@7e90f16f)),segFN=segments_1,generation=1,filenames=[segments_1]
[junit4:junit4]   2> 1742 T3010 oasc.SolrCore.registerSearcher [00016_core] Registered new searcher Searcher@5c48dff5 main{StandardDirectoryReader(segments_1:1)}
[junit4:junit4]   2> 1742 T3007 oasu.CommitTracker.<init> Hard AutoCommit: disabled
[junit4:junit4]   2> 1743 T2997 C156 oasc.SolrDeletionPolicy.onInit SolrDeletionPolicy.onInit: commits:num=1
[junit4:junit4]   2> 		commit{dir=MockDirWrapper(RateLimitedDirectoryWrapper(org.apache.lucene.store.SimpleFSDirectory@/usr/home/hudson/hudson-slave/workspace/Lucene-Solr-NightlyTests-trunk/solr/build/solr-core/test/J0/OpenCloseCoreStressTest_/00012_core/data/index lockFactory=org.apache.lucene.store.NativeFSLockFactory@b4c9830)),segFN=segments_1,generation=1,filenames=[segments_1]
[junit4:junit4]   2> 1743 T2994 C157 oasc.SolrDeletionPolicy.onInit SolrDeletionPolicy.onInit: commits:num=1
[junit4:junit4]   2> 		commit{dir=MockDirWrapper(RateLimitedDirectoryWrapper(org.apache.lucene.store.SimpleFSDirectory@/usr/home/hudson/hudson-slave/workspace/Lucene-Solr-NightlyTests-trunk/solr/build/solr-core/test/J0/OpenCloseCoreStressTest_/00018_core/data/index lockFactory=org.apache.lucene.store.NativeFSLockFactory@4f672c5a)),segFN=segments_1,generation=1,filenames=[segments_1]
[junit4:junit4]   2> 1744 T2951 C155 UPDATE [00019_core] webapp=/solr path=/update params={wt=javabin&version=2} {add=[id19]} 0 23
[junit4:junit4]   2> 1744 T2954 C155 UPDATE [00019_core] webapp=/solr path=/update params={wt=javabin&version=2} {add=[id6]} 0 26
[junit4:junit4]   2> 1744 T2989 C155 UPDATE [00019_core] webapp=/solr path=/update params={wt=javabin&version=2} {add=[id9]} 0 23
[junit4:junit4]   2> 1744 T2953 C155 UPDATE [00019_core] webapp=/solr path=/update params={wt=javabin&version=2} {add=[id17]} 0 21
[junit4:junit4]   2> 1743 T3010 oasu.CommitTracker.<init> Hard AutoCommit: disabled
[junit4:junit4]   2> 1743 T3007 oasu.CommitTracker.<init> Soft AutoCommit: disabled
[junit4:junit4]   2> 1744 T2997 C156 oasc.SolrDeletionPolicy.updateCommits newest commit = 1[segments_1]
[junit4:junit4]   2> 1744 T2985 C158 oasc.SolrDeletionPolicy.updateCommits newest commit = 1[segments_1]
[junit4:junit4]   2> 1744 T2996 C155 UPDATE [00019_core] webapp=/solr path=/update params={wt=javabin&version=2} {add=[id24]} 0 26
[junit4:junit4]   2> 1744 T2993 C155 UPDATE [00019_core] webapp=/solr path=/update params={wt=javabin&version=2} {add=[id26]} 0 18
[junit4:junit4]   2> 1745 T3010 oasu.CommitTracker.<init> Soft AutoCommit: disabled
[junit4:junit4]   2> 1745 T2994 C157 oasc.SolrDeletionPolicy.updateCommits newest commit = 1[segments_1]
[junit4:junit4]   2> 1748 T2951 C148 UPDATE [00006_core] webapp=/solr path=/update params={wt=javabin&version=2} {add=[id30]} 0 1
[junit4:junit4]   2> 1748 T2953 C149 UPDATE [00017_core] webapp=/solr path=/update params={wt=javabin&version=2} {add=[id31]} 0 1
[junit4:junit4]   2> 1747 T3001 oasc.CoreMaps.putTransientCore Opening transient core 00015_core
[junit4:junit4]   2> 1750 T2997 C156 UPDATE [00012_core] webapp=/solr path=/update params={wt=javabin&version=2} {add=[id20]} 0 29
[junit4:junit4]   2> 1748 T2954 C155 UPDATE [00019_core] webapp=/solr path=/update params={wt=javabin&version=2} {add=[id28]} 0 1
[junit4:junit4]   2> 1750 T3001 oasc.CoreContainer.registerCore registering core: 00015_core
[junit4:junit4]   2> 1750 T2957 C156 UPDATE [00012_core] webapp=/solr path=/update params={wt=javabin&version=2} {add=[id22]} 0 8
[junit4:junit4]   2> 1750 T2952 C156 UPDATE [00012_core] webapp=/solr path=/update params={wt=javabin&version=2} {add=[id5]} 0 27
[junit4:junit4]   2> 1749 T2955 C158 UPDATE [00001_core] webapp=/solr path=/update params={wt=javabin&version=2} {add=[id2]} 0 26
[junit4:junit4]   2> 1748 T2985 C158 UPDATE [00001_core] webapp=/solr path=/update params={wt=javabin&version=2} {add=[id8]} 0 25
[junit4:junit4]   2> 1751 T2994 C157 UPDATE [00018_core] webapp=/solr path=/update params={wt=javabin&version=2} {add=[id10]} 0 25
[junit4:junit4]   2> 1751 T2993 C150 UPDATE [00005_core] webapp=/solr path=/update params={wt=javabin&version=2} {add=[id33]} 0 1
[junit4:junit4]   2> 1752 T3007 oasc.CoreMaps.putTransientCore Opening transient core 00007_core
[junit4:junit4]   2> 1753 T2953 C150 UPDATE [00005_core] webapp=/solr path=/update params={wt=javabin&version=2} {add=[id35]} 0 1
[junit4:junit4]   2> 1753 T2951 C156 UPDATE [00012_core] webapp=/solr path=/update params={wt=javabin&version=2} {add=[id34]} 0 1
[junit4:junit4]   2> 1753 T3007 oasc.CoreContainer.registerCore registering core: 00007_core
[junit4:junit4]   2> 1754 T2952 C150 UPDATE [00005_core] webapp=/solr path=/update params={wt=javabin&version=2} {add=[id37]} 0 0
[junit4:junit4]   2> 1754 T3010 oasc.CoreMaps.putTransientCore Opening transient core 00016_core
[junit4:junit4]   2> 1755 T2955 C155 UPDATE [00019_core] webapp=/solr path=/update params={wt=javabin&version=2} {add=[id39]} 0 1
[junit4:junit4]   2> 1755 T3010 oasc.CoreContainer.registerCore registering core: 00016_core
[junit4:junit4]   2> 1755 T2994 oasc.CoreContainer.create Creating SolrCore '00002_core' using instanceDir: /usr/home/hudson/hudson-slave/workspace/Lucene-Solr-NightlyTests-trunk/solr/build/solr-core/test/J0/./OpenCloseCoreStressTest_/00002_core
[junit4:junit4]   2> 1755 T3005 oasc.SolrDeletionPolicy.onCommit SolrDeletionPolicy.onCommit: commits:num=1
[junit4:junit4]   2> 		commit{dir=MockDirWrapper(RateLimitedDirectoryWrapper(org.apache.lucene.store.SimpleFSDirectory@/usr/home/hudson/hudson-slave/workspace/Lucene-Solr-NightlyTests-trunk/solr/build/solr-core/test/J0/OpenCloseCoreStressTest_/00011_core/data/index lockFactory=org.apache.lucene.store.NativeFSLockFactory@15d92772)),segFN=segments_1,generation=1,filenames=[segments_1]
[junit4:junit4]   2> 1755 T2993 C148 UPDATE [00006_core] webapp=/solr path=/update params={wt=javabin&version=2} {add=[id42]} 0 0
[junit4:junit4]   2> 1756 T2985 C154 UPDATE [00014_core] webapp=/solr path=/update params={wt=javabin&version=2} {add=[id40]} 0 1
[junit4:junit4]   2> 1756 T3005 oasc.SolrDeletionPolicy.updateCommits newest commit = 1[segments_1]
[junit4:junit4]   2> 1756 T2957 C147 UPDATE [00008_core] webapp=/solr path=/update params={wt=javabin&version=2} {add=[id43]} 0 1
[junit4:junit4]   2> 1757 T2953 C153 UPDATE [00013_core] webapp=/solr path=/update params={wt=javabin&version=2} {add=[id44]} 0 1
[junit4:junit4]   2> 1757 T2994 oasc.SolrResourceLoader.<init> new SolrResourceLoader for directory: '/usr/home/hudson/hudson-slave/workspace/Lucene-Solr-NightlyTests-trunk/solr/build/solr-core/test/J0/./OpenCloseCoreStressTest_/00002_core/'
[junit4:junit4]   2> 1758 T2952 C147 UPDATE [00008_core] webapp=/solr path=/update params={wt=javabin&version=2} {add=[id46]} 0 1
[junit4:junit4]   2> 1757 T2951 C158 UPDATE [00001_core] webapp=/solr path=/update params={wt=javabin&version=2} {add=[id45]} 0 0
[junit4:junit4]   2> 1759 T2955 C154 UPDATE [00014_core] webapp=/solr path=/update params={wt=javabin&version=2} {add=[id47]} 0 1
[junit4:junit4]   2> 1760 T2993 C157 UPDATE [00018_core] webapp=/solr path=/update params={wt=javabin&version=2} {add=[id48]} 0 1
[junit4:junit4]   2> 1761 T2985 C153 UPDATE [00013_core] webapp=/solr path=/update params={wt=javabin&version=2} {add=[id51]} 0 0
[junit4:junit4]   2> 1762 T2952 C151 UPDATE [00003_core] webapp=/solr path=/update params={wt=javabin&version=2} {add=[id53]} 0 1
[junit4:junit4]   2> 1764 T2955 C152 UPDATE [00010_core] webapp=/solr path=/update params={wt=javabin&version=2} {add=[id54]} 0 3
[junit4:junit4]   2> 1765 T2993 C147 UPDATE [00008_core] webapp=/solr path=/update params={wt=javabin&version=2} {add=[id55]} 0 0
[junit4:junit4]   2> 1766 T2985 C158 UPDATE [00001_core] webapp=/solr path=/update params={wt=javabin&version=2} {add=[id56]} 0 1
[junit4:junit4]   2> 1767 T2952 C155 UPDATE [00019_core] webapp=/solr path=/update params={wt=javabin&version=2} {add=[id57]} 0 1
[junit4:junit4]   2> 1767 T2997 C146 oasc.SolrDeletionPolicy.onInit SolrDeletionPolicy.onInit: commits:num=1
[junit4:junit4]   2> 		commit{dir=MockDirWrapper(RateLimitedDirectoryWrapper(org.apache.lucene.store.SimpleFSDirectory@/usr/home/hudson/hudson-slave/workspace/Lucene-Solr-NightlyTests-trunk/solr/build/solr-core/test/J0/OpenCloseCoreStressTest_/00000_core/data/index lockFactory=org.apache.lucene.store.NativeFSLockFactory@2b0f4069)),segFN=segments_1,generation=1,filenames=[segments_1]
[junit4:junit4]   2> 1769 T2997 C146 oasc.SolrDeletionPolicy.updateCommits newest commit = 1[segments_1]
[junit4:junit4]   2> 1769 T3005 oasc.SolrCore.initWriters created json: solr.JSONResponseWriter
[junit4:junit4]   2> 1770 T2955 C157 UPDATE [00018_core] webapp=/solr path=/update params={wt=javabin&version=2} {add=[id58]} 0 0
[junit4:junit4]   2> ASYNC  NEW_CORE C159 name=00015_core org.apache.solr.core.SolrCore@39818620
[junit4:junit4]   2> 1770 T3001 C159 REQ [00015_core] webapp=/solr path=/select params={q=*:*&wt=javabin&qt=/select&version=2} hits=0 status=0 QTime=0 
[junit4:junit4]   2> 1771 T2993 C154 UPDATE [00014_core] webapp=/solr path=/update params={wt=javabin&version=2} {add=[id59]} 0 1
[junit4:junit4]   2> 1772 T2952 C155 UPDATE [00019_core] webapp=/solr path=/update params={wt=javabin&version=2} {add=[id61]} 0 1
[junit4:junit4]   2> 1772 T2985 C157 UPDATE [00018_core] webapp=/solr path=/update params={wt=javabin&version=2} {add=[id60]} 0 1
[junit4:junit4]   2> 1772 T2997 C146 UPDATE [00000_core] webapp=/solr path=/update params={wt=javabin&version=2} {add=[id36]} 0 20
[junit4:junit4]   2> 1772 T3005 oasc.RequestHandlers.initHandlersFromConfig created /admin/: solr.admin.AdminHandlers
[junit4:junit4]   2> 1773 T3005 oasc.RequestHandlers.initHandlersFromConfig created /select: solr.SearchHandler
[junit4:junit4]   2> 1774 T3005 oasc.RequestHandlers.initHandlersFromConfig created /update: solr.UpdateRequestHandler
[junit4:junit4]   2> ASYNC  NEW_CORE C160 name=00007_core org.apache.solr.core.SolrCore@5d5608f8
[junit4:junit4]   2> 1774 T3007 C160 REQ [00007_core] webapp=/solr path=/select params={q=*:*&wt=javabin&qt=/select&version=2} hits=0 status=0 QTime=0 
[junit4:junit4]   2> 1774 T2955 C153 UPDATE [00013_core] webapp=/solr path=/update params={wt=javabin&version=2} {add=[id62]} 0 1
[junit4:junit4]   2> 1776 T3012 C148 REQ [00006_core] webapp=/solr path=/select params={q=*:*&wt=javabin&qt=/select&version=2} hits=0 status=0 QTime=1 
[junit4:junit4]   2> 1776 T2997 C152 UPDATE [00010_core] webapp=/solr path=/update params={wt=javabin&version=2} {add=[id65]} 0 1
[junit4:junit4]   2> 1776 T2985 C156 UPDATE [00012_core] webapp=/solr path=/update params={wt=javabin&version=2} {add=[id66]} 0 1
[junit4:junit4]   2> ASYNC  NEW_CORE C161 name=00016_core org.apache.solr.core.SolrCore@37acad03
[junit4:junit4]   2> 1777 T3010 C161 REQ [00016_core] webapp=/solr path=/select params={q=*:*&wt=javabin&qt=/select&version=2} hits=0 status=0 QTime=1 
[junit4:junit4]   2> 1777 T3004 C147 REQ [00008_core] webapp=/solr path=/select params={q=*:*&wt=javabin&qt=/select&version=2} hits=0 status=0 QTime=0 
[junit4:junit4]   2> 1777 T2956 C159 oasc.SolrDeletionPolicy.onInit SolrDeletionPolicy.onInit: commits:num=1
[junit4:junit4]   2> 		commit{dir=MockDirWrapper(RateLimitedDirectoryWrapper(org.apache.lucene.store.SimpleFSDirectory@/usr/home/hudson/hudson-slave/workspace/Lucene-Solr-NightlyTests-trunk/solr/build/solr-core/test/J0/OpenCloseCoreStressTest_/00015_core/data/index lockFactory=org.apache.lucene.store.NativeFSLockFactory@544df234)),segFN=segments_1,generation=1,filenames=[segments_1]
[junit4:junit4]   2> 1778 T2956 C159 oasc.SolrDeletionPolicy.updateCommits newest commit = 1[segments_1]
[junit4:junit4]   2> 1778 T2955 C155 UPDATE [00019_core] webapp=/solr path=/update params={wt=javabin&version=2} {add=[id67]} 0 0
[junit4:junit4]   2> 1778 T2997 C151 UPDATE [00003_core] webapp=/solr path=/update params={wt=javabin&version=2} {add=[id68]} 0 0
[junit4:junit4]   2> 1780 T2985 C151 UPDATE [00003_core] webapp=/solr path=/update params={wt=javabin&version=2} {add=[id69]} 0 1
[junit4:junit4]   2> 1780 T2956 C159 UPDATE [00015_core] webapp=/solr path=/update params={wt=javabin&version=2} {add=[id27]} 0 13
[junit4:junit4]   2> 1780 T2952 C159 UPDATE [00015_core] webapp=/solr path=/update params={wt=javabin&version=2} {add=[id64]} 0 6
[junit4:junit4]   2> 1781 T2953 C159 UPDATE [00015_core] webapp=/solr path=/update params={wt=javabin&version=2} {add=[id50]} 0 4
[junit4:junit4]   2> 1781 T2955 oasc.CoreContainer.create Creating SolrCore '00009_core' using instanceDir: /usr/home/hudson/hudson-slave/workspace/Lucene-Solr-NightlyTests-trunk/solr/build/solr-core/test/J0/./OpenCloseCoreStressTest_/00009_core
[junit4:junit4]   2> 1782 T3000 C150 REQ [00005_core] webapp=/solr path=/select params={q=*:*&wt=javabin&qt=/select&version=2} hits=0 status=0 QTime=0 
[junit4:junit4]   2> 1782 T2995 C161 oasc.SolrDeletionPolicy.onInit SolrDeletionPolicy.onInit: commits:num=1
[junit4:junit4]   2> 		commit{dir=MockDirWrapper(RateLimitedDirectoryWrapper(org.apache.lucene.store.SimpleFSDirectory@/usr/home/hudson/hudson-slave/workspace/Lucene-Solr-NightlyTests-trunk/solr/build/solr-core/test/J0/OpenCloseCoreStressTest_/00016_core/data/index lockFactory=org.apache.lucene.store.NativeFSLockFactory@76fff18d)),segFN=segments_1,generation=1,filenames=[segments_1]
[junit4:junit4]   2> 1783 T2997 C149 UPDATE [00017_core] webapp=/solr path=/update params={wt=javabin&version=2} {add=[id71]} 0 1
[junit4:junit4]   2> 1782 T2955 oasc.SolrResourceLoader.<init> new SolrResourceLoader for directory: '/usr/home/hudson/hudson-slave/workspace/Lucene-Solr-NightlyTests-trunk/solr/build/solr-core/test/J0/./OpenCloseCoreStressTest_/00009_core/'
[junit4:junit4]   2> 1783 T3003 C151 REQ [00003_core] webapp=/solr path=/select params={q=*:*&wt=javabin&qt=/select&version=2} hits=0 status=0 QTime=0 
[junit4:junit4]   2> 1783 T2995 C161 oasc.SolrDeletionPolicy.updateCommits newest commit = 1[segments_1]
[junit4:junit4]   2> 1783 T2956 C147 UPDATE [00008_core] webapp=/solr path=/update params={wt=javabin&version=2} {add=[id73]} 0 0
[junit4:junit4]   2> 1784 T2985 C159 UPDATE [00015_core] webapp=/solr path=/update params={wt=javabin&version=2} {add=[id72]} 0 1
[junit4:junit4]   2> 1784 T3008 C146 REQ [00000_core] webapp=/solr path=/select params={q=*:*&wt=javabin&qt=/select&version=2} hits=0 status=0 QTime=0 
[junit4:junit4]   2> 1784 T2952 C153 UPDATE [00013_core] webapp=/solr path=/update params={wt=javabin&version=2} {add=[id74]} 0 0
[junit4:junit4]   2> 1785 T2953 C148 UPDATE [00006_core] webapp=/solr path=/update params={wt=javabin&version=2} {add=[id75]} 0 1
[junit4:junit4]   2> 1785 T2999 C151 REQ [00003_core] webapp=/solr path=/select params={q=*:*&wt=javabin&qt=/select&version=2} hits=0 status=0 QTime=0 
[junit4:junit4]   2> 1786 T2996 C161 UPDATE [00016_core] webapp=/solr path=/update params={wt=javabin&version=2} {add=[id32]} 0 10
[junit4:junit4]   2> 1785 T2995 C161 UPDATE [00016_core] webapp=/solr path=/update params={wt=javabin&version=2} {add=[id16]} 0 12
[junit4:junit4]   2> 1787 T2997 C148 UPDATE [00006_core] webapp=/solr path=/update params={wt=javabin&version=2} {add=[id76]} 0 1
[junit4:junit4]   2> 1787 T2985 C157 UPDATE [00018_core] webapp=/solr path=/update params={wt=javabin&version=2} {add=[id77]} 0 0
[junit4:junit4]   2> 1788 T2956 C159 UPDATE [00015_core] webapp=/solr path=/update params={wt=javabin&version=2} {add=[id78]} 0 0
[junit4:junit4]   2> 1788 T2952 C151 UPDATE [00003_core] webapp=/solr path=/update params={wt=javabin&version=2} {add=[id79]} 0 0
[junit4:junit4]   2> 1789 T2953 C146 UPDATE [00000_core] webapp=/solr path=/update params={wt=javabin&version=2} {add=[id80]} 0 1
[junit4:junit4]   2> 1790 T2995 C147 UPDATE [00008_core] webapp=/solr path=/update params={wt=javabin&version=2} {add=[id82]} 0 1
[junit4:junit4]   2> 1790 T2985 C153 UPDATE [00013_core] webapp=/solr path=/update params={wt=javabin&version=2} {add=[id84]} 0 0
[junit4:junit4]   2> 1790 T2956 C151 UPDATE [00003_core] webapp=/solr path=/update params={wt=javabin&version=2} {add=[id85]} 0 0
[junit4:junit4]   2> 1791 T2997 C161 UPDATE [00016_core] webapp=/solr path=/update params={wt=javabin&version=2} {add=[id83]} 0 1
[junit4:junit4]   2> 1791 T2952 C154 UPDATE [00014_core] webapp=/solr path=/update params={wt=javabin&version=2} {add=[id86]} 0 1
[junit4:junit4]   2> 1792 T2953 C153 UPDATE [00013_core] webapp=/solr path=/update params={wt=javabin&version=2} {add=[id87]} 0 0
[junit4:junit4]   2> 1793 T2956 C156 UPDATE [00012_core] webapp=/solr path=/update params={wt=javabin&version=2} {add=[id90]} 0 0
[junit4:junit4]   2> 1793 T2985 C148 UPDATE [00006_core] webapp=/solr path=/update params={wt=javabin&version=2} {add=[id89]} 0 0
[junit4:junit4]   2> 1793 T2997 C152 UPDATE [00010_core] webapp=/solr path=/update params={wt=javabin&version=2} {add=[id91]} 0 0
[junit4:junit4]   2> 1795 T2952 C155 UPDATE [00019_core] webapp=/solr path=/update params={wt=javabin&version=2} {add=[id92]} 0 1
[junit4:junit4]   2> 1795 T2953 C156 UPDATE [00012_core] webapp=/solr path=/update params={wt=javabin&version=2} {add=[id93]} 0 0
[junit4:junit4]   2> 1798 T2997 C152 UPDATE [00010_core] webapp=/solr path=/update params={wt=javabin&version=2} {add=[id96]} 0 1
[junit4:junit4]   2> 1797 T2985 C158 UPDATE [00001_core] webapp=/solr path=/update params={wt=javabin&version=2} {add=[id95]} 0 0
[junit4:junit4]   2> 1797 T2952 C150 UPDATE [00005_core] webapp=/solr path=/update params={wt=javabin&version=2} {add=[id97]} 0 0
[junit4:junit4]   2> 1800 T3005 oashl.XMLLoader.init xsltCacheLifetimeSeconds=60
[junit4:junit4]   2> 1800 T2985 C153 UPDATE [00013_core] webapp=/solr path=/update params={wt=javabin&version=2} {add=[id99]} 0 0
[junit4:junit4]   2> 1801 T2997 C152 UPDATE [00010_core] webapp=/solr path=/update params={wt=javabin&version=2} {add=[id100]} 0 1
[junit4:junit4]   2> 1801 T2952 C148 UPDATE [00006_core] webapp=/solr path=/update params={wt=javabin&version=2} {add=[id101]} 0 0
[junit4:junit4]   2> 1802 T2995 C160 oasc.SolrDeletionPolicy.onInit SolrDeletionPolicy.onInit: commits:num=1
[junit4:junit4]   2> 		commit{dir=MockDirWrapper(RateLimitedDirectoryWrapper(org.apache.lucene.store.SimpleFSDirectory@/usr/home/hudson/hudson-slave/workspace/Lucene-Solr-NightlyTests-trunk/solr/build/solr-core/test/J0/OpenCloseCoreStressTest_/00007_core/data/index lockFactory=org.apache.lucene.store.NativeFSLockFactory@48ef57d)),segFN=segments_1,generation=1,filenames=[segments_1]
[junit4:junit4]   2> 1803 T2995 C160 oasc.SolrDeletionPolicy.updateCommits newest commit = 1[segments_1]
[junit4:junit4]   2> 1803 T2997 C155 UPDATE [00019_core] webapp=/solr path=/update params={wt=javabin&version=2} {add=[id103]} 0 0
[junit4:junit4]   2> 1804 T2952 C154 UPDATE [00014_core] webapp=/solr path=/update params={wt=javabin&version=2} {add=[id104]} 0 0
[junit4:junit4]   2> 1805 T2953 C160 UPDATE [00007_core] webapp=/solr path=/update params={wt=javabin&version=2} {add=[id98]} 0 7
[junit4:junit4]   2> 1805 T2995 C160 UPDATE [00007_core] webapp=/solr path=/update params={wt=javabin&version=2} {add=[id88]} 0 12
[junit4:junit4]   2> 1807 T3005 oass.SolrIndexSearcher.<init> Opening Searcher@26cce091 main
[junit4:junit4]   2> 1807 T2952 C157 UPDATE [00018_core] webapp=/solr path=/update params={wt=javabin&version=2} {add=[id106]} 0 0
[junit4:junit4]   2> 1808 T2997 C157 UPDATE [00018_core] webapp=/solr path=/update params={wt=javabin&version=2} {add=[id105]} 0 1
[junit4:junit4]   2> 1808 T3005 oasc.SolrCore.registerSearcher [00011_core] Registered new searcher Searcher@26cce091 main{StandardDirectoryReader(segments_1:1)}
[junit4:junit4]   2> 1808 T3005 oasu.CommitTracker.<init> Hard AutoCommit: disabled
[junit4:junit4]   2> 1809 T2995 C160 UPDATE [00007_core] webapp=/solr path=/update params={wt=javabin&version=2} {add=[id108]} 0 1
[junit4:junit4]   2> 1809 T3005 oasu.CommitTracker.<init> Soft AutoCommit: disabled
[junit4:junit4]   2> 1809 T2953 C151 UPDATE [00003_core] webapp=/solr path=/update params={wt=javabin&version=2} {add=[id107]} 0 1
[junit4:junit4]   2> 1810 T2997 C150 UPDATE [00005_core] webapp=/solr path=/update params={wt=javabin&version=2} {add=[id110]} 0 0
[junit4:junit4]   2> 1811 T2995 C160 UPDATE [00007_core] webapp=/solr path=/update params={wt=javabin&version=2} {add=[id111]} 0 0
[junit4:junit4]   2> 1812 T2953 C154 UPDATE [00014_core] webapp=/solr path=/update params={wt=javabin&version=2} {add=[id112]} 0 0
[junit4:junit4]   2> 1813 T3005 oasc.CoreMaps.putTransientCore Opening transient core 00011_core
[junit4:junit4]   2> 1813 T3005 oasc.CoreContainer.registerCore registering core: 00011_core
[junit4:junit4]   2> 1815 T2995 C157 UPDATE [00018_core] webapp=/solr path=/update params={wt=javabin&version=2} {add=[id114]} 0 1
[junit4:junit4]   2> 1816 T2953 C154 UPDATE [00014_core] webapp=/solr path=/update params={wt=javabin&version=2} {add=[id115]} 0 1
[junit4:junit4]   2> 1819 T2953 C149 UPDATE [00017_core] webapp=/solr path=/update params={wt=javabin&version=2} {add=[id117]} 0 1
[junit4:junit4]   2> 1819 T2995 C160 UPDATE [00007_core] webapp=/solr path=/update params={wt=javabin&version=2} {add=[id116]} 0 1
[junit4:junit4]   2> 1822 T3009 C157 REQ [00018_core] webapp=/solr path=/select params={q=*:*&wt=javabin&qt=/select&version=2} hits=0 status=0 QTime=0 
[junit4:junit4]   2> 1823 T2995 C148 UPDATE [00006_core] webapp=/solr path=/update params={wt=javabin&version=2} {add=[id118]} 0 1
[junit4:junit4]   2> ASYNC  NEW_CORE C162 name=00011_core org.apache.solr.core.SolrCore@3a7fe89b
[junit4:junit4]   2> 1824 T3005 C162 REQ [00011_core] webapp=/solr path=/select params={q=*:*&wt=javabin&qt=/select&version=2} hits=0 status=0 QTime=0 
[junit4:junit4]   2> 1826 T3013 C162 REQ [00011_core] webapp=/solr path=/select params={q=*:*&wt=javabin&qt=/select&version=2} hits=0 status=0 QTime=1 
[junit4:junit4]   2> 1827 T2995 C160 UPDATE [00007_core] webapp=/solr path=/update params={wt=javabin&version=2} {add=[id120]} 0 1
[junit4:junit4]   2> 1829 T2996 C162 oasc.SolrDeletionPolicy.onInit SolrDeletionPolicy.onInit: commits:num=1
[junit4:junit4]   2> 		commit{dir=MockDirWrapper(RateLimitedDirectoryWrapper(org.apache.lucene.store.SimpleFSDirectory@/usr/home/hudson/hudson-slave/workspace/Lucene-Solr-NightlyTests-trunk/solr/build/solr-core/test/J0/OpenCloseCoreStressTest_/00011_core/data/index lockFactory=org.apache.lucene.store.NativeFSLockFactory@15d92772)),segFN=segments_1,generation=1,filenames=[segments_1]
[junit4:junit4]   2> 1829 T2996 C162 oasc.SolrDeletionPolicy.updateCommits newest commit = 1[segments_1]
[junit4:junit4]   2> 1832 T2995 C154 UPDATE [00014_core] webapp=/solr path=/update params={wt=javabin&version=2} {add=[id121]} 0 1
[junit4:junit4]   2> 1833 T2996 C162 UPDATE [00011_core] webapp=/solr path=/update params={wt=javabin&version=2} {add=[id81]} 0 9
[junit4:junit4]   2> 1833 T2951 C162 UPDATE [00011_core] webapp=/solr path=/update params={wt=javabin&version=2} {add=[id52]} 0 6
[junit4:junit4]   2> 1833 T2989 C162 UPDATE [00011_core] webapp=/solr path=/update params={wt=javabin&version=2} {add=[id29]} 0 8
[junit4:junit4]   2> 1833 T2956 C162 UPDATE [00011_core] webapp=/solr path=/update params={wt=javabin&version=2} {add=[id94]} 0 6
[junit4:junit4]   2> 1835 T2995 C147 UPDATE [00008_core] webapp=/solr path=/update params={wt=javabin&version=2} {add=[id122]} 0 1
[junit4:junit4]   2> 1836 T2996 C154 UPDATE [00014_core] webapp=/solr path=/update params={wt=javabin&version=2} {add=[id123]} 0 0
[junit4:junit4]   2> 1837 T2956 C154 UPDATE [00014_core] webapp=/solr path=/update params={wt=javabin&version=2} {add=[id126]} 0 1
[junit4:junit4]   2> 1837 T2951 C148 UPDATE [00006_core] webapp=/solr path=/update params={wt=javabin&version=2} {add=[id124]} 0 1
[junit4:junit4]   2> 1836 T2989 C160 UPDATE [00007_core] webapp=/solr path=/update params={wt=javabin&version=2} {add=[id125]} 0 0
[junit4:junit4]   2> 1838 T2995 C153 UPDATE [00013_core] webapp=/solr path=/update params={wt=javabin&version=2} {add=[id127]} 0 1
[junit4:junit4]   2> 1839 T2996 C162 UPDATE [00011_core] webapp=/solr path=/update params={wt=javabin&version=2} {add=[id128]} 0 0
[junit4:junit4]   2> 1840 T2951 C150 UPDATE [00005_core] webapp=/solr path=/update params={wt=javabin&version=2} {add=[id129]} 0 0
[junit4:junit4]   2> 1841 T2995 C149 UPDATE [00017_core] webapp=/solr path=/update params={wt=javabin&version=2} {add=[id132]} 0 1
[junit4:junit4]   2> 1841 T2989 C154 UPDATE [00014_core] webapp=/solr path=/update params={wt=javabin&version=2} {add=[id131]} 0 1
[junit4:junit4]   2> 1840 T2956 C155 UPDATE [00019_core] webapp=/solr path=/update params={wt=javabin&version=2} {add=[id130]} 0 0
[junit4:junit4]   2> 1843 T2996 C158 UPDATE [00001_core] webapp=/solr path=/update params={wt=javabin&version=2} {add=[id133]} 0 1
[junit4:junit4]   2> 1843 T3011 C160 REQ [00007_core] webapp=/solr path=/select params={q=*:*&wt=javabin&qt=/select&version=2} hits=0 status=0 QTime=0 
[junit4:junit4]   2> 1845 T2956 C148 UPDATE [00006_core] webapp=/solr path=/update params={wt=javabin&version=2} {add=[id136]} 0 1
[junit4:junit4]   2> 1845 T2989 C147 UPDATE [00008_core] webapp=/solr path=/update params={wt=javabin&version=2} {add=[id135]} 0 1
[junit4:junit4]   2> 1846 T2995 C147 UPDATE [00008_core] webapp=/solr path=/update params={wt=javabin&version=2} {add=[id138]} 0 0
[junit4:junit4]   2> 1847 T2996 C157 UPDATE [00018_core] webapp=/solr path=/update params={wt=javabin&version=2} {add=[id137]} 0 1
[junit4:junit4]   2> 1848 T2956 C149 UPDATE [00017_core] webapp=/solr path=/update params={wt=javabin&version=2} {add=[id140]} 0 1
[junit4:junit4]   2> 1848 T2989 C151 UPDATE [00003_core] webapp=/solr path=/update params={wt=javabin&version=2} {add=[id139]} 0 1
[junit4:junit4]   2> 1850 T2996 C151 UPDATE [00003_core] webapp=/solr path=/update params={wt=javabin&version=2} {add=[id142]} 0 1
[junit4:junit4]   2> 1850 T2956 C155 UPDATE [00019_core] webapp=/solr path=/update params={wt=javabin&version=2} {add=[id144]} 0 0
[junit4:junit4]   2> 1850 T2989 C160 UPDATE [00007_core] webapp=/solr path=/update params={wt=javabin&version=2} {add=[id143]} 0 0
[junit4:junit4]   2> 1853 T2996 C153 UPDATE [00013_core] webapp=/solr path=/update params={wt=javabin&version=2} {add=[id145]} 0 1
[junit4:junit4]   2> 1853 T2956 C151 UPDATE [00003_core] webapp=/solr path=/update params={wt=javabin&version=2} {add=[id147]} 0 0
[junit4:junit4]   2> 1853 T2989 C155 UPDATE [00019_core] webapp=/solr path=/update params={wt=javabin&version=2} {add=[id146]} 0 0
[junit4:junit4]   2> 1856 T2956 C146 UPDATE [00000_core] webapp=/solr path=/update params={wt=javabin&version=2} {add=[id150]} 0 0
[junit4:junit4]   2> 1857 T2996 C146 UPDATE [00000_core] webapp=/solr path=/update params={wt=javabin&version=2} {add=[id148]} 0 1
[junit4:junit4]   2> 1857 T2989 C160 UPDATE [00007_core] webapp=/solr path=/update params={wt=javabin&version=2} {add=[id149]} 0 1
[junit4:junit4]   2> 1862 T2989 C155 UPDATE [00019_core] webapp=/solr path=/update params={wt=javabin&version=2} {add=[id153]} 0 1
[junit4:junit4]   2> 1862 T2996 C146 UPDATE [00000_core] webapp=/solr path=/update params={wt=javabin&version=2} {add=[id152]} 0 1
[junit4:junit4]   2> 1863 T2956 C151 UPDATE [00003_core] webapp=/solr path=/update params={wt=javabin&version=2} {add=[id151]} 0 0
[junit4:junit4]   2> 1864 T2994 oasc.SolrConfig.<init> Using Lucene MatchVersion: LUCENE_41
[junit4:junit4]   2> 1876 T2989 C149 UPDATE [00017_core] webapp=/solr path=/update params={wt=javabin&version=2} {add=[id154]} 0 11
[junit4:junit4]   2> 1876 T2996 C152 UPDATE [00010_core] webapp=/solr path=/update params={wt=javabin&version=2} {add=[id155]} 0 11
[junit4:junit4]   2> 1878 T3001 C160 REQ [00007_core] webapp=/solr path=/select params={q=*:*&wt=javabin&qt=/select&version=2} hits=0 status=0 QTime=0 
[junit4:junit4]   2> 1878 T3007 C150 REQ [00005_core] webapp=/solr path=/select params={q=*:*&wt=javabin&qt=/select&version=2} hits=0 status=0 QTime=0 
[junit4:junit4]   2> 1879 T3012 C155 REQ [00019_core] webapp=/solr path=/select params={q=*:*&wt=javabin&qt=/select&version=2} hits=0 status=0 QTime=0 
[junit4:junit4]   2> 1880 T2989 C157 UPDATE [00018_core] webapp=/solr path=/update params={wt=javabin&version=2} {add=[id157]} 0 1
[junit4:junit4]   2> 1880 T3010 C150 REQ [00005_core] webapp=/solr path=/select params={q=*:*&wt=javabin&qt=/select&version=2} hits=0 status=0 QTime=0 
[junit4:junit4]   2> 1881 T3004 C161 REQ [00016_core] webapp=/solr path=/select params={q=*:*&wt=javabin&qt=/select&version=2} hits=0 status=0 QTime=0 
[junit4:junit4]   2> 1882 T2955 oasc.SolrConfig.<init> Using Lucene MatchVersion: LUCENE_41
[junit4:junit4]   2> 1882 T2989 C161 UPDATE [00016_core] webapp=/solr path=/update params={wt=javabin&version=2} {add=[id159]} 0 0
[junit4:junit4]   2> 1883 T2998 oasc.SolrConfig.<init> Using Lucene MatchVersion: LUCENE_41
[junit4:junit4]   2> 1885 T2989 C157 UPDATE [00018_core] webapp=/solr path=/update params={wt=javabin&version=2} {add=[id160]} 0 0
[junit4:junit4]   2> 1886 T3000 C155 REQ [00019_core] webapp=/solr path=/select params={q=*:*&wt=javabin&qt=/select&version=2} hits=0 status=0 QTime=0 
[junit4:junit4]   2> 1887 T3003 C155 REQ [00019_core] webapp=/solr path=/select params={q=*:*&wt=javabin&qt=/select&version=2} hits=0 status=0 QTime=0 
[junit4:junit4]   2> 1888 T3008 C162 REQ [00011_core] webapp=/solr path=/select params={q=*:*&wt=javabin&qt=/select&version=2} hits=0 status=0 QTime=0 
[junit4:junit4]   2> 1888 T2989 C160 UPDATE [00007_core] webapp=/solr path=/update params={wt=javabin&version=2} {add=[id161]} 0 0
[junit4:junit4]   2> 1889 T2999 C146 REQ [00000_core] webapp=/solr path=/select params={q=*:*&wt=javabin&qt=/select&version=2} hits=0 status=0 QTime=0 
[junit4:junit4]   2> 1891 T2989 C146 UPDATE [00000_core] webapp=/solr path=/update params={wt=javabin&version=2} {add=[id162]} 0 0
[junit4:junit4]   2> 1894 T2989 C147 UPDATE [00008_core] webapp=/solr path=/update params={wt=javabin&version=2} {add=[id163]} 0 0
[junit4:junit4]   2> 1926 T3009 C155 REQ [00019_core] webapp=/solr path=/select params={q=*:*&wt=javabin&qt=/select&version=2} hits=0 status=0 QTime=0 
[junit4:junit4]   2> 1928 T3005 C151 REQ [00003_core] webapp=/solr path=/select params={q=*:*&wt=javabin&qt=/select&version=2} hits=0 status=0 QTime=0 
[junit4:junit4]   2> 1947 T2955 oasc.SolrConfig.<init> Loaded SolrConfig: solrconfig-minimal.xml
[junit4:junit4]   2> 1947 T3011 C158 REQ [00001_core] webapp=/solr path=/select params={q=*:*&wt=javabin&qt=/select&version=2} hits=0 status=0 QTime=0 
[junit4:junit4]   2> 1948 T2955 oass.IndexSchema.readSchema Reading Solr Schema
[junit4:junit4]   2> 1953 T2955 oass.IndexSchema.readSchema Schema name=tiny
[junit4:junit4]   2> 1954 T2998 oasc.SolrConfig.<init> Loaded SolrConfig: solrconfig-minimal.xml
[junit4:junit4]   2> 1955 T2998 oass.IndexSchema.readSchema Reading Solr Schema
[junit4:junit4]   2> 1959 T2998 oass.IndexSchema.readSchema Schema name=tiny
[junit4:junit4]   2> 1969 T2994 oasc.SolrConfig.<init> Loaded SolrConfig: solrconfig-minimal.xml
[junit4:junit4]   2> 1971 T2994 oass.IndexSchema.readSchema Reading Solr Schema
[junit4:junit4]   2> 1976 T2994 oass.IndexSchema.readSchema Schema name=tiny
[junit4:junit4]   2> 1982 T2955 oass.IndexSchema.readSchema unique key field: id
[junit4:junit4]   2> 1982 T3001 C158 REQ [00001_core] webapp=/solr path=/select params={q=*:*&wt=javabin&qt=/select&version=2} hits=0 status=0 QTime=0 
[junit4:junit4]   2> 1982 T3007 C150 REQ [00005_core] webapp=/solr path=/select params={q=*:*&wt=javabin&qt=/select&version=2} hits=0 status=0 QTime=0 
[junit4:junit4]   2> 1984 T2955 oasc.SolrCore.initDirectoryFactory org.apache.solr.core.MockFSDirectoryFactory
[junit4:junit4]   2> 1985 T2955 oasc.SolrCore.<init> [00009_core] Opening new SolrCore at /usr/home/hudson/hudson-slave/workspace/Lucene-Solr-NightlyTests-trunk/solr/build/solr-core/test/J0/./OpenCloseCoreStressTest_/00009_core/, dataDir=/usr/home/hudson/hudson-slave/workspace/Lucene-Solr-NightlyTests-trunk/solr/build/solr-core/test/J0/OpenCloseCoreStressTest_/00009_core/data/
[junit4:junit4]   2> 1985 T2955 oasc.JmxMonitoredMap.<init> JMX monitoring is enabled. Adding Solr mbeans to JMX Server: com.sun.jmx.mbeanserver.JmxMBeanServer@1320e2db
[junit4:junit4]   2> 1985 T3004 C150 REQ [00005_core] webapp=/solr path=/select params={q=*:*&wt=javabin&qt=/select&version=2} hits=0 status=0 QTime=0 
[junit4:junit4]   2> 1986 T2955 oasc.SolrCore.initDirectoryFactory org.apache.solr.core.MockFSDirectoryFactory
[junit4:junit4]   2> 1987 T2955 oasc.CachingDirectoryFactory.get return new directory for /usr/home/hudson/hudson-slave/workspace/Lucene-Solr-NightlyTests-trunk/solr/build/solr-core/test/J0/OpenCloseCoreStressTest_/00009_core/data
[junit4:junit4]   2> 1987 T2998 oass.IndexSchema.readSchema unique key field: id
[junit4:junit4]   2> 1987 T2955 oasc.SolrCore.getNewIndexDir New index directory detected: old=null new=/usr/home/hudson/hudson-slave/workspace/Lucene-Solr-NightlyTests-trunk/solr/build/solr-core/test/J0/OpenCloseCoreStressTest_/00009_core/data/index/
[junit4:junit4]   2> 1989 T2955 oasc.SolrCore.initIndex WARNING [00009_core] Solr index directory '/usr/home/hudson/hudson-slave/workspace/Lucene-Solr-NightlyTests-trunk/solr/build/solr-core/test/J0/OpenCloseCoreStressTest_/00009_core/data/index' doesn't exist. Creating new index...
[junit4:junit4]   2> 1989 T2998 oasc.SolrCore.initDirectoryFactory org.apache.solr.core.MockFSDirectoryFactory
[junit4:junit4]   2> 1989 T2955 oasc.CachingDirectoryFactory.get return new directory for /usr/home/hudson/hudson-slave/workspace/Lucene-Solr-NightlyTests-trunk/solr/build/solr-core/test/J0/OpenCloseCoreStressTest_/00009_core/data/index
[junit4:junit4]   2> 1990 T2998 oasc.SolrCore.<init> [00004_core] Opening new SolrCore at /usr/home/hudson/hudson-slave/workspace/Lucene-Solr-NightlyTests-trunk/solr/build/solr-core/test/J0/./OpenCloseCoreStressTest_/00004_core/, dataDir=/usr/home/hudson/hudson-slave/workspace/Lucene-Solr-NightlyTests-trunk/solr/build/solr-core/test/J0/OpenCloseCoreStressTest_/00004_core/data/
[junit4:junit4]   2> 1990 T3000 C146 REQ [00000_core] webapp=/solr path=/select params={q=*:*&wt=javabin&qt=/select&version=2} hits=0 status=0 QTime=0 
[junit4:junit4]   2> 1990 T2998 oasc.JmxMonitoredMap.<init> JMX monitoring is enabled. Adding Solr mbeans to JMX Server: com.sun.jmx.mbeanserver.JmxMBeanServer@1320e2db
[junit4:junit4]   2> 1991 T2998 oasc.SolrCore.initDirectoryFactory org.apache.solr.core.MockFSDirectoryFactory
[junit4:junit4]   2> 1991 T3003 C160 REQ [00007_core] webapp=/solr path=/select params={q=*:*&wt=javabin&qt=/select&version=2} hits=0 status=0 QTime=0 
[junit4:junit4]   2> 1992 T2998 oasc.CachingDirectoryFactory.get return new directory for /usr/home/hudson/hudson-slave/workspace/Lucene-Solr-NightlyTests-trunk/solr/build/solr-core/test/J0/OpenCloseCoreStressTest_/00004_core/data
[junit4:junit4]   2> 1992 T3008 C153 REQ [00013_core] webapp=/solr path=/select params={q=*:*&wt=javabin&qt=/select&version=2} hits=0 status=0 QTime=0 
[junit4:junit4]   2> 1993 T2999 C147 REQ [00008_core] webapp=/solr path=/select params={q=*:*&wt=javabin&qt=/select&version=2} hits=0 status=0 QTime=0 
[junit4:junit4]   2> 1993 T2998 oasc.SolrCore.getNewIndexDir New index directory detected: old=null new=/usr/home/hudson/hudson-slave/workspace/Lucene-Solr-NightlyTests-trunk/solr/build/solr-core/test/J0/OpenCloseCoreStressTest_/00004_core/data/index/
[junit4:junit4]   2> 1994 T2998 oasc.SolrCore.initIndex WARNING [00004_core] Solr index directory '/usr/home/hudson/hudson-slave/workspace/Lucene-Solr-NightlyTests-trunk/solr/build/solr-core/test/J0/OpenCloseCoreStressTest_/00004_core/data/index' doesn't exist. Creating new index...
[junit4:junit4]   2> 1995 T2998 oasc.CachingDirectoryFactory.get return new directory for /usr/home/hudson/hudson-slave/workspace/Lucene-Solr-NightlyTests-trunk/solr/build/solr-core/test/J0/OpenCloseCoreStressTest_/00004_core/data/index
[junit4:junit4]   2> 2012 T2994 oass.IndexSchema.readSchema unique key field: id
[junit4:junit4]   2> 2015 T2994 oasc.SolrCore.initDirectoryFactory org.apache.solr.core.MockFSDirectoryFactory
[junit4:junit4]   2> 2015 T2955 oasc.SolrDeletionPolicy.onCommit SolrDeletionPolicy.onCommit: commits:num=1
[junit4:junit4]   2> 		commit{dir=MockDirWrapper(RateLimitedDirectoryWrapper(NRTCachingDirectory(org.apache.lucene.store.MMapDirectory@/usr/home/hudson/hudson-slave/workspace/Lucene-Solr-NightlyTests-trunk/solr/build/solr-core/test/J0/OpenCloseCoreStressTest_/00009_core/data/index lockFactory=org.apache.lucene.store.NativeFSLockFactory@5a9aa050; maxCacheMB=0.818359375 maxMergeSizeMB=0.908203125))),segFN=segments_1,generation=1,filenames=[segments_1]
[junit4:junit4]   2> 2016 T2994 oasc.SolrCore.<init> [00002_core] Opening new SolrCore at /usr/home/hudson/hudson-slave/workspace/Lucene-Solr-NightlyTests-trunk/solr/build/solr-core/test/J0/./OpenCloseCoreStressTest_/00002_core/, dataDir=/usr/home/hudson/hudson-slave/workspace/Lucene-Solr-NightlyTests-trunk/solr/build/solr-core/test/J0/OpenCloseCoreStressTest_/00002_core/data/
[junit4:junit4]   2> 2016 T2955 oasc.SolrDeletionPolicy.updateCommits newest commit = 1[segments_1]
[junit4:junit4]   2> 2016 T2994 oasc.JmxMonitoredMap.<init> JMX monitoring is enabled. Adding Solr mbeans to JMX Server: com.sun.jmx.mbeanserver.JmxMBeanServer@1320e2db
[junit4:junit4]   2> 2017 T2994 oasc.SolrCore.initDirectoryFactory org.apache.solr.core.MockFSDirectoryFactory
[junit4:junit4]   2> 2018 T2994 oasc.CachingDirectoryFactory.get return new directory for /usr/home/hudson/hudson-slave/workspace/Lucene-Solr-NightlyTests-trunk/solr/build/solr-core/test/J0/OpenCloseCoreStressTest_/00002_core/data
[junit4:junit4]   2> 2019 T2994 oasc.SolrCore.getNewIndexDir New index directory detected: old=null new=/usr/home/hudson/hudson-slave/workspace/Lucene-Solr-NightlyTests-trunk/solr/build/solr-core/test/J0/OpenCloseCoreStressTest_/00002_core/data/index/
[junit4:junit4]   2> 2021 T2994 oasc.SolrCore.initIndex WARNING [00002_core] Solr index directory '/usr/home/hudson/hudson-slave/workspace/Lucene-Solr-NightlyTests-trunk/solr/build/solr-core/test/J0/OpenCloseCoreStressTest_/00002_core/data/index' doesn't exist. Creating new index...
[junit4:junit4]   2> 2022 T2955 oasc.SolrCore.initWriters created json: solr.JSONResponseWriter
[junit4:junit4]   2> 2022 T2994 oasc.CachingDirectoryFactory.get return new directory for /usr/home/hudson/hudson-slave/workspace/Lucene-Solr-NightlyTests-trunk/solr/build/solr-core/test/J0/OpenCloseCoreStressTest_/00002_core/data/index
[junit4:junit4]   2> 2023 T2955 oasc.RequestHandlers.initHandlersFromConfig created /admin/: solr.admin.AdminHandlers
[junit4:junit4]   2> 2024 T2955 oasc.RequestHandlers.initHandlersFromConfig created /select: solr.SearchHandler
[junit4:junit4]   2> 2025 T2955 oasc.RequestHandlers.initHandlersFromConfig created /update: solr.UpdateRequestHandler
[junit4:junit4]   2> 2030 T3009 C158 REQ [00001_core] webapp=/solr path=/select params={q=*:*&wt=javabin&qt=/select&version=2} hits=0 status=0 QTime=0 
[junit4:junit4]   2> 2032 T2998 oasc.SolrDeletionPolicy.onCommit SolrDeletionPolicy.onCommit: commits:num=1
[junit4:junit4]   2> 		commit{dir=MockDirWrapper(RateLimitedDirectoryWrapper(NRTCachingDirectory(org.apache.lucene.store.MMapDirectory@/usr/home/hudson/hudson-slave/workspace/Lucene-Solr-NightlyTests-trunk/solr/build/solr-core/test/J0/OpenCloseCoreStressTest_/00004_core/data/index lockFactory=org.apache.lucene.store.NativeFSLockFactory@6362aba6; maxCacheMB=0.818359375 maxMergeSizeMB=0.908203125))),segFN=segments_1,generation=1,filenames=[segments_1]
[junit4:junit4]   2> 2032 T3005 C158 REQ [00001_core] webapp=/solr path=/select params={q=*:*&wt=javabin&qt=/select&version=2} hits=0 status=0 QTime=0 
[junit4:junit4]   2> 2032 T2998 oasc.SolrDeletionPolicy.updateCommits newest commit = 1[segments_1]
[junit4:junit4]   2> 2034 T2998 oasc.SolrCore.initWriters created json: solr.JSONResponseWriter
[junit4:junit4]   2> 2036 T2998 oasc.RequestHandlers.initHandlersFromConfig created /admin/: solr.admin.AdminHandlers
[junit4:junit4]   2> 2036 T2998 oasc.RequestHandlers.initHandlersFromConfig created /select: solr.SearchHandler
[junit4:junit4]   2> 2037 T2998 oasc.RequestHandlers.initHandlersFromConfig created /update: solr.UpdateRequestHandler
[junit4:junit4]   2> 2041 T2955 oashl.XMLLoader.init xsltCacheLifetimeSeconds=60
[junit4:junit4]   2> 2046 T2998 oashl.XMLLoader.init xsltCacheLifetimeSeconds=60
[junit4:junit4]   2> 2050 T2955 oass.SolrIndexSearcher.<init> Opening Searcher@26dab4e5 main
[junit4:junit4]   2> 2051 T2994 oasc.SolrDeletionPolicy.onCommit SolrDeletionPolicy.onCommit: commits:num=1
[junit4:junit4]   2> 		commit{dir=MockDirWrapper(RateLimitedDirectoryWrapper(NRTCachingDirectory(org.apache.lucene.store.MMapDirectory@/usr/home/hudson/hudson-slave/workspace/Lucene-Solr-NightlyTests-trunk/solr/build/solr-core/test/J0/OpenCloseCoreStressTest_/00002_core/data/index lockFactory=org.apache.lucene.store.NativeFSLockFactory@2b6a25e4; maxCacheMB=0.818359375 maxMergeSizeMB=0.908203125))),segFN=segments_1,generation=1,filenames=[segments_1]
[junit4:junit4]   2> 2051 T2955 oasc.SolrCore.registerSearcher [00009_core] Registered new searcher Searcher@26dab4e5 main{StandardDirectoryReader(segments_1:1)}
[junit4:junit4]   2> 2051 T3011 C149 REQ [00017_core] webapp=/solr path=/select params={q=*:*&wt=javabin&qt=/select&version=2} hits=0 status=0 QTime=0 
[junit4:junit4]   2> 2051 T2994 oasc.SolrDeletionPolicy.updateCommits newest commit = 1[segments_1]
[junit4:junit4]   2> 2052 T2955 oasu.CommitTracker.<init> Hard AutoCommit: disabled
[junit4:junit4]   2> 2052 T2998 oass.SolrIndexSearcher.<init> Opening Searcher@6ac84123 main
[junit4:junit4]   2> 2052 T2955 oasu.CommitTracker.<init> Soft AutoCommit: disabled
[junit4:junit4]   2> 2053 T2998 oasc.SolrCore.registerSearcher [00004_core] Registered new searcher Searcher@6ac84123 main{StandardDirectoryReader(segments_1:1)}
[junit4:junit4]   2> 2053 T2998 oasu.CommitTracker.<init> Hard AutoCommit: disabled
[junit4:junit4]   2> 2054 T2994 oasc.SolrCore.initWriters created json: solr.JSONResponseWriter
[junit4:junit4]   2> 2054 T2998 oasu.CommitTracker.<init> Soft AutoCommit: disabled
[junit4:junit4]   2> 2056 T2955 oasc.CoreMaps.putTransientCore Opening transient core 00009_core
[junit4:junit4]   2> 2056 T2955 oasc.CoreContainer.registerCore registering core: 00009_core
[junit4:junit4]   2> 2056 T2994 oasc.RequestHandlers.initHandlersFromConfig created /admin/: solr.admin.AdminHandlers
[junit4:junit4]   2> 2057 T2994 oasc.RequestHandlers.initHandlersFromConfig created /select: solr.SearchHandler
[junit4:junit4]   2> 2058 T2998 oasc.CoreMaps.putTransientCore Opening transient core 00004_core
[junit4:junit4]   2> 2058 T2994 oasc.RequestHandlers.initHandlersFromConfig created /update: solr.UpdateRequestHandler
[junit4:junit4]   2> 2059 T2998 oasc.CoreContainer.registerCore registering core: 00004_core
[junit4:junit4]   2> 2087 T3007 C157 REQ [00018_core] webapp=/solr path=/select params={q=*:*&wt=javabin&qt=/select&version=2} hits=0 status=0 QTime=0 
[junit4:junit4]   2> ASYNC  NEW_CORE C163 name=00009_core org.apache.solr.core.SolrCore@879b950
[junit4:junit4]   2> 2088 T3010 C163 REQ [00009_core] webapp=/solr path=/select params={q=*:*&wt=javabin&qt=/select&version=2} hits=0 status=0 QTime=0 
[junit4:junit4]   2> ASYNC  NEW_CORE C164 name=00004_core org.apache.solr.core.SolrCore@2a74ce66
[junit4:junit4]   2> 2091 T3002 C164 REQ [00004_core] webapp=/solr path=/select params={q=*:*&wt=javabin&qt=/select&version=2} hits=0 status=0 QTime=0 
[junit4:junit4]   2> 2091 T3013 C164 REQ [00004_core] webapp=/solr path=/select params={q=*:*&wt=javabin&qt=/select&version=2} hits=0 status=0 QTime=0 
[junit4:junit4]   2> 2094 T3000 C163 REQ [00009_core] webapp=/solr path=/select params={q=*:*&wt=javabin&qt=/select&version=2} hits=0 status=0 QTime=0 
[junit4:junit4]   2> 2095 T3003 C158 REQ [00001_core] webapp=/solr path=/select params={q=*:*&wt=javabin&qt=/select&version=2} hits=0 status=0 QTime=0 
[junit4:junit4]   2> 2096 T2954 C164 oasc.SolrDeletionPolicy.onInit SolrDeletionPolicy.onInit: commits:num=1
[junit4:junit4]   2> 		commit{dir=MockDirWrapper(RateLimitedDirectoryWrapper(NRTCachingDirectory(org.apache.lucene.store.MMapDirectory@/usr/home/hudson/hudson-slave/workspace/Lucene-Solr-NightlyTests-trunk/solr/build/solr-core/test/J0/OpenCloseCoreStressTest_/00004_core/data/index lockFactory=org.apache.lucene.store.NativeFSLockFactory@6362aba6; maxCacheMB=0.818359375 maxMergeSizeMB=0.908203125))),segFN=segments_1,generation=1,filenames=[segments_1]
[junit4:junit4]   2> 2096 T3008 C160 REQ [00007_core] webapp=/solr path=/select params={q=*:*&wt=javabin&qt=/select&version=2} hits=0 status=0 QTime=0 
[junit4:junit4]   2> 2097 T2954 C164 oasc.SolrDeletionPolicy.updateCommits newest commit = 1[segments_1]
[junit4:junit4]   2> 2097 T2999 C147 REQ [00008_core] webapp=/solr path=/select params={q=*:*&wt=javabin&qt=/select&version=2} hits=0 status=0 QTime=0 
[junit4:junit4]   2> 2099 T2956 C163 oasc.SolrDeletionPolicy.onInit SolrDeletionPolicy.onInit: commits:num=1
[junit4:junit4]   2> 		commit{dir=MockDirWrapper(RateLimitedDirectoryWrapper(NRTCachingDirectory(org.apache.lucene.store.MMapDirectory@/usr/home/hudson/hudson-slave/workspace/Lucene-Solr-NightlyTests-trunk/solr/build/solr-core/test/J0/OpenCloseCoreStressTest_/00009_core/data/index lockFactory=org.apache.lucene.store.NativeFSLockFactory@5a9aa050; maxCacheMB=0.818359375 maxMergeSizeMB=0.908203125))),segFN=segments_1,generation=1,filenames=[segments_1]
[junit4:junit4]   2> 2100 T2956 C163 oasc.SolrDeletionPolicy.updateCommits newest commit = 1[segments_1]
[junit4:junit4]   2> 2101 T2985 C164 UPDATE [00004_core] webapp=/solr path=/update params={wt=javabin&version=2} {add=[id102]} 0 12
[junit4:junit4]   2> 2101 T2996 C164 UPDATE [00004_core] webapp=/solr path=/update params={wt=javabin&version=2} {add=[id158]} 0 12
[junit4:junit4]   2> 2101 T2953 C164 UPDATE [00004_core] webapp=/solr path=/update params={wt=javabin&version=2} {add=[id119]} 0 11
[junit4:junit4]   2> 2103 T2955 C163 UPDATE [00009_core] webapp=/solr path=/update params={wt=javabin&version=2} {add=[id70]} 0 13
[junit4:junit4]   2> 2101 T2956 C163 UPDATE [00009_core] webapp=/solr path=/update params={wt=javabin&version=2} {add=[id156]} 0 11
[junit4:junit4]   2> 2101 T2998 C164 UPDATE [00004_core] webapp=/solr path=/update params={wt=javabin&version=2} {add=[id23]} 0 11
[junit4:junit4]   2> 2101 T2954 C164 UPDATE [00004_core] webapp=/solr path=/update params={wt=javabin&version=2} {add=[id38]} 0 13
[junit4:junit4]   2> 2105 T2985 C148 UPDATE [00006_core] webapp=/solr path=/update params={wt=javabin&version=2} {add=[id165]} 0 0
[junit4:junit4]   2> 2105 T2994 oashl.XMLLoader.init xsltCacheLifetimeSeconds=60
[junit4:junit4]   2> 2106 T2996 C157 UPDATE [00018_core] webapp=/solr path=/update params={wt=javabin&version=2} {add=[id166]} 0 1
[junit4:junit4]   2> 2105 T2955 C157 UPDATE [00018_core] webapp=/solr path=/update params={wt=javabin&version=2} {add=[id168]} 0 0
[junit4:junit4]   2> 2105 T2953 C162 UPDATE [00011_core] webapp=/solr path=/update params={wt=javabin&version=2} {add=[id167]} 0 0
[junit4:junit4]   2> 2106 T2954 C148 UPDATE [00006_core] webapp=/solr path=/update params={wt=javabin&version=2} {add=[id171]} 0 0
[junit4:junit4]   2> 2107 T2956 C148 UPDATE [00006_core] webapp=/solr path=/update params={wt=javabin&version=2} {add=[id169]} 0 1
[junit4:junit4]   2> 2106 T2998 C146 UPDATE [00000_core] webapp=/solr path=/update params={wt=javabin&version=2} {add=[id170]} 0 0
[junit4:junit4]   2> 2108 T2985 C152 UPDATE [00010_core] webapp=/solr path=/update params={wt=javabin&version=2} {add=[id172]} 0 0
[junit4:junit4]   2> 2109 T2998 C159 UPDATE [00015_core] webapp=/solr path=/update params={wt=javabin&version=2} {add=[id178]} 0 0
[junit4:junit4]   2> 2109 T2954 C164 UPDATE [00004_core] webapp=/solr path=/update params={wt=javabin&version=2} {add=[id176]} 0 0
[junit4:junit4]   2> 2109 T2956 C161 UPDATE [00016_core] webapp=/solr path=/update params={wt=javabin&version=2} {add=[id177]} 0 0
[junit4:junit4]   2> 2110 T2953 C160 UPDATE [00007_core] webapp=/solr path=/update params={wt=javabin&version=2} {add=[id174]} 0 1
[junit4:junit4]   2> 2109 T2955 C163 UPDATE [00009_core] webapp=/solr path=/update params={wt=javabin&version=2} {add=[id173]} 0 0
[junit4:junit4]   2> 2109 T2996 C160 UPDATE [00007_core] webapp=/solr path=/update params={wt=javabin&version=2} {add=[id175]} 0 0
[junit4:junit4]   2> 2111 T2985 C153 UPDATE [00013_core] webapp=/solr path=/update params={wt=javabin&version=2} {add=[id179]} 0 0
[junit4:junit4]   2> 2112 T2953 C154 UPDATE [00014_core] webapp=/solr path=/update params={wt=javabin&version=2} {add=[id182]} 0 0
[junit4:junit4]   2> 2112 T2954 C147 UPDATE [00008_core] webapp=/solr path=/update params={wt=javabin&version=2} {add=[id181]} 0 0
[junit4:junit4]   2> 2112 T2956 C151 UPDATE [00003_core] webapp=/solr path=/update params={wt=javabin&version=2} {add=[id183]} 0 0
[junit4:junit4]   2> 2113 T2998 C156 UPDATE [00012_core] webapp=/solr path=/update params={wt=javabin&version=2} {add=[id180]} 0 1
[junit4:junit4]   2> 2113 T2955 C148 UPDATE [00006_core] webapp=/solr path=/update params={wt=javabin&version=2} {add=[id184]} 0 0
[junit4:junit4]   2> 2113 T2996 C159 UPDATE [00015_core] webapp=/solr path=/update params={wt=javabin&version=2} {add=[id185]} 0 0
[junit4:junit4]   2> 2115 T2985 C162 UPDATE [00011_core] webapp=/solr path=/update params={wt=javabin&version=2} {add=[id186]} 0 0
[junit4:junit4]   2> 2115 T2954 C161 UPDATE [00016_core] webapp=/solr path=/update params={wt=javabin&version=2} {add=[id188]} 0 0
[junit4:junit4]   2> 2116 T2956 C157 UPDATE [00018_core] webapp=/solr path=/update params={wt=javabin&version=2} {add=[id189]} 0 1
[junit4:junit4]   2> 2115 T2953 C158 UPDATE [00001_core] webapp=/solr path=/update params={wt=javabin&version=2} {add=[id187]} 0 0
[junit4:junit4]   2> 2116 T2955 C163 UPDATE [00009_core] webapp=/solr path=/update params={wt=javabin&version=2} {add=[id191]} 0 0
[junit4:junit4]   2> 2116 T2996 C160 UPDATE [00007_core] webapp=/solr path=/update params={wt=javabin&version=2} {add=[id192]} 0 0
[junit4:junit4]   2> 2117 T2998 C162 UPDATE [00011_core] webapp=/solr path=/update params={wt=javabin&version=2} {add=[id190]} 0 1
[junit4:junit4]   2> 2118 T2954 C151 UPDATE [00003_core] webapp=/solr path=/update params={wt=javabin&version=2} {add=[id193]} 0 0
[junit4:junit4]   2> 2118 T2994 oass.SolrIndexSearcher.<init> Opening Searcher@86ca372 main
[junit4:junit4]   2> 2118 T2953 C161 UPDATE [00016_core] webapp=/solr path=/update params={wt=javabin&version=2} {add=[id194]} 0 0
[junit4:junit4]   2> 2119 T2955 C151 UPDATE [00003_core] webapp=/solr path=/update params={wt=javabin&version=2} {add=[id196]} 0 0
[junit4:junit4]   2> 2119 T2956 C152 UPDATE [00010_core] webapp=/solr path=/update params={wt=javabin&version=2} {add=[id195]} 0 0
[junit4:junit4]   2> 2119 T2996 C159 UPDATE [00015_core] webapp=/solr path=/update params={wt=javabin&version=2} {add=[id198]} 0 0
[junit4:junit4]   2> 2120 T2994 oasc.SolrCore.registerSearcher [00002_core] Registered new searcher Searcher@86ca372 main{StandardDirectoryReader(segments_1:1)}
[junit4:junit4]   2> 2119 T2998 C146 UPDATE [00000_core] webapp=/solr path=/update params={wt=javabin&version=2} {add=[id199]} 0 0
[junit4:junit4]   2> 2120 T2985 C155 UPDATE [00019_core] webapp=/solr path=/update params={wt=javabin&version=2} {add=[id197]} 0 1
[junit4:junit4]   2> 2120 T2994 oasu.CommitTracker.<init> Hard AutoCommit: disabled
[junit4:junit4]   2> 2121 T2994 oasu.CommitTracker.<init> Soft AutoCommit: disabled
[junit4:junit4]   2> 2121 T2953 C160 UPDATE [00007_core] webapp=/solr path=/update params={wt=javabin&version=2} {add=[id201]} 0 0
[junit4:junit4]   2> 2121 T2954 C161 UPDATE [00016_core] webapp=/solr path=/update params={wt=javabin&version=2} {add=[id200]} 0 0
[junit4:junit4]   2> 2122 T2996 C146 UPDATE [00000_core] webapp=/solr path=/update params={wt=javabin&version=2} {add=[id203]} 0 0
[junit4:junit4]   2> 2122 T2955 C156 UPDATE [00012_core] webapp=/solr path=/update params={wt=javabin&version=2} {add=[id202]} 0 0
[junit4:junit4]   2> 2123 T2956 C148 UPDATE [00006_core] webapp=/solr path=/update params={wt=javabin&version=2} {add=[id205]} 0 0
[junit4:junit4]   2> 2124 T2985 C151 UPDATE [00003_core] webapp=/solr path=/update params={wt=javabin&version=2} {add=[id206]} 0 1
[junit4:junit4]   2> 2124 T2998 C148 UPDATE [00006_core] webapp=/solr path=/update params={wt=javabin&version=2} {add=[id204]} 0 1
[junit4:junit4]   2> 2124 T2954 C152 UPDATE [00010_core] webapp=/solr path=/update params={wt=javabin&version=2} {add=[id208]} 0 0
[junit4:junit4]   2> 2125 T2953 C147 UPDATE [00008_core] webapp=/solr path=/update params={wt=javabin&version=2} {add=[id207]} 0 1
[junit4:junit4]   2> 2125 T2996 C155 UPDATE [00019_core] webapp=/solr path=/update params={wt=javabin&version=2} {add=[id209]} 0 0
[junit4:junit4]   2> 2126 T2955 C160 UPDATE [00007_core] webapp=/solr path=/update params={wt=javabin&version=2} {add=[id210]} 0 1
[junit4:junit4]   2> 2126 T2956 C162 UPDATE [00011_core] webapp=/solr path=/update params={wt=javabin&version=2} {add=[id211]} 0 0
[junit4:junit4]   2> 2126 T2985 C155 UPDATE [00019_core] webapp=/solr path=/update params={wt=javabin&version=2} {add=[id212]} 0 0
[junit4:junit4]   2> 2127 T2994 oasc.CoreMaps.putTransientCore Opening transient core 00002_core
[junit4:junit4]   2> 2127 T2994 oasc.CoreContainer.registerCore registering core: 00002_core
[junit4:junit4]   2> 2128 T2954 C163 UPDATE [00009_core] webapp=/solr path=/update params={wt=javabin&version=2} {add=[id215]} 0 1
[junit4:junit4]   2> 2128 T2953 C155 UPDATE [00019_core] webapp=/solr path=/update params={wt=javabin&version=2} {add=[id214]} 0 1
[junit4:junit4]   2> 2129 T2955 C155 UPDATE [00019_core] webapp=/solr path=/update params={wt=javabin&version=2} {add=[id217]} 0 1
[junit4:junit4]   2> 2129 T2996 C158 UPDATE [00001_core] webapp=/solr path=/update params={wt=javabin&version=2} {add=[id216]} 0 1
[junit4:junit4]   2> 2130 T2985 C154 UPDATE [00014_core] webapp=/solr path=/update params={wt=javabin&version=2} {add=[id219]} 0 1
[junit4:junit4]   2> 2130 T2956 C159 UPDATE [00015_core] webapp=/solr path=/update params={wt=javabin&version=2} {add=[id218]} 0 1
[junit4:junit4]   2> 2132 T2954 C153 UPDATE [00013_core] webapp=/solr path=/update params={wt=javabin&version=2} {add=[id220]} 0 1
[junit4:junit4]   2> 2132 T2953 C158 UPDATE [00001_core] webapp=/solr path=/update params={wt=javabin&version=2} {add=[id221]} 0 1
[junit4:junit4]   2> 2133 T2955 C157 UPDATE [00018_core] webapp=/solr path=/update params={wt=javabin&version=2} {add=[id222]} 0 1
[junit4:junit4]   2> 2133 T2996 C154 UPDATE [00014_core] webapp=/solr path=/update params={wt=javabin&version=2} {add=[id223]} 0 1
[junit4:junit4]   2> 2134 T2985 C162 UPDATE [00011_core] webapp=/solr path=/update params={wt=javabin&version=2} {add=[id224]} 0 1
[junit4:junit4]   2> 2135 T2956 C153 UPDATE [00013_core] webapp=/solr path=/update params={wt=javabin&version=2} {add=[id225]} 0 1
[junit4:junit4]   2> 2135 T3009 C153 REQ [00013_core] webapp=/solr path=/select params={q=*:*&wt=javabin&qt=/select&version=2} hits=0 status=0 QTime=0 
[junit4:junit4]   2> 2136 T2953 C149 UPDATE [00017_core] webapp=/solr path=/update params={wt=javabin&version=2} {add=[id227]} 0 1
[junit4:junit4]   2> 2136 T2954 C148 UPDATE [00006_core] webapp=/solr path=/update params={wt=javabin&version=2} {add=[id226]} 0 1
[junit4:junit4]   2> 2137 T2955 C161 UPDATE [00016_core] webapp=/solr path=/update params={wt=javabin&version=2} {add=[id228]} 0 1
[junit4:junit4]   2> 2137 T3005 C159 REQ [00015_core] webapp=/solr path=/select params={q=*:*&wt=javabin&qt=/select&version=2} hits=0 status=0 QTime=0 
[junit4:junit4]   2> 2138 T2985 C151 UPDATE [00003_core] webapp=/solr path=/update params={wt=javabin&version=2} {add=[id230]} 0 0
[junit4:junit4]   2> 2139 T2956 C153 UPDATE [00013_core] webapp=/solr path=/update params={wt=javabin&version=2} {add=[id231]} 0 1
[junit4:junit4]   2> 2139 T2996 C150 UPDATE [00005_core] webapp=/solr path=/update params={wt=javabin&version=2} {add=[id229]} 0 2
[junit4:junit4]   2> ASYNC  NEW_CORE C165 name=00002_core org.apache.solr.core.SolrCore@549ddf75
[junit4:junit4]   2> 2167 T3004 C165 REQ [00002_core] webapp=/solr path=/select params={q=*:*&wt=javabin&qt=/select&version=2} hits=0 status=0 QTime=0 
[junit4:junit4]   2> 2139 T2953 C152 UPDATE [00010_core] webapp=/solr path=/update params={wt=javabin&version=2} {add=[id232]} 0 1
[junit4:junit4]   2> 2169 T3001 C165 REQ [00002_core] webapp=/solr path=/select params={q=*:*&wt=javabin&qt=/select&version=2} hits=0 status=0 QTime=0 
[junit4:junit4]   2> 2169 T2954 C159 UPDATE [00015_core] webapp=/solr path=/update params={wt=javabin&version=2} {add=[id234]} 0 1
[junit4:junit4]   2> 2169 T3011 C163 REQ [00009_core] webapp=/solr path=/select params={q=*:*&wt=javabin&qt=/select&version=2} hits=0 status=0 QTime=0 
[junit4:junit4]   2> 2169 T3012 C165 REQ [00002_core] webapp=/solr path=/select params={q=*:*&wt=javabin&qt=/select&version=2} hits=0 status=0 QTime=0 
[junit4:junit4]   2> 2169 T2955 C159 UPDATE [00015_core] webapp=/solr path=/update params={wt=javabin&version=2} {add=[id233]} 0 1
[junit4:junit4]   2> 2171 T2996 C157 UPDATE [00018_core] webapp=/solr path=/update params={wt=javabin&version=2} {add=[id237]} 0 0
[junit4:junit4]   2> 2171 T2985 C148 UPDATE [00006_core] webapp=/solr path=/update params={wt=javabin&version=2} {add=[id235]} 0 0
[junit4:junit4]   2> 2171 T2953 C146 UPDATE [00000_core] webapp=/solr path=/update params={wt=javabin&version=2} {add=[id238]} 0 0
[junit4:junit4]   2> 2171 T2956 C162 UPDATE [00011_core] webapp=/solr path=/update params={wt=javabin&version=2} {add=[id236]} 0 0
[junit4:junit4]   2> 2172 T3006 C165 REQ [00002_core] webapp=/solr path=/select params={q=*:*&wt=javabin&qt=/select&version=2} hits=0 status=0 QTime=0 
[junit4:junit4]   2> 2173 T2955 C148 UPDATE [00006_core] webapp=/solr path=/update params={wt=javabin&version=2} {add=[id239]} 0 0
[junit4:junit4]   2> 2174 T2954 C152 UPDATE [00010_core] webapp=/solr path=/update params={wt=javabin&version=2} {add=[id240]} 0 0
[junit4:junit4]   2> 2175 T2996 C152 UPDATE [00010_core] webapp=/solr path=/update params={wt=javabin&version=2} {add=[id241]} 0 1
[junit4:junit4]   2> 2175 T2997 C165 oasc.SolrDeletionPolicy.onInit SolrDeletionPolicy.onInit: commits:num=1
[junit4:junit4]   2> 		commit{dir=MockDirWrapper(RateLimitedDirectoryWrapper(NRTCachingDirectory(org.apache.lucene.store.MMapDirectory@/usr/home/hudson/hudson-slave/workspace/Lucene-Solr-NightlyTests-trunk/solr/build/solr-core/test/J0/OpenCloseCoreStressTest_/00002_core/data/index lockFactory=org.apache.lucene.store.NativeFSLockFactory@2b6a25e4; maxCacheMB=0.818359375 maxMergeSizeMB=0.908203125))),segFN=segments_1,generation=1,filenames=[segments_1]
[junit4:junit4]   2> 2175 T2956 C153 UPDATE [00013_core] webapp=/solr path=/update params={wt=javabin&version=2} {add=[id244]} 0 0
[junit4:junit4]   2> 2176 T2985 C158 UPDATE [00001_core] webapp=/solr path=/update params={wt=javabin&version=2} {add=[id242]} 0 1
[junit4:junit4]   2> 2176 T2953 C149 UPDATE [00017_core] webapp=/solr path=/update params={wt=javabin&version=2} {add=[id243]} 0 1
[junit4:junit4]   2> 2176 T2997 C165 oasc.SolrDeletionPolicy.updateCommits newest commit = 1[segments_1]
[junit4:junit4]   2> 2176 T2955 C153 UPDATE [00013_core] webapp=/solr path=/update params={wt=javabin&version=2} {add=[id245]} 0 0
[junit4:junit4]   2> 2178 T2996 C164 UPDATE [00004_core] webapp=/solr path=/update params={wt=javabin&version=2} {add=[id247]} 0 0
[junit4:junit4]   2> 2179 T2954 C163 UPDATE [00009_core] webapp=/solr path=/update params={wt=javabin&version=2} {add=[id246]} 0 1
[junit4:junit4]   2> 2179 T2956 C161 UPDATE [00016_core] webapp=/solr path=/update params={wt=javabin&version=2} {add=[id248]} 0 1
[junit4:junit4]   2> 2179 T2985 C153 UPDATE [00013_core] webapp=/solr path=/update params={wt=javabin&version=2} {add=[id249]} 0 0
[junit4:junit4]   2> 2179 T2953 C156 UPDATE [00012_core] webapp=/solr path=/update params={wt=javabin&version=2} {add=[id250]} 0 0
[junit4:junit4]   2> 2180 T2955 C160 UPDATE [00007_core] webapp=/solr path=/update params={wt=javabin&version=2} {add=[id251]} 0 0
[junit4:junit4]   2> 2181 T2994 C165 UPDATE [00002_core] webapp=/solr path=/update params={wt=javabin&version=2} {add=[id41]} 0 9
[junit4:junit4]   2> 2181 T2997 C165 UPDATE [00002_core] webapp=/solr path=/update params={wt=javabin&version=2} {add=[id113]} 0 42
[junit4:junit4]   2> 2182 T2952 C165 UPDATE [00002_core] webapp=/solr path=/update params={wt=javabin&version=2} {add=[id109]} 0 10
[junit4:junit4]   2> 2182 T2995 C165 UPDATE [00002_core] webapp=/solr path=/update params={wt=javabin&version=2} {add=[id141]} 0 13
[junit4:junit4]   2> 2182 T2954 C158 UPDATE [00001_core] webapp=/solr path=/update params={wt=javabin&version=2} {add=[id253]} 0 0
[junit4:junit4]   2> 2182 T2989 C165 UPDATE [00002_core] webapp=/solr path=/update params={wt=javabin&version=2} {add=[id164]} 0 10
[junit4:junit4]   2> 2182 T2953 C152 UPDATE [00010_core] webapp=/solr path=/update params={wt=javabin&version=2} {add=[id256]} 0 0
[junit4:junit4]   2> 2181 T2998 C165 UPDATE [00002_core] webapp=/solr path=/update params={wt=javabin&version=2} {add=[id213]} 0 9
[junit4:junit4]   2> 2181 T2951 C165 UPDATE [00002_core] webapp=/solr path=/update params={wt=javabin&version=2} {add=[id134]} 0 42
[junit4:junit4]   2> 2181 T2957 C165 UPDATE [00002_core] webapp=/solr path=/update params={wt=javabin&version=2} {add=[id49]} 0 9
[junit4:junit4]   2> 2183 T2955 C156 UPDATE [00012_core] webapp=/solr path=/update params={wt=javabin&version=2} {add=[id257]} 0 0
[junit4:junit4]   2> 2181 T2993 C165 UPDATE [00002_core] webapp=/solr path=/update params={wt=javabin&version=2} {add=[id63]} 0 12
[junit4:junit4]   2> 2183 T2956 C154 UPDATE [00014_core] webapp=/solr path=/update params={wt=javabin&version=2} {add=[id254]} 0 1
[junit4:junit4]   2> 2182 T2985 C154 UPDATE [00014_core] webapp=/solr path=/update params={wt=javabin&version=2} {add=[id255]} 0 0
[junit4:junit4]   2> 2182 T2996 C155 UPDATE [00019_core] webapp=/solr path=/update params={wt=javabin&version=2} {add=[id252]} 0 1
[junit4:junit4]   2> 2185 T2994 C155 UPDATE [00019_core] webapp=/solr path=/update params={wt=javabin&version=2} {add=[id258]} 0 1
[junit4:junit4]   2> 2185 T2997 C163 UPDATE [00009_core] webapp=/solr path=/update params={wt=javabin&version=2} {add=[id259]} 0 1
[junit4:junit4]   2> 2185 T2995 C162 UPDATE [00011_core] webapp=/solr path=/update params={wt=javabin&version=2} {add=[id261]} 0 0
[junit4:junit4]   2> 2186 T2954 C148 UPDATE [00006_core] webapp=/solr path=/update params={wt=javabin&version=2} {add=[id262]} 0 1
[junit4:junit4]   2> 2185 T2951 C149 UPDATE [00017_core] webapp=/solr path=/update params={wt=javabin&version=2} {add=[id265]} 0 0
[junit4:junit4]   2> 2185 T2989 C154 UPDATE [00014_core] webapp=/solr path=/update params={wt=javabin&version=2} {add=[id263]} 0 0
[junit4:junit4]   2> 2186 T2998 C149 UPDATE [00017_core] webapp=/solr path=/update params={wt=javabin&version=2} {add=[id264]} 0 1
[junit4:junit4]   2> 2187 T2993 C161 UPDATE [00016_core] webapp=/solr path=/update params={wt=javabin&version=2} {add=[id268]} 0 1
[junit4:junit4]   2> 2187 T2957 C150 UPDATE [00005_core] webapp=/solr path=/update params={wt=javabin&version=2} {add=[id266]} 0 1
[junit4:junit4]   2> 2186 T2952 C158 UPDATE [00001_core] webapp=/solr path=/update params={wt=javabin&version=2} {add=[id260]} 0 1
[junit4:junit4]   2> 2187 T2955 C159 UPDATE [00015_core] webapp=/solr path=/update params={wt=javabin&version=2} {add=[id267]} 0 1
[junit4:junit4]   2> 2187 T2996 C155 UPDATE [00019_core] webapp=/solr path=/update params={wt=javabin&version=2} {add=[id272]} 0 0
[junit4:junit4]   2> 2187 T2985 C146 UPDATE [00000_core] webapp=/solr path=/update params={wt=javabin&version=2} {add=[id270]} 0 1
[junit4:junit4]   2> 2187 T2956 C165 UPDATE [00002_core] webapp=/solr path=/update params={wt=javabin&version=2} {add=[id269]} 0 1
[junit4:junit4]   2> 2186 T2953 C149 UPDATE [00017_core] webapp=/solr path=/update params={wt=javabin&version=2} {add=[id271]} 0 0
[junit4:junit4]   2> 2188 T2995 C162 UPDATE [00011_core] webapp=/solr path=/update params={wt=javabin&version=2} {add=[id275]} 0 0
[junit4:junit4]   2> 2189 T2997 C161 UPDATE [00016_core] webapp=/solr path=/update params={wt=javabin&version=2} {add=[id273]} 0 1
[junit4:junit4]   2> 2188 T2994 C161 UPDATE [00016_core] webapp=/solr path=/update params={wt=javabin&version=2} {add=[id274]} 0 0
[junit4:junit4]   2> 2189 T2954 C165 UPDATE [00002_core] webapp=/solr path=/update params={wt=javabin&version=2} {add=[id276]} 0 1
[junit4:junit4]   2> 2189 T2998 C156 UPDATE [00012_core] webapp=/solr path=/update params={wt=javabin&version=2} {add=[id279]} 0 0
[junit4:junit4]   2> 2189 T2951 C149 UPDATE [00017_core] webapp=/solr path=/update params={wt=javabin&version=2} {add=[id277]} 0 0
[junit4:junit4]   2> 2190 T2957 C159 UPDATE [00015_core] webapp=/solr path=/update params={wt=javabin&version=2} {add=[id280]} 0 1
[junit4:junit4]   2> 2190 T2989 C156 UPDATE [00012_core] webapp=/solr path=/update params={wt=javabin&version=2} {add=[id278]} 0 1
[junit4:junit4]   2> 2190 T2956 C155 UPDATE [00019_core] webapp=/solr path=/update params={wt=javabin&version=2} {add=[id286]} 0 0
[junit4:junit4]   2> 2191 T2952 C163 UPDATE [00009_core] webapp=/solr path=/update params={wt=javabin&version=2} {add=[id281]} 0 1
[junit4:junit4]   2> 2191 T2985 C159 UPDATE [00015_core] webapp=/solr path=/update params={wt=javabin&version=2} {add=[id285]} 0 1
[junit4:junit4]   2> 2191 T2996 C156 UPDATE [00012_core] webapp=/solr path=/update params={wt=javabin&version=2} {add=[id284]} 0 1
[junit4:junit4]   2> 2192 T2953 C154 UPDATE [00014_core] webapp=/solr path=/update params={wt=javabin&version=2} {add=[id287]} 0 1
[junit4:junit4]   2> 2191 T2993 C157 UPDATE [00018_core] webapp=/solr path=/update params={wt=javabin&version=2} {add=[id283]} 0 1
[junit4:junit4]   2> 2191 T2955 C148 UPDATE [00006_core] webapp=/solr path=/update params={wt=javabin&version=2} {add=[id282]} 0 1
[junit4:junit4]   2> 2192 T3010 C165 REQ [00002_core] webapp=/solr path=/select params={q=*:*&wt=javabin&qt=/select&version=2} hits=0 status=0 QTime=0 
[junit4:junit4]   2> 2192 T2995 C148 UPDATE [00006_core] webapp=/solr path=/update params={wt=javabin&version=2} {add=[id288]} 0 1
[junit4:junit4]   2> 2191 T3007 C154 REQ [00014_core] webapp=/solr path=/select params={q=*:*&wt=javabin&qt=/select&version=2} hits=0 status=0 QTime=0 
[junit4:junit4]   2> 2192 T2954 C151 UPDATE [00003_core] webapp=/solr path=/update params={wt=javabin&version=2} {add=[id291]} 0 0
[junit4:junit4]   2> 2193 T2997 C156 UPDATE [00012_core] webapp=/solr path=/update params={wt=javabin&version=2} {add=[id289]} 0 1
[junit4:junit4]   2> 2194 T2998 C159 UPDATE [00015_core] webapp=/solr path=/update params={wt=javabin&version=2} {add=[id293]} 0 1
[junit4:junit4]   2> 2194 T2989 C149 UPDATE [00017_core] webapp=/solr path=/update params={wt=javabin&version=2} {add=[id295]} 0 1
[junit4:junit4]   2> 2193 T2994 C150 UPDATE [00005_core] webapp=/solr path=/update params={wt=javabin&version=2} {add=[id290]} 0 1
[junit4:junit4]   2> 2194 T2985 C148 UPDATE [00006_core] webapp=/solr path=/update params={wt=javabin&version=2} {add=[id298]} 0 0
[junit4:junit4]   2> 2194 T2956 C155 UPDATE [00019_core] webapp=/solr path=/update params={wt=javabin&version=2} {add=[id296]} 0 1
[junit4:junit4]   2> 2195 T2952 C147 UPDATE [00008_core] webapp=/solr path=/update params={wt=javabin&version=2} {add=[id297]} 0 1
[junit4:junit4]   2> 2194 T2957 C147 UPDATE [00008_core] webapp=/solr path=/update params={wt=javabin&version=2} {add=[id294]} 0 1
[junit4:junit4]   2> 2193 T2951 C161 UPDATE [00016_core] webapp=/solr path=/update params={wt=javabin&version=2} {add=[id292]} 0 0
[junit4:junit4]   2> 2195 T2953 C147 UPDATE [00008_core] webapp=/solr path=/update params={wt=javabin&version=2} {add=[id300]} 0 1
[junit4:junit4]   2> 2194 T2996 C163 UPDATE [00009_core] webapp=/solr path=/update params={wt=javabin&version=2} {add=[id299]} 0 0
[junit4:junit4]   2> 2194 T3013 C159 REQ [00015_core] webapp=/solr path=/select params={q=*:*&wt=javabin&qt=/select&version=2} hits=0 status=0 QTime=0 
[junit4:junit4]   2> 2196 T2993 C146 UPDATE [00000_core] webapp=/solr path=/update params={wt=javabin&version=2} {add=[id301]} 0 1
[junit4:junit4]   2> 2196 T2955 C164 UPDATE [00004_core] webapp=/solr path=/update params={wt=javabin&version=2} {add=[id302]} 0 1
[junit4:junit4]   2> 2197 T2954 C153 UPDATE [00013_core] webapp=/solr path=/update params={wt=javabin&version=2} {add=[id304]} 0 1
[junit4:junit4]   2> 2197 T2998 C161 UPDATE [00016_core] webapp=/solr path=/update params={wt=javabin&version=2} {add=[id306]} 0 1
[junit4:junit4]   2> 2196 T2995 C156 UPDATE [00012_core] webapp=/solr path=/update params={wt=javabin&version=2} {add=[id303]} 0 1
[junit4:junit4]   2> 2197 T2994 C150 UPDATE [00005_core] webapp=/solr path=/update params={wt=javabin&version=2} {add=[id308]} 0 0
[junit4:junit4]   2> 2195 T3002 C157 REQ [00018_core] webapp=/solr path=/select params={q=*:*&wt=javabin&qt=/select&version=2} hits=0 status=0 QTime=0 
[junit4:junit4]   2> 2198 T2989 C149 UPDATE [00017_core] webapp=/solr path=/update params={wt=javabin&version=2} {add=[id307]} 0 1
[junit4:junit4]   2> 2197 T2997 C164 UPDATE [00004_core] webapp=/solr path=/update params={wt=javabin&version=2} {add=[id305]} 0 1
[junit4:junit4]   2> 2199 T2957 C149 UPDATE [00017_core] webapp=/solr path=/update params={wt=javabin&version=2} {add=[id310]} 0 1
[junit4:junit4]   2> 2199 T2953 C157 UPDATE [00018_core] webapp=/solr path=/update params={wt=javabin&version=2} {add=[id313]} 0 1
[junit4:junit4]   2> 2198 T3000 C147 REQ [00008_core] webapp=/solr path=/select params={q=*:*&wt=javabin&qt=/select&version=2} hits=0 status=0 QTime=0 
[junit4:junit4]   2> 2198 T2985 C163 UPDATE [00009_core] webapp=/solr path=/update params={wt=javabin&version=2} {add=[id309]} 0 1
[junit4:junit4]   2> 2201 T2955 C159 UPDATE [00015_core] webapp=/solr path=/update params={wt=javabin&version=2} {add=[id317]} 0 2
[junit4:junit4]   2> 2201 T2996 C163 UPDATE [00009_core] webapp=/solr path=/update params={wt=javabin&version=2} {add=[id314]} 0 2
[junit4:junit4]   2> 2201 T2956 C159 UPDATE [00015_core] webapp=/solr path=/update params={wt=javabin&version=2} {add=[id315]} 0 2
[junit4:junit4]   2> 2201 T3008 C160 REQ [00007_core] webapp=/solr path=/select params={q=*:*&wt=javabin&qt=/select&version=2} hits=0 status=0 QTime=0 
[junit4:junit4]   2> 2202 T2995 C157 UPDATE [00018_core] webapp=/solr path=/update params={wt=javabin&version=2} {add=[id319]} 0 1
[junit4:junit4]   2> 2199 T2951 C151 UPDATE [00003_core] webapp=/solr path=/update params={wt=javabin&version=2} {add=[id312]} 0 1
[junit4:junit4]   2> 2199 T2952 C162 UPDATE [00011_core] webapp=/solr path=/update params={wt=javabin&version=2} {add=[id311]} 0 1
[junit4:junit4]   2> 2202 T2989 C146 UPDATE [00000_core] webapp=/solr path=/update params={wt=javabin&version=2} {add=[id321]} 0 1
[junit4:junit4]   2> 2202 T2954 C148 UPDATE [00006_core] webapp=/solr path=/update params={wt=javabin&version=2} {add=[id323]} 0 1
[junit4:junit4]   2> 2203 T2993 C159 UPDATE [00015_core] webapp=/solr path=/update params={wt=javabin&version=2} {add=[id316]} 0 4
[junit4:junit4]   2> 2202 T2994 C151 UPDATE [00003_core] webapp=/solr path=/update params={wt=javabin&version=2} {add=[id320]} 0 1
[junit4:junit4]   2> 2202 T2997 C149 UPDATE [00017_core] webapp=/solr path=/update params={wt=javabin&version=2} {add=[id322]} 0 1
[junit4:junit4]   2> 2201 T2998 C157 UPDATE [00018_core] webapp=/solr path=/update params={wt=javabin&version=2} {add=[id318]} 0 2
[junit4:junit4]   2> 2204 T2985 C148 UPDATE [00006_core] webapp=/solr path=/update params={wt=javabin&version=2} {add=[id325]} 0 1
[junit4:junit4]   2> 2199 T3003 C147 REQ [00008_core] webapp=/solr path=/select params={q=*:*&wt=javabin&qt=/select&version=2} hits=0 status=0 QTime=0 
[junit4:junit4]   2> 2204 T2957 C164 UPDATE [00004_core] webapp=/solr path=/update params={wt=javabin&version=2} {add=[id324]} 0 1
[junit4:junit4]   2> 2204 T2955 C158 UPDATE [00001_core] webapp=/solr path=/update params={wt=javabin&version=2} {add=[id326]} 0 1
[junit4:junit4]   2> 2203 T2999 C160 REQ [00007_core] webapp=/solr path=/select params={q=*:*&wt=javabin&qt=/select&version=2} hits=0 status=0 QTime=0 
[junit4:junit4]   2> 2204 T2996 C161 UPDATE [00016_core] webapp=/solr path=/update params={wt=javabin&version=2} {add=[id327]} 0 0
[junit4:junit4]   2> 2206 T2951 C160 UPDATE [00007_core] webapp=/solr path=/update params={wt=javabin&version=2} {add=[id329]} 0 1
[junit4:junit4]   2> 2206 T2995 C160 UPDATE [00007_core] webapp=/solr path=/update params={wt=javabin&version=2} {add=[id328]} 0 1
[junit4:junit4]   2> 2206 T2953 C162 UPDATE [00011_core] webapp=/solr path=/update params={wt=javabin&version=2} {add=[id330]} 0 1
[junit4:junit4]   2> 2206 T2997 C165 UPDATE [00002_core] webapp=/solr path=/update params={wt=javabin&version=2} {add=[id333]} 0 0
[junit4:junit4]   2> 2207 T2998 C152 UPDATE [00010_core] webapp=/solr path=/update params={wt=javabin&version=2} {add=[id335]} 0 1
[junit4:junit4]   2> 2207 T2985 C148 UPDATE [00006_core] webapp=/solr path=/update params={wt=javabin&version=2} {add=[id336]} 0 1
[junit4:junit4]   2> 2207 T2994 C160 UPDATE [00007_core] webapp=/solr path=/update params={wt=javabin&version=2} {add=[id332]} 0 1
[junit4:junit4]   2> 2206 T2989 C151 UPDATE [00003_core] webapp=/solr path=/update params={wt=javabin&version=2} {add=[id331]} 0 1
[junit4:junit4]   2> 2208 T2957 C157 UPDATE [00018_core] webapp=/solr path=/update params={wt=javabin&version=2} {add=[id337]} 0 1
[junit4:junit4]   2> 2206 T2956 C153 UPDATE [00013_core] webapp=/solr path=/update params={wt=javabin&version=2} {add=[id334]} 0 0
[junit4:junit4]   2> 2208 T2955 C154 UPDATE [00014_core] webapp=/solr path=/update params={wt=javabin&version=2} {add=[id342]} 0 1
[junit4:junit4]   2> 2217 T2995 C149 UPDATE [00017_core] webapp=/solr path=/update params={wt=javabin&version=2} {add=[id344]} 0 9
[junit4:junit4]   2> 2208 T2954 C160 UPDATE [00007_core] webapp=/solr path=/update params={wt=javabin&version=2} {add=[id340]} 0 1
[junit4:junit4]   2> 2218 T2985 C151 UPDATE [00003_core] webapp=/solr path=/update params={wt=javabin&version=2} {add=[id349]} 0 0
[junit4:junit4]   2> 2218 T2997 C147 UPDATE [00008_core] webapp=/solr path=/update params={wt=javabin&version=2} {add=[id346]} 0 0
[junit4:junit4]   2> 2218 T2994 C152 UPDATE [00010_core] webapp=/solr path=/update params={wt=javabin&version=2} {add=[id348]} 0 0
[junit4:junit4]   2> 2218 T2989 C164 UPDATE [00004_core] webapp=/solr path=/update params={wt=javabin&version=2} {add=[id350]} 0 0
[junit4:junit4]   2> 2208 T2993 C161 UPDATE [00016_core] webapp=/solr path=/update params={wt=javabin&version=2} {add=[id341]} 0 1
[junit4:junit4]   2> 2208 T2952 C150 UPDATE [00005_core] webapp=/solr path=/update params={wt=javabin&version=2} {add=[id338]} 0 1
[junit4:junit4]   2> 2207 T2996 C155 UPDATE [00019_core] webapp=/solr path=/update params={wt=javabin&version=2} {add=[id339]} 0 0
[junit4:junit4]   2> 2218 T2953 C164 UPDATE [00004_core] webapp=/solr path=/update params={wt=javabin&version=2} {add=[id345]} 0 0
[junit4:junit4]   2> 2219 T2957 C155 UPDATE [00019_core] webapp=/solr path=/update params={wt=javabin&version=2} {add=[id351]} 0 0
[junit4:junit4]   2> 2218 T2998 C148 UPDATE [00006_core] webapp=/solr path=/update params={wt=javabin&version=2} {add=[id347]} 0 0
[junit4:junit4]   2> 2217 T2951 C146 UPDATE [00000_core] webapp=/solr path=/update params={wt=javabin&version=2} {add=[id343]} 0 9
[junit4:junit4]   2> 2220 T2956 C151 UPDATE [00003_core] webapp=/solr path=/update params={wt=javabin&version=2} {add=[id352]} 0 0
[junit4:junit4]   2> 2220 T2955 C159 UPDATE [00015_core] webapp=/solr path=/update params={wt=javabin&version=2} {add=[id353]} 0 0
[junit4:junit4]   2> 2221 T2995 C149 UPDATE [00017_core] webapp=/solr path=/update params={wt=javabin&version=2} {add=[id354]} 0 1
[junit4:junit4]   2> 2221 T2993 C152 UPDATE [00010_core] webapp=/solr path=/update params={wt=javabin&version=2} {add=[id358]} 0 0
[junit4:junit4]   2> 2222 T2985 C161 UPDATE [00016_core] webapp=/solr path=/update params={wt=javabin&version=2} {add=[id356]} 0 1
[junit4:junit4]   2> 2222 T2994 C146 UPDATE [00000_core] webapp=/solr path=/update params={wt=javabin&version=2} {add=[id357]} 0 1
[junit4:junit4]   2> 2222 T2954 C161 UPDATE [00016_core] webapp=/solr path=/update params={wt=javabin&version=2} {add=[id355]} 0 1
[junit4:junit4]   2> 2222 T2952 C157 UPDATE [00018_core] webapp=/solr path=/update params={wt=javabin&version=2} {add=[id359]} 0 1
[junit4:junit4]   2> 2223 T2997 C161 UPDATE [00016_core] webapp=/solr path=/update params={wt=javabin&version=2} {add=[id365]} 0 1
[junit4:junit4]   2> 2223 T2957 C150 UPDATE [00005_core] webapp=/solr path=/update params={wt=javabin&version=2} {add=[id363]} 0 1
[junit4:junit4]   2> 2223 T2989 C165 UPDATE [00002_core] webapp=/solr path=/update params={wt=javabin&version=2} {add=[id362]} 0 1
[junit4:junit4]   2> 2223 T2996 C157 UPDATE [00018_core] webapp=/solr path=/update params={wt=javabin&version=2} {add=[id360]} 0 1
[junit4:junit4]   2> 2223 T2953 C156 UPDATE [00012_core] webapp=/solr path=/update params={wt=javabin&version=2} {add=[id361]} 0 0
[junit4:junit4]   2> 2223 T2955 C156 UPDATE [00012_core] webapp=/solr path=/update params={wt=javabin&version=2} {add=[id367]} 0 0
[junit4:junit4]   2> 2224 T2951 C162 UPDATE [00011_core] webapp=/solr path=/update params={wt=javabin&version=2} {add=[id366]} 0 1
[junit4:junit4]   2> 2223 T2998 C161 UPDATE [00016_core] webapp=/solr path=/update params={wt=javabin&version=2} {add=[id364]} 0 1
[junit4:junit4]   2> 2224 T2995 C162 UPDATE [00011_core] webapp=/solr path=/update params={wt=javabin&version=2} {add=[id368]} 0 0
[junit4:junit4]   2> 2225 T2993 C153 UPDATE [00013_core] webapp=/solr path=/update params={wt=javabin&version=2} {add=[id370]} 0 1
[junit4:junit4]   2> 2224 T2985 C150 UPDATE [00005_core] webapp=/solr path=/update params={wt=javabin&version=2} {add=[id371]} 0 0
[junit4:junit4]   2> 2225 T2956 C164 UPDATE [00004_core] webapp=/solr path=/update params={wt=javabin&version=2} {add=[id369]} 0 1
[junit4:junit4]   2> 2225 T2997 C155 UPDATE [00019_core] webapp=/solr path=/update params={wt=javabin&version=2} {add=[id375]} 0 0
[junit4:junit4]   2> 2226 T2994 C155 UPDATE [00019_core] webapp=/solr path=/update params={wt=javabin&version=2} {add=[id374]} 0 1
[junit4:junit4]   2> 2226 T2955 C163 UPDATE [00009_core] webapp=/solr path=/update params={wt=javabin&version=2} {add=[id379]} 0 0
[junit4:junit4]   2> 2225 T2954 C161 UPDATE [00016_core] webapp=/solr path=/update params={wt=javabin&version=2} {add=[id373]} 0 0
[junit4:junit4]   2> 2227 T2953 C150 UPDATE [00005_core] webapp=/solr path=/update params={wt=javabin&version=2} {add=[id378]} 0 1
[junit4:junit4]   2> 2225 T2952 C148 UPDATE [00006_core] webapp=/solr path=/update params={wt=javabin&version=2} {add=[id372]} 0 0
[junit4:junit4]   2> 2226 T2957 C163 UPDATE [00009_core] webapp=/solr path=/update params={wt=javabin&version=2} {add=[id376]} 0 1
[junit4:junit4]   2> 2227 T2993 C158 UPDATE [00001_core] webapp=/solr path=/update params={wt=javabin&version=2} {add=[id384]} 0 0
[junit4:junit4]   2> 2228 T2989 C159 UPDATE [00015_core] webapp=/solr path=/update params={wt=javabin&version=2} {add=[id382]} 0 1
[junit4:junit4]   2> 2226 T2996 C161 UPDATE [00016_core] webapp=/solr path=/update params={wt=javabin&version=2} {add=[id377]} 0 0
[junit4:junit4]   2> 2227 T2995 C147 UPDATE [00008_core] webapp=/solr path=/update params={wt=javabin&version=2} {add=[id383]} 0 0
[junit4:junit4]   2> 2228 T2951 C159 UPDATE [00015_core] webapp=/solr path=/update params={wt=javabin&version=2} {add=[id380]} 0 1
[junit4:junit4]   2> 2227 T2998 C149 UPDATE [00017_core] webapp=/solr path=/update params={wt=javabin&version=2} {add=[id381]} 0 0
[junit4:junit4]   2> 2228 T2997 C161 UPDATE [00016_core] webapp=/solr path=/update params={wt=javabin&version=2} {add=[id387]} 0 0
[junit4:junit4]   2> 2229 T2985 C151 UPDATE [00003_core] webapp=/solr path=/update params={wt=javabin&version=2} {add=[id385]} 0 1
[junit4:junit4]   2> 2229 T2956 C160 UPDATE [00007_core] webapp=/solr path=/update params={wt=javabin&version=2} {add=[id386]} 0 1
[junit4:junit4]   2> 2229 T2994 C160 UPDATE [00007_core] webapp=/solr path=/update params={wt=javabin&version=2} {add=[id388]} 0 0
[junit4:junit4]   2> 2229 T2955 C149 UPDATE [00017_core] webapp=/solr path=/update params={wt=javabin&version=2} {add=[id389]} 0 0
[junit4:junit4]   2> 2230 T2952 C161 UPDATE [00016_core] webapp=/solr path=/update params={wt=javabin&version=2} {add=[id393]} 0 0
[junit4:junit4]   2> 2231 T2957 C156 UPDATE [00012_core] webapp=/solr path=/update params={wt=javabin&version=2} {add=[id391]} 0 1
[junit4:junit4]   2> 2231 T2954 C149 UPDATE [00017_core] webapp=/solr path=/update params={wt=javabin&version=2} {add=[id390]} 0 1
[junit4:junit4]   2> 2231 T2989 C158 UPDATE [00001_core] webapp=/solr path=/update params={wt=javabin&version=2} {add=[id395]} 0 1
[junit4:junit4]   2> 2231 T2996 C159 UPDATE [00015_core] webapp=/solr path=/update params={wt=javabin&version=2} {add=[id394]} 0 1
[junit4:junit4]   2> 2232 T2951 C152 UPDATE [00010_core] webapp=/solr path=/update params={wt=javabin&version=2} {add=[id400]} 0 1
[junit4:junit4]   2> 2232 T2997 C158 UPDATE [00001_core] webapp=/solr path=/update params={wt=javabin&version=2} {add=[id399]} 0 1
[junit4:junit4]   2> 2232 T2995 C146 UPDATE [00000_core] webapp=/solr path

[...truncated too long message...]

bin&qt=/replication&version=2} status=0 QTime=3 
[junit4:junit4]   2> 557848 T5036 C244 REQ [collection1] webapp=/solr path=/replication params={slave=false&command=details&wt=javabin&qt=/replication&version=2} status=0 QTime=0 
[junit4:junit4]   2> 557849 T5061 C245 REQ [collection1] webapp=/solr path=/replication params={command=details&wt=javabin&qt=/replication&version=2} status=0 QTime=3 
[junit4:junit4]   2> 557851 T5037 C244 REQ [collection1] webapp=/solr path=/replication params={command=indexversion&wt=javabin&qt=/replication&version=2} status=0 QTime=0 
[junit4:junit4]   2> 557853 T5061 C245 REQ [collection1] webapp=/solr path=/replication params={command=indexversion&wt=javabin&qt=/replication&version=2} status=0 QTime=0 
[junit4:junit4]   2> 557857 T5063 C245 REQ [collection1] webapp=/solr path=/replication params={slave=false&command=details&wt=javabin&qt=/replication&version=2} status=0 QTime=0 
[junit4:junit4]   2> 557858 T5037 C244 REQ [collection1] webapp=/solr path=/replication params={command=details&wt=javabin&qt=/replication&version=2} status=0 QTime=3 
[junit4:junit4]   2> 557862 T5036 C244 REQ [collection1] webapp=/solr path=/replication params={slave=false&command=details&wt=javabin&qt=/replication&version=2} status=0 QTime=0 
[junit4:junit4]   2> 557863 T5061 C245 REQ [collection1] webapp=/solr path=/replication params={command=details&wt=javabin&qt=/replication&version=2} status=0 QTime=3 
[junit4:junit4]   2> 557864 T4475 oas.SolrTestCaseJ4.tearDown ###Ending doTestSnapPullWithMasterUrl
[junit4:junit4]   2> 557864 T4475 oasc.CoreContainer.shutdown Shutting down CoreContainer instance=1569705521
[junit4:junit4]   2> 557867 T4475 oasc.SolrCore.close [collection1]  CLOSING SolrCore org.apache.solr.core.SolrCore@25ad75bf
[junit4:junit4]   2> 557867 T4475 oasu.DirectUpdateHandler2.close closing DirectUpdateHandler2{commits=2,autocommits=0,soft autocommits=0,optimizes=0,rollbacks=0,expungeDeletes=0,docsPending=0,adds=0,deletesById=0,deletesByQuery=0,errors=0,cumulative_adds=496,cumulative_deletesById=0,cumulative_deletesByQuery=1,cumulative_errors=0}
[junit4:junit4]   2> 557868 T4475 oasu.SolrCoreState.decrefSolrCoreState Closing SolrCoreState
[junit4:junit4]   2> 557869 T4475 oasu.DefaultSolrCoreState.closeIndexWriter SolrCoreState ref count has reached 0 - closing IndexWriter
[junit4:junit4]   2> 557869 T4475 oasu.DefaultSolrCoreState.closeIndexWriter closing IndexWriter with IndexWriterCloser
[junit4:junit4]   2> 557870 T4475 oasc.SolrCore.closeSearcher [collection1] Closing main searcher on request.
[junit4:junit4]   2> 557871 T4475 oasc.CachingDirectoryFactory.close Closing MockDirectoryFactory - 2 directories currently being tracked
[junit4:junit4]   2> 557871 T4475 oasc.CachingDirectoryFactory.closeCacheValue looking to close ./org.apache.solr.handler.TestReplicationHandler$SolrInstance-1364356983446/master/collection1/data [CachedDir<<refCount=0;path=./org.apache.solr.handler.TestReplicationHandler$SolrInstance-1364356983446/master/collection1/data;done=false>>]
[junit4:junit4]   2> 557872 T4475 oasc.CachingDirectoryFactory.close Closing directory: ./org.apache.solr.handler.TestReplicationHandler$SolrInstance-1364356983446/master/collection1/data
[junit4:junit4]   2> 557872 T4475 oasc.CachingDirectoryFactory.closeCacheValue looking to close ./org.apache.solr.handler.TestReplicationHandler$SolrInstance-1364356983446/master/collection1/data/index.20130327010306358 [CachedDir<<refCount=0;path=./org.apache.solr.handler.TestReplicationHandler$SolrInstance-1364356983446/master/collection1/data/index.20130327010306358;done=false>>]
[junit4:junit4]   2> 557873 T4475 oasc.CachingDirectoryFactory.close Closing directory: ./org.apache.solr.handler.TestReplicationHandler$SolrInstance-1364356983446/master/collection1/data/index.20130327010306358
[junit4:junit4]   2> 557883 T4475 oejsh.ContextHandler.doStop stopped o.e.j.s.ServletContextHandler{/solr,null}
[junit4:junit4]   2> 557935 T4475 oasc.CoreContainer.shutdown Shutting down CoreContainer instance=1921487704
[junit4:junit4]   2> 557937 T4475 oasc.SolrCore.close [collection1]  CLOSING SolrCore org.apache.solr.core.SolrCore@47f99fcd
[junit4:junit4]   2> 557938 T4475 oasu.DirectUpdateHandler2.close closing DirectUpdateHandler2{commits=2,autocommits=0,soft autocommits=0,optimizes=0,rollbacks=0,expungeDeletes=0,docsPending=0,adds=0,deletesById=0,deletesByQuery=0,errors=0,cumulative_adds=3,cumulative_deletesById=0,cumulative_deletesByQuery=1,cumulative_errors=0}
[junit4:junit4]   2> 557939 T4475 oasu.SolrCoreState.decrefSolrCoreState Closing SolrCoreState
[junit4:junit4]   2> 557939 T4475 oasu.DefaultSolrCoreState.closeIndexWriter SolrCoreState ref count has reached 0 - closing IndexWriter
[junit4:junit4]   2> 557939 T4475 oasu.DefaultSolrCoreState.closeIndexWriter closing IndexWriter with IndexWriterCloser
[junit4:junit4]   2> 557941 T4475 oasc.SolrCore.closeSearcher [collection1] Closing main searcher on request.
[junit4:junit4]   2> 557941 T4475 oasc.CachingDirectoryFactory.close Closing MockDirectoryFactory - 2 directories currently being tracked
[junit4:junit4]   2> 557941 T4475 oasc.CachingDirectoryFactory.closeCacheValue looking to close ./org.apache.solr.handler.TestReplicationHandler$SolrInstance-1364356983762/slave/collection1/data [CachedDir<<refCount=0;path=./org.apache.solr.handler.TestReplicationHandler$SolrInstance-1364356983762/slave/collection1/data;done=false>>]
[junit4:junit4]   2> 557942 T4475 oasc.CachingDirectoryFactory.close Closing directory: ./org.apache.solr.handler.TestReplicationHandler$SolrInstance-1364356983762/slave/collection1/data
[junit4:junit4]   2> 557942 T4475 oasc.CachingDirectoryFactory.closeCacheValue looking to close ./org.apache.solr.handler.TestReplicationHandler$SolrInstance-1364356983762/slave/collection1/data/index.20130327010305455 [CachedDir<<refCount=0;path=./org.apache.solr.handler.TestReplicationHandler$SolrInstance-1364356983762/slave/collection1/data/index.20130327010305455;done=false>>]
[junit4:junit4]   2> 557943 T4475 oasc.CachingDirectoryFactory.close Closing directory: ./org.apache.solr.handler.TestReplicationHandler$SolrInstance-1364356983762/slave/collection1/data/index.20130327010305455
[junit4:junit4]   2> 557952 T4475 oejsh.ContextHandler.doStop stopped o.e.j.s.ServletContextHandler{/solr,null}
[junit4:junit4]   2> 558103 T4475 oas.SolrTestCaseJ4.deleteCore ###deleteCore
[junit4:junit4]   2> NOTE: test params are: codec=FastCompressingStoredFields(storedFieldsFormat=CompressingStoredFieldsFormat(compressionMode=FAST, chunkSize=435), termVectorsFormat=CompressingTermVectorsFormat(compressionMode=FAST, chunkSize=435)), sim=DefaultSimilarity, locale=es_CL, timezone=America/Asuncion
[junit4:junit4]   2> NOTE: FreeBSD 9.0-RELEASE amd64/Oracle Corporation 1.7.0_17 (64-bit)/cpus=16,threads=1,free=153989840,total=294518784
[junit4:junit4]   2> NOTE: All tests run in this JVM: [TestDFRSimilarityFactory, CurrencyFieldXmlFileTest, SuggesterTSTTest, TestReload, TestFastOutputStream, TestJmxIntegration, TestElisionMultitermQuery, IndexBasedSpellCheckerTest, DirectUpdateHandlerTest, TestDefaultSearchFieldResource, CollectionsAPIDistributedZkTest, TestPropInject, SolrPluginUtilsTest, TestZkChroot, TestDistributedSearch, TestLuceneMatchVersion, ConvertedLegacyTest, IndexSchemaRuntimeFieldTest, TestRTGBase, OpenExchangeRatesOrgProviderTest, TestLMJelinekMercerSimilarityFactory, TestRandomFaceting, DOMUtilTest, JSONWriterTest, FileUtilsTest, DirectSolrSpellCheckerTest, SolrRequestParserTest, StatsComponentTest, SolrCoreCheckLockOnStartupTest, TestSolrDiscoveryProperties, DistanceFunctionTest, TestWordDelimiterFilterFactory, TestDistributedGrouping, TestStressReorder, TestDynamicFieldCollectionResource, TermVectorComponentDistributedTest, EchoParamsTest, CopyFieldTest, SpellPossibilityIteratorTest, SortByFunctionTest, TestFieldCollectionResource, TestRangeQuery, NoCacheHeaderTest, SolrIndexConfigTest, DateMathParserTest, TestComponentsName, TestQueryTypes, TestFieldTypeCollectionResource, TestIndexingPerformance, SolrCmdDistributorTest, TestSuggestSpellingConverter, TestSchemaVersionResource, TestCodecSupport, OutputWriterTest, SuggesterWFSTTest, TestStressLucene, DebugComponentTest, BasicDistributedZk2Test, ClusterStateTest, TestJmxMonitoredMap, TestArbitraryIndexDir, DisMaxRequestHandlerTest, TestCollationField, LeaderElectionIntegrationTest, HighlighterTest, SignatureUpdateProcessorFactoryTest, TestMultiCoreConfBootstrap, SyncSliceTest, ShardRoutingTest, BasicZkTest, RecoveryZkTest, FullSolrCloudDistribCmdsTest, TestReplicationHandler]
[junit4:junit4] Completed on J1 in 558.13s, 12 tests, 2 failures <<< FAILURES!

[...truncated 404 lines...]
BUILD FAILED
/usr/home/hudson/hudson-slave/workspace/Lucene-Solr-NightlyTests-trunk/build.xml:382: The following error occurred while executing this line:
/usr/home/hudson/hudson-slave/workspace/Lucene-Solr-NightlyTests-trunk/build.xml:355: The following error occurred while executing this line:
/usr/home/hudson/hudson-slave/workspace/Lucene-Solr-NightlyTests-trunk/build.xml:39: The following error occurred while executing this line:
/usr/home/hudson/hudson-slave/workspace/Lucene-Solr-NightlyTests-trunk/solr/build.xml:183: The following error occurred while executing this line:
/usr/home/hudson/hudson-slave/workspace/Lucene-Solr-NightlyTests-trunk/solr/common-build.xml:449: The following error occurred while executing this line:
/usr/home/hudson/hudson-slave/workspace/Lucene-Solr-NightlyTests-trunk/lucene/common-build.xml:1230: The following error occurred while executing this line:
/usr/home/hudson/hudson-slave/workspace/Lucene-Solr-NightlyTests-trunk/lucene/common-build.xml:874: There were test failures: 281 suites, 1157 tests, 3 failures, 25 ignored (6 assumptions)

Total time: 121 minutes 41 seconds
Build step 'Invoke Ant' marked build as failure
Archiving artifacts
Recording test results
Email was triggered for: Failure
Sending email for trigger: Failure



Mime
View raw message