lucene-dev mailing list archives

Site index · List index
Message view « Date » · « Thread »
Top « Date » · « Thread »
From Policeman Jenkins Server <jenk...@thetaphi.de>
Subject [JENKINS] Lucene-Solr-trunk-Linux (64bit/jdk1.8.0-ea-b79) - Build # 4778 - Failure!
Date Tue, 19 Mar 2013 14:35:46 GMT
Build: http://jenkins.thetaphi.de/job/Lucene-Solr-trunk-Linux/4778/
Java: 64bit/jdk1.8.0-ea-b79 -XX:+UseParallelGC

2 tests failed.
REGRESSION:  org.apache.solr.cloud.BasicDistributedZk2Test.testDistribSearch

Error Message:
Server at http://127.0.0.1:53197/u_zfl/h/onenodecollectioncore returned non ok status:404, message:Can not find: /u_zfl/h/onenodecollectioncore/update

Stack Trace:
org.apache.solr.common.SolrException: Server at http://127.0.0.1:53197/u_zfl/h/onenodecollectioncore returned non ok status:404, message:Can not find: /u_zfl/h/onenodecollectioncore/update
	at __randomizedtesting.SeedInfo.seed([CB0075E55D2C5B43:4AE6FBFD2A733B7F]:0)
	at org.apache.solr.client.solrj.impl.HttpSolrServer.request(HttpSolrServer.java:375)
	at org.apache.solr.client.solrj.impl.HttpSolrServer.request(HttpSolrServer.java:181)
	at org.apache.solr.client.solrj.request.AbstractUpdateRequest.process(AbstractUpdateRequest.java:117)
	at org.apache.solr.client.solrj.SolrServer.add(SolrServer.java:116)
	at org.apache.solr.client.solrj.SolrServer.add(SolrServer.java:102)
	at org.apache.solr.cloud.BasicDistributedZk2Test.testNodeWithoutCollectionForwarding(BasicDistributedZk2Test.java:196)
	at org.apache.solr.cloud.BasicDistributedZk2Test.doTest(BasicDistributedZk2Test.java:89)
	at org.apache.solr.BaseDistributedSearchTestCase.testDistribSearch(BaseDistributedSearchTestCase.java:806)
	at sun.reflect.NativeMethodAccessorImpl.invoke0(Native Method)
	at sun.reflect.NativeMethodAccessorImpl.invoke(NativeMethodAccessorImpl.java:57)
	at sun.reflect.DelegatingMethodAccessorImpl.invoke(DelegatingMethodAccessorImpl.java:43)
	at java.lang.reflect.Method.invoke(Method.java:487)
	at com.carrotsearch.randomizedtesting.RandomizedRunner.invoke(RandomizedRunner.java:1559)
	at com.carrotsearch.randomizedtesting.RandomizedRunner.access$600(RandomizedRunner.java:79)
	at com.carrotsearch.randomizedtesting.RandomizedRunner$6.evaluate(RandomizedRunner.java:737)
	at com.carrotsearch.randomizedtesting.RandomizedRunner$7.evaluate(RandomizedRunner.java:773)
	at com.carrotsearch.randomizedtesting.RandomizedRunner$8.evaluate(RandomizedRunner.java:787)
	at com.carrotsearch.randomizedtesting.rules.SystemPropertiesRestoreRule$1.evaluate(SystemPropertiesRestoreRule.java:53)
	at org.apache.lucene.util.TestRuleSetupTeardownChained$1.evaluate(TestRuleSetupTeardownChained.java:50)
	at org.apache.lucene.util.TestRuleFieldCacheSanity$1.evaluate(TestRuleFieldCacheSanity.java:51)
	at org.apache.lucene.util.AbstractBeforeAfterRule$1.evaluate(AbstractBeforeAfterRule.java:46)
	at com.carrotsearch.randomizedtesting.rules.SystemPropertiesInvariantRule$1.evaluate(SystemPropertiesInvariantRule.java:55)
	at org.apache.lucene.util.TestRuleThreadAndTestName$1.evaluate(TestRuleThreadAndTestName.java:49)
	at org.apache.lucene.util.TestRuleIgnoreAfterMaxFailures$1.evaluate(TestRuleIgnoreAfterMaxFailures.java:70)
	at org.apache.lucene.util.TestRuleMarkFailure$1.evaluate(TestRuleMarkFailure.java:48)
	at com.carrotsearch.randomizedtesting.rules.StatementAdapter.evaluate(StatementAdapter.java:36)
	at com.carrotsearch.randomizedtesting.ThreadLeakControl$StatementRunner.run(ThreadLeakControl.java:358)
	at com.carrotsearch.randomizedtesting.ThreadLeakControl.forkTimeoutingTask(ThreadLeakControl.java:782)
	at com.carrotsearch.randomizedtesting.ThreadLeakControl$3.evaluate(ThreadLeakControl.java:442)
	at com.carrotsearch.randomizedtesting.RandomizedRunner.runSingleTest(RandomizedRunner.java:746)
	at com.carrotsearch.randomizedtesting.RandomizedRunner$3.evaluate(RandomizedRunner.java:648)
	at com.carrotsearch.randomizedtesting.RandomizedRunner$4.evaluate(RandomizedRunner.java:682)
	at com.carrotsearch.randomizedtesting.RandomizedRunner$5.evaluate(RandomizedRunner.java:693)
	at com.carrotsearch.randomizedtesting.rules.StatementAdapter.evaluate(StatementAdapter.java:36)
	at com.carrotsearch.randomizedtesting.rules.SystemPropertiesRestoreRule$1.evaluate(SystemPropertiesRestoreRule.java:53)
	at org.apache.lucene.util.AbstractBeforeAfterRule$1.evaluate(AbstractBeforeAfterRule.java:46)
	at org.apache.lucene.util.TestRuleStoreClassName$1.evaluate(TestRuleStoreClassName.java:42)
	at com.carrotsearch.randomizedtesting.rules.SystemPropertiesInvariantRule$1.evaluate(SystemPropertiesInvariantRule.java:55)
	at com.carrotsearch.randomizedtesting.rules.NoShadowingOrOverridesOnMethodsRule$1.evaluate(NoShadowingOrOverridesOnMethodsRule.java:39)
	at com.carrotsearch.randomizedtesting.rules.NoShadowingOrOverridesOnMethodsRule$1.evaluate(NoShadowingOrOverridesOnMethodsRule.java:39)
	at com.carrotsearch.randomizedtesting.rules.StatementAdapter.evaluate(StatementAdapter.java:36)
	at org.apache.lucene.util.TestRuleAssertionsRequired$1.evaluate(TestRuleAssertionsRequired.java:43)
	at org.apache.lucene.util.TestRuleMarkFailure$1.evaluate(TestRuleMarkFailure.java:48)
	at org.apache.lucene.util.TestRuleIgnoreAfterMaxFailures$1.evaluate(TestRuleIgnoreAfterMaxFailures.java:70)
	at org.apache.lucene.util.TestRuleIgnoreTestSuites$1.evaluate(TestRuleIgnoreTestSuites.java:55)
	at com.carrotsearch.randomizedtesting.rules.StatementAdapter.evaluate(StatementAdapter.java:36)
	at com.carrotsearch.randomizedtesting.ThreadLeakControl$StatementRunner.run(ThreadLeakControl.java:358)
	at java.lang.Thread.run(Thread.java:722)


REGRESSION:  org.apache.solr.cloud.UnloadDistributedZkTest.testDistribSearch

Error Message:
Still found shard2 in collection test_unload_shard_and_collection

Stack Trace:
java.lang.AssertionError: Still found shard2 in collection test_unload_shard_and_collection
	at __randomizedtesting.SeedInfo.seed([CB0075E55D2C5B43:4AE6FBFD2A733B7F]:0)
	at org.junit.Assert.fail(Assert.java:93)
	at org.apache.solr.cloud.UnloadDistributedZkTest.testUnloadShardAndCollection(UnloadDistributedZkTest.java:124)
	at org.apache.solr.cloud.UnloadDistributedZkTest.doTest(UnloadDistributedZkTest.java:77)
	at org.apache.solr.BaseDistributedSearchTestCase.testDistribSearch(BaseDistributedSearchTestCase.java:806)
	at sun.reflect.NativeMethodAccessorImpl.invoke0(Native Method)
	at sun.reflect.NativeMethodAccessorImpl.invoke(NativeMethodAccessorImpl.java:57)
	at sun.reflect.DelegatingMethodAccessorImpl.invoke(DelegatingMethodAccessorImpl.java:43)
	at java.lang.reflect.Method.invoke(Method.java:487)
	at com.carrotsearch.randomizedtesting.RandomizedRunner.invoke(RandomizedRunner.java:1559)
	at com.carrotsearch.randomizedtesting.RandomizedRunner.access$600(RandomizedRunner.java:79)
	at com.carrotsearch.randomizedtesting.RandomizedRunner$6.evaluate(RandomizedRunner.java:737)
	at com.carrotsearch.randomizedtesting.RandomizedRunner$7.evaluate(RandomizedRunner.java:773)
	at com.carrotsearch.randomizedtesting.RandomizedRunner$8.evaluate(RandomizedRunner.java:787)
	at com.carrotsearch.randomizedtesting.rules.SystemPropertiesRestoreRule$1.evaluate(SystemPropertiesRestoreRule.java:53)
	at org.apache.lucene.util.TestRuleSetupTeardownChained$1.evaluate(TestRuleSetupTeardownChained.java:50)
	at org.apache.lucene.util.TestRuleFieldCacheSanity$1.evaluate(TestRuleFieldCacheSanity.java:51)
	at org.apache.lucene.util.AbstractBeforeAfterRule$1.evaluate(AbstractBeforeAfterRule.java:46)
	at com.carrotsearch.randomizedtesting.rules.SystemPropertiesInvariantRule$1.evaluate(SystemPropertiesInvariantRule.java:55)
	at org.apache.lucene.util.TestRuleThreadAndTestName$1.evaluate(TestRuleThreadAndTestName.java:49)
	at org.apache.lucene.util.TestRuleIgnoreAfterMaxFailures$1.evaluate(TestRuleIgnoreAfterMaxFailures.java:70)
	at org.apache.lucene.util.TestRuleMarkFailure$1.evaluate(TestRuleMarkFailure.java:48)
	at com.carrotsearch.randomizedtesting.rules.StatementAdapter.evaluate(StatementAdapter.java:36)
	at com.carrotsearch.randomizedtesting.ThreadLeakControl$StatementRunner.run(ThreadLeakControl.java:358)
	at com.carrotsearch.randomizedtesting.ThreadLeakControl.forkTimeoutingTask(ThreadLeakControl.java:782)
	at com.carrotsearch.randomizedtesting.ThreadLeakControl$3.evaluate(ThreadLeakControl.java:442)
	at com.carrotsearch.randomizedtesting.RandomizedRunner.runSingleTest(RandomizedRunner.java:746)
	at com.carrotsearch.randomizedtesting.RandomizedRunner$3.evaluate(RandomizedRunner.java:648)
	at com.carrotsearch.randomizedtesting.RandomizedRunner$4.evaluate(RandomizedRunner.java:682)
	at com.carrotsearch.randomizedtesting.RandomizedRunner$5.evaluate(RandomizedRunner.java:693)
	at com.carrotsearch.randomizedtesting.rules.StatementAdapter.evaluate(StatementAdapter.java:36)
	at com.carrotsearch.randomizedtesting.rules.SystemPropertiesRestoreRule$1.evaluate(SystemPropertiesRestoreRule.java:53)
	at org.apache.lucene.util.AbstractBeforeAfterRule$1.evaluate(AbstractBeforeAfterRule.java:46)
	at org.apache.lucene.util.TestRuleStoreClassName$1.evaluate(TestRuleStoreClassName.java:42)
	at com.carrotsearch.randomizedtesting.rules.SystemPropertiesInvariantRule$1.evaluate(SystemPropertiesInvariantRule.java:55)
	at com.carrotsearch.randomizedtesting.rules.NoShadowingOrOverridesOnMethodsRule$1.evaluate(NoShadowingOrOverridesOnMethodsRule.java:39)
	at com.carrotsearch.randomizedtesting.rules.NoShadowingOrOverridesOnMethodsRule$1.evaluate(NoShadowingOrOverridesOnMethodsRule.java:39)
	at com.carrotsearch.randomizedtesting.rules.StatementAdapter.evaluate(StatementAdapter.java:36)
	at org.apache.lucene.util.TestRuleAssertionsRequired$1.evaluate(TestRuleAssertionsRequired.java:43)
	at org.apache.lucene.util.TestRuleMarkFailure$1.evaluate(TestRuleMarkFailure.java:48)
	at org.apache.lucene.util.TestRuleIgnoreAfterMaxFailures$1.evaluate(TestRuleIgnoreAfterMaxFailures.java:70)
	at org.apache.lucene.util.TestRuleIgnoreTestSuites$1.evaluate(TestRuleIgnoreTestSuites.java:55)
	at com.carrotsearch.randomizedtesting.rules.StatementAdapter.evaluate(StatementAdapter.java:36)
	at com.carrotsearch.randomizedtesting.ThreadLeakControl$StatementRunner.run(ThreadLeakControl.java:358)
	at java.lang.Thread.run(Thread.java:722)




Build Log:
[...truncated 8968 lines...]
[junit4:junit4] Suite: org.apache.solr.cloud.UnloadDistributedZkTest
[junit4:junit4]   2> 1 T34 oas.BaseDistributedSearchTestCase.initHostContext Setting hostContext system property: /
[junit4:junit4]   2> 17 T34 oas.SolrTestCaseJ4.setUp ###Starting testDistribSearch
[junit4:junit4]   2> Creating dataDir: /mnt/ssd/jenkins/workspace/Lucene-Solr-trunk-Linux/solr/build/solr-core/test/J0/./solrtest-UnloadDistributedZkTest-1363702663669
[junit4:junit4]   2> 21 T34 oasc.ZkTestServer.run STARTING ZK TEST SERVER
[junit4:junit4]   2> 33 T35 oasc.ZkTestServer$ZKServerMain.runFromConfig Starting server
[junit4:junit4]   2> 65 T35 oaz.Environment.logEnv Server environment:zookeeper.version=3.4.5-1392090, built on 09/30/2012 17:52 GMT
[junit4:junit4]   2> 65 T35 oaz.Environment.logEnv Server environment:host.name=serv1
[junit4:junit4]   2> 65 T35 oaz.Environment.logEnv Server environment:java.version=1.8.0-ea
[junit4:junit4]   2> 67 T35 oaz.Environment.logEnv Server environment:java.vendor=Oracle Corporation
[junit4:junit4]   2> 68 T35 oaz.Environment.logEnv Server environment:java.home=/var/lib/jenkins/tools/java/64bit/jdk1.8.0-ea-b79/jre
[junit4:junit4]   2> 68 T35 oaz.Environment.logEnv Server environment:java.class.path=/mnt/ssd/jenkins/workspace/Lucene-Solr-trunk-Linux/solr/build/solr-core/classes/test:/mnt/ssd/jenkins/workspace/Lucene-Solr-trunk-Linux/solr/build/solr-test-framework/classes/java:/mnt/ssd/jenkins/workspace/Lucene-Solr-trunk-Linux/solr/build/solr-core/test-files:/mnt/ssd/jenkins/workspace/Lucene-Solr-trunk-Linux/lucene/build/test-framework/classes/java:/mnt/ssd/jenkins/workspace/Lucene-Solr-trunk-Linux/lucene/build/codecs/classes/java:/mnt/ssd/jenkins/workspace/Lucene-Solr-trunk-Linux/solr/build/solr-solrj/classes/java:/mnt/ssd/jenkins/workspace/Lucene-Solr-trunk-Linux/solr/build/solr-core/classes/java:/mnt/ssd/jenkins/workspace/Lucene-Solr-trunk-Linux/lucene/build/analysis/common/lucene-analyzers-common-5.0-SNAPSHOT.jar:/mnt/ssd/jenkins/workspace/Lucene-Solr-trunk-Linux/lucene/build/analysis/kuromoji/lucene-analyzers-kuromoji-5.0-SNAPSHOT.jar:/mnt/ssd/jenkins/workspace/Lucene-Solr-trunk-Linux/lucene/build/analysis/phonetic/lucene-analyzers-phonetic-5.0-SNAPSHOT.jar:/mnt/ssd/jenkins/workspace/Lucene-Solr-trunk-Linux/lucene/build/codecs/lucene-codecs-5.0-SNAPSHOT.jar:/mnt/ssd/jenkins/workspace/Lucene-Solr-trunk-Linux/lucene/build/highlighter/lucene-highlighter-5.0-SNAPSHOT.jar:/mnt/ssd/jenkins/workspace/Lucene-Solr-trunk-Linux/lucene/build/memory/lucene-memory-5.0-SNAPSHOT.jar:/mnt/ssd/jenkins/workspace/Lucene-Solr-trunk-Linux/lucene/build/misc/lucene-misc-5.0-SNAPSHOT.jar:/mnt/ssd/jenkins/workspace/Lucene-Solr-trunk-Linux/lucene/build/spatial/lucene-spatial-5.0-SNAPSHOT.jar:/mnt/ssd/jenkins/workspace/Lucene-Solr-trunk-Linux/lucene/build/suggest/lucene-suggest-5.0-SNAPSHOT.jar:/mnt/ssd/jenkins/workspace/Lucene-Solr-trunk-Linux/lucene/build/grouping/lucene-grouping-5.0-SNAPSHOT.jar:/mnt/ssd/jenkins/workspace/Lucene-Solr-trunk-Linux/lucene/build/queries/lucene-queries-5.0-SNAPSHOT.jar:/mnt/ssd/jenkins/workspace/Lucene-Solr-trunk-Linux/lucene/build/queryparser/lucene-queryparser-5.0-SNAPSHOT.jar:/mnt/ssd/jenkins/workspace/Lucene-Solr-trunk-Linux/solr/core/lib/cglib-nodep-2.2.jar:/mnt/ssd/jenkins/workspace/Lucene-Solr-trunk-Linux/solr/core/lib/commons-cli-1.2.jar:/mnt/ssd/jenkins/workspace/Lucene-Solr-trunk-Linux/solr/core/lib/commons-codec-1.7.jar:/mnt/ssd/jenkins/workspace/Lucene-Solr-trunk-Linux/solr/core/lib/commons-fileupload-1.2.1.jar:/mnt/ssd/jenkins/workspace/Lucene-Solr-trunk-Linux/solr/core/lib/commons-lang-2.6.jar:/mnt/ssd/jenkins/workspace/Lucene-Solr-trunk-Linux/solr/core/lib/easymock-3.0.jar:/mnt/ssd/jenkins/workspace/Lucene-Solr-trunk-Linux/solr/core/lib/guava-13.0.1.jar:/mnt/ssd/jenkins/workspace/Lucene-Solr-trunk-Linux/solr/core/lib/javax.servlet-api-3.0.1.jar:/mnt/ssd/jenkins/workspace/Lucene-Solr-trunk-Linux/solr/core/lib/objenesis-1.2.jar:/mnt/ssd/jenkins/workspace/Lucene-Solr-trunk-Linux/solr/core/lib/org.restlet-2.1.1.jar:/mnt/ssd/jenkins/workspace/Lucene-Solr-trunk-Linux/solr/core/lib/org.restlet.ext.servlet-2.1.1.jar:/mnt/ssd/jenkins/workspace/Lucene-Solr-trunk-Linux/solr/core/lib/spatial4j-0.3.jar:/mnt/ssd/jenkins/workspace/Lucene-Solr-trunk-Linux/solr/solrj/lib/commons-io-2.1.jar:/mnt/ssd/jenkins/workspace/Lucene-Solr-trunk-Linux/solr/solrj/lib/httpclient-4.2.3.jar:/mnt/ssd/jenkins/workspace/Lucene-Solr-trunk-Linux/solr/solrj/lib/httpcore-4.2.2.jar:/mnt/ssd/jenkins/workspace/Lucene-Solr-trunk-Linux/solr/solrj/lib/httpmime-4.2.3.jar:/mnt/ssd/jenkins/workspace/Lucene-Solr-trunk-Linux/solr/solrj/lib/jcl-over-slf4j-1.6.4.jar:/mnt/ssd/jenkins/workspace/Lucene-Solr-trunk-Linux/solr/solrj/lib/noggit-0.5.jar:/mnt/ssd/jenkins/workspace/Lucene-Solr-trunk-Linux/solr/solrj/lib/slf4j-api-1.6.4.jar:/mnt/ssd/jenkins/workspace/Lucene-Solr-trunk-Linux/solr/solrj/lib/slf4j-jdk14-1.6.4.jar:/mnt/ssd/jenkins/workspace/Lucene-Solr-trunk-Linux/solr/solrj/lib/wstx-asl-3.2.7.jar:/mnt/ssd/jenkins/workspace/Lucene-Solr-trunk-Linux/solr/solrj/lib/zookeeper-3.4.5.jar:/mnt/ssd/jenkins/workspace/Lucene-Solr-trunk-Linux/solr/example/lib/jetty-continuation-8.1.8.v20121106.jar:/mnt/ssd/jenkins/workspace/Lucene-Solr-trunk-Linux/solr/example/lib/jetty-deploy-8.1.8.v20121106.jar:/mnt/ssd/jenkins/workspace/Lucene-Solr-trunk-Linux/solr/example/lib/jetty-http-8.1.8.v20121106.jar:/mnt/ssd/jenkins/workspace/Lucene-Solr-trunk-Linux/solr/example/lib/jetty-io-8.1.8.v20121106.jar:/mnt/ssd/jenkins/workspace/Lucene-Solr-trunk-Linux/solr/example/lib/jetty-jmx-8.1.8.v20121106.jar:/mnt/ssd/jenkins/workspace/Lucene-Solr-trunk-Linux/solr/example/lib/jetty-security-8.1.8.v20121106.jar:/mnt/ssd/jenkins/workspace/Lucene-Solr-trunk-Linux/solr/example/lib/jetty-server-8.1.8.v20121106.jar:/mnt/ssd/jenkins/workspace/Lucene-Solr-trunk-Linux/solr/example/lib/jetty-servlet-8.1.8.v20121106.jar:/mnt/ssd/jenkins/workspace/Lucene-Solr-trunk-Linux/solr/example/lib/jetty-util-8.1.8.v20121106.jar:/mnt/ssd/jenkins/workspace/Lucene-Solr-trunk-Linux/solr/example/lib/jetty-webapp-8.1.8.v20121106.jar:/mnt/ssd/jenkins/workspace/Lucene-Solr-trunk-Linux/solr/example/lib/jetty-xml-8.1.8.v20121106.jar:/mnt/ssd/jenkins/workspace/Lucene-Solr-trunk-Linux/solr/example/lib/servlet-api-3.0.jar:/mnt/ssd/jenkins/workspace/Lucene-Solr-trunk-Linux/solr/example/example-DIH/solr/db/lib/derby-10.9.1.0.jar:/mnt/ssd/jenkins/workspace/Lucene-Solr-trunk-Linux/solr/example/example-DIH/solr/db/lib/hsqldb-1.8.0.10.jar:/mnt/ssd/jenkins/workspace/Lucene-Solr-trunk-Linux/lucene/build/core/classes/java:/mnt/ssd/jenkins/workspace/Lucene-Solr-trunk-Linux/lucene/test-framework/lib/junit-4.10.jar:/mnt/ssd/jenkins/workspace/Lucene-Solr-trunk-Linux/lucene/test-framework/lib/randomizedtesting-runner-2.0.8.jar:/var/lib/jenkins/tools/hudson.tasks.Ant_AntInstallation/ANT_1.8.2/lib/ant-launcher.jar:/var/lib/jenkins/.ant/lib/ivy-2.3.0.jar:/var/lib/jenkins/tools/hudson.tasks.Ant_AntInstallation/ANT_1.8.2/lib/ant-jai.jar:/var/lib/jenkins/tools/hudson.tasks.Ant_AntInstallation/ANT_1.8.2/lib/ant-swing.jar:/var/lib/jenkins/tools/hudson.tasks.Ant_AntInstallation/ANT_1.8.2/lib/ant-apache-oro.jar:/var/lib/jenkins/tools/hudson.tasks.Ant_AntInstallation/ANT_1.8.2/lib/ant-jmf.jar:/var/lib/jenkins/tools/hudson.tasks.Ant_AntInstallation/ANT_1.8.2/lib/ant-apache-xalan2.jar:/var/lib/jenkins/tools/hudson.tasks.Ant_AntInstallation/ANT_1.8.2/lib/ant-javamail.jar:/var/lib/jenkins/tools/hudson.tasks.Ant_AntInstallation/ANT_1.8.2/lib/ant-apache-resolver.jar:/var/lib/jenkins/tools/hudson.tasks.Ant_AntInstallation/ANT_1.8.2/lib/ant-testutil.jar:/var/lib/jenkins/tools/hudson.tasks.Ant_AntInstallation/ANT_1.8.2/lib/ant-commons-logging.jar:/var/lib/jenkins/tools/hudson.tasks.Ant_AntInstallation/ANT_1.8.2/lib/ant-apache-log4j.jar:/var/lib/jenkins/tools/hudson.tasks.Ant_AntInstallation/ANT_1.8.2/lib/ant-junit.jar:/var/lib/jenkins/tools/hudson.tasks.Ant_AntInstallation/ANT_1.8.2/lib/ant-jsch.jar:/var/lib/jenkins/tools/hudson.tasks.Ant_AntInstallation/ANT_1.8.2/lib/ant-commons-net.jar:/var/lib/jenkins/tools/hudson.tasks.Ant_AntInstallation/ANT_1.8.2/lib/ant-apache-bsf.jar:/var/lib/jenkins/tools/hudson.tasks.Ant_AntInstallation/ANT_1.8.2/lib/ant-jdepend.jar:/var/lib/jenkins/tools/hudson.tasks.Ant_AntInstallation/ANT_1.8.2/lib/ant-netrexx.jar:/var/lib/jenkins/tools/hudson.tasks.Ant_AntInstallation/ANT_1.8.2/lib/ant-apache-regexp.jar:/var/lib/jenkins/tools/hudson.tasks.Ant_AntInstallation/ANT_1.8.2/lib/ant-junit4.jar:/var/lib/jenkins/tools/hudson.tasks.Ant_AntInstallation/ANT_1.8.2/lib/ant.jar:/var/lib/jenkins/tools/hudson.tasks.Ant_AntInstallation/ANT_1.8.2/lib/ant-apache-bcel.jar:/var/lib/jenkins/tools/hudson.tasks.Ant_AntInstallation/ANT_1.8.2/lib/ant-antlr.jar:/var/lib/jenkins/tools/java/64bit/jdk1.8.0-ea-b79/lib/tools.jar:/var/lib/jenkins/.ivy2/cache/com.carrotsearch.randomizedtesting/junit4-ant/jars/junit4-ant-2.0.8.jar
[junit4:junit4]   2> 69 T35 oaz.Environment.logEnv Server environment:java.library.path=/usr/java/packages/lib/amd64:/usr/lib64:/lib64:/lib:/usr/lib
[junit4:junit4]   2> 69 T35 oaz.Environment.logEnv Server environment:java.io.tmpdir=.
[junit4:junit4]   2> 70 T35 oaz.Environment.logEnv Server environment:java.compiler=<NA>
[junit4:junit4]   2> 70 T35 oaz.Environment.logEnv Server environment:os.name=Linux
[junit4:junit4]   2> 70 T35 oaz.Environment.logEnv Server environment:os.arch=amd64
[junit4:junit4]   2> 71 T35 oaz.Environment.logEnv Server environment:os.version=3.2.0-39-generic
[junit4:junit4]   2> 71 T35 oaz.Environment.logEnv Server environment:user.name=jenkins
[junit4:junit4]   2> 71 T35 oaz.Environment.logEnv Server environment:user.home=/var/lib/jenkins
[junit4:junit4]   2> 71 T35 oaz.Environment.logEnv Server environment:user.dir=/mnt/ssd/jenkins/workspace/Lucene-Solr-trunk-Linux/solr/build/solr-core/test/J0
[junit4:junit4]   2> 87 T35 oazs.ZooKeeperServer.setTickTime tickTime set to 1000
[junit4:junit4]   2> 88 T35 oazs.ZooKeeperServer.setMinSessionTimeout minSessionTimeout set to -1
[junit4:junit4]   2> 88 T35 oazs.ZooKeeperServer.setMaxSessionTimeout maxSessionTimeout set to -1
[junit4:junit4]   2> 100 T35 oazs.NIOServerCnxnFactory.configure binding to port 0.0.0.0/0.0.0.0:0
[junit4:junit4]   2> 132 T34 oasc.ZkTestServer.run start zk server on port:33013
[junit4:junit4]   2> 147 T35 oazsp.FileTxnSnapLog.save Snapshotting: 0x0 to /mnt/ssd/jenkins/workspace/Lucene-Solr-trunk-Linux/solr/build/solr-core/test/J0/./org.apache.solr.cloud.UnloadDistributedZkTest-1363702663668/zookeeper/server1/data/version-2/snapshot.0
[junit4:junit4]   2> 164 T34 oaz.Environment.logEnv Client environment:zookeeper.version=3.4.5-1392090, built on 09/30/2012 17:52 GMT
[junit4:junit4]   2> 164 T34 oaz.Environment.logEnv Client environment:host.name=serv1
[junit4:junit4]   2> 165 T34 oaz.Environment.logEnv Client environment:java.version=1.8.0-ea
[junit4:junit4]   2> 165 T34 oaz.Environment.logEnv Client environment:java.vendor=Oracle Corporation
[junit4:junit4]   2> 165 T34 oaz.Environment.logEnv Client environment:java.home=/var/lib/jenkins/tools/java/64bit/jdk1.8.0-ea-b79/jre
[junit4:junit4]   2> 166 T34 oaz.Environment.logEnv Client environment:java.class.path=/mnt/ssd/jenkins/workspace/Lucene-Solr-trunk-Linux/solr/build/solr-core/classes/test:/mnt/ssd/jenkins/workspace/Lucene-Solr-trunk-Linux/solr/build/solr-test-framework/classes/java:/mnt/ssd/jenkins/workspace/Lucene-Solr-trunk-Linux/solr/build/solr-core/test-files:/mnt/ssd/jenkins/workspace/Lucene-Solr-trunk-Linux/lucene/build/test-framework/classes/java:/mnt/ssd/jenkins/workspace/Lucene-Solr-trunk-Linux/lucene/build/codecs/classes/java:/mnt/ssd/jenkins/workspace/Lucene-Solr-trunk-Linux/solr/build/solr-solrj/classes/java:/mnt/ssd/jenkins/workspace/Lucene-Solr-trunk-Linux/solr/build/solr-core/classes/java:/mnt/ssd/jenkins/workspace/Lucene-Solr-trunk-Linux/lucene/build/analysis/common/lucene-analyzers-common-5.0-SNAPSHOT.jar:/mnt/ssd/jenkins/workspace/Lucene-Solr-trunk-Linux/lucene/build/analysis/kuromoji/lucene-analyzers-kuromoji-5.0-SNAPSHOT.jar:/mnt/ssd/jenkins/workspace/Lucene-Solr-trunk-Linux/lucene/build/analysis/phonetic/lucene-analyzers-phonetic-5.0-SNAPSHOT.jar:/mnt/ssd/jenkins/workspace/Lucene-Solr-trunk-Linux/lucene/build/codecs/lucene-codecs-5.0-SNAPSHOT.jar:/mnt/ssd/jenkins/workspace/Lucene-Solr-trunk-Linux/lucene/build/highlighter/lucene-highlighter-5.0-SNAPSHOT.jar:/mnt/ssd/jenkins/workspace/Lucene-Solr-trunk-Linux/lucene/build/memory/lucene-memory-5.0-SNAPSHOT.jar:/mnt/ssd/jenkins/workspace/Lucene-Solr-trunk-Linux/lucene/build/misc/lucene-misc-5.0-SNAPSHOT.jar:/mnt/ssd/jenkins/workspace/Lucene-Solr-trunk-Linux/lucene/build/spatial/lucene-spatial-5.0-SNAPSHOT.jar:/mnt/ssd/jenkins/workspace/Lucene-Solr-trunk-Linux/lucene/build/suggest/lucene-suggest-5.0-SNAPSHOT.jar:/mnt/ssd/jenkins/workspace/Lucene-Solr-trunk-Linux/lucene/build/grouping/lucene-grouping-5.0-SNAPSHOT.jar:/mnt/ssd/jenkins/workspace/Lucene-Solr-trunk-Linux/lucene/build/queries/lucene-queries-5.0-SNAPSHOT.jar:/mnt/ssd/jenkins/workspace/Lucene-Solr-trunk-Linux/lucene/build/queryparser/lucene-queryparser-5.0-SNAPSHOT.jar:/mnt/ssd/jenkins/workspace/Lucene-Solr-trunk-Linux/solr/core/lib/cglib-nodep-2.2.jar:/mnt/ssd/jenkins/workspace/Lucene-Solr-trunk-Linux/solr/core/lib/commons-cli-1.2.jar:/mnt/ssd/jenkins/workspace/Lucene-Solr-trunk-Linux/solr/core/lib/commons-codec-1.7.jar:/mnt/ssd/jenkins/workspace/Lucene-Solr-trunk-Linux/solr/core/lib/commons-fileupload-1.2.1.jar:/mnt/ssd/jenkins/workspace/Lucene-Solr-trunk-Linux/solr/core/lib/commons-lang-2.6.jar:/mnt/ssd/jenkins/workspace/Lucene-Solr-trunk-Linux/solr/core/lib/easymock-3.0.jar:/mnt/ssd/jenkins/workspace/Lucene-Solr-trunk-Linux/solr/core/lib/guava-13.0.1.jar:/mnt/ssd/jenkins/workspace/Lucene-Solr-trunk-Linux/solr/core/lib/javax.servlet-api-3.0.1.jar:/mnt/ssd/jenkins/workspace/Lucene-Solr-trunk-Linux/solr/core/lib/objenesis-1.2.jar:/mnt/ssd/jenkins/workspace/Lucene-Solr-trunk-Linux/solr/core/lib/org.restlet-2.1.1.jar:/mnt/ssd/jenkins/workspace/Lucene-Solr-trunk-Linux/solr/core/lib/org.restlet.ext.servlet-2.1.1.jar:/mnt/ssd/jenkins/workspace/Lucene-Solr-trunk-Linux/solr/core/lib/spatial4j-0.3.jar:/mnt/ssd/jenkins/workspace/Lucene-Solr-trunk-Linux/solr/solrj/lib/commons-io-2.1.jar:/mnt/ssd/jenkins/workspace/Lucene-Solr-trunk-Linux/solr/solrj/lib/httpclient-4.2.3.jar:/mnt/ssd/jenkins/workspace/Lucene-Solr-trunk-Linux/solr/solrj/lib/httpcore-4.2.2.jar:/mnt/ssd/jenkins/workspace/Lucene-Solr-trunk-Linux/solr/solrj/lib/httpmime-4.2.3.jar:/mnt/ssd/jenkins/workspace/Lucene-Solr-trunk-Linux/solr/solrj/lib/jcl-over-slf4j-1.6.4.jar:/mnt/ssd/jenkins/workspace/Lucene-Solr-trunk-Linux/solr/solrj/lib/noggit-0.5.jar:/mnt/ssd/jenkins/workspace/Lucene-Solr-trunk-Linux/solr/solrj/lib/slf4j-api-1.6.4.jar:/mnt/ssd/jenkins/workspace/Lucene-Solr-trunk-Linux/solr/solrj/lib/slf4j-jdk14-1.6.4.jar:/mnt/ssd/jenkins/workspace/Lucene-Solr-trunk-Linux/solr/solrj/lib/wstx-asl-3.2.7.jar:/mnt/ssd/jenkins/workspace/Lucene-Solr-trunk-Linux/solr/solrj/lib/zookeeper-3.4.5.jar:/mnt/ssd/jenkins/workspace/Lucene-Solr-trunk-Linux/solr/example/lib/jetty-continuation-8.1.8.v20121106.jar:/mnt/ssd/jenkins/workspace/Lucene-Solr-trunk-Linux/solr/example/lib/jetty-deploy-8.1.8.v20121106.jar:/mnt/ssd/jenkins/workspace/Lucene-Solr-trunk-Linux/solr/example/lib/jetty-http-8.1.8.v20121106.jar:/mnt/ssd/jenkins/workspace/Lucene-Solr-trunk-Linux/solr/example/lib/jetty-io-8.1.8.v20121106.jar:/mnt/ssd/jenkins/workspace/Lucene-Solr-trunk-Linux/solr/example/lib/jetty-jmx-8.1.8.v20121106.jar:/mnt/ssd/jenkins/workspace/Lucene-Solr-trunk-Linux/solr/example/lib/jetty-security-8.1.8.v20121106.jar:/mnt/ssd/jenkins/workspace/Lucene-Solr-trunk-Linux/solr/example/lib/jetty-server-8.1.8.v20121106.jar:/mnt/ssd/jenkins/workspace/Lucene-Solr-trunk-Linux/solr/example/lib/jetty-servlet-8.1.8.v20121106.jar:/mnt/ssd/jenkins/workspace/Lucene-Solr-trunk-Linux/solr/example/lib/jetty-util-8.1.8.v20121106.jar:/mnt/ssd/jenkins/workspace/Lucene-Solr-trunk-Linux/solr/example/lib/jetty-webapp-8.1.8.v20121106.jar:/mnt/ssd/jenkins/workspace/Lucene-Solr-trunk-Linux/solr/example/lib/jetty-xml-8.1.8.v20121106.jar:/mnt/ssd/jenkins/workspace/Lucene-Solr-trunk-Linux/solr/example/lib/servlet-api-3.0.jar:/mnt/ssd/jenkins/workspace/Lucene-Solr-trunk-Linux/solr/example/example-DIH/solr/db/lib/derby-10.9.1.0.jar:/mnt/ssd/jenkins/workspace/Lucene-Solr-trunk-Linux/solr/example/example-DIH/solr/db/lib/hsqldb-1.8.0.10.jar:/mnt/ssd/jenkins/workspace/Lucene-Solr-trunk-Linux/lucene/build/core/classes/java:/mnt/ssd/jenkins/workspace/Lucene-Solr-trunk-Linux/lucene/test-framework/lib/junit-4.10.jar:/mnt/ssd/jenkins/workspace/Lucene-Solr-trunk-Linux/lucene/test-framework/lib/randomizedtesting-runner-2.0.8.jar:/var/lib/jenkins/tools/hudson.tasks.Ant_AntInstallation/ANT_1.8.2/lib/ant-launcher.jar:/var/lib/jenkins/.ant/lib/ivy-2.3.0.jar:/var/lib/jenkins/tools/hudson.tasks.Ant_AntInstallation/ANT_1.8.2/lib/ant-jai.jar:/var/lib/jenkins/tools/hudson.tasks.Ant_AntInstallation/ANT_1.8.2/lib/ant-swing.jar:/var/lib/jenkins/tools/hudson.tasks.Ant_AntInstallation/ANT_1.8.2/lib/ant-apache-oro.jar:/var/lib/jenkins/tools/hudson.tasks.Ant_AntInstallation/ANT_1.8.2/lib/ant-jmf.jar:/var/lib/jenkins/tools/hudson.tasks.Ant_AntInstallation/ANT_1.8.2/lib/ant-apache-xalan2.jar:/var/lib/jenkins/tools/hudson.tasks.Ant_AntInstallation/ANT_1.8.2/lib/ant-javamail.jar:/var/lib/jenkins/tools/hudson.tasks.Ant_AntInstallation/ANT_1.8.2/lib/ant-apache-resolver.jar:/var/lib/jenkins/tools/hudson.tasks.Ant_AntInstallation/ANT_1.8.2/lib/ant-testutil.jar:/var/lib/jenkins/tools/hudson.tasks.Ant_AntInstallation/ANT_1.8.2/lib/ant-commons-logging.jar:/var/lib/jenkins/tools/hudson.tasks.Ant_AntInstallation/ANT_1.8.2/lib/ant-apache-log4j.jar:/var/lib/jenkins/tools/hudson.tasks.Ant_AntInstallation/ANT_1.8.2/lib/ant-junit.jar:/var/lib/jenkins/tools/hudson.tasks.Ant_AntInstallation/ANT_1.8.2/lib/ant-jsch.jar:/var/lib/jenkins/tools/hudson.tasks.Ant_AntInstallation/ANT_1.8.2/lib/ant-commons-net.jar:/var/lib/jenkins/tools/hudson.tasks.Ant_AntInstallation/ANT_1.8.2/lib/ant-apache-bsf.jar:/var/lib/jenkins/tools/hudson.tasks.Ant_AntInstallation/ANT_1.8.2/lib/ant-jdepend.jar:/var/lib/jenkins/tools/hudson.tasks.Ant_AntInstallation/ANT_1.8.2/lib/ant-netrexx.jar:/var/lib/jenkins/tools/hudson.tasks.Ant_AntInstallation/ANT_1.8.2/lib/ant-apache-regexp.jar:/var/lib/jenkins/tools/hudson.tasks.Ant_AntInstallation/ANT_1.8.2/lib/ant-junit4.jar:/var/lib/jenkins/tools/hudson.tasks.Ant_AntInstallation/ANT_1.8.2/lib/ant.jar:/var/lib/jenkins/tools/hudson.tasks.Ant_AntInstallation/ANT_1.8.2/lib/ant-apache-bcel.jar:/var/lib/jenkins/tools/hudson.tasks.Ant_AntInstallation/ANT_1.8.2/lib/ant-antlr.jar:/var/lib/jenkins/tools/java/64bit/jdk1.8.0-ea-b79/lib/tools.jar:/var/lib/jenkins/.ivy2/cache/com.carrotsearch.randomizedtesting/junit4-ant/jars/junit4-ant-2.0.8.jar
[junit4:junit4]   2> 167 T34 oaz.Environment.logEnv Client environment:java.library.path=/usr/java/packages/lib/amd64:/usr/lib64:/lib64:/lib:/usr/lib
[junit4:junit4]   2> 168 T34 oaz.Environment.logEnv Client environment:java.io.tmpdir=.
[junit4:junit4]   2> 168 T34 oaz.Environment.logEnv Client environment:java.compiler=<NA>
[junit4:junit4]   2> 169 T34 oaz.Environment.logEnv Client environment:os.name=Linux
[junit4:junit4]   2> 169 T34 oaz.Environment.logEnv Client environment:os.arch=amd64
[junit4:junit4]   2> 170 T34 oaz.Environment.logEnv Client environment:os.version=3.2.0-39-generic
[junit4:junit4]   2> 170 T34 oaz.Environment.logEnv Client environment:user.name=jenkins
[junit4:junit4]   2> 171 T34 oaz.Environment.logEnv Client environment:user.home=/var/lib/jenkins
[junit4:junit4]   2> 172 T34 oaz.Environment.logEnv Client environment:user.dir=/mnt/ssd/jenkins/workspace/Lucene-Solr-trunk-Linux/solr/build/solr-core/test/J0
[junit4:junit4]   2> 174 T34 oaz.ZooKeeper.<init> Initiating client connection, connectString=127.0.0.1:33013 sessionTimeout=10000 watcher=org.apache.solr.common.cloud.ConnectionManager@60945960
[junit4:junit4]   2> 203 T34 oascc.ConnectionManager.waitForConnected Waiting for client to connect to ZooKeeper
[junit4:junit4]   2> 207 T39 oaz.ClientCnxn$SendThread.logStartConnect Opening socket connection to server localhost.localdomain/127.0.0.1:33013. Will not attempt to authenticate using SASL (access denied ("javax.security.auth.AuthPermission" "getLoginConfiguration"))
[junit4:junit4]   2> 209 T39 oaz.ClientCnxn$SendThread.primeConnection Socket connection established to localhost.localdomain/127.0.0.1:33013, initiating session
[junit4:junit4]   2> 1811 T36 oazs.NIOServerCnxnFactory.run Accepted socket connection from /127.0.0.1:51445
[junit4:junit4]   2> 1824 T36 oazs.ZooKeeperServer.processConnectRequest Client attempting to establish new session at /127.0.0.1:51445
[junit4:junit4]   2> 1830 T38 oazsp.FileTxnLog.append Creating new log file: log.1
[junit4:junit4]   2> 1926 T38 oazs.ZooKeeperServer.finishSessionInit Established session 0x13d83034a830000 with negotiated timeout 10000 for client /127.0.0.1:51445
[junit4:junit4]   2> 1927 T39 oaz.ClientCnxn$SendThread.onConnected Session establishment complete on server localhost.localdomain/127.0.0.1:33013, sessionid = 0x13d83034a830000, negotiated timeout = 10000
[junit4:junit4]   2> 1931 T40 oascc.ConnectionManager.process Watcher org.apache.solr.common.cloud.ConnectionManager@60945960 name:ZooKeeperConnection Watcher:127.0.0.1:33013 got event WatchedEvent state:SyncConnected type:None path:null path:null type:None
[junit4:junit4]   2> 1931 T34 oascc.ConnectionManager.waitForConnected Client is connected to ZooKeeper
[junit4:junit4]   2> 1934 T34 oascc.SolrZkClient.makePath makePath: /solr
[junit4:junit4]   2> 1962 T41 oazs.PrepRequestProcessor.pRequest2Txn Processed session termination for sessionid: 0x13d83034a830000
[junit4:junit4]   2> 1963 T40 oaz.ClientCnxn$EventThread.run EventThread shut down
[junit4:junit4]   2> 1963 T34 oaz.ZooKeeper.close Session: 0x13d83034a830000 closed
[junit4:junit4]   2> 1964 T34 oaz.ZooKeeper.<init> Initiating client connection, connectString=127.0.0.1:33013/solr sessionTimeout=10000 watcher=org.apache.solr.common.cloud.ConnectionManager@335f03f7
[junit4:junit4]   2> 1965 T42 oaz.ClientCnxn$SendThread.logStartConnect Opening socket connection to server localhost.localdomain/127.0.0.1:33013. Will not attempt to authenticate using SASL (access denied ("javax.security.auth.AuthPermission" "getLoginConfiguration"))
[junit4:junit4]   2> 1966 T34 oascc.ConnectionManager.waitForConnected Waiting for client to connect to ZooKeeper
[junit4:junit4]   2> 1966 T42 oaz.ClientCnxn$SendThread.primeConnection Socket connection established to localhost.localdomain/127.0.0.1:33013, initiating session
[junit4:junit4]   2> 1970 T36 oazs.NIOServerCnxn.closeSock Closed socket connection for client /127.0.0.1:51445 which had sessionid 0x13d83034a830000
[junit4:junit4]   2> 1971 T36 oazs.NIOServerCnxnFactory.run Accepted socket connection from /127.0.0.1:51446
[junit4:junit4]   2> 1971 T36 oazs.ZooKeeperServer.processConnectRequest Client attempting to establish new session at /127.0.0.1:51446
[junit4:junit4]   2> 1973 T38 oazs.ZooKeeperServer.finishSessionInit Established session 0x13d83034a830001 with negotiated timeout 10000 for client /127.0.0.1:51446
[junit4:junit4]   2> 1973 T42 oaz.ClientCnxn$SendThread.onConnected Session establishment complete on server localhost.localdomain/127.0.0.1:33013, sessionid = 0x13d83034a830001, negotiated timeout = 10000
[junit4:junit4]   2> 1973 T43 oascc.ConnectionManager.process Watcher org.apache.solr.common.cloud.ConnectionManager@335f03f7 name:ZooKeeperConnection Watcher:127.0.0.1:33013/solr got event WatchedEvent state:SyncConnected type:None path:null path:null type:None
[junit4:junit4]   2> 1974 T34 oascc.ConnectionManager.waitForConnected Client is connected to ZooKeeper
[junit4:junit4]   2> 1982 T34 oascc.SolrZkClient.makePath makePath: /collections/collection1
[junit4:junit4]   2> 1989 T34 oascc.SolrZkClient.makePath makePath: /collections/collection1/shards
[junit4:junit4]   2> 1993 T34 oascc.SolrZkClient.makePath makePath: /collections/control_collection
[junit4:junit4]   2> 1997 T34 oascc.SolrZkClient.makePath makePath: /collections/control_collection/shards
[junit4:junit4]   2> 2002 T34 oasc.AbstractZkTestCase.putConfig put /mnt/ssd/jenkins/workspace/Lucene-Solr-trunk-Linux/solr/build/solr-core/test-files/solr/collection1/conf/solrconfig-tlog.xml to /configs/conf1/solrconfig.xml
[junit4:junit4]   2> 2010 T34 oascc.SolrZkClient.makePath makePath: /configs/conf1/solrconfig.xml
[junit4:junit4]   2> 2017 T34 oasc.AbstractZkTestCase.putConfig put /mnt/ssd/jenkins/workspace/Lucene-Solr-trunk-Linux/solr/build/solr-core/test-files/solr/collection1/conf/schema.xml to /configs/conf1/schema.xml
[junit4:junit4]   2> 2020 T34 oascc.SolrZkClient.makePath makePath: /configs/conf1/schema.xml
[junit4:junit4]   2> 2026 T34 oasc.AbstractZkTestCase.putConfig put /mnt/ssd/jenkins/workspace/Lucene-Solr-trunk-Linux/solr/build/solr-core/test-files/solr/collection1/conf/stopwords.txt to /configs/conf1/stopwords.txt
[junit4:junit4]   2> 2027 T34 oascc.SolrZkClient.makePath makePath: /configs/conf1/stopwords.txt
[junit4:junit4]   2> 2032 T34 oasc.AbstractZkTestCase.putConfig put /mnt/ssd/jenkins/workspace/Lucene-Solr-trunk-Linux/solr/build/solr-core/test-files/solr/collection1/conf/protwords.txt to /configs/conf1/protwords.txt
[junit4:junit4]   2> 2033 T34 oascc.SolrZkClient.makePath makePath: /configs/conf1/protwords.txt
[junit4:junit4]   2> 2037 T34 oasc.AbstractZkTestCase.putConfig put /mnt/ssd/jenkins/workspace/Lucene-Solr-trunk-Linux/solr/build/solr-core/test-files/solr/collection1/conf/currency.xml to /configs/conf1/currency.xml
[junit4:junit4]   2> 2038 T34 oascc.SolrZkClient.makePath makePath: /configs/conf1/currency.xml
[junit4:junit4]   2> 2044 T34 oasc.AbstractZkTestCase.putConfig put /mnt/ssd/jenkins/workspace/Lucene-Solr-trunk-Linux/solr/build/solr-core/test-files/solr/collection1/conf/open-exchange-rates.json to /configs/conf1/open-exchange-rates.json
[junit4:junit4]   2> 2044 T34 oascc.SolrZkClient.makePath makePath: /configs/conf1/open-exchange-rates.json
[junit4:junit4]   2> 2048 T34 oasc.AbstractZkTestCase.putConfig put /mnt/ssd/jenkins/workspace/Lucene-Solr-trunk-Linux/solr/build/solr-core/test-files/solr/collection1/conf/mapping-ISOLatin1Accent.txt to /configs/conf1/mapping-ISOLatin1Accent.txt
[junit4:junit4]   2> 2049 T34 oascc.SolrZkClient.makePath makePath: /configs/conf1/mapping-ISOLatin1Accent.txt
[junit4:junit4]   2> 2053 T34 oasc.AbstractZkTestCase.putConfig put /mnt/ssd/jenkins/workspace/Lucene-Solr-trunk-Linux/solr/build/solr-core/test-files/solr/collection1/conf/old_synonyms.txt to /configs/conf1/old_synonyms.txt
[junit4:junit4]   2> 2054 T34 oascc.SolrZkClient.makePath makePath: /configs/conf1/old_synonyms.txt
[junit4:junit4]   2> 2058 T34 oasc.AbstractZkTestCase.putConfig put /mnt/ssd/jenkins/workspace/Lucene-Solr-trunk-Linux/solr/build/solr-core/test-files/solr/collection1/conf/synonyms.txt to /configs/conf1/synonyms.txt
[junit4:junit4]   2> 2059 T34 oascc.SolrZkClient.makePath makePath: /configs/conf1/synonyms.txt
[junit4:junit4]   2> 2064 T41 oazs.PrepRequestProcessor.pRequest2Txn Processed session termination for sessionid: 0x13d83034a830001
[junit4:junit4]   2> 2065 T43 oaz.ClientCnxn$EventThread.run EventThread shut down
[junit4:junit4]   2> 2066 T36 oazs.NIOServerCnxn.closeSock Closed socket connection for client /127.0.0.1:51446 which had sessionid 0x13d83034a830001
[junit4:junit4]   2> 2065 T34 oaz.ZooKeeper.close Session: 0x13d83034a830001 closed
[junit4:junit4]   2> 2307 T34 oejs.Server.doStart jetty-8.1.8.v20121106
[junit4:junit4]   2> 2397 T34 oejs.AbstractConnector.doStart Started SelectChannelConnector@127.0.0.1:54079
[junit4:junit4]   2> 2413 T34 oass.SolrDispatchFilter.init SolrDispatchFilter.init()
[junit4:junit4]   2> 2414 T34 oasc.SolrResourceLoader.locateSolrHome JNDI not configured for solr (NoInitialContextEx)
[junit4:junit4]   2> 2415 T34 oasc.SolrResourceLoader.locateSolrHome using system property solr.solr.home: /mnt/ssd/jenkins/workspace/Lucene-Solr-trunk-Linux/solr/build/solr-core/test/J0/./org.apache.solr.cloud.UnloadDistributedZkTest-controljetty-1363702665719
[junit4:junit4]   2> 2415 T34 oasc.CoreContainer$Initializer.initialize looking for solr config file: /mnt/ssd/jenkins/workspace/Lucene-Solr-trunk-Linux/solr/build/solr-core/test/J0/./org.apache.solr.cloud.UnloadDistributedZkTest-controljetty-1363702665719/solr.xml
[junit4:junit4]   2> 2415 T34 oasc.CoreContainer.<init> New CoreContainer 1952299434
[junit4:junit4]   2> 2416 T34 oasc.CoreContainer.load Loading CoreContainer using Solr Home: '/mnt/ssd/jenkins/workspace/Lucene-Solr-trunk-Linux/solr/build/solr-core/test/J0/./org.apache.solr.cloud.UnloadDistributedZkTest-controljetty-1363702665719/'
[junit4:junit4]   2> 2417 T34 oasc.SolrResourceLoader.<init> new SolrResourceLoader for directory: '/mnt/ssd/jenkins/workspace/Lucene-Solr-trunk-Linux/solr/build/solr-core/test/J0/./org.apache.solr.cloud.UnloadDistributedZkTest-controljetty-1363702665719/'
[junit4:junit4]   2> 2460 T34 oashc.HttpShardHandlerFactory.getParameter Setting socketTimeout to: 120000
[junit4:junit4]   2> 2460 T34 oashc.HttpShardHandlerFactory.getParameter Setting urlScheme to: http://
[junit4:junit4]   2> 2461 T34 oashc.HttpShardHandlerFactory.getParameter Setting connTimeout to: 15000
[junit4:junit4]   2> 2461 T34 oashc.HttpShardHandlerFactory.getParameter Setting maxConnectionsPerHost to: 20
[junit4:junit4]   2> 2461 T34 oashc.HttpShardHandlerFactory.getParameter Setting corePoolSize to: 0
[junit4:junit4]   2> 2462 T34 oashc.HttpShardHandlerFactory.getParameter Setting maximumPoolSize to: 2147483647
[junit4:junit4]   2> 2462 T34 oashc.HttpShardHandlerFactory.getParameter Setting maxThreadIdleTime to: 5
[junit4:junit4]   2> 2463 T34 oashc.HttpShardHandlerFactory.getParameter Setting sizeOfQueue to: -1
[junit4:junit4]   2> 2463 T34 oashc.HttpShardHandlerFactory.getParameter Setting fairnessPolicy to: false
[junit4:junit4]   2> 2476 T34 oascsi.HttpClientUtil.createClient Creating new http client, config:maxConnectionsPerHost=20&maxConnections=10000&socketTimeout=120000&connTimeout=15000&retry=false
[junit4:junit4]   2> 2955 T34 oasc.CoreContainer.load Registering Log Listener
[junit4:junit4]   2> 2969 T34 oasc.CoreContainer.initZooKeeper Zookeeper client=127.0.0.1:33013/solr
[junit4:junit4]   2> 2978 T34 oasc.ZkController.checkChrootPath zkHost includes chroot
[junit4:junit4]   2> 2978 T34 oaz.ZooKeeper.<init> Initiating client connection, connectString=127.0.0.1:33013 sessionTimeout=60000 watcher=org.apache.solr.common.cloud.ConnectionManager@7edf969b
[junit4:junit4]   2> 2979 T34 oascc.ConnectionManager.waitForConnected Waiting for client to connect to ZooKeeper
[junit4:junit4]   2> 2980 T54 oaz.ClientCnxn$SendThread.logStartConnect Opening socket connection to server localhost.localdomain/127.0.0.1:33013. Will not attempt to authenticate using SASL (access denied ("javax.security.auth.AuthPermission" "getLoginConfiguration"))
[junit4:junit4]   2> 2981 T54 oaz.ClientCnxn$SendThread.primeConnection Socket connection established to localhost.localdomain/127.0.0.1:33013, initiating session
[junit4:junit4]   2> 2981 T36 oazs.NIOServerCnxnFactory.run Accepted socket connection from /127.0.0.1:51448
[junit4:junit4]   2> 2982 T36 oazs.ZooKeeperServer.processConnectRequest Client attempting to establish new session at /127.0.0.1:51448
[junit4:junit4]   2> 2984 T38 oazs.ZooKeeperServer.finishSessionInit Established session 0x13d83034a830002 with negotiated timeout 20000 for client /127.0.0.1:51448
[junit4:junit4]   2> 2984 T54 oaz.ClientCnxn$SendThread.onConnected Session establishment complete on server localhost.localdomain/127.0.0.1:33013, sessionid = 0x13d83034a830002, negotiated timeout = 20000
[junit4:junit4]   2> 2984 T55 oascc.ConnectionManager.process Watcher org.apache.solr.common.cloud.ConnectionManager@7edf969b name:ZooKeeperConnection Watcher:127.0.0.1:33013 got event WatchedEvent state:SyncConnected type:None path:null path:null type:None
[junit4:junit4]   2> 2985 T34 oascc.ConnectionManager.waitForConnected Client is connected to ZooKeeper
[junit4:junit4]   2> 2987 T41 oazs.PrepRequestProcessor.pRequest2Txn Processed session termination for sessionid: 0x13d83034a830002
[junit4:junit4]   2> 2987 T55 oaz.ClientCnxn$EventThread.run EventThread shut down
[junit4:junit4]   2> 2987 T36 oazs.NIOServerCnxn.closeSock Closed socket connection for client /127.0.0.1:51448 which had sessionid 0x13d83034a830002
[junit4:junit4]   2> 2987 T34 oaz.ZooKeeper.close Session: 0x13d83034a830002 closed
[junit4:junit4]   2> 2990 T34 oascsi.HttpClientUtil.createClient Creating new http client, config:maxConnections=500&maxConnectionsPerHost=16&socketTimeout=120000&connTimeout=15000
[junit4:junit4]   2> 2997 T34 oaz.ZooKeeper.<init> Initiating client connection, connectString=127.0.0.1:33013/solr sessionTimeout=30000 watcher=org.apache.solr.common.cloud.ConnectionManager@547e7a87
[junit4:junit4]   2> 2998 T34 oascc.ConnectionManager.waitForConnected Waiting for client to connect to ZooKeeper
[junit4:junit4]   2> 2998 T56 oaz.ClientCnxn$SendThread.logStartConnect Opening socket connection to server localhost.localdomain/127.0.0.1:33013. Will not attempt to authenticate using SASL (access denied ("javax.security.auth.AuthPermission" "getLoginConfiguration"))
[junit4:junit4]   2> 2999 T56 oaz.ClientCnxn$SendThread.primeConnection Socket connection established to localhost.localdomain/127.0.0.1:33013, initiating session
[junit4:junit4]   2> 2999 T36 oazs.NIOServerCnxnFactory.run Accepted socket connection from /127.0.0.1:51449
[junit4:junit4]   2> 3001 T36 oazs.ZooKeeperServer.processConnectRequest Client attempting to establish new session at /127.0.0.1:51449
[junit4:junit4]   2> 3002 T38 oazs.ZooKeeperServer.finishSessionInit Established session 0x13d83034a830003 with negotiated timeout 20000 for client /127.0.0.1:51449
[junit4:junit4]   2> 3002 T56 oaz.ClientCnxn$SendThread.onConnected Session establishment complete on server localhost.localdomain/127.0.0.1:33013, sessionid = 0x13d83034a830003, negotiated timeout = 20000
[junit4:junit4]   2> 3003 T57 oascc.ConnectionManager.process Watcher org.apache.solr.common.cloud.ConnectionManager@547e7a87 name:ZooKeeperConnection Watcher:127.0.0.1:33013/solr got event WatchedEvent state:SyncConnected type:None path:null path:null type:None
[junit4:junit4]   2> 3003 T34 oascc.ConnectionManager.waitForConnected Client is connected to ZooKeeper
[junit4:junit4]   2> 3009 T34 oascc.SolrZkClient.makePath makePath: /overseer/queue
[junit4:junit4]   2> 3015 T41 oazs.PrepRequestProcessor.pRequest Got user-level KeeperException when processing sessionid:0x13d83034a830003 type:create cxid:0x7 zxid:0x1b txntype:-1 reqpath:n/a Error Path:/solr/overseer Error:KeeperErrorCode = NodeExists for /solr/overseer
[junit4:junit4]   2> 3016 T34 oascc.SolrZkClient.makePath makePath: /overseer/collection-queue-work
[junit4:junit4]   2> 3024 T34 oascc.SolrZkClient.makePath makePath: /live_nodes
[junit4:junit4]   2> 3027 T34 oasc.ZkController.createEphemeralLiveNode Register node as live in ZooKeeper:/live_nodes/127.0.0.1:54079_
[junit4:junit4]   2> 3030 T41 oazs.PrepRequestProcessor.pRequest Got user-level KeeperException when processing sessionid:0x13d83034a830003 type:delete cxid:0x12 zxid:0x1e txntype:-1 reqpath:n/a Error Path:/solr/live_nodes/127.0.0.1:54079_ Error:KeeperErrorCode = NoNode for /solr/live_nodes/127.0.0.1:54079_
[junit4:junit4]   2> 3031 T34 oascc.SolrZkClient.makePath makePath: /live_nodes/127.0.0.1:54079_
[junit4:junit4]   2> 3038 T34 oascc.SolrZkClient.makePath makePath: /overseer_elect/election
[junit4:junit4]   2> 3053 T41 oazs.PrepRequestProcessor.pRequest Got user-level KeeperException when processing sessionid:0x13d83034a830003 type:delete cxid:0x20 zxid:0x23 txntype:-1 reqpath:n/a Error Path:/solr/overseer_elect/leader Error:KeeperErrorCode = NoNode for /solr/overseer_elect/leader
[junit4:junit4]   2> 3055 T34 oascc.SolrZkClient.makePath makePath: /overseer_elect/leader
[junit4:junit4]   2> 3063 T34 oasc.Overseer.start Overseer (id=89371617775517699-127.0.0.1:54079_-n_0000000000) starting
[junit4:junit4]   2> 3065 T41 oazs.PrepRequestProcessor.pRequest Got user-level KeeperException when processing sessionid:0x13d83034a830003 type:create cxid:0x25 zxid:0x25 txntype:-1 reqpath:n/a Error Path:/solr/overseer Error:KeeperErrorCode = NodeExists for /solr/overseer
[junit4:junit4]   2> 3075 T41 oazs.PrepRequestProcessor.pRequest Got user-level KeeperException when processing sessionid:0x13d83034a830003 type:create cxid:0x26 zxid:0x26 txntype:-1 reqpath:n/a Error Path:/solr/overseer Error:KeeperErrorCode = NodeExists for /solr/overseer
[junit4:junit4]   2> 3078 T41 oazs.PrepRequestProcessor.pRequest Got user-level KeeperException when processing sessionid:0x13d83034a830003 type:create cxid:0x28 zxid:0x27 txntype:-1 reqpath:n/a Error Path:/solr/overseer Error:KeeperErrorCode = NodeExists for /solr/overseer
[junit4:junit4]   2> 3080 T34 oascc.SolrZkClient.makePath makePath: /overseer/queue-work
[junit4:junit4]   2> 3100 T41 oazs.PrepRequestProcessor.pRequest Got user-level KeeperException when processing sessionid:0x13d83034a830003 type:create cxid:0x2e zxid:0x29 txntype:-1 reqpath:n/a Error Path:/solr/overseer Error:KeeperErrorCode = NodeExists for /solr/overseer
[junit4:junit4]   2> 3103 T59 oasc.OverseerCollectionProcessor.run Process current queue of collection creations
[junit4:junit4]   2> 3104 T34 oascc.SolrZkClient.makePath makePath: /clusterstate.json
[junit4:junit4]   2> 3110 T34 oascc.SolrZkClient.makePath makePath: /aliases.json
[junit4:junit4]   2> 3114 T34 oascc.ZkStateReader.createClusterStateWatchersAndUpdate Updating cluster state from ZooKeeper... 
[junit4:junit4]   2> 3128 T58 oasc.Overseer$ClusterStateUpdater.run Starting to work on the main queue
[junit4:junit4]   2> 3148 T34 oass.SolrDispatchFilter.init user.dir=/mnt/ssd/jenkins/workspace/Lucene-Solr-trunk-Linux/solr/build/solr-core/test/J0
[junit4:junit4]   2> 3148 T34 oass.SolrDispatchFilter.init SolrDispatchFilter.init() done
[junit4:junit4]   2> 3164 T34 oascsi.HttpClientUtil.createClient Creating new http client, config:maxConnections=128&maxConnectionsPerHost=32&followRedirects=false
[junit4:junit4]   2> 3171 T34 oascsi.HttpClientUtil.createClient Creating new http client, config:
[junit4:junit4]   2> 3173 T34 oaz.ZooKeeper.<init> Initiating client connection, connectString=127.0.0.1:33013/solr sessionTimeout=10000 watcher=org.apache.solr.common.cloud.ConnectionManager@2544fc7c
[junit4:junit4]   2> 3174 T34 oascc.ConnectionManager.waitForConnected Waiting for client to connect to ZooKeeper
[junit4:junit4]   2> 3174 T61 oaz.ClientCnxn$SendThread.logStartConnect Opening socket connection to server localhost.localdomain/127.0.0.1:33013. Will not attempt to authenticate using SASL (access denied ("javax.security.auth.AuthPermission" "getLoginConfiguration"))
[junit4:junit4]   2> 3175 T61 oaz.ClientCnxn$SendThread.primeConnection Socket connection established to localhost.localdomain/127.0.0.1:33013, initiating session
[junit4:junit4]   2> 3175 T36 oazs.NIOServerCnxnFactory.run Accepted socket connection from /127.0.0.1:51450
[junit4:junit4]   2> 3176 T36 oazs.ZooKeeperServer.processConnectRequest Client attempting to establish new session at /127.0.0.1:51450
[junit4:junit4]   2> 3177 T38 oazs.ZooKeeperServer.finishSessionInit Established session 0x13d83034a830004 with negotiated timeout 10000 for client /127.0.0.1:51450
[junit4:junit4]   2> 3177 T61 oaz.ClientCnxn$SendThread.onConnected Session establishment complete on server localhost.localdomain/127.0.0.1:33013, sessionid = 0x13d83034a830004, negotiated timeout = 10000
[junit4:junit4]   2> 3178 T62 oascc.ConnectionManager.process Watcher org.apache.solr.common.cloud.ConnectionManager@2544fc7c name:ZooKeeperConnection Watcher:127.0.0.1:33013/solr got event WatchedEvent state:SyncConnected type:None path:null path:null type:None
[junit4:junit4]   2> 3179 T34 oascc.ConnectionManager.waitForConnected Client is connected to ZooKeeper
[junit4:junit4]   2> 3182 T34 oascc.ZkStateReader.createClusterStateWatchersAndUpdate Updating cluster state from ZooKeeper... 
[junit4:junit4]   2> 3198 T34 oasc.ChaosMonkey.monkeyLog monkey: init - expire sessions:true cause connection loss:true
[junit4:junit4]   2> 3278 T34 oejs.Server.doStart jetty-8.1.8.v20121106
[junit4:junit4]   2> 3280 T34 oejs.AbstractConnector.doStart Started SelectChannelConnector@127.0.0.1:42161
[junit4:junit4]   2> 3281 T34 oass.SolrDispatchFilter.init SolrDispatchFilter.init()
[junit4:junit4]   2> 3281 T34 oasc.SolrResourceLoader.locateSolrHome JNDI not configured for solr (NoInitialContextEx)
[junit4:junit4]   2> 3282 T34 oasc.SolrResourceLoader.locateSolrHome using system property solr.solr.home: /mnt/ssd/jenkins/workspace/Lucene-Solr-trunk-Linux/solr/build/solr-core/test/J0/./org.apache.solr.cloud.UnloadDistributedZkTest-jetty1-1363702666849
[junit4:junit4]   2> 3282 T34 oasc.CoreContainer$Initializer.initialize looking for solr config file: /mnt/ssd/jenkins/workspace/Lucene-Solr-trunk-Linux/solr/build/solr-core/test/J0/./org.apache.solr.cloud.UnloadDistributedZkTest-jetty1-1363702666849/solr.xml
[junit4:junit4]   2> 3282 T34 oasc.CoreContainer.<init> New CoreContainer 876425238
[junit4:junit4]   2> 3283 T34 oasc.CoreContainer.load Loading CoreContainer using Solr Home: '/mnt/ssd/jenkins/workspace/Lucene-Solr-trunk-Linux/solr/build/solr-core/test/J0/./org.apache.solr.cloud.UnloadDistributedZkTest-jetty1-1363702666849/'
[junit4:junit4]   2> 3283 T34 oasc.SolrResourceLoader.<init> new SolrResourceLoader for directory: '/mnt/ssd/jenkins/workspace/Lucene-Solr-trunk-Linux/solr/build/solr-core/test/J0/./org.apache.solr.cloud.UnloadDistributedZkTest-jetty1-1363702666849/'
[junit4:junit4]   2> 3304 T34 oashc.HttpShardHandlerFactory.getParameter Setting socketTimeout to: 120000
[junit4:junit4]   2> 3305 T34 oashc.HttpShardHandlerFactory.getParameter Setting urlScheme to: http://
[junit4:junit4]   2> 3305 T34 oashc.HttpShardHandlerFactory.getParameter Setting connTimeout to: 15000
[junit4:junit4]   2> 3306 T34 oashc.HttpShardHandlerFactory.getParameter Setting maxConnectionsPerHost to: 20
[junit4:junit4]   2> 3306 T34 oashc.HttpShardHandlerFactory.getParameter Setting corePoolSize to: 0
[junit4:junit4]   2> 3307 T34 oashc.HttpShardHandlerFactory.getParameter Setting maximumPoolSize to: 2147483647
[junit4:junit4]   2> 3307 T34 oashc.HttpShardHandlerFactory.getParameter Setting maxThreadIdleTime to: 5
[junit4:junit4]   2> 3307 T34 oashc.HttpShardHandlerFactory.getParameter Setting sizeOfQueue to: -1
[junit4:junit4]   2> 3308 T34 oashc.HttpShardHandlerFactory.getParameter Setting fairnessPolicy to: false
[junit4:junit4]   2> 3308 T34 oascsi.HttpClientUtil.createClient Creating new http client, config:maxConnectionsPerHost=20&maxConnections=10000&socketTimeout=120000&connTimeout=15000&retry=false
[junit4:junit4]   2> 3316 T34 oasc.CoreContainer.load Registering Log Listener
[junit4:junit4]   2> 3330 T34 oasc.CoreContainer.initZooKeeper Zookeeper client=127.0.0.1:33013/solr
[junit4:junit4]   2> 3331 T34 oasc.ZkController.checkChrootPath zkHost includes chroot
[junit4:junit4]   2> 3331 T34 oaz.ZooKeeper.<init> Initiating client connection, connectString=127.0.0.1:33013 sessionTimeout=60000 watcher=org.apache.solr.common.cloud.ConnectionManager@4e516af2
[junit4:junit4]   2> 3332 T34 oascc.ConnectionManager.waitForConnected Waiting for client to connect to ZooKeeper
[junit4:junit4]   2> 3332 T72 oaz.ClientCnxn$SendThread.logStartConnect Opening socket connection to server localhost.localdomain/127.0.0.1:33013. Will not attempt to authenticate using SASL (access denied ("javax.security.auth.AuthPermission" "getLoginConfiguration"))
[junit4:junit4]   2> 3333 T72 oaz.ClientCnxn$SendThread.primeConnection Socket connection established to localhost.localdomain/127.0.0.1:33013, initiating session
[junit4:junit4]   2> 3333 T36 oazs.NIOServerCnxnFactory.run Accepted socket connection from /127.0.0.1:51451
[junit4:junit4]   2> 3334 T36 oazs.ZooKeeperServer.processConnectRequest Client attempting to establish new session at /127.0.0.1:51451
[junit4:junit4]   2> 3336 T38 oazs.ZooKeeperServer.finishSessionInit Established session 0x13d83034a830005 with negotiated timeout 20000 for client /127.0.0.1:51451
[junit4:junit4]   2> 3336 T72 oaz.ClientCnxn$SendThread.onConnected Session establishment complete on server localhost.localdomain/127.0.0.1:33013, sessionid = 0x13d83034a830005, negotiated timeout = 20000
[junit4:junit4]   2> 3336 T73 oascc.ConnectionManager.process Watcher org.apache.solr.common.cloud.ConnectionManager@4e516af2 name:ZooKeeperConnection Watcher:127.0.0.1:33013 got event WatchedEvent state:SyncConnected type:None path:null path:null type:None
[junit4:junit4]   2> 3336 T34 oascc.ConnectionManager.waitForConnected Client is connected to ZooKeeper
[junit4:junit4]   2> 3338 T41 oazs.PrepRequestProcessor.pRequest2Txn Processed session termination for sessionid: 0x13d83034a830005
[junit4:junit4]   2> 3339 T73 oaz.ClientCnxn$EventThread.run EventThread shut down
[junit4:junit4]   2> 3339 T34 oaz.ZooKeeper.close Session: 0x13d83034a830005 closed
[junit4:junit4]   2> 3339 T36 oazs.NIOServerCnxn.closeSock Closed socket connection for client /127.0.0.1:51451 which had sessionid 0x13d83034a830005
[junit4:junit4]   2> 3340 T34 oascsi.HttpClientUtil.createClient Creating new http client, config:maxConnections=500&maxConnectionsPerHost=16&socketTimeout=120000&connTimeout=15000
[junit4:junit4]   2> 3343 T34 oaz.ZooKeeper.<init> Initiating client connection, connectString=127.0.0.1:33013/solr sessionTimeout=30000 watcher=org.apache.solr.common.cloud.ConnectionManager@7361b158
[junit4:junit4]   2> 3344 T34 oascc.ConnectionManager.waitForConnected Waiting for client to connect to ZooKeeper
[junit4:junit4]   2> 3344 T74 oaz.ClientCnxn$SendThread.logStartConnect Opening socket connection to server localhost.localdomain/127.0.0.1:33013. Will not attempt to authenticate using SASL (access denied ("javax.security.auth.AuthPermission" "getLoginConfiguration"))
[junit4:junit4]   2> 3345 T74 oaz.ClientCnxn$SendThread.primeConnection Socket connection established to localhost.localdomain/127.0.0.1:33013, initiating session
[junit4:junit4]   2> 3345 T36 oazs.NIOServerCnxnFactory.run Accepted socket connection from /127.0.0.1:51452
[junit4:junit4]   2> 3346 T36 oazs.ZooKeeperServer.processConnectRequest Client attempting to establish new session at /127.0.0.1:51452
[junit4:junit4]   2> 3348 T38 oazs.ZooKeeperServer.finishSessionInit Established session 0x13d83034a830006 with negotiated timeout 20000 for client /127.0.0.1:51452
[junit4:junit4]   2> 3348 T74 oaz.ClientCnxn$SendThread.onConnected Session establishment complete on server localhost.localdomain/127.0.0.1:33013, sessionid = 0x13d83034a830006, negotiated timeout = 20000
[junit4:junit4]   2> 3348 T75 oascc.ConnectionManager.process Watcher org.apache.solr.common.cloud.ConnectionManager@7361b158 name:ZooKeeperConnection Watcher:127.0.0.1:33013/solr got event WatchedEvent state:SyncConnected type:None path:null path:null type:None
[junit4:junit4]   2> 3349 T34 oascc.ConnectionManager.waitForConnected Client is connected to ZooKeeper
[junit4:junit4]   2> 3350 T41 oazs.PrepRequestProcessor.pRequest Got user-level KeeperException when processing sessionid:0x13d83034a830006 type:create cxid:0x1 zxid:0x30 txntype:-1 reqpath:n/a Error Path:/solr/overseer Error:KeeperErrorCode = NodeExists for /solr/overseer
[junit4:junit4]   2> 3352 T41 oazs.PrepRequestProcessor.pRequest Got user-level KeeperException when processing sessionid:0x13d83034a830006 type:create cxid:0x3 zxid:0x31 txntype:-1 reqpath:n/a Error Path:/solr/overseer Error:KeeperErrorCode = NodeExists for /solr/overseer
[junit4:junit4]   2> 3354 T34 oascc.ZkStateReader.createClusterStateWatchersAndUpdate Updating cluster state from ZooKeeper... 
[junit4:junit4]   2> 4359 T34 oasc.ZkController.createEphemeralLiveNode Register node as live in ZooKeeper:/live_nodes/127.0.0.1:42161_
[junit4:junit4]   2> 4360 T41 oazs.PrepRequestProcessor.pRequest Got user-level KeeperException when processing sessionid:0x13d83034a830006 type:delete cxid:0xd zxid:0x32 txntype:-1 reqpath:n/a Error Path:/solr/live_nodes/127.0.0.1:42161_ Error:KeeperErrorCode = NoNode for /solr/live_nodes/127.0.0.1:42161_
[junit4:junit4]   2> 4362 T34 oascc.SolrZkClient.makePath makePath: /live_nodes/127.0.0.1:42161_
[junit4:junit4]   2> 4368 T62 oascc.ZkStateReader$3.process Updating live nodes... (2)
[junit4:junit4]   2> 4368 T57 oascc.ZkStateReader$3.process Updating live nodes... (2)
[junit4:junit4]   2> 4369 T75 oascc.ZkStateReader$3.process Updating live nodes... (2)
[junit4:junit4]   2> 4377 T34 oass.SolrDispatchFilter.init user.dir=/mnt/ssd/jenkins/workspace/Lucene-Solr-trunk-Linux/solr/build/solr-core/test/J0
[junit4:junit4]   2> 4377 T34 oass.SolrDispatchFilter.init SolrDispatchFilter.init() done
[junit4:junit4]   2> 4378 T34 oascsi.HttpClientUtil.createClient Creating new http client, config:maxConnections=128&maxConnectionsPerHost=32&followRedirects=false
[junit4:junit4]   2> 4451 T34 oejs.Server.doStart jetty-8.1.8.v20121106
[junit4:junit4]   2> 4454 T34 oejs.AbstractConnector.doStart Started SelectChannelConnector@127.0.0.1:33731
[junit4:junit4]   2> 4455 T34 oass.SolrDispatchFilter.init SolrDispatchFilter.init()
[junit4:junit4]   2> 4455 T34 oasc.SolrResourceLoader.locateSolrHome JNDI not configured for solr (NoInitialContextEx)
[junit4:junit4]   2> 4456 T34 oasc.SolrResourceLoader.locateSolrHome using system property solr.solr.home: /mnt/ssd/jenkins/workspace/Lucene-Solr-trunk-Linux/solr/build/solr-core/test/J0/./org.apache.solr.cloud.UnloadDistributedZkTest-jetty2-1363702668032
[junit4:junit4]   2> 4456 T34 oasc.CoreContainer$Initializer.initialize looking for solr config file: /mnt/ssd/jenkins/workspace/Lucene-Solr-trunk-Linux/solr/build/solr-core/test/J0/./org.apache.solr.cloud.UnloadDistributedZkTest-jetty2-1363702668032/solr.xml
[junit4:junit4]   2> 4457 T34 oasc.CoreContainer.<init> New CoreContainer 1846512050
[junit4:junit4]   2> 4457 T34 oasc.CoreContainer.load Loading CoreContainer using Solr Home: '/mnt/ssd/jenkins/workspace/Lucene-Solr-trunk-Linux/solr/build/solr-core/test/J0/./org.apache.solr.cloud.UnloadDistributedZkTest-jetty2-1363702668032/'
[junit4:junit4]   2> 4457 T34 oasc.SolrResourceLoader.<init> new SolrResourceLoader for directory: '/mnt/ssd/jenkins/workspace/Lucene-Solr-trunk-Linux/solr/build/solr-core/test/J0/./org.apache.solr.cloud.UnloadDistributedZkTest-jetty2-1363702668032/'
[junit4:junit4]   2> 4480 T34 oashc.HttpShardHandlerFactory.getParameter Setting socketTimeout to: 120000
[junit4:junit4]   2> 4481 T34 oashc.HttpShardHandlerFactory.getParameter Setting urlScheme to: http://
[junit4:junit4]   2> 4481 T34 oashc.HttpShardHandlerFactory.getParameter Setting connTimeout to: 15000
[junit4:junit4]   2> 4482 T34 oashc.HttpShardHandlerFactory.getParameter Setting maxConnectionsPerHost to: 20
[junit4:junit4]   2> 4482 T34 oashc.HttpShardHandlerFactory.getParameter Setting corePoolSize to: 0
[junit4:junit4]   2> 4483 T34 oashc.HttpShardHandlerFactory.getParameter Setting maximumPoolSize to: 2147483647
[junit4:junit4]   2> 4483 T34 oashc.HttpShardHandlerFactory.getParameter Setting maxThreadIdleTime to: 5
[junit4:junit4]   2> 4483 T34 oashc.HttpShardHandlerFactory.getParameter Setting sizeOfQueue to: -1
[junit4:junit4]   2> 4484 T34 oashc.HttpShardHandlerFactory.getParameter Setting fairnessPolicy to: false
[junit4:junit4]   2> 4484 T34 oascsi.HttpClientUtil.createClient Creating new http client, config:maxConnectionsPerHost=20&maxConnections=10000&socketTimeout=120000&connTimeout=15000&retry=false
[junit4:junit4]   2> 4492 T34 oasc.CoreContainer.load Registering Log Listener
[junit4:junit4]   2> 4505 T34 oasc.CoreContainer.initZooKeeper Zookeeper client=127.0.0.1:33013/solr
[junit4:junit4]   2> 4505 T34 oasc.ZkController.checkChrootPath zkHost includes chroot
[junit4:junit4]   2> 4506 T34 oaz.ZooKeeper.<init> Initiating client connection, connectString=127.0.0.1:33013 sessionTimeout=60000 watcher=org.apache.solr.common.cloud.ConnectionManager@7c4a787b
[junit4:junit4]   2> 4507 T34 oascc.ConnectionManager.waitForConnected Waiting for client to connect to ZooKeeper
[junit4:junit4]   2> 4507 T86 oaz.ClientCnxn$SendThread.logStartConnect Opening socket connection to server localhost.localdomain/127.0.0.1:33013. Will not attempt to authenticate using SASL (access denied ("javax.security.auth.AuthPermission" "getLoginConfiguration"))
[junit4:junit4]   2> 4508 T86 oaz.ClientCnxn$SendThread.primeConnection Socket connection established to localhost.localdomain/127.0.0.1:33013, initiating session
[junit4:junit4]   2> 4508 T36 oazs.NIOServerCnxnFactory.run Accepted socket connection from /127.0.0.1:51453
[junit4:junit4]   2> 4508 T36 oazs.ZooKeeperServer.processConnectRequest Client attempting to establish new session at /127.0.0.1:51453
[junit4:junit4]   2> 4510 T38 oazs.ZooKeeperServer.finishSessionInit Established session 0x13d83034a830007 with negotiated timeout 20000 for client /127.0.0.1:51453
[junit4:junit4]   2> 4510 T86 oaz.ClientCnxn$SendThread.onConnected Session establishment complete on server localhost.localdomain/127.0.0.1:33013, sessionid = 0x13d83034a830007, negotiated timeout = 20000
[junit4:junit4]   2> 4510 T87 oascc.ConnectionManager.process Watcher org.apache.solr.common.cloud.ConnectionManager@7c4a787b name:ZooKeeperConnection Watcher:127.0.0.1:33013 got event WatchedEvent state:SyncConnected type:None path:null path:null type:None
[junit4:junit4]   2> 4511 T34 oascc.ConnectionManager.waitForConnected Client is connected to ZooKeeper
[junit4:junit4]   2> 4512 T41 oazs.PrepRequestProcessor.pRequest2Txn Processed session termination for sessionid: 0x13d83034a830007
[junit4:junit4]   2> 4513 T87 oaz.ClientCnxn$EventThread.run EventThread shut down
[junit4:junit4]   2> 4513 T34 oaz.ZooKeeper.close Session: 0x13d83034a830007 closed
[junit4:junit4]   2> 4513 T36 oazs.NIOServerCnxn.closeSock Closed socket connection for client /127.0.0.1:51453 which had sessionid 0x13d83034a830007
[junit4:junit4]   2> 4514 T34 oascsi.HttpClientUtil.createClient Creating new http client, config:maxConnections=500&maxConnectionsPerHost=16&socketTimeout=120000&connTimeout=15000
[junit4:junit4]   2> 4518 T34 oaz.ZooKeeper.<init> Initiating client connection, connectString=127.0.0.1:33013/solr sessionTimeout=30000 watcher=org.apache.solr.common.cloud.ConnectionManager@6b267920
[junit4:junit4]   2> 4519 T34 oascc.ConnectionManager.waitForConnected Waiting for client to connect to ZooKeeper
[junit4:junit4]   2> 4519 T88 oaz.ClientCnxn$SendThread.logStartConnect Opening socket connection to server localhost.localdomain/127.0.0.1:33013. Will not attempt to authenticate using SASL (access denied ("javax.security.auth.AuthPermission" "getLoginConfiguration"))
[junit4:junit4]   2> 4520 T88 oaz.ClientCnxn$SendThread.primeConnection Socket connection established to localhost.localdomain/127.0.0.1:33013, initiating session
[junit4:junit4]   2> 4520 T36 oazs.NIOServerCnxnFactory.run Accepted socket connection from /127.0.0.1:51454
[junit4:junit4]   2> 4520 T36 oazs.ZooKeeperServer.processConnectRequest Client attempting to establish new session at /127.0.0.1:51454
[junit4:junit4]   2> 4521 T38 oazs.ZooKeeperServer.finishSessionInit Established session 0x13d83034a830008 with negotiated timeout 20000 for client /127.0.0.1:51454
[junit4:junit4]   2> 4522 T88 oaz.ClientCnxn$SendThread.onConnected Session establishment complete on server localhost.localdomain/127.0.0.1:33013, sessionid = 0x13d83034a830008, negotiated timeout = 20000
[junit4:junit4]   2> 4522 T89 oascc.ConnectionManager.process Watcher org.apache.solr.common.cloud.ConnectionManager@6b267920 name:ZooKeeperConnection Watcher:127.0.0.1:33013/solr got event WatchedEvent state:SyncConnected type:None path:null path:null type:None
[junit4:junit4]   2> 4522 T34 oascc.ConnectionManager.waitForConnected Client is connected to ZooKeeper
[junit4:junit4]   2> 4523 T41 oazs.PrepRequestProcessor.pRequest Got user-level KeeperException when processing sessionid:0x13d83034a830008 type:create cxid:0x1 zxid:0x38 txntype:-1 reqpath:n/a Error Path:/solr/overseer Error:KeeperErrorCode = NodeExists for /solr/overseer
[junit4:junit4]   2> 4525 T41 oazs.PrepRequestProcessor.pRequest Got user-level KeeperException when processing sessionid:0x13d83034a830008 type:create cxid:0x3 zxid:0x39 txntype:-1 reqpath:n/a Error Path:/solr/overseer Error:KeeperErrorCode = NodeExists for /solr/overseer
[junit4:junit4]   2> 4528 T34 oascc.ZkStateReader.createClusterStateWatchersAndUpdate Updating cluster state from ZooKeeper... 
[junit4:junit4]   2> 5532 T34 oasc.ZkController.createEphemeralLiveNode Register node as live in ZooKeeper:/live_nodes/127.0.0.1:33731_
[junit4:junit4]   2> 5534 T41 oazs.PrepRequestProcessor.pRequest Got user-level KeeperException when processing sessionid:0x13d83034a830008 type:delete cxid:0xd zxid:0x3a txntype:-1 reqpath:n/a Error Path:/solr/live_nodes/127.0.0.1:33731_ Error:KeeperErrorCode = NoNode for /solr/live_nodes/127.0.0.1:33731_
[junit4:junit4]   2> 5535 T34 oascc.SolrZkClient.makePath makePath: /live_nodes/127.0.0.1:33731_
[junit4:junit4]   2> 5539 T75 oascc.ZkStateReader$3.process Updating live nodes... (3)
[junit4:junit4]   2> 5539 T62 oascc.ZkStateReader$3.process Updating live nodes... (3)
[junit4:junit4]   2> 5539 T57 oascc.ZkStateReader$3.process Updating live nodes... (3)
[junit4:junit4]   2> 5540 T89 oascc.ZkStateReader$3.process Updating live nodes... (3)
[junit4:junit4]   2> 5549 T34 oass.SolrDispatchFilter.init user.dir=/mnt/ssd/jenkins/workspace/Lucene-Solr-trunk-Linux/solr/build/solr-core/test/J0
[junit4:junit4]   2> 5550 T34 oass.SolrDispatchFilter.init SolrDispatchFilter.init() done
[junit4:junit4]   2> 5551 T34 oascsi.HttpClientUtil.createClient Creating new http client, config:maxConnections=128&maxConnectionsPerHost=32&followRedirects=false
[junit4:junit4]   2> 5657 T34 oejs.Server.doStart jetty-8.1.8.v20121106
[junit4:junit4]   2> 5660 T34 oejs.AbstractConnector.doStart Started SelectChannelConnector@127.0.0.1:48725
[junit4:junit4]   2> 5661 T34 oass.SolrDispatchFilter.init SolrDispatchFilter.init()
[junit4:junit4]   2> 5662 T34 oasc.SolrResourceLoader.locateSolrHome JNDI not configured for solr (NoInitialContextEx)
[junit4:junit4]   2> 5662 T34 oasc.SolrResourceLoader.locateSolrHome using system property solr.solr.home: /mnt/ssd/jenkins/workspace/Lucene-Solr-trunk-Linux/solr/build/solr-core/test/J0/./org.apache.solr.cloud.UnloadDistributedZkTest-jetty3-1363702669207
[junit4:junit4]   2> 5663 T34 oasc.CoreContainer$Initializer.initialize looking for solr config file: /mnt/ssd/jenkins/workspace/Lucene-Solr-trunk-Linux/solr/build/solr-core/test/J0/./org.apache.solr.cloud.UnloadDistributedZkTest-jetty3-1363702669207/solr.xml
[junit4:junit4]   2> 5663 T34 oasc.CoreContainer.<init> New CoreContainer 1258792952
[junit4:junit4]   2> 5664 T34 oasc.CoreContainer.load Loading CoreContainer using Solr Home: '/mnt/ssd/jenkins/workspace/Lucene-Solr-trunk-Linux/solr/build/solr-core/test/J0/./org.apache.solr.cloud.UnloadDistributedZkTest-jetty3-1363702669207/'
[junit4:junit4]   2> 5665 T34 oasc.SolrResourceLoader.<init> new SolrResourceLoader for directory: '/mnt/ssd/jenkins/workspace/Lucene-Solr-trunk-Linux/solr/build/solr-core/test/J0/./org.apache.solr.cloud.UnloadDistributedZkTest-jetty3-1363702669207/'
[junit4:junit4]   2> 5695 T34 oashc.HttpShardHandlerFactory.getParameter Setting socketTimeout to: 120000
[junit4:junit4]   2> 5695 T34 oashc.HttpShardHandlerFactory.getParameter Setting urlScheme to: http://
[junit4:junit4]   2> 5696 T34 oashc.HttpShardHandlerFactory.getParameter Setting connTimeout to: 15000
[junit4:junit4]   2> 5696 T34 oashc.HttpShardHandlerFactory.getParameter Setting maxConnectionsPerHost to: 20
[junit4:junit4]   2> 5696 T34 oashc.HttpShardHandlerFactory.getParameter Setting corePoolSize to: 0
[junit4:junit4]   2> 5697 T34 oashc.HttpShardHandlerFactory.getParameter Setting maximumPoolSize to: 2147483647
[junit4:junit4]   2> 5697 T34 oashc.HttpShardHandlerFactory.getParameter Setting maxThreadIdleTime to: 5
[junit4:junit4]   2> 5698 T34 oashc.HttpShardHandlerFactory.getParameter Setting sizeOfQueue to: -1
[junit4:junit4]   2> 5698 T34 oashc.HttpShardHandlerFactory.getParameter Setting fairnessPolicy to: false
[junit4:junit4]   2> 5699 T34 oascsi.HttpClientUtil.createClient Creating new http client, config:maxConnectionsPerHost=20&maxConnections=10000&socketTimeout=120000&connTimeout=15000&retry=false
[junit4:junit4]   2> 5708 T34 oasc.CoreContainer.load Registering Log Listener
[junit4:junit4]   2> 5720 T34 oasc.CoreContainer.initZooKeeper Zookeeper client=127.0.0.1:33013/solr
[junit4:junit4]   2> 5720 T34 oasc.ZkController.checkChrootPath zkHost includes chroot
[junit4:junit4]   2> 5721 T34 oaz.ZooKeeper.<init> Initiating client connection, connectString=127.0.0.1:33013 sessionTimeout=60000 watcher=org.apache.solr.common.cloud.ConnectionManager@5268019
[junit4:junit4]   2> 5722 T34 oascc.ConnectionManager.waitForConnected Waiting for client to connect to ZooKeeper
[junit4:junit4]   2> 5722 T100 oaz.ClientCnxn$SendThread.logStartConnect Opening socket connection to server localhost.localdomain/127.0.0.1:33013. Will not attempt to authenticate using SASL (access denied ("javax.security.auth.AuthPermission" "getLoginConfiguration"))
[junit4:junit4]   2> 5723 T100 oaz.ClientCnxn$SendThread.primeConnection Socket connection established to localhost.localdomain/127.0.0.1:33013, initiating session
[junit4:junit4]   2> 5723 T36 oazs.NIOServerCnxnFactory.run Accepted socket connection from /127.0.0.1:51455
[junit4:junit4]   2> 5724 T36 oazs.ZooKeeperServer.processConnectRequest Client attempting to establish new session at /127.0.0.1:51455
[junit4:junit4]   2> 5774 T38 oazs.ZooKeeperServer.finishSessionInit Established session 0x13d83034a830009 with negotiated timeout 20000 for client /127.0.0.1:51455
[junit4:junit4]   2> 5774 T100 oaz.ClientCnxn$SendThread.onConnected Session establishment complete on server localhost.localdomain/127.0.0.1:33013, sessionid = 0x13d83034a830009, negotiated timeout = 20000
[junit4:junit4]   2> 5775 T101 oascc.ConnectionManager.process Watcher org.apache.solr.common.cloud.ConnectionManager@5268019 name:ZooKeeperConnection Watcher:127.0.0.1:33013 got event WatchedEvent state:SyncConnected type:None path:null path:null type:None
[junit4:junit4]   2> 5775 T34 oascc.ConnectionManager.waitForConnected Client is connected to ZooKeeper
[junit4:junit4]   2> 5777 T41 oazs.PrepRequestProcessor.pRequest2Txn Processed session termination for sessionid: 0x13d83034a830009
[junit4:junit4]   2> 5778 T36 oazs.NIOServerCnxn.closeSock Closed socket connection for client /127.0.0.1:51455 which had sessionid 0x13d83034a830009
[junit4:junit4]   2> 5779 T101 oaz.ClientCnxn$EventThread.run EventThread shut down
[junit4:junit4]   2> 5779 T34 oaz.ZooKeeper.close Session: 0x13d83034a830009 closed
[junit4:junit4]   2> 5780 T34 oascsi.HttpClientUtil.createClient Creating new http client, config:maxConnections=500&maxConnectionsPerHost=16&socketTimeout=120000&connTimeout=15000
[junit4:junit4]   2> 5783 T34 oaz.ZooKeeper.<init> Initiating client connection, connectString=127.0.0.1:33013/solr sessionTimeout=30000 watcher=org.apache.solr.common.cloud.ConnectionManager@6d8a6c9b
[junit4:junit4]   2> 5785 T34 oascc.ConnectionManager.waitForConnected Waiting for client to connect to ZooKeeper
[junit4:junit4]   2> 5785 T102 oaz.ClientCnxn$SendThread.logStartConnect Opening socket connection to server localhost.localdomain/127.0.0.1:33013. Will not attempt to authenticate using SASL (access denied ("javax.security.auth.AuthPermission" "getLoginConfiguration"))
[junit4:junit4]   2> 5786 T102 oaz.ClientCnxn$SendThread.primeConnection Socket connection established to localhost.localdomain/127.0.0.1:33013, initiating session
[junit4:junit4]   2> 5786 T36 oazs.NIOServerCnxnFactory.run Accepted socket connection from /127.0.0.1:51456
[junit4:junit4]   2> 5786 T36 oazs.ZooKeeperServer.processConnectRequest Client attempting to establish new session at /127.0.0.1:51456
[junit4:junit4]   2> 5787 T38 oazs.ZooKeeperServer.finishSessionInit Established session 0x13d83034a83000a with negotiated timeout 20000 for client /127.0.0.1:51456
[junit4:junit4]   2> 5788 T102 oaz.ClientCnxn$SendThread.onConnected Session establishment complete on server localhost.localdomain/127.0.0.1:33013, sessionid = 0x13d83034a83000a, negotiated timeout = 20000
[junit4:junit4]   2> 5788 T103 oascc.ConnectionManager.process Watcher org.apache.solr.common.cloud.ConnectionManager@6d8a6c9b name:ZooKeeperConnection Watcher:127.0.0.1:33013/solr got event WatchedEvent state:SyncConnected type:None path:null path:null type:None
[junit4:junit4]   2> 5789 T34 oascc.ConnectionManager.waitForConnected Client is connected to ZooKeeper
[junit4:junit4]   2> 5790 T41 oazs.PrepRequestProcessor.pRequest Got user-level KeeperException when processing sessionid:0x13d83034a83000a type:create cxid:0x1 zxid:0x40 txntype:-1 reqpath:n/a Error Path:/solr/overseer Error:KeeperErrorCode = NodeExists for /solr/overseer
[junit4:junit4]   2> 5792 T41 oazs.PrepRequestProcessor.pRequest Got user-level KeeperException when processing sessionid:0x13d83034a83000a type:create cxid:0x3 zxid:0x41 txntype:-1 reqpath:n/a Error Path:/solr/overseer Error:KeeperErrorCode = NodeExists for /solr/overseer
[junit4:junit4]   2> 5795 T34 oascc.ZkStateReader.createClusterStateWatchersAndUpdate Updating cluster state from ZooKeeper... 
[junit4:junit4]   2> 6799 T34 oasc.ZkController.createEphemeralLiveNode Register node as live in ZooKeeper:/live_nodes/127.0.0.1:48725_
[junit4:junit4]   2> 6800 T41 oazs.PrepRequestProcessor.pRequest Got user-level KeeperException when processing sessionid:0x13d83034a83000a type:delete cxid:0xd zxid:0x42 txntype:-1 reqpath:n/a Error Path:/solr/live_nodes/127.0.0.1:48725_ Error:KeeperErrorCode = NoNode for /solr/live_nodes/127.0.0.1:48725_
[junit4:junit4]   2> 6801 T34 oascc.SolrZkClient.makePath makePath: /live_nodes/127.0.0.1:48725_
[junit4:junit4]   2> 6805 T57 oascc.ZkStateReader$3.process Updating live nodes... (4)
[junit4:junit4]   2> 6805 T89 oascc.ZkStateReader$3.process Updating live nodes... (4)
[junit4:junit4]   2> 6806 T103 oascc.ZkStateReader$3.process Updating live nodes... (4)
[junit4:junit4]   2> 6807 T62 oascc.ZkStateReader$3.process Updating live nodes... (4)
[junit4:junit4]   2> 6807 T75 oascc.ZkStateReader$3.process Updating live nodes... (4)
[junit4:junit4]   2> 6813 T34 oass.SolrDispatchFilter.init user.dir=/mnt/ssd/jenkins/workspace/Lucene-Solr-trunk-Linux/solr/build/solr-core/test/J0
[junit4:junit4]   2> 6813 T34 oass.SolrDispatchFilter.init SolrDispatchFilter.init() done
[junit4:junit4]   2> 6814 T34 oascsi.HttpClientUtil.createClient Creating new http client, config:maxConnections=128&maxConnectionsPerHost=32&followRedirects=false
[junit4:junit4]   2> 6877 T34 oejs.Server.doStart jetty-8.1.8.v20121106
[junit4:junit4]   2> 6879 T34 oejs.AbstractConnector.doStart Started SelectChannelConnector@127.0.0.1:57911
[junit4:junit4]   2> 6880 T34 oass.SolrDispatchFilter.init SolrDispatchFilter.init()
[junit4:junit4]   2> 6880 T34 oasc.SolrResourceLoader.locateSolrHome JNDI not configured for solr (NoInitialContextEx)
[junit4:junit4]   2> 6881 T34 oasc.SolrResourceLoader.locateSolrHome using system property solr.solr.home: /mnt/ssd/jenkins/workspace/Lucene-Solr-trunk-Linux/solr/build/solr-core/test/J0/./org.apache.solr.cloud.UnloadDistributedZkTest-jetty4-1363702670468
[junit4:junit4]   2> 6881 T34 oasc.CoreContainer$Initializer.initialize looking for solr config file: /mnt/ssd/jenkins/workspace/Lucene-Solr-trunk-Linux/solr/build/solr-core/test/J0/./org.apache.solr.cloud.UnloadDistributedZkTest-jetty4-1363702670468/solr.xml
[junit4:junit4]   2> 6882 T34 oasc.CoreContainer.<init> New CoreContainer 597645958
[junit4:junit4]   2> 6882 T34 oasc.CoreContainer.load Loading CoreContainer using Solr Home: '/mnt/ssd/jenkins/workspace/Lucene-Solr-trunk-Linux/solr/build/solr-core/test/J0/./org.apache.solr.cloud.UnloadDistributedZkTest-jetty4-1363702670468/'
[junit4:junit4]   2> 6882 T34 oasc.SolrResourceLoader.<init> new SolrResourceLoader for directory: '/mnt/ssd/jenkins/workspace/Lucene-Solr-trunk-Linux/solr/build/solr-core/test/J0/./org.apache.solr.cloud.UnloadDistributedZkTest-jetty4-1363702670468/'
[junit4:junit4]   2> 6902 T34 oashc.HttpShardHandlerFactory.getParameter Setting socketTimeout to: 120000
[junit4:junit4]   2> 6903 T34 oashc.HttpShardHandlerFactory.getParameter Setting urlScheme to: http://
[junit4:junit4]   2> 6903 T34 oashc.HttpShardHandlerFactory.getParameter Setting connTimeout to: 15000
[junit4:junit4]   2> 6904 T34 oashc.HttpShardHandlerFactory.getParameter Setting maxConnectionsPerHost to: 20
[junit4:junit4]   2> 6904 T34 oashc.HttpShardHandlerFactory.getParameter Setting corePoolSize to: 0
[junit4:junit4]   2> 6904 T34 oashc.HttpShardHandlerFactory.getParameter Setting maximumPoolSize to: 2147483647
[junit4:junit4]   2> 6905 T34 oashc.HttpShardHandlerFactory.getParameter Setting maxThreadIdleTime to: 5
[junit4:junit4]   2> 6905 T34 oashc.HttpShardHandlerFactory.getParameter Setting sizeOfQueue to: -1
[junit4:junit4]   2> 6905 T34 oashc.HttpShardHandlerFactory.getParameter Setting fairnessPolicy to: false
[junit4:junit4]   2> 6906 T34 oascsi.HttpClientUtil.createClient Creating new http client, config:maxConnectionsPerHost=20&maxConnections=10000&socketTimeout=120000&connTimeout=15000&retry=false
[junit4:junit4]   2> 6913 T34 oasc.CoreContainer.load Registering Log Listener
[junit4:junit4]   2> 6925 T34 oasc.CoreContainer.initZooKeeper Zookeeper client=127.0.0.1:33013/solr
[junit4:junit4]   2> 6925 T34 oasc.ZkController.checkChrootPath zkHost includes chroot
[junit4:junit4]   2> 6926 T34 oaz.ZooKeeper.<init> Initiating client connection, connectString=127.0.0.1:33013 sessionTimeout=60000 watcher=org.apache.solr.common.cloud.ConnectionManager@4aaaef88
[junit4:junit4]   2> 6927 T34 oascc.ConnectionManager.waitForConnected Waiting for client to connect to ZooKeeper
[junit4:junit4]   2> 6927 T114 oaz.ClientCnxn$SendThread.logStartConnect Opening socket connection to server localhost.localdomain/127.0.0.1:33013. Will not attempt to authenticate using SASL (access denied ("javax.security.auth.AuthPermission" "getLoginConfiguration"))
[junit4:junit4]   2> 6928 T114 oaz.ClientCnxn$SendThread.primeConnection Socket connection established to localhost.localdomain/127.0.0.1:33013, initiating session
[junit4:junit4]   2> 6928 T36 oazs.NIOServerCnxnFactory.run Accepted socket connection from /127.0.0.1:51458
[junit4:junit4]   2> 6929 T36 oazs.ZooKeeperServer.processConnectRequest Client attempting to establish new session at /127.0.0.1:51458
[junit4:junit4]   2> 6930 T38 oazs.ZooKeeperServer.finishSessionInit Established session 0x13d83034a83000b with negotiated timeout 20000 for client /127.0.0.1:51458
[junit4:junit4]   2> 6930 T114 oaz.ClientCnxn$SendThread.onConnected Session establishment complete on server localhost.localdomain/127.0.0.1:33013, sessionid = 0x13d83034a83000b, negotiated timeout = 20000
[junit4:junit4]   2> 6930 T115 oascc.ConnectionManager.process Watcher org.apache.solr.common.cloud.ConnectionManager@4aaaef88 name:ZooKeeperConnection Watcher:127.0.0.1:33013 got event WatchedEvent state:SyncConnected type:None path:null path:null type:None
[junit4:junit4]   2> 6931 T34 oascc.ConnectionManager.waitForConnected Client is connected to ZooKeeper
[junit4:junit4]   2> 6932 T41 oazs.PrepRequestProcessor.pRequest2Txn Processed session termination for sessionid: 0x13d83034a83000b
[junit4:junit4]   2> 6933 T115 oaz.ClientCnxn$EventThread.run EventThread shut down
[junit4:junit4]   2> 6933 T34 oaz.ZooKeeper.close Session: 0x13d83034a83000b closed
[junit4:junit4]   2> 6933 T36 oazs.NIOServerCnxn.closeSock Closed socket connection for client /127.0.0.1:51458 which had sessionid 0x13d83034a83000b
[junit4:junit4]   2> 6934 T34 oascsi.HttpClientUtil.createClient Creating new http client, config:maxConnections=500&maxConnectionsPerHost=16&socketTimeout=120000&connTimeout=15000
[junit4:junit4]   2> 6938 T34 oaz.ZooKeeper.<init> Initiating client connection, connectString=127.0.0.1:33013/solr sessionTimeout=30000 watcher=org.apache.solr.common.cloud.ConnectionManager@60f41311
[junit4:junit4]   2> 6939 T34 oascc.ConnectionManager.waitForConnected Waiting for client to connect to ZooKeeper
[junit4:junit4]   2> 6939 T116 oaz.ClientCnxn$SendThread.logStartConnect Opening socket connection to server localhost.localdomain/127.0.0.1:33013. Will not attempt to authenticate using SASL (access denied ("javax.security.auth.AuthPermission" "getLoginConfiguration"))
[junit4:junit4]   2> 6940 T116 oaz.ClientCnxn$SendThread.primeConnection Socket connection established to localhost.localdomain/127.0.0.1:33013, initiating session
[junit4:junit4]   2> 6940 T36 oazs.NIOServerCnxnFactory.run Accepted socket connection from /127.0.0.1:51459
[junit4:junit4]   2> 6940 T36 oazs.ZooKeeperServer.processConnectRequest Client attempting to establish new session at /127.0.0.1:51459
[junit4:junit4]   2> 6942 T38 oazs.ZooKeeperServer.finishSessionInit Established session 0x13d83034a83000c with negotiated timeout 20000 for client /127.0.0.1:51459
[junit4:junit4]   2> 6942 T116 oaz.ClientCnxn$SendThread.onConnected Session establishment complete on server localhost.localdomain/127.0.0.1:33013, sessionid = 0x13d83034a83000c, negotiated timeout = 20000
[junit4:junit4]   2> 6942 T117 oascc.ConnectionManager.process Watcher org.apache.solr.common.cloud.ConnectionManager@60f41311 name:ZooKeeperConnection Watcher:127.0.0.1:33013/solr got event WatchedEvent state:SyncConnected type:None path:null path:null type:None
[junit4:junit4]   2> 6943 T34 oascc.ConnectionManager.waitForConnected Client is connected to ZooKeeper
[junit4:junit4]   2> 6943 T41 oazs.PrepRequestProcessor.pRequest Got user-level KeeperException when processing sessionid:0x13d83034a83000c type:create cxid:0x1 zxid:0x48 txntype:-1 reqpath:n/a Error Path:/solr/overseer Error:KeeperErrorCode = NodeExists for /solr/overseer
[junit4:junit4]   2> 6945 T41 oazs.PrepRequestProcessor.pRequest Got user-level KeeperException when processing sessionid:0x13d83034a83000c type:create cxid:0x3 zxid:0x49 txntype:-1 reqpath:n/a Error Path:/solr/overseer Error:KeeperErrorCode = NodeExists for /solr/overseer
[junit4:junit4]   2> 6949 T34 oascc.ZkStateReader.createClusterStateWatchersAndUpdate Updating cluster state from ZooKeeper... 
[junit4:junit4]   2> 7953 T34 oasc.ZkController.createEphemeralLiveNode Register node as live in ZooKeeper:/live_nodes/127.0.0.1:57911_
[junit4:junit4]   2> 7954 T41 oazs.PrepRequestProcessor.pRequest Got user-level KeeperException when processing sessionid:0x13d83034a83000c type:delete cxid:0xd zxid:0x4a txntype:-1 reqpath:n/a Error Path:/solr/live_nodes/127.0.0.1:57911_ Error:KeeperErrorCode = NoNode for /solr/live_nodes/127.0.0.1:57911_
[junit4:junit4]   2> 7954 T34 oascc.SolrZkClient.makePath makePath: /live_nodes/127.0.0.1:57911_
[junit4:junit4]   2> 7958 T103 oascc.ZkStateReader$3.process Updating live nodes... (5)
[junit4:junit4]   2> 7958 T57 oascc.ZkStateReader$3.process Updating live nodes... (5)
[junit4:junit4]   2> 7958 T89 oascc.ZkStateReader$3.process Updating live nodes... (5)
[junit4:junit4]   2> 7959 T117 oascc.ZkStateReader$3.process Updating live nodes... (5)
[junit4:junit4]   2> 7958 T75 oascc.ZkStateReader$3.process Updating live nodes... (5)
[junit4:junit4]   2> 7958 T62 oascc.ZkStateReader$3.process Updating live nodes... (5)
[junit4:junit4]   2> 7964 T34 oass.SolrDispatchFilter.init user.dir=/mnt/ssd/jenkins/workspace/Lucene-Solr-trunk-Linux/solr/build/solr-core/test/J0
[junit4:junit4]   2> 7965 T34 oass.SolrDispatchFilter.init SolrDispatchFilter.init() done
[junit4:junit4]   2> 7965 T34 oascsi.HttpClientUtil.createClient Creating new http client, config:maxConnections=128&maxConnectionsPerHost=32&followRedirects=false
[junit4:junit4]   2> 7969 T34 oascsi.HttpClientUtil.createClient Creating new http client, config:maxConnections=128&maxConnectionsPerHost=32&followRedirects=false
[junit4:junit4]   2> 8208 T70 oasc.CoreContainer.create Creating SolrCore 'unloadcollection1' using instanceDir: /mnt/ssd/jenkins/workspace/Lucene-Solr-trunk-Linux/solr/build/solr-core/test/J0/./org.apache.solr.cloud.UnloadDistributedZkTest-jetty1-1363702666849/unloadcollection1
[junit4:junit4]   2> 8209 T70 oasc.ZkController.createCollectionZkNode Check for collection zkNode:unloadcollection
[junit4:junit4]   2> 8210 T70 oasc.ZkController.createCollectionZkNode Creating collection in ZooKeeper:unloadcollection
[junit4:junit4]   2> 8211 T70 oasc.ZkController.getConfName Looking for collection configName
[junit4:junit4]   2> 8213 T70 oasc.ZkController.getConfName Only one config set found in zk - using it:conf1
[junit4:junit4]   2> 8214 T70 oascc.SolrZkClient.makePath makePath: /collections/unloadcollection
[junit4:junit4]   2> 8218 T70 oasc.ZkController.readConfigName Load collection config from:/collections/unloadcollection
[junit4:junit4]   2> 8223 T70 oasc.SolrResourceLoader.<init> new SolrResourceLoader for directory: '/mnt/ssd/jenkins/workspace/Lucene-Solr-trunk-Linux/solr/build/solr-core/test/J0/./org.apache.solr.cloud.UnloadDistributedZkTest-jetty1-1363702666849/unloadcollection1/'
[junit4:junit4]   2> 8266 T70 oasc.SolrConfig.<init> Using Lucene MatchVersion: LUCENE_50
[junit4:junit4]   2> 8327 T70 oasc.SolrConfig.<init> Loaded SolrConfig: solrconfig.xml
[junit4:junit4]   2> 8328 T70 oass.IndexSchema.readSchema Reading Solr Schema
[junit4:junit4]   2> 8348 T70 oass.IndexSchema.readSchema Schema name=test
[junit4:junit4]   2> 8718 T70 oass.OpenExchangeRatesOrgProvider.init Initialized with rates=open-exchange-rates.json, refreshInterval=1440.
[junit4:junit4]   2> 8728 T70 oass.IndexSchema.readSchema default search field in schema is text
[junit4:junit4]   2> 8731 T70 oass.IndexSchema.readSchema unique key field: id
[junit4:junit4]   2> 8758 T70 oass.FileExchangeRateProvider.reload Reloading exchange rates from file currency.xml
[junit4:junit4]   2> 8762 T70 oass.FileExchangeRateProvider.reload Reloading exchange rates from file currency.xml
[junit4:junit4]   2> 8767 T70 oass.OpenExchangeRatesOrgProvider.reload Reloading exchange rates from open-exchange-rates.json
[junit4:junit4]   2> 8769 T70 oass.OpenExchangeRatesOrgProvider$OpenExchangeRates.<init> WARNING Unknown key IMPORTANT NOTE
[junit4:junit4]   2> 8769 T70 oass.OpenExchangeRatesOrgProvider$OpenExchangeRates.<init> WARNING Expected key, got STRING
[junit4:junit4]   2> 8770 T70 oass.OpenExchangeRatesOrgProvider.reload Reloading exchange rates from open-exchange-rates.json
[junit4:junit4]   2> 8772 T70 oass.OpenExchangeRatesOrgProvider$OpenExchangeRates.<init> WARNING Unknown key IMPORTANT NOTE
[junit4:junit4]   2> 8772 T70 oass.OpenExchangeRatesOrgProvider$OpenExchangeRates.<init> WARNING Expected key, got STRING
[junit4:junit4]   2> 8773 T70 oasc.SolrCore.initDirectoryFactory org.apache.solr.core.MockDirectoryFactory
[junit4:junit4]   2> 8773 T70 oasc.SolrCore.<init> [unloadcollection1] Opening new SolrCore at /mnt/ssd/jenkins/workspace/Lucene-Solr-trunk-Linux/solr/build/solr-core/test/J0/./org.apache.solr.cloud.UnloadDistributedZkTest-jetty1-1363702666849/unloadcollection1/, dataDir=/mnt/ssd/jenkins/workspace/Lucene-Solr-trunk-Linux/solr/build/solr-core/test/J0/./solrtest-UnloadDistributedZkTest-1363702663669/1363702671627unloadcollection1_1n/
[junit4:junit4]   2> 8776 T70 oasc.JmxMonitoredMap.<init> JMX monitoring is enabled. Adding Solr mbeans to JMX Server: com.sun.jmx.mbeanserver.JmxMBeanServer@3a9ff9ea
[junit4:junit4]   2> 8778 T70 oasc.SolrCore.initDirectoryFactory org.apache.solr.core.MockDirectoryFactory
[junit4:junit4]   2> 8779 T70 oasc.CachingDirectoryFactory.get return new directory for /mnt/ssd/jenkins/workspace/Lucene-Solr-trunk-Linux/solr/build/solr-core/test/J0/./solrtest-UnloadDistributedZkTest-1363702663669/1363702671627unloadcollection1_1n forceNew: false
[junit4:junit4]   2> 8780 T70 oasc.SolrCore.getNewIndexDir New index directory detected: old=null new=/mnt/ssd/jenkins/workspace/Lucene-Solr-trunk-Linux/solr/build/solr-core/test/J0/./solrtest-UnloadDistributedZkTest-1363702663669/1363702671627unloadcollection1_1n/index/
[junit4:junit4]   2> 8781 T70 oasc.SolrCore.initIndex WARNING [unloadcollection1] Solr index directory '/mnt/ssd/jenkins/workspace/Lucene-Solr-trunk-Linux/solr/build/solr-core/test/J0/./solrtest-UnloadDistributedZkTest-1363702663669/1363702671627unloadcollection1_1n/index' doesn't exist. Creating new index...
[junit4:junit4]   2> 8786 T70 oasc.CachingDirectoryFactory.get return new directory for /mnt/ssd/jenkins/workspace/Lucene-Solr-trunk-Linux/solr/build/solr-core/test/J0/./solrtest-UnloadDistributedZkTest-1363702663669/1363702671627unloadcollection1_1n/index forceNew: false
[junit4:junit4]   2> 8792 T70 oasc.SolrDeletionPolicy.onCommit SolrDeletionPolicy.onCommit: commits:num=1
[junit4:junit4]   2> 		commit{dir=MockDirWrapper(org.apache.lucene.store.NIOFSDirectory@/mnt/ssd/jenkins/workspace/Lucene-Solr-trunk-Linux/solr/build/solr-core/test/J0/index3246332463tmp lockFactory=org.apache.lucene.store.NativeFSLockFactory@44f64b95),segFN=segments_1,generation=1,filenames=[segments_1]
[junit4:junit4]   2> 8793 T70 oasc.SolrDeletionPolicy.updateCommits newest commit = 1[segments_1]
[junit4:junit4]   2> 8807 T70 oasup.UpdateRequestProcessorChain.init inserting DistributedUpdateProcessorFactory into updateRequestProcessorChain "dedupe"
[junit4:junit4]   2> 8808 T70 oasup.UpdateRequestProcessorChain.init inserting DistributedUpdateProcessorFactory into updateRequestProcessorChain "stored_sig"
[junit4:junit4]   2> 8810 T70 oasup.UpdateRequestProcessorChain.init inserting DistributedUpdateProcessorFactory into updateRequestProcessorChain "distrib-dup-test-chain-implicit"
[junit4:junit4]   2> 8812 T70 oasc.RequestHandlers.initHandlersFromConfig created standard: solr.StandardRequestHandler
[junit4:junit4]   2> 8813 T70 oasc.RequestHandlers.initHandlersFromConfig created /get: solr.RealTimeGetHandler
[junit4:junit4]   2> 8814 T70 oasc.RequestHandlers.initHandlersFromConfig adding lazy requestHandler: solr.ReplicationHandler
[junit4:junit4]   2> 8815 T70 oasc.RequestHandlers.initHandlersFromConfig created /replication: solr.ReplicationHandler
[junit4:junit4]   2> 8816 T70 oasc.RequestHandlers.initHandlersFromConfig created /update: solr.UpdateRequestHandler
[junit4:junit4]   2> 8817 T70 oasc.RequestHandlers.initHandlersFromConfig created /admin/: org.apache.solr.handler.admin.AdminHandlers
[junit4:junit4]   2> 8822 T70 oashl.XMLLoader.init xsltCacheLifetimeSeconds=60
[junit4:junit4]   2> 8827 T70 oass.SolrIndexSearcher.<init> Opening Searcher@2fc7662d main
[junit4:junit4]   2> 8832 T70 oasu.UpdateHandler.clearLog Clearing tlog files, tlogDir=/mnt/ssd/jenkins/workspace/Lucene-Solr-trunk-Linux/solr/build/solr-core/test/J0/./solrtest-UnloadDistributedZkTest-1363702663669/1363702671627unloadcollection1_1n/tlog
[junit4:junit4]   2> 8839 T70 oasu.CommitTracker.<init> Hard AutoCommit: disabled
[junit4:junit4]   2> 8840 T70 oasu.CommitTracker.<init> Soft AutoCommit: disabled
[junit4:junit4]   2> 8849 T119 oasc.SolrCore.registerSearcher [unloadcollection1] Registered new searcher Searcher@2fc7662d main{StandardDirectoryReader(segments_1:1)}
[junit4:junit4]   2> 8854 T70 oasc.ZkController.publish publishing core=unloadcollection1 state=down
[junit4:junit4]   2> 9143 T58 oascc.ZkStateReader.updateClusterState Updating cloud state from ZooKeeper... 
[junit4:junit4]   2> 9144 T58 oasc.Overseer$ClusterStateUpdater.updateState Update state numShards=1 message={
[junit4:junit4]   2> 	  "core_node_name":null,
[junit4:junit4]   2> 	  "numShards":"1",
[junit4:junit4]   2> 	  "core":"unloadcollection1",
[junit4:junit4]   2> 	  "collection":"unloadcollection",
[junit4:junit4]   2> 	  "roles":null,
[junit4:junit4]   2> 	  "node_name":"127.0.0.1:42161_",
[junit4:junit4]   2> 	  "base_url":"http://127.0.0.1:42161",
[junit4:junit4]   2> 	  "operation":"state",
[junit4:junit4]   2> 	  "state":"down",
[junit4:junit4]   2> 	  "shard":null}
[junit4:junit4]   2> 9144 T58 oasc.Overseer$ClusterStateUpdater.createCollection Create collection unloadcollection with numShards 1
[junit4:junit4]   2> 9151 T58 oasc.Overseer$ClusterStateUpdater.updateState Assigning new node to shard shard=shard1
[junit4:junit4]   2> 9161 T62 oascc.ZkStateReader$2.process A cluster state change: WatchedEvent state:SyncConnected type:NodeDataChanged path:/clusterstate.json, has occurred - updating... (live nodes size: 5)
[junit4:junit4]   2> 9161 T75 oascc.ZkStateReader$2.process A cluster state change: WatchedEvent state:SyncConnected type:NodeDataChanged path:/clusterstate.json, has occurred - updating... (live nodes size: 5)
[junit4:junit4]   2> 9162 T89 oascc.ZkStateReader$2.process A cluster state change: WatchedEvent state:SyncConnected type:NodeDataChanged path:/clusterstate.json, has occurred - updating... (live nodes size: 5)
[junit4:junit4]   2> 9162 T117 oascc.ZkStateReader$2.process A cluster state change: WatchedEvent state:SyncConnected type:NodeDataChanged path:/clusterstate.json, has occurred - updating... (live nodes size: 5)
[junit4:junit4]   2> 9161 T103 oascc.ZkStateReader$2.process A cluster state change: WatchedEvent state:SyncConnected type:NodeDataChanged path:/clusterstate.json, has occurred - updating... (live nodes size: 5)
[junit4:junit4]   2> 9162 T57 oascc.ZkStateReader$2.process A cluster state change: WatchedEvent state:SyncConnected type:NodeDataChanged path:/clusterstate.json, has occurred - updating... (live nodes size: 5)
[junit4:junit4]   2> 9857 T70 oasc.CoreContainer.registerCore registering core: unloadcollection1
[junit4:junit4]   2> 9858 T70 oasc.ZkController.register Register replica - core:unloadcollection1 address:http://127.0.0.1:42161 collection:unloadcollection shard:shard1
[junit4:junit4]   2> 9861 T70 oascsi.HttpClientUtil.createClient Creating new http client, config:maxConnections=10000&maxConnectionsPerHost=20&connTimeout=30000&socketTimeout=30000&retry=false
[junit4:junit4]   2> 9869 T70 oascc.SolrZkClient.makePath makePath: /collections/unloadcollection/leader_elect/shard1/election
[junit4:junit4]   2> 9881 T41 oazs.PrepRequestProcessor.pRequest Got user-level KeeperException when processing sessionid:0x13d83034a830006 type:delete cxid:0x51 zxid:0x57 txntype:-1 reqpath:n/a Error Path:/solr/collections/unloadcollection/leaders Error:KeeperErrorCode = NoNode for /solr/collections/unloadcollection/leaders
[junit4:junit4]   2> 9882 T70 oasc.ShardLeaderElectionContext.runLeaderProcess Running the leader process.
[junit4:junit4]   2> 9883 T41 oazs.PrepRequestProcessor.pRequest Got user-level KeeperException when processing sessionid:0x13d83034a830006 type:create cxid:0x52 zxid:0x58 txntype:-1 reqpath:n/a Error Path:/solr/overseer Error:KeeperErrorCode = NodeExists for /solr/overseer
[junit4:junit4]   2> 9886 T70 oasc.ShardLeaderElectionContext.waitForReplicasToComeUp Enough replicas found to continue.
[junit4:junit4]   2> 9886 T70 oasc.ShardLeaderElectionContext.runLeaderProcess I may be the new leader - try and sync
[junit4:junit4]   2> 9887 T70 oasc.SyncStrategy.sync Sync replicas to http://127.0.0.1:42161/unloadcollection1/
[junit4:junit4]   2> 9888 T70 oasc.SyncStrategy.syncReplicas Sync Success - now sync replicas to me
[junit4:junit4]   2> 9888 T70 oasc.SyncStrategy.syncToMe http://127.0.0.1:42161/unloadcollection1/ has no replicas
[junit4:junit4]   2> 9889 T70 oasc.ShardLeaderElectionContext.runLeaderProcess I am the new leader: http://127.0.0.1:42161/unloadcollection1/
[junit4:junit4]   2> 9889 T70 oascc.SolrZkClient.makePath makePath: /collections/unloadcollection/leaders/shard1
[junit4:junit4]   2> 9895 T41 oazs.PrepRequestProcessor.pRequest Got user-level KeeperException when processing sessionid:0x13d83034a830006 type:create cxid:0x5d zxid:0x5c txntype:-1 reqpath:n/a Error Path:/solr/overseer Error:KeeperErrorCode = NodeExists for /solr/overseer
[junit4:junit4]   2> 10670 T58 oascc.ZkStateReader.updateClusterState Updating cloud state from ZooKeeper... 
[junit4:junit4]   2> 10769 T75 oascc.ZkStateReader$2.process A cluster state change: WatchedEvent state:SyncConnected type:NodeDataChanged path:/clusterstate.json, has occurred - updating... (live nodes size: 5)
[junit4:junit4]   2> 10769 T117 oascc.ZkStateReader$2.process A cluster state change: WatchedEvent state:SyncConnected type:NodeDataChanged path:/clusterstate.json, has occurred - updating... (live nodes size: 5)
[junit4:junit4]   2> 10769 T57 oascc.ZkStateReader$2.process A cluster state change: WatchedEvent state:SyncConnected type:NodeDataChanged path:/clusterstate.json, has occurred - updating... (live nodes size: 5)
[junit4:junit4]   2> 10769 T89 oascc.ZkStateReader$2.process A cluster state change: WatchedEvent state:SyncConnected type:NodeDataChanged path:/clusterstate.json, has occurred - updating... (live nodes size: 5)
[junit4:junit4]   2> 10769 T62 oascc.ZkStateReader$2.process A cluster state change: WatchedEvent state:SyncConnected type:NodeDataChanged path:/clusterstate.json, has occurred - updating... (live nodes size: 5)
[junit4:junit4]   2> 10769 T103 oascc.ZkStateReader$2.process A cluster state change: WatchedEvent state:SyncConnected type:NodeDataChanged path:/clusterstate.json, has occurred - updating... (live nodes size: 5)
[junit4:junit4]   2> 10801 T70 oasc.ZkController.register We are http://127.0.0.1:42161/unloadcollection1/ and leader is http://127.0.0.1:42161/unloadcollection1/
[junit4:junit4]   2> 10802 T70 oasc.ZkController.register No LogReplay needed for core=unloadcollection1 baseURL=http://127.0.0.1:42161
[junit4:junit4]   2> 10803 T70 oasc.ZkController.checkRecovery I am the leader, no recovery necessary
[junit4:junit4]   2> 10803 T70 oasc.ZkController.publish publishing core=unloadcollection1 state=active
[junit4:junit4]   2> 10806 T70 oascc.ZkStateReader.updateClusterState Updating cloud state from ZooKeeper... 
[junit4:junit4]   2> 10808 T70 oasc.CoreContainer.persistFile Persisting cores config to /mnt/ssd/jenkins/workspace/Lucene-Solr-trunk-Linux/solr/build/solr-core/test/J0/./org.apache.solr.cloud.UnloadDistributedZkTest-jetty1-1363702666849/solr.xml
[junit4:junit4]   2> 10815 T70 oasc.SolrXMLSerializer.persistFile Persisting cores config to /mnt/ssd/jenkins/workspace/Lucene-Solr-trunk-Linux/solr/build/solr-core/test/J0/./org.apache.solr.cloud.UnloadDistributedZkTest-jetty1-1363702666849/solr.xml
[junit4:junit4]   2> 10816 T70 oass.SolrDispatchFilter.handleAdminRequest /admin/cores {numShards=1&version=2&collection=unloadcollection&name=unloadcollection1&wt=javabin&action=CREATE&dataDir=/mnt/ssd/jenkins/workspace/Lucene-Solr-trunk-Linux/solr/build/solr-core/test/J0/./solrtest-UnloadDistributedZkTest-1363702663669/1363702671627unloadcollection1_1n} status=0 QTime=2611 
[junit4:junit4]   2> 10843 T34 oascsi.HttpClientUtil.createClient Creating new http client, config:
[junit4:junit4]   2> 10845 T34 oaz.ZooKeeper.<init> Initiating client connection, connectString=127.0.0.1:33013/solr sessionTimeout=10000 watcher=org.apache.solr.common.cloud.ConnectionManager@6e6f6453
[junit4:junit4]   2> 10845 T34 oascc.ConnectionManager.waitForConnected Waiting for client to connect to ZooKeeper
[junit4:junit4]   2> 10846 T120 oaz.ClientCnxn$SendThread.logStartConnect Opening socket connection to server localhost.localdomain/127.0.0.1:33013. Will not attempt to authenticate using SASL (access denied ("javax.security.auth.AuthPermission" "getLoginConfiguration"))
[junit4:junit4]   2> 10846 T120 oaz.ClientCnxn$SendThread.primeConnection Socket connection established to localhost.localdomain/127.0.0.1:33013, initiating session
[junit4:junit4]   2> 10846 T36 oazs.NIOServerCnxnFactory.run Accepted socket connection from /127.0.0.1:51464
[junit4:junit4]   2> 10847 T36 oazs.ZooKeeperServer.processConnectRequest Client attempting to establish new session at /127.0.0.1:51464
[junit4:junit4]   2> 10848 T38 oazs.ZooKeeperServer.finishSessionInit Established session 0x13d83034a83000d with negotiated timeout 10000 for client /127.0.0.1:51464
[junit4:junit4]   2> 10848 T120 oaz.ClientCnxn$SendThread.onConnected Session establishment complete on server localhost.localdomain/127.0.0.1:33013, sessionid = 0x13d83034a83000d, negotiated timeout = 10000
[junit4:junit4]   2> 10849 T121 oascc.ConnectionManager.process Watcher org.apache.solr.common.cloud.ConnectionManager@6e6f6453 name:ZooKeeperConnection Watcher:127.0.0.1:33013/solr got event WatchedEvent state:SyncConnected type:None path:null path:null type:None
[junit4:junit4]   2> 10849 T34 oascc.ConnectionManager.waitForConnected Client is connected to ZooKeeper
[junit4:junit4]   2> 10851 T34 oascc.ZkStateReader.createClusterStateWatchersAndUpdate Updating cluster state from ZooKeeper... 
[junit4:junit4]   2> 10855 T34 oascc.ZkStateReader.updateClusterState Updating cloud state from ZooKeeper... 
[junit4:junit4]   2> 10857 T34 oascsi.HttpClientUtil.createClient Creating new http client, config:maxConnections=128&maxConnectionsPerHost=32&followRedirects=false
[junit4:junit4]   2> 10863 T82 oasc.CoreContainer.create Creating SolrCore 'unloadcollection2' using instanceDir: /mnt/ssd/jenkins/workspace/Lucene-Solr-trunk-Linux/solr/build/solr-core/test/J0/./org.apache.solr.cloud.UnloadDistributedZkTest-jetty2-1363702668032/unloadcollection2
[junit4:junit4]   2> 10864 T82 oasc.ZkController.createCollectionZkNode Check for collection zkNode:unloadcollection
[junit4:junit4]   2> 10865 T82 oasc.ZkController.createCollectionZkNode Collection zkNode exists
[junit4:junit4]   2> 10865 T82 oasc.ZkController.readConfigName Load collection config from:/collections/unloadcollection
[junit4:junit4]   2> 10867 T82 oasc.SolrResourceLoader.<init> new SolrResourceLoader for directory: '/mnt/ssd/jenkins/workspace/Lucene-Solr-trunk-Linux/solr/build/solr-core/test/J0/./org.apache.solr.cloud.UnloadDistributedZkTest-jetty2-1363702668032/unloadcollection2/'
[junit4:junit4]   2> 10906 T82 oasc.SolrConfig.<init> Using Lucene MatchVersion: LUCENE_50
[junit4:junit4]   2> 10938 T82 oasc.SolrConfig.<init> Loaded SolrConfig: solrconfig.xml
[junit4:junit4]   2> 10940 T82 oass.IndexSchema.readSchema Reading Solr Schema
[junit4:junit4]   2> 10957 T82 oass.IndexSchema.readSchema Schema name=test
[junit4:junit4]   2> 11321 T82 oass.OpenExchangeRatesOrgProvider.init Initialized with rates=open-exchange-rates.json, refreshInterval=1440.
[junit4:junit4]   2> 11335 T82 oass.IndexSchema.readSchema default search field in schema is text
[junit4:junit4]   2> 11339 T82 oass.IndexSchema.readSchema unique key field: id
[junit4:junit4]   2> 11373 T82 oass.FileExchangeRateProvider.reload Reloading exchange rates from file currency.xml
[junit4:junit4]   2> 11378 T82 oass.FileExchangeRateProvider.reload Reloading exchange rates from file currency.xml
[junit4:junit4]   2> 11382 T82 oass.OpenExchangeRatesOrgProvider.reload Reloading exchange rates from open-exchange-rates.json
[junit4:junit4]   2> 11385 T82 oass.OpenExchangeRatesOrgProvider$OpenExchangeRates.<init> WARNING Unknown key IMPORTANT NOTE
[junit4:junit4]   2> 11386 T82 oass.OpenExchangeRatesOrgProvider$OpenExchangeRates.<init> WARNING Expected key, got STRING
[junit4:junit4]   2> 11386 T82 oass.OpenExchangeRatesOrgProvider.reload Reloading exchange rates from open-exchange-rates.json
[junit4:junit4]   2> 11388 T82 oass.OpenExchangeRatesOrgProvider$OpenExchangeRates.<init> WARNING Unknown key IMPORTANT NOTE
[junit4:junit4]   2> 11388 T82 oass.OpenExchangeRatesOrgProvider$OpenExchangeRates.<init> WARNING Expected key, got STRING
[junit4:junit4]   2> 11389 T82 oasc.SolrCore.initDirectoryFactory org.apache.solr.core.MockDirectoryFactory
[junit4:junit4]   2> 11389 T82 oasc.SolrCore.<init> [unloadcollection2] Opening new SolrCore at /mnt/ssd/jenkins/workspace/Lucene-Solr-trunk-Linux/solr/build/solr-core/test/J0/./org.apache.solr.cloud.UnloadDistributedZkTest-jetty2-1363702668032/unloadcollection2/, dataDir=/mnt/ssd/jenkins/workspace/Lucene-Solr-trunk-Linux/solr/build/solr-core/test/J0/./solrtest-UnloadDistributedZkTest-1363702663669/1363702674511unloadcollection1_2n/
[junit4:junit4]   2> 11390 T82 oasc.JmxMonitoredMap.<init> JMX monitoring is enabled. Adding Solr mbeans to JMX Server: com.sun.jmx.mbeanserver.JmxMBeanServer@3a9ff9ea
[junit4:junit4]   2> 11390 T82 oasc.SolrCore.initDirectoryFactory org.apache.solr.core.MockDirectoryFactory
[junit4:junit4]   2> 11391 T82 oasc.CachingDirectoryFactory.get return new directory for /mnt/ssd/jenkins/workspace/Lucene-Solr-trunk-Linux/solr/build/solr-core/test/J0/./solrtest-UnloadDistributedZkTest-1363702663669/1363702674511unloadcollection1_2n forceNew: false
[junit4:junit4]   2> 11391 T82 oasc.SolrCore.getNewIndexDir New index directory detected: old=null new=/mnt/ssd/jenkins/workspace/Lucene-Solr-trunk-Linux/solr/build/solr-core/test/J0/./solrtest-UnloadDistributedZkTest-1363702663669/1363702674511unloadcollection1_2n/index/
[junit4:junit4]   2> 11392 T82 oasc.SolrCore.initIndex WARNING [unloadcollection2] Solr index directory '/mnt/ssd/jenkins/workspace/Lucene-Solr-trunk-Linux/solr/build/solr-core/test/J0/./solrtest-UnloadDistributedZkTest-1363702663669/1363702674511unloadcollection1_2n/index' doesn't exist. Creating new index...
[junit4:junit4]   2> 11393 T82 oasc.CachingDirectoryFactory.get return new directory for /mnt/ssd/jenkins/workspace/Lucene-Solr-trunk-Linux/solr/build/solr-core/test/J0/./solrtest-UnloadDistributedZkTest-1363702663669/1363702674511unloadcollection1_2n/index forceNew: false
[junit4:junit4]   2> 11403 T82 oasc.SolrDeletionPolicy.onCommit SolrDeletionPolicy.onCommit: commits:num=1
[junit4:junit4]   2> 		commit{dir=MockDirWrapper(org.apache.lucene.store.NIOFSDirectory@/mnt/ssd/jenkins/workspace/Lucene-Solr-trunk-Linux/solr/build/solr-core/test/J0/index3246332464tmp lockFactory=org.apache.lucene.store.NativeFSLockFactory@3e9d786c),segFN=segments_1,generation=1,filenames=[segments_1]
[junit4:junit4]   2> 11404 T82 oasc.SolrDeletionPolicy.updateCommits newest commit = 1[segments_1]
[junit4:junit4]   2> 11406 T82 oasup.UpdateRequestProcessorChain.init inserting DistributedUpdateProcessorFactory into updateRequestProcessorChain "dedupe"
[junit4:junit4]   2> 11407 T82 oasup.UpdateRequestProcessorChain.init inserting DistributedUpdateProcessorFactory into updateRequestProcessorChain "stored_sig"
[junit4:junit4]   2> 11408 T82 oasup.UpdateRequestProcessorChain.init inserting DistributedUpdateProcessorFactory into updateRequestProcessorChain "distrib-dup-test-chain-implicit"
[junit4:junit4]   2> 11409 T82 oasc.RequestHandlers.initHandlersFromConfig created standard: solr.StandardRequestHandler
[junit4:junit4]   2> 11409 T82 oasc.RequestHandlers.initHandlersFromConfig created /get: solr.RealTimeGetHandler
[junit4:junit4]   2> 11410 T82 oasc.RequestHandlers.initHandlersFromConfig adding lazy requestHandler: solr.ReplicationHandler
[junit4:junit4]   2> 11410 T82 oasc.RequestHandlers.initHandlersFromConfig created /replication: solr.ReplicationHandler
[junit4:junit4]   2> 11411 T82 oasc.RequestHandlers.initHandlersFromConfig created /update: solr.UpdateRequestHandler
[junit4:junit4]   2> 11411 T82 oasc.RequestHandlers.initHandlersFromConfig created /admin/: org.apache.solr.handler.admin.AdminHandlers
[junit4:junit4]   2> 11414 T82 oashl.XMLLoader.init xsltCacheLifetimeSeconds=60
[junit4:junit4]   2> 11417 T82 oass.SolrIndexSearcher.<init> Opening Searcher@29ce7a48 main
[junit4:junit4]   2> 11418 T82 oasu.UpdateHandler.clearLog Clearing tlog files, tlogDir=/mnt/ssd/jenkins/workspace/Lucene-Solr-trunk-Linux/solr/build/solr-core/test/J0/./solrtest-UnloadDistributedZkTest-1363702663669/1363702674511unloadcollection1_2n/tlog
[junit4:junit4]   2> 11419 T82 oasu.CommitTracker.<init> Hard AutoCommit: disabled
[junit4:junit4]   2> 11419 T82 oasu.CommitTracker.<init> Soft AutoCommit: disabled
[junit4:junit4]   2> 11425 T122 oasc.SolrCore.registerSearcher [unloadcollection2] Registered new searcher Searcher@29ce7a48 main{StandardDirectoryReader(segments_1:1)}
[junit4:junit4]   2> 11429 T82 oasc.ZkController.publish publishing core=unloadcollection2 state=down
[junit4:junit4]   2> 11429 T82 oasc.ZkController.publish numShards not found on descriptor - reading it from system property
[junit4:junit4]   2> 12279 T58 oascc.ZkStateReader.updateClusterState Updating cloud state from ZooKeeper... 
[junit4:junit4]   2> 12280 T58 oasc.Overseer$ClusterStateUpdater.updateState Update state numShards=1 message={
[junit4:junit4]   2> 	  "core_node_name":"127.0.0.1:42161__unloadcollection1",
[junit4:junit4]   2> 	  "numShards":"1",
[junit4:junit4]   2> 	  "core":"unloadcollection1",
[junit4:junit4]   2> 	  "collection":"unloadcollection",
[junit4:junit4]   2> 	  "roles":null,
[junit4:junit4]   2> 	  "node_name":"127.0.0.1:42161_",
[junit4:junit4]   2> 	  "base_url":"http://127.0.0.1:42161",
[junit4:junit4]   2> 	  "operation":"state",
[junit4:junit4]   2> 	  "state":"active",
[junit4:junit4]   2> 	  "shard":"shard1"}
[junit4:junit4]   2> 12286 T58 oasc.Overseer$ClusterStateUpdater.updateState Update state numShards=2 message={
[junit4:junit4]   2> 	  "core_node_name":null,
[junit4:junit4]   2> 	  "numShards":"2",
[junit4:junit4]   2> 	  "core":"unloadcollection2",
[junit4:junit4]   2> 	  "collection":"unloadcollection",
[junit4:junit4]   2> 	  "roles":null,
[junit4:junit4]   2> 	  "node_name":"127.0.0.1:33731_",
[junit4:junit4]   2> 	  "base_url":"http://127.0.0.1:33731",
[junit4:junit4]   2> 	  "operation":"state",
[junit4:junit4]   2> 	  "state":"down",
[junit4:junit4]   2> 	  "shard":null}
[junit4:junit4]   2> 12286 T58 oasc.Overseer$ClusterStateUpdater.updateState Collection already exists with numShards=1
[junit4:junit4]   2> 12287 T58 oasc.Overseer$ClusterStateUpdater.updateState Assigning new node to shard shard=shard1
[junit4:junit4]   2> 12293 T121 oascc.ZkStateReader$2.process A cluster state change: WatchedEvent state:SyncConnected type:NodeDataChanged path:/clusterstate.json, has occurred - updating... (live nodes size: 5)
[junit4:junit4]   2> 12293 T75 oascc.ZkStateReader$2.process A cluster state change: WatchedEvent state:SyncConnected type:NodeDataChanged path:/clusterstate.json, has occurred - updating... (live nodes size: 5)
[junit4:junit4]   2> 12293 T117 oascc.ZkStateReader$2.process A cluster state change: WatchedEvent state:SyncConnected type:NodeDataChanged path:/clusterstate.json, has occurred - updating... (live nodes size: 5)
[junit4:junit4]   2> 12293 T57 oascc.ZkStateReader$2.process A cluster state change: WatchedEvent state:SyncConnected type:NodeDataChanged path:/clusterstate.json, has occurred - updating... (live nodes size: 5)
[junit4:junit4]   2> 12293 T62 oascc.ZkStateReader$2.process A cluster state change: WatchedEvent state:SyncConnected type:NodeDataChanged path:/clusterstate.json, has occurred - updating... (live nodes size: 5)
[junit4:junit4]   2> 12293 T103 oascc.ZkStateReader$2.process A cluster state change: WatchedEvent state:SyncConnected type:NodeDataChanged path:/clusterstate.json, has occurred - updating... (live nodes size: 5)
[junit4:junit4]   2> 12293 T89 oascc.ZkStateReader$2.process A cluster state change: WatchedEvent state:SyncConnected type:NodeDataChanged path:/clusterstate.json, has occurred - updating... (live nodes size: 5)
[junit4:junit4]   2> 12431 T82 oasc.CoreContainer.registerCore registering core: unloadcollection2
[junit4:junit4]   2> 12432 T82 oasc.ZkController.register Register replica - core:unloadcollection2 address:http://127.0.0.1:33731 collection:unloadcollection shard:shard1
[junit4:junit4]   2> 12438 T82 oasc.ZkController.register We are http://127.0.0.1:33731/unloadcollection2/ and leader is http://127.0.0.1:42161/unloadcollection1/
[junit4:junit4]   2> 12438 T82 oasc.ZkController.register No LogReplay needed for core=unloadcollection2 baseURL=http://127.0.0.1:33731
[junit4:junit4]   2> 12439 T82 oasc.ZkController.checkRecovery Core needs to recover:unloadcollection2
[junit4:junit4]   2> 12439 T82 oasu.DefaultSolrCoreState.doRecovery Running recovery - first canceling any ongoing recovery
[junit4:junit4]   2> ASYNC  NEW_CORE C3 name=unloadcollection2 org.apache.solr.core.SolrCore@490807f1 url=http://127.0.0.1:33731/unloadcollection2 node=127.0.0.1:33731_ C3_STATE=coll:unloadcollection core:unloadcollection2 props:{core=unloadcollection2, collection=unloadcollection, node_name=127.0.0.1:33731_, base_url=http://127.0.0.1:33731, state=down}
[junit4:junit4]   2> 12442 T123 C3 P33731 oasc.RecoveryStrategy.run Starting recovery process.  core=unloadcollection2 recoveringAfterStartup=true
[junit4:junit4]   2> 12443 T123 C3 P33731 oasc.RecoveryStrategy.doRecovery ###### startupVersions=[]
[junit4:junit4]   2> 12443 T82 oascc.ZkStateReader.updateClusterState Updating cloud state from ZooKeeper... 
[junit4:junit4]   2> 12443 T123 C3 P33731 oasc.ZkController.publish publishing core=unloadcollection2 state=recovering
[junit4:junit4]   2> 12444 T123 C3 P33731 oasc.ZkController.publish numShards not found on descriptor - reading it from system property
[junit4:junit4]   2> 12444 T82 oasc.CoreContainer.persistFile Persisting cores config to /mnt/ssd/jenkins/workspace/Lucene-Solr-trunk-Linux/solr/build/solr-core/test/J0/./org.apache.solr.cloud.UnloadDistributedZkTest-jetty2-1363702668032/solr.xml
[junit4:junit4]   2> 12445 T123 C3 P33731 oascsi.HttpClientUtil.createClient Creating new http client, config:maxConnections=128&maxConnectionsPerHost=32&followRedirects=false
[junit4:junit4]   2> 12454 T82 oasc.SolrXMLSerializer.persistFile Persisting cores config to /mnt/ssd/jenkins/workspace/Lucene-Solr-trunk-Linux/solr/build/solr-core/test/J0/./org.apache.solr.cloud.UnloadDistributedZkTest-jetty2-1363702668032/solr.xml
[junit4:junit4]   2> 12456 T82 oass.SolrDispatchFilter.handleAdminRequest /admin/cores {version=2&collection=unloadcollection&name=unloadcollection2&wt=javabin&action=CREATE&dataDir=/mnt/ssd/jenkins/workspace/Lucene-Solr-trunk-Linux/solr/build/solr-core/test/J0/./solrtest-UnloadDistributedZkTest-1363702663669/1363702674511unloadcollection1_2n} status=0 QTime=1593 
[junit4:junit4]   2> 12458 T34 oascc.ZkStateReader.updateClusterState Updating cloud state from ZooKeeper... 
[junit4:junit4]   2> 12459 T34 oasc.AbstractDistribZkTestBase.waitForRecoveriesToFinish Wait for recoveries to finish - collection: unloadcollection failOnTimeout:true timeout (sec):230
[junit4:junit4]   2> 12460 T34 oascc.ZkStateReader.updateClusterState Updating cloud state from ZooKeeper... 
[junit4:junit4]   2> 13463 T34 oascc.ZkStateReader.updateClusterState Updating cloud state from ZooKeeper... 
[junit4:junit4]   2> 13809 T58 oascc.ZkStateReader.updateClusterState Updating cloud state from ZooKeeper... 
[junit4:junit4]   2> 13812 T58 oasc.Overseer$ClusterStateUpdater.updateState Update state numShards=2 message={
[junit4:junit4]   2> 	  "core_node_name":"127.0.0.1:33731__unloadcollection2",
[junit4:junit4]   2> 	  "numShards":"2",
[junit4:junit4]   2> 	  "core":"unloadcollection2",
[junit4:junit4]   2> 	  "collection":"unloadcollection",
[junit4:junit4]   2> 	  "roles":null,
[junit4:junit4]   2> 	  "node_name":"127.0.0.1:33731_",
[junit4:junit4]   2> 	  "base_url":"http://127.0.0.1:33731",
[junit4:junit4]   2> 	  "operation":"state",
[junit4:junit4]   2> 	  "state":"recovering",
[junit4:junit4]   2> 	  "shard":"shard1"}
[junit4:junit4]   2> 13820 T121 oascc.ZkStateReader$2.process A cluster state change: WatchedEvent state:SyncConnected type:NodeDataChanged path:/clusterstate.json, has occurred - updating... (live nodes size: 5)
[junit4:junit4]   2> 13820 T103 oascc.ZkStateReader$2.process A cluster state change: WatchedEvent state:SyncConnected type:NodeDataChanged path:/clusterstate.json, has occurred - updating... (live nodes size: 5)
[junit4:junit4]   2> 13820 T117 oascc.ZkStateReader$2.process A cluster state change: WatchedEvent state:SyncConnected type:NodeDataChanged path:/clusterstate.json, has occurred - updating... (live nodes size: 5)
[junit4:junit4]   2> 13820 T57 oascc.ZkStateReader$2.process A cluster state change: WatchedEvent state:SyncConnected type:NodeDataChanged path:/clusterstate.json, has occurred - updating... (live nodes size: 5)
[junit4:junit4]   2> 13820 T89 oascc.ZkStateReader$2.process A cluster state change: WatchedEvent state:SyncConnected type:NodeDataChanged path:/clusterstate.json, has occurred - updating... (live nodes size: 5)
[junit4:junit4]   2> 13820 T75 oascc.ZkStateReader$2.process A cluster state change: WatchedEvent state:SyncConnected type:NodeDataChanged path:/clusterstate.json, has occurred - updating... (live nodes size: 5)
[junit4:junit4]   2> 13820 T62 oascc.ZkStateReader$2.process A cluster state change: WatchedEvent state:SyncConnected type:NodeDataChanged path:/clusterstate.json, has occurred - updating... (live nodes size: 5)
[junit4:junit4]   2> 14456 T68 oass.SolrDispatchFilter.handleAdminRequest /admin/cores {core=unloadcollection1&version=2&nodeName=127.0.0.1:33731_&coreNodeName=127.0.0.1:33731__unloadcollection2&wt=javabin&action=PREPRECOVERY&state=recovering&onlyIfLeader=true&checkLive=true} status=0 QTime=2000 
[junit4:junit4]   2> 14466 T34 oascc.ZkStateReader.updateClusterState Updating cloud state from ZooKeeper... 
[junit4:junit4]   2> 15469 T34 oascc.ZkStateReader.updateClusterState Updating cloud state from ZooKeeper... 
[junit4:junit4]   2>  C3_STATE=coll:unloadcollection core:unloadcollection2 props:{core=unloadcollection2, collection=unloadcollection, node_name=127.0.0.1:33731_, base_url=http://127.0.0.1:33731, state=recovering, shard=shard1}
[junit4:junit4]   2> 16458 T123 C3 P33731 oasc.RecoveryStrategy.doRecovery Attempting to PeerSync from http://127.0.0.1:42161/unloadcollection1/ core=unloadcollection2 - recoveringAfterStartup=true
[junit4:junit4]   2> 16463 T123 C3 P33731 oascsi.HttpClientUtil.createClient Creating new http client, config:maxConnectionsPerHost=20&maxConnections=10000&connTimeout=30000&socketTimeout=30000&retry=false
[junit4:junit4]   2> 16471 T34 oascc.ZkStateReader.updateClusterState Updating cloud state from ZooKeeper... 
[junit4:junit4]   2> 16472 T123 C3 P33731 oasu.PeerSync.sync PeerSync: core=unloadcollection2 url=http://127.0.0.1:33731 START replicas=[http://127.0.0.1:42161/unloadcollection1/] nUpdates=100
[junit4:junit4]   2> 16476 T123 C3 P33731 oasu.PeerSync.sync WARNING no frame of reference to tell of we've missed updates
[junit4:junit4]   2> 16476 T123 C3 P33731 oasc.RecoveryStrategy.doRecovery PeerSync Recovery was not successful - trying replication. core=unloadcollection2
[junit4:junit4]   2> 16477 T123 C3 P33731 oasc.RecoveryStrategy.doRecovery Starting Replication Recovery. core=unloadcollection2
[junit4:junit4]   2> 16477 T123 C3 P33731 oasc.RecoveryStrategy.doRecovery Begin buffering updates. core=unloadcollection2
[junit4:junit4]   2> 16477 T123 C3 P33731 oasu.UpdateLog.bufferUpdates Starting to buffer updates. FSUpdateLog{state=ACTIVE, tlog=null}
[junit4:junit4]   2> 16477 T123 C3 P33731 oasc.RecoveryStrategy.replicate Attempting to replicate from http://127.0.0.1:42161/unloadcollection1/. core=unloadcollection2
[junit4:junit4]   2> 16478 T123 C3 P33731 oascsi.HttpClientUtil.createClient Creating new http client, config:maxConnections=128&maxConnectionsPerHost=32&followRedirects=false
[junit4:junit4]   2> ASYNC  NEW_CORE C4 name=unloadcollection1 org.apache.solr.core.SolrCore@7bddaca8 url=http://127.0.0.1:42161/unloadcollection1 node=127.0.0.1:42161_ C4_STATE=coll:unloadcollection core:unloadcollection1 props:{core=unloadcollection1, collection=unloadcollection, node_name=127.0.0.1:42161_, base_url=http://127.0.0.1:42161, state=active, shard=shard1, leader=true}
[junit4:junit4]   2> 16491 T69 C4 P42161 REQ /get {distrib=false&version=2&getVersions=100&wt=javabin&qt=/get} status=0 QTime=1 
[junit4:junit4]   2> 16495 T70 C4 P42161 oasu.DirectUpdateHandler2.commit start commit{,optimize=false,openSearcher=false,waitSearcher=true,expungeDeletes=false,softCommit=false,prepareCommit=false}
[junit4:junit4]   2> 16497 T70 C4 P42161 oasc.SolrDeletionPolicy.onInit SolrDeletionPolicy.onInit: commits:num=1
[junit4:junit4]   2> 		commit{dir=MockDirWrapper(org.apache.lucene.store.NIOFSDirectory@/mnt/ssd/jenkins/workspace/Lucene-Solr-trunk-Linux/solr/build/solr-core/test/J0/index3246332463tmp lockFactory=org.apache.lucene.store.NativeFSLockFactory@44f64b95),segFN=segments_1,generation=1,filenames=[segments_1]
[junit4:junit4]   2> 16498 T70 C4 P42161 oasc.SolrDeletionPolicy.updateCommits newest commit = 1[segments_1]
[junit4:junit4]   2> 16502 T70 C4 P42161 oasc.SolrDeletionPolicy.onCommit SolrDeletionPolicy.onCommit: commits:num=2
[junit4:junit4]   2> 		commit{dir=MockDirWrapper(org.apache.lucene.store.NIOFSDirectory@/mnt/ssd/jenkins/workspace/Lucene-Solr-trunk-Linux/solr/build/solr-core/test/J0/index3246332463tmp lockFactory=org.apache.lucene.store.NativeFSLockFactory@44f64b95),segFN=segments_1,generation=1,filenames=[segments_1]
[junit4:junit4]   2> 		commit{dir=MockDirWrapper(org.apache.lucene.store.NIOFSDirectory@/mnt/ssd/jenkins/workspace/Lucene-Solr-trunk-Linux/solr/build/solr-core/test/J0/index3246332463tmp lockFactory=org.apache.lucene.store.NativeFSLockFactory@44f64b95),segFN=segments_2,generation=2,filenames=[segments_2]
[junit4:junit4]   2> 16502 T70 C4 P42161 oasc.SolrDeletionPolicy.updateCommits newest commit = 2[segments_2]
[junit4:junit4]   2> 16503 T70 C4 P42161 oass.SolrIndexSearcher.<init> Opening Searcher@63c51cb8 realtime
[junit4:junit4]   2> 16504 T70 C4 P42161 oasu.DirectUpdateHandler2.commit end_commit_flush
[junit4:junit4]   2> 16504 T70 C4 P42161 /update {version=2&openSearcher=false&wt=javabin&softCommit=false&commit=true&commit_end_point=true&waitSearcher=true} {commit=} 0 14
[junit4:junit4]   2> 16523 T123 C3 P33731 oash.ReplicationHandler.inform Commits will be reserved for  10000
[junit4:junit4]   2> 16523 T123 C3 P33731 oascsi.HttpClientUtil.createClient Creating new http client, config:connTimeout=5000&socketTimeout=20000&allowCompression=false&maxConnections=10000&maxConnectionsPerHost=10000
[junit4:junit4]   2> 16529 T123 C3 P33731 oash.SnapPuller.<init>  No value set for 'pollInterval'. Timer Task not started.
[junit4:junit4]   2> 16542 T69 C4 P42161 oash.ReplicationHandler.inform Commits will be reserved for  10000
[junit4:junit4]   2> 16543 T69 C4 P42161 REQ /replication {command=indexversion&version=2&qt=/replication&wt=javabin} status=0 QTime=12 
[junit4:junit4]   2> 16544 T123 C3 P33731 oash.SnapPuller.fetchLatestIndex Master's generation: 2
[junit4:junit4]   2> 16545 T123 C3 P33731 oash.SnapPuller.fetchLatestIndex Slave's generation: 1
[junit4:junit4]   2> 16545 T123 C3 P33731 oash.SnapPuller.fetchLatestIndex Starting replication process
[junit4:junit4]   2> 16549 T70 C4 P42161 REQ /replication {command=filelist&generation=2&version=2&qt=/replication&wt=javabin} status=0 QTime=1 
[junit4:junit4]   2> 16550 T123 C3 P33731 oash.SnapPuller.fetchLatestIndex Number of files in latest index in master: 1
[junit4:junit4]   2> 16552 T123 C3 P33731 oasc.CachingDirectoryFactory.get return new directory for /mnt/ssd/jenkins/workspace/Lucene-Solr-trunk-Linux/solr/build/solr-core/test/J0/./solrtest-UnloadDistributedZkTest-1363702663669/1363702674511unloadcollection1_2n/index.20130319091800202 forceNew: false
[junit4:junit4]   2> 16552 T123 C3 P33731 oash.SnapPuller.fetchLatestIndex Starting download to MockDirWrapper(org.apache.lucene.store.RAMDirectory@f96e053 lockFactory=org.apache.lucene.store.NativeFSLockFactory@792e79fc) fullCopy=false
[junit4:junit4]   2> 16560 T68 C4 P42161 REQ /replication {command=filecontent&generation=2&checksum=true&wt=filestream&qt=/replication&file=segments_2} status=0 QTime=2 
[junit4:junit4]   2> 16565 T123 C3 P33731 oash.SnapPuller.fetchLatestIndex Total time taken for download : 0 secs
[junit4:junit4]   2> 16574 T123 C3 P33731 oasu.DefaultSolrCoreState.newIndexWriter Creating new IndexWriter...
[junit4:junit4]   2> 16575 T123 C3 P33731 oasu.DefaultSolrCoreState.newIndexWriter Waiting until IndexWriter is unused... core=unloadcollection2
[junit4:junit4]   2> 16627 T123 C3 P33731 oasc.SolrDeletionPolicy.onInit SolrDeletionPolicy.onInit: commits:num=2
[junit4:junit4]   2> 		commit{dir=MockDirWrapper(org.apache.lucene.store.NIOFSDirectory@/mnt/ssd/jenkins/workspace/Lucene-Solr-trunk-Linux/solr/build/solr-core/test/J0/index3246332464tmp lockFactory=org.apache.lucene.store.NativeFSLockFactory@3e9d786c),segFN=segments_1,generation=1,filenames=[segments_1]
[junit4:junit4]   2> 		commit{dir=MockDirWrapper(org.apache.lucene.store.NIOFSDirectory@/mnt/ssd/jenkins/workspace/Lucene-Solr-trunk-Linux/solr/build/solr-core/test/J0/index3246332464tmp lockFactory=org.apache.lucene.store.NativeFSLockFactory@3e9d786c),segFN=segments_2,generation=2,filenames=[segments_2]
[junit4:junit4]   2> 16628 T123 C3 P33731 oasc.SolrDeletionPolicy.updateCommits newest commit = 2[segments_2]
[junit4:junit4]   2> 16629 T123 C3 P33731 oasu.DefaultSolrCoreState.newIndexWriter New IndexWriter is ready to be used.
[junit4:junit4]   2> 16630 T123 C3 P33731 oass.SolrIndexSearcher.<init> Opening Searcher@688a304f main
[junit4:junit4]   2> 16631 T122 oasc.SolrCore.registerSearcher [unloadcollection2] Registered new searcher Searcher@688a304f main{StandardDirectoryReader(segments_2:1:nrt)}
[junit4:junit4]   2> 16632 T123 C3 P33731 oasc.RecoveryStrategy.replay No replay needed. core=unloadcollection2
[junit4:junit4]   2> 16633 T123 C3 P33731 oasc.RecoveryStrategy.doRecovery Replication Recovery was successful - registering as Active. core=unloadcollection2
[junit4:junit4]   2> 16633 T123 C3 P33731 oasc.ZkController.publish publishing core=unloadcollection2 state=active
[junit4:junit4]   2> 16633 T123 C3 P33731 oasc.ZkController.publish numShards not found on descriptor - reading it from system property
[junit4:junit4]   2> 16636 T123 C3 P33731 oasc.RecoveryStrategy.doRecovery Finished recovery process. core=unloadcollection2
[junit4:junit4]   2> 16832 T58 oascc.ZkStateReader.updateClusterState Updating cloud state from ZooKeeper... 
[junit4:junit4]   2> 16834 T58 oasc.Overseer$ClusterStateUpdater.updateState Update state numShards=2 message={
[junit4:junit4]   2> 	  "core_node_name":"127.0.0.1:33731__unloadcollection2",
[junit4:junit4]   2> 	  "numShards":"2",
[junit4:junit4]   2> 	  "core":"unloadcollection2",
[junit4:junit4]   2> 	  "collection":"unloadcollection",
[junit4:junit4]   2> 	  "roles":null,
[junit4:junit4]   2> 	  "node_name":"127.0.0.1:33731_",
[junit4:junit4]   2> 	  "base_url":"http://127.0.0.1:33731",
[junit4:junit4]   2> 	  "operation":"state",
[junit4:junit4]   2> 	  "state":"active",
[junit4:junit4]   2> 	  "shard":"shard1"}
[junit4:junit4]   2> 16839 T89 oascc.ZkStateReader$2.process A cluster state change: WatchedEvent state:SyncConnected type:NodeDataChanged path:/clusterstate.json, has occurred - updating... (live nodes size: 5)
[junit4:junit4]   2> 16839 T121 oascc.ZkStateReader$2.process A cluster state change: WatchedEvent state:SyncConnected type:NodeDataChanged path:/clusterstate.json, has occurred - updating... (live nodes size: 5)
[junit4:junit4]   2> 16840 T57 oascc.ZkStateReader$2.process A cluster state change: WatchedEvent state:SyncConnected type:NodeDataChanged path:/clusterstate.json, has occurred - updating... (live nodes size: 5)
[junit4:junit4]   2> 16840 T117 oascc.ZkStateReader$2.process A cluster state change: WatchedEvent state:SyncConnected type:NodeDataChanged path:/clusterstate.json, has occurred - updating... (live nodes size: 5)
[junit4:junit4]   2> 16840 T75 oascc.ZkStateReader$2.process A cluster state change: WatchedEvent state:SyncConnected type:NodeDataChanged path:/clusterstate.json, has occurred - updating... (live nodes size: 5)
[junit4:junit4]   2> 16840 T103 oascc.ZkStateReader$2.process A cluster state change: WatchedEvent state:SyncConnected type:NodeDataChanged path:/clusterstate.json, has occurred - updating... (live nodes size: 5)
[junit4:junit4]   2> 16840 T62 oascc.ZkStateReader$2.process A cluster state change: WatchedEvent state:SyncConnected type:NodeDataChanged path:/clusterstate.json, has occurred - updating... (live nodes size: 5)
[junit4:junit4]   2> 17473 T34 oascc.ZkStateReader.updateClusterState Updating cloud state from ZooKeeper... 
[junit4:junit4]   2> 17475 T34 oasc.AbstractDistribZkTestBase.waitForRecoveriesToFinish Recoveries finished - collection: unloadcollection
[junit4:junit4]   2> 17476 T34 oascsi.HttpClientUtil.createClient Creating new http client, config:maxConnections=128&maxConnectionsPerHost=32&followRedirects=false
[junit4:junit4]   2>  C3_STATE=coll:unloadcollection core:unloadcollection2 props:{core=unloadcollection2, collection=unloadcollection, node_name=127.0.0.1:33731_, base_url=http://127.0.0.1:33731, state=active, shard=shard1}
[junit4:junit4]   2> 17536 T83 C3 P33731 /update {version=2&distrib.from=http://127.0.0.1:42161/unloadcollection1/&wt=javabin&update.distrib=FROMLEADER} {add=[6 (1429945902596882432)]} 0 4
[junit4:junit4]   2> 17537 T71 C4 P42161 /update {version=2&wt=javabin} {add=[6 (1429945902596882432)]} 0 40
[junit4:junit4]   2> 17552 T85 C3 P33731 /update {version=2&distrib.from=http://127.0.0.1:42161/unloadcollection1/&wt=javabin&update.distrib=FROMLEADER} {add=[7 (1429945902633582592)]} 0 4
[junit4:junit4]   2> 17553 T69 C4 P42161 /update {version=2&wt=javabin} {add=[7 (1429945902633582592)]} 0 13
[junit4:junit4]   2> 17563 T82 C3 P33731 /update {version=2&distrib.from=http://127.0.0.1:42161/unloadcollection1/&wt=javabin&update.distrib=FROMLEADER} {add=[8 (1429945902649311232)]} 0 2
[junit4:junit4]   2> 17564 T70 C4 P42161 /update {version=2&wt=javabin} {add=[8 (1429945902649311232)]} 0 8
[junit4:junit4]   2> 17567 T68 C4 P42161 oasu.DirectUpdateHandler2.commit start commit{,optimize=false,openSearcher=true,waitSearcher=true,expungeDeletes=false,softCommit=false,prepareCommit=false}
[junit4:junit4]   2> 17602 T68 C4 P42161 oasc.SolrDeletionPolicy.onCommit SolrDeletionPolicy.onCommit: commits:num=2
[junit4:junit4]   2> 		commit{dir=MockDirWrapper(org.apache.lucene.store.NIOFSDirectory@/mnt/ssd/jenkins/workspace/Lucene-Solr-trunk-Linux/solr/build/solr-core/test/J0/index3246332463tmp lockFactory=org.apache.lucene.store.NativeFSLockFactory@44f64b95),segFN=segments_2,generation=2,filenames=[segments_2]
[junit4:junit4]   2> 		commit{dir=MockDirWrapper(org.apache.lucene.store.NIOFSDirectory@/mnt/ssd/jenkins/workspace/Lucene-Solr-trunk-Linux/solr/build/solr-core/test/J0/index3246332463tmp lockFactory=org.apache.lucene.store.NativeFSLockFactory@44f64b95),segFN=segments_3,generation=3,filenames=[_0_Memory_0.ram, _0.nvd, _0_Direct_0.tim, _0_Asserting_0.dvd, _0_NestedPulsing_0.tim, _0_Direct_0.tip, _0_Direct_0.doc, _0_Lucene41_0.tip, _0_NestedPulsing_0.doc, _0.fdx, _0_NestedPulsing_0.tip, _0.si, _0_Asserting_0.dvm, _0.fdt, _0_Lucene41_0.tim, _0_Lucene41_0.pos, _0.nvm, _0_Lucene41_0.doc, _0_NestedPulsing_0.pos, segments_3, _0_Direct_0.pos, _0.fnm]
[junit4:junit4]   2> 17602 T68 C4 P42161 oasc.SolrDeletionPolicy.updateCommits newest commit = 3[_0_Memory_0.ram, _0.nvd, _0_Direct_0.tim, _0_Asserting_0.dvd, _0_NestedPulsing_0.tim, _0_Direct_0.tip, _0_Direct_0.doc, _0_Lucene41_0.tip, _0_NestedPulsing_0.doc, _0.fdx, _0_NestedPulsing_0.tip, _0.si, _0_Asserting_0.dvm, _0.fdt, _0_Lucene41_0.tim, _0_Lucene41_0.pos, _0.nvm, _0_Lucene41_0.doc, _0_NestedPulsing_0.pos, segments_3, _0_Direct_0.pos, _0.fnm]
[junit4:junit4]   2> 17619 T68 C4 P42161 oass.SolrIndexSearcher.<init> Opening Searcher@431a46df main
[junit4:junit4]   2> 17620 T68 C4 P42161 oasu.DirectUpdateHandler2.commit end_commit_flush
[junit4:junit4]   2> 17621 T119 oasc.SolrCore.registerSearcher [unloadcollection1] Registered new searcher Searcher@431a46df main{StandardDirectoryReader(segments_3:3:nrt _0(5.0):C3)}
[junit4:junit4]   2> 17622 T68 C4 P42161 oasu.SolrCmdDistributor.distribCommit Distrib commit to:[StdNode: http://127.0.0.1:33731/unloadcollection2/] params:commit_end_point=true&commit=true&softCommit=false&waitSearcher=true&expungeDeletes=false
[junit4:junit4]   2> 17625 T84 C3 P33731 oasu.DirectUpdateHandler2.commit start commit{,optimize=false,openSearcher=true,waitSearcher=true,expungeDeletes=false,softCommit=false,prepareCommit=false}
[junit4:junit4]   2> 17652 T84 C3 P33731 oasc.SolrDeletionPolicy.onCommit SolrDeletionPolicy.onCommit: commits:num=2
[junit4:junit4]   2> 		commit{dir=MockDirWrapper(org.apache.lucene.store.NIOFSDirectory@/mnt/ssd/jenkins/workspace/Lucene-Solr-trunk-Linux/solr/build/solr-core/test/J0/index3246332464tmp lockFactory=org.apache.lucene.store.NativeFSLockFactory@3e9d786c),segFN=segments_2,generation=2,filenames=[segments_2]
[junit4:junit4]   2> 		commit{dir=MockDirWrapper(org.apache.lucene.store.NIOFSDirectory@/mnt/ssd/jenkins/workspace/Lucene-Solr-trunk-Linux/solr/build/solr-core/test/J0/index3246332464tmp lockFactory=org.apache.lucene.store.NativeFSLockFactory@3e9d786c),segFN=segments_3,generation=3,filenames=[_0_Memory_0.ram, _0.nvd, _0_Direct_0.tim, _0_Asserting_0.dvd, _0_NestedPulsing_0.tim, _0_Direct_0.tip, _0_Direct_0.doc, _0_Lucene41_0.tip, _0_NestedPulsing_0.doc, _0.fdx, _0_NestedPulsing_0.tip, _0.si, _0_Asserting_0.dvm, _0.fdt, _0_Lucene41_0.tim, _0_Lucene41_0.pos, _0.nvm, _0_Lucene41_0.doc, _0_NestedPulsing_0.pos, segments_3, _0_Direct_0.pos, _0.fnm]
[junit4:junit4]   2> 17652 T84 C3 P33731 oasc.SolrDeletionPolicy.updateCommits newest commit = 3[_0_Memory_0.ram, _0.nvd, _0_Direct_0.tim, _0_Asserting_0.dvd, _0_NestedPulsing_0.tim, _0_Direct_0.tip, _0_Direct_0.doc, _0_Lucene41_0.tip, _0_NestedPulsing_0.doc, _0.fdx, _0_NestedPulsing_0.tip, _0.si, _0_Asserting_0.dvm, _0.fdt, _0_Lucene41_0.tim, _0_Lucene41_0.pos, _0.nvm, _0_Lucene41_0.doc, _0_NestedPulsing_0.pos, segments_3, _0_Direct_0.pos, _0.fnm]
[junit4:junit4]   2> 17658 T84 C3 P33731 oass.SolrIndexSearcher.<init> Opening Searcher@3d029d45 main
[junit4:junit4]   2> 17658 T84 C3 P33731 oasu.DirectUpdateHandler2.commit end_commit_flush
[junit4:junit4]   2> 17660 T122 oasc.SolrCore.registerSearcher [unloadcollection2] Registered new searcher Searcher@3d029d45 main{StandardDirectoryReader(segments_3:3:nrt _0(5.0):C3)}
[junit4:junit4]   2> 17661 T84 C3 P33731 /update {version=2&wt=javabin&softCommit=false&commit=true&commit_end_point=true&expungeDeletes=false&waitSearcher=true} {commit=} 0 36
[junit4:junit4]   2> 17662 T68 C4 P42161 /update {version=2&wt=javabin&softCommit=false&commit=true&waitSearcher=true} {commit=} 0 95
[junit4:junit4]   2> 17663 T34 oascsi.HttpClientUtil.createClient Creating new http client, config:maxConnections=128&maxConnectionsPerHost=32&followRedirects=false
[junit4:junit4]   2> 17670 T99 oasc.CoreContainer.create Creating SolrCore 'unloadcollection3' using instanceDir: /mnt/ssd/jenkins/workspace/Lucene-Solr-trunk-Linux/solr/build/solr-core/test/J0/./org.apache.solr.cloud.UnloadDistributedZkTest-jetty3-1363702669207/unloadcollection3
[junit4:junit4]   2> 17671 T99 oasc.ZkController.createCollectionZkNode Check for collection zkNode:unloadcollection
[junit4:junit4]   2> 17672 T99 oasc.ZkController.createCollectionZkNode Collection zkNode exists
[junit4:junit4]   2> 17672 T99 oasc.ZkController.readConfigName Load collection config from:/collections/unloadcollection
[junit4:junit4]   2> 17674 T99 oasc.SolrResourceLoader.<init> new SolrResourceLoader for directory: '/mnt/ssd/jenkins/workspace/Lucene-Solr-trunk-Linux/solr/build/solr-core/test/J0/./org.apache.solr.cloud.UnloadDistributedZkTest-jetty3-1363702669207/unloadcollection3/'
[junit4:junit4]   2> 17727 T99 oasc.SolrConfig.<init> Using Lucene MatchVersion: LUCENE_50
[junit4:junit4]   2> 17767 T99 oasc.SolrConfig.<init> Loaded SolrConfig: solrconfig.xml
[junit4:junit4]   2> 17769 T99 oass.IndexSchema.readSchema Reading Solr Schema
[junit4:junit4]   2> 17784 T99 oass.IndexSchema.readSchema Schema name=test
[junit4:junit4]   2> 18118 T99 oass.OpenExchangeRatesOrgProvider.init Initialized with rates=open-exchange-rates.json, refreshInterval=1440.
[junit4:junit4]   2> 18126 T99 oass.IndexSchema.readSchema default search field in schema is text
[junit4:junit4]   2> 18129 T99 oass.IndexSchema.readSchema unique key field: id
[junit4:junit4]   2> 18156 T99 oass.FileExchangeRateProvider.reload Reloading exchange rates from file currency.xml
[junit4:junit4]   2> 18160 T99 oass.FileExchangeRateProvider.reload Reloading exchange rates from file currency.xml
[junit4:junit4]   2> 18164 T99 oass.OpenExchangeRatesOrgProvider.reload Reloading exchange rates from open-exchange-rates.json
[junit4:junit4]   2> 18166 T99 oass.OpenExchangeRatesOrgProvider$OpenExchangeRates.<init> WARNING Unknown key IMPORTANT NOTE
[junit4:junit4]   2> 18167 T99 oass.OpenExchangeRatesOrgProvider$OpenExchangeRates.<init> WARNING Expected key, got STRING
[junit4:junit4]   2> 18167 T99 oass.OpenExchangeRatesOrgProvider.reload Reloading exchange rates from open-exchange-rates.json
[junit4:junit4]   2> 18169 T99 oass.OpenExchangeRatesOrgProvider$OpenExchangeRates.<init> WARNING Unknown key IMPORTANT NOTE
[junit4:junit4]   2> 18169 T99 oass.OpenExchangeRatesOrgProvider$OpenExchangeRates.<init> WARNING Expected key, got STRING
[junit4:junit4]   2> 18170 T99 oasc.SolrCore.initDirectoryFactory org.apache.solr.core.MockDirectoryFactory
[junit4:junit4]   2> 18170 T99 oasc.SolrCore.<init> [unloadcollection3] Opening new SolrCore at /mnt/ssd/jenkins/workspace/Lucene-Solr-trunk-Linux/solr/build/solr-core/test/J0/./org.apache.solr.cloud.UnloadDistributedZkTest-jetty3-1363702669207/unloadcollection3/, dataDir=/mnt/ssd/jenkins/workspace/Lucene-Solr-trunk-Linux/solr/build/solr-core/test/J0/./solrtest-UnloadDistributedZkTest-1363702663669/1363702681318unloadcollection_3n/
[junit4:junit4]   2> 18171 T99 oasc.JmxMonitoredMap.<init> JMX monitoring is enabled. Adding Solr mbeans to JMX Server: com.sun.jmx.mbeanserver.JmxMBeanServer@3a9ff9ea
[junit4:junit4]   2> 18171 T99 oasc.SolrCore.initDirectoryFactory org.apache.solr.core.MockDirectoryFactory
[junit4:junit4]   2> 18172 T99 oasc.CachingDirectoryFactory.get return new directory for /mnt/ssd/jenkins/workspace/Lucene-Solr-trunk-Linux/solr/build/solr-core/test/J0/./solrtest-UnloadDistributedZkTest-1363702663669/1363702681318unloadcollection_3n forceNew: false
[junit4:junit4]   2> 18173 T99 oasc.SolrCore.getNewIndexDir New index directory detected: old=null new=/mnt/ssd/jenkins/workspace/Lucene-Solr-trunk-Linux/solr/build/solr-core/test/J0/./solrtest-UnloadDistributedZkTest-1363702663669/1363702681318unloadcollection_3n/index/
[junit4:junit4]   2> 18173 T99 oasc.SolrCore.initIndex WARNING [unloadcollection3] Solr index directory '/mnt/ssd/jenkins/workspace/Lucene-Solr-trunk-Linux/solr/build/solr-core/test/J0/./solrtest-UnloadDistributedZkTest-1363702663669/1363702681318unloadcollection_3n/index' doesn't exist. Creating new index...
[junit4:junit4]   2> 18175 T99 oasc.CachingDirectoryFactory.get return new directory for /mnt/ssd/jenkins/workspace/Lucene-Solr-trunk-Linux/solr/build/solr-core/test/J0/./solrtest-UnloadDistributedZkTest-1363702663669/1363702681318unloadcollection_3n/index forceNew: false
[junit4:junit4]   2> 18178 T99 oasc.SolrDeletionPolicy.onCommit SolrDeletionPolicy.onCommit: commits:num=1
[junit4:junit4]   2> 		commit{dir=MockDirWrapper(org.apache.lucene.store.NIOFSDirectory@/mnt/ssd/jenkins/workspace/Lucene-Solr-trunk-Linux/solr/build/solr-core/test/J0/index3246332465tmp lockFactory=org.apache.lucene.store.NativeFSLockFactory@3290b690),segFN=segments_1,generation=1,filenames=[segments_1]
[junit4:junit4]   2> 18179 T99 oasc.SolrDeletionPolicy.updateCommits newest commit = 1[segments_1]
[junit4:junit4]   2> 18181 T99 oasup.UpdateRequestProcessorChain.init inserting DistributedUpdateProcessorFactory into updateRequestProcessorChain "dedupe"
[junit4:junit4]   2> 18182 T99 oasup.UpdateRequestProcessorChain.init inserting DistributedUpdateProcessorFactory into updateRequestProcessorChain "stored_sig"
[junit4:junit4]   2> 18183 T99 oasup.UpdateRequestProcessorChain.init inserting DistributedUpdateProcessorFactory into updateRequestProcessorChain "distrib-dup-test-chain-implicit"
[junit4:junit4]   2> 18183 T99 oasc.RequestHandlers.initHandlersFromConfig created standard: solr.StandardRequestHandler
[junit4:junit4]   2> 18184 T99 oasc.RequestHandlers.initHandlersFromConfig created /get: solr.RealTimeGetHandler
[junit4:junit4]   2> 18185 T99 oasc.RequestHandlers.initHandlersFromConfig adding lazy requestHandler: solr.ReplicationHandler
[junit4:junit4]   2> 18186 T99 oasc.RequestHandlers.initHandlersFromConfig created /replication: solr.ReplicationHandler
[junit4:junit4]   2> 18187 T99 oasc.RequestHandlers.initHandlersFromConfig created /update: solr.UpdateRequestHandler
[junit4:junit4]   2> 18187 T99 oasc.RequestHandlers.initHandlersFromConfig created /admin/: org.apache.solr.handler.admin.AdminHandlers
[junit4:junit4]   2> 18191 T99 oashl.XMLLoader.init xsltCacheLifetimeSeconds=60
[junit4:junit4]   2> 18196 T99 oass.SolrIndexSearcher.<init> Opening Searcher@e2c5eef main
[junit4:junit4]   2> 18196 T99 oasu.UpdateHandler.clearLog Clearing tlog files, tlogDir=/mnt/ssd/jenkins/workspace/Lucene-Solr-trunk-Linux/solr/build/solr-core/test/J0/./solrtest-UnloadDistributedZkTest-1363702663669/1363702681318unloadcollection_3n/tlog
[junit4:junit4]   2> 18197 T99 oasu.CommitTracker.<init> Hard AutoCommit: disabled
[junit4:junit4]   2> 18197 T99 oasu.CommitTracker.<init> Soft AutoCommit: disabled
[junit4:junit4]   2> 18203 T127 oasc.SolrCore.registerSearcher [unloadcollection3] Registered new searcher Searcher@e2c5eef main{StandardDirectoryReader(segments_1:1)}
[junit4:junit4]   2> 18206 T99 oasc.ZkController.publish publishing core=unloadcollection3 state=down
[junit4:junit4]   2> 18207 T99 oasc.ZkController.publish numShards not found on descriptor - reading it from system property
[junit4:junit4]   2> 18347 T58 oascc.ZkStateReader.updateClusterState Updating cloud state from ZooKeeper... 
[junit4:junit4]   2> 18348 T58 oasc.Overseer$ClusterStateUpdater.updateState Update state numShards=2 message={
[junit4:junit4]   2> 	  "core_node_name":null,
[junit4:junit4]   2> 	  "numShards":"2",
[junit4:junit4]   2> 	  "core":"unloadcollection3",
[junit4:junit4]   2> 	  "collection":"unloadcollection",
[junit4:junit4]   2> 	  "roles":null,
[junit4:junit4]   2> 	  "node_name":"127.0.0.1:48725_",
[junit4:junit4]   2> 	  "base_url":"http://127.0.0.1:48725",
[junit4:junit4]   2> 	  "operation":"state",
[junit4:junit4]   2> 	  "state":"down",
[junit4:junit4]   2> 	  "shard":null}
[junit4:junit4]   2> 18348 T58 oasc.Overseer$ClusterStateUpdater.updateState Collection already exists with numShards=1
[junit4:junit4]   2> 18349 T58 oasc.Overseer$ClusterStateUpdater.updateState Assigning new node to shard shard=shard1
[junit4:junit4]   2> 18354 T121 oascc.ZkStateReader$2.process A cluster state change: WatchedEvent state:SyncConnected type:NodeDataChanged path:/clusterstate.json, has occurred - updating... (live nodes size: 5)
[junit4:junit4]   2> 18355 T62 oascc.ZkStateReader$2.process A cluster state change: WatchedEvent state:SyncConnected type:NodeDataChanged path:/clusterstate.json, has occurred - updating... (live nodes size: 5)
[junit4:junit4]   2> 18355 T89 oascc.ZkStateReader$2.process A cluster state change: WatchedEvent state:SyncConnected type:NodeDataChanged path:/clusterstate.json, has occurred - updating... (live nodes size: 5)
[junit4:junit4]   2> 18355 T75 oascc.ZkStateReader$2.process A cluster state change: WatchedEvent state:SyncConnected type:NodeDataChanged path:/clusterstate.json, has occurred - updating... (live nodes size: 5)
[junit4:junit4]   2> 18355 T57 oascc.ZkStateReader$2.process A cluster state change: WatchedEvent state:SyncConnected type:NodeDataChanged path:/clusterstate.json, has occurred - updating... (live nodes size: 5)
[junit4:junit4]   2> 18355 T103 oascc.ZkStateReader$2.process A cluster state change: WatchedEvent state:SyncConnected type:NodeDataChanged path:/clusterstate.json, has occurred - updating... (live nodes size: 5)
[junit4:junit4]   2> 18355 T117 oascc.ZkStateReader$2.process A cluster state change: WatchedEvent state:SyncConnected type:NodeDataChanged path:/clusterstate.json, has occurred - updating... (live nodes size: 5)
[junit4:junit4]   2> 19209 T99 oasc.CoreContainer.registerCore registering core: unloadcollection3
[junit4:junit4]   2> 19209 T99 oasc.ZkController.register Register replica - core:unloadcollection3 address:http://127.0.0.1:48725 collection:unloadcollection shard:shard1
[junit4:junit4]   2> 19214 T99 oasc.ZkController.register We are http://127.0.0.1:48725/unloadcollection3/ and leader is http://127.0.0.1:42161/unloadcollection1/
[junit4:junit4]   2> 19214 T99 oasc.ZkController.register No LogReplay needed for core=unloadcollection3 baseURL=http://127.0.0.1:48725
[junit4:junit4]   2> 19214 T99 oasc.ZkController.checkRecovery Core needs to recover:unloadcollection3
[junit4:junit4]   2> 19215 T99 oasu.DefaultSolrCoreState.doRecovery Running recovery - first canceling any ongoing recovery
[junit4:junit4]   2> ASYNC  NEW_CORE C5 name=unloadcollection3 org.apache.solr.core.SolrCore@7c4024be url=http://127.0.0.1:48725/unloadcollection3 node=127.0.0.1:48725_ C5_STATE=coll:unloadcollection core:unloadcollection3 props:{core=unloadcollection3, collection=unloadcollection, node_name=127.0.0.1:48725_, base_url=http://127.0.0.1:48725, state=down}
[junit4:junit4]   2> 19215 T128 C5 P48725 oasc.RecoveryStrategy.run Starting recovery process.  core=unloadcollection3 recoveringAfterStartup=true
[junit4:junit4]   2> 19216 T128 C5 P48725 oasc.RecoveryStrategy.doRecovery ###### startupVersions=[]
[junit4:junit4]   2> 19216 T99 oascc.ZkStateReader.updateClusterState Updating cloud state from ZooKeeper... 
[junit4:junit4]   2> 19217 T128 C5 P48725 oasc.ZkController.publish publishing core=unloadcollection3 state=recovering
[junit4:junit4]   2> 19217 T128 C5 P48725 oasc.ZkController.publish numShards not found on descriptor - reading it from system property
[junit4:junit4]   2> 19218 T99 oasc.CoreContainer.persistFile Persisting cores config to /mnt/ssd/jenkins/workspace/Lucene-Solr-trunk-Linux/solr/build/solr-core/test/J0/./org.apache.solr.cloud.UnloadDistributedZkTest-jetty3-1363702669207/solr.xml
[junit4:junit4]   2> 19218 T128 C5 P48725 oascsi.HttpClientUtil.createClient Creating new http client, config:maxConnections=128&maxConnectionsPerHost=32&followRedirects=false
[junit4:junit4]   2> 19223 T99 oasc.SolrXMLSerializer.persistFile Persisting cores config to /mnt/ssd/jenkins/workspace/Lucene-Solr-trunk-Linux/solr/build/solr-core/test/J0/./org.apache.solr.cloud.UnloadDistributedZkTest-jetty3-1363702669207/solr.xml
[junit4:junit4]   2> 19224 T99 oass.SolrDispatchFilter.handleAdminRequest /admin/cores {version=2&collection=unloadcollection&name=unloadcollection3&wt=javabin&action=CREATE&dataDir=/mnt/ssd/jenkins/workspace/Lucene-Solr-trunk-Linux/solr/build/solr-core/test/J0/./solrtest-UnloadDistributedZkTest-1363702663669/1363702681318unloadcollection_3n} status=0 QTime=1554 
[junit4:junit4]   2> 19225 T34 oasc.AbstractDistribZkTestBase.waitForRecoveriesToFinish Wait for recoveries to finish - collection: unloadcollection failOnTimeout:true timeout (sec):230
[junit4:junit4]   2> 19226 T34 oascc.ZkStateReader.updateClusterState Updating cloud state from ZooKeeper... 
[junit4:junit4]   2> 19862 T58 oascc.ZkStateReader.updateClusterState Updating cloud state from ZooKeeper... 
[junit4:junit4]   2> 19863 T58 oasc.Overseer$ClusterStateUpdater.updateState Update state numShards=2 message={
[junit4:junit4]   2> 	  "core_node_name":"127.0.0.1:48725__unloadcollection3",
[junit4:junit4]   2> 	  "numShards":"2",
[junit4:junit4]   2> 	  "core":"unloadcollection3",
[junit4:junit4]   2> 	  "collection":"unloadcollection",
[junit4:junit4]   2> 	  "roles":null,
[junit4:junit4]   2> 	  "node_name":"127.0.0.1:48725_",
[junit4:junit4]   2> 	  "base_url":"http://127.0.0.1:48725",
[junit4:junit4]   2> 	  "operation":"state",
[junit4:junit4]   2> 	  "state":"recovering",
[junit4:junit4]   2> 	  "shard":"shard1"}
[junit4:junit4]   2> 19870 T103 oascc.ZkStateReader$2.process A cluster state change: WatchedEvent state:SyncConnected type:NodeDataChanged path:/clusterstate.json, has occurred - updating... (live nodes size: 5)
[junit4:junit4]   2> 19870 T117 oascc.ZkStateReader$2.process A cluster state change: WatchedEvent state:SyncConnected type:NodeDataChanged path:/clusterstate.json, has occurred - updating... (live nodes size: 5)
[junit4:junit4]   2> 19870 T57 oascc.ZkStateReader$2.process A cluster state change: WatchedEvent state:SyncConnected type:NodeDataChanged path:/clusterstate.json, has occurred - updating... (live nodes size: 5)
[junit4:junit4]   2> 19870 T89 oascc.ZkStateReader$2.process A cluster state change: WatchedEvent state:SyncConnected type:NodeDataChanged path:/clusterstate.json, has occurred - updating... (live nodes size: 5)
[junit4:junit4]   2> 19870 T121 oascc.ZkStateReader$2.process A cluster state change: WatchedEvent state:SyncConnected type:NodeDataChanged path:/clusterstate.json, has occurred - updating... (live nodes size: 5)
[junit4:junit4]   2> 19870 T62 oascc.ZkStateReader$2.process A cluster state change: WatchedEvent state:SyncConnected type:NodeDataChanged path:/clusterstate.json, has occurred - updating... (live nodes size: 5)
[junit4:junit4]   2> 19870 T75 oascc.ZkStateReader$2.process A cluster state change: WatchedEvent state:SyncConnected type:NodeDataChanged path:/clusterstate.json, has occurred - updating... (live nodes size: 5)
[junit4:junit4]   2> 20225 T71 oass.SolrDispatchFilter.handleAdminRequest /admin/cores {core=unloadcollection1&version=2&nodeName=127.0.0.1:48725_&coreNodeName=127.0.0.1:48725__unloadcollection3&wt=javabin&action=PREPRECOVERY&state=recovering&onlyIfLeader=true&checkLive=true} status=0 QTime=1001 
[junit4:junit4]   2> 20229 T34 oascc.ZkStateReader.updateClusterState Updating cloud state from ZooKeeper... 
[junit4:junit4]   2> 21231 T34 oascc.ZkStateReader.updateClusterState Updating cloud state from ZooKeeper... 
[junit4:junit4]   2>  C5_STATE=coll:unloadcollection core:unloadcollection3 props:{core=unloadcollection3, collection=unloadcollection, node_name=127.0.0.1:48725_, base_url=http://127.0.0.1:48725, state=recovering, shard=shard1}
[junit4:junit4]   2> 22226 T128 C5 P48725 oasc.RecoveryStrategy.doRecovery Attempting to PeerSync from http://127.0.0.1:42161/unloadcollection1/ core=unloadcollection3 - recoveringAfterStartup=true
[junit4:junit4]   2> 22226 T128 C5 P48725 oasu.PeerSync.sync PeerSync: core=unloadcollection3 url=http://127.0.0.1:48725 START replicas=[http://127.0.0.1:42161/unloadcollection1/] nUpdates=100
[junit4:junit4]   2> 22227 T128 C5 P48725 oasu.PeerSync.sync WARNING no frame of reference to tell of we've missed updates
[junit4:junit4]   2> 22227 T128 C5 P48725 oasc.RecoveryStrategy.doRecovery PeerSync Recovery was not successful - trying replication. core=unloadcollection3
[junit4:junit4]   2> 22228 T128 C5 P48725 oasc.RecoveryStrategy.doRecovery Starting Replication Recovery. core=unloadcollection3
[junit4:junit4]   2> 22228 T128 C5 P48725 oasc.RecoveryStrategy.doRecovery Begin buffering updates. core=unloadcollection3
[junit4:junit4]   2> 22228 T128 C5 P48725 oasu.UpdateLog.bufferUpdates Starting to buffer updates. FSUpdateLog{state=ACTIVE, tlog=null}
[junit4:junit4]   2> 22228 T128 C5 P48725 oasc.RecoveryStrategy.replicate Attempting to replicate from http://127.0.0.1:42161/unloadcollection1/. core=unloadcollection3
[junit4:junit4]   2> 22229 T128 C5 P48725 oascsi.HttpClientUtil.createClient Creating new http client, config:maxConnections=128&maxConnectionsPerHost=32&followRedirects=false
[junit4:junit4]   2> 22233 T71 C4 P42161 REQ /get {distrib=false&version=2&getVersions=100&wt=javabin&qt=/get} status=0 QTime=3 
[junit4:junit4]   2> 22233 T34 oascc.ZkStateReader.updateClusterState Updating cloud state from ZooKeeper... 
[junit4:junit4]   2> 22236 T68 C4 P42161 oasu.DirectUpdateHandler2.commit start commit{,optimize=false,openSearcher=false,waitSearcher=true,expungeDeletes=false,softCommit=false,prepareCommit=false}
[junit4:junit4]   2> 22242 T68 C4 P42161 oasc.SolrDeletionPolicy.onCommit SolrDeletionPolicy.onCommit: commits:num=3
[junit4:junit4]   2> 		commit{dir=MockDirWrapper(org.apache.lucene.store.NIOFSDirectory@/mnt/ssd/jenkins/workspace/Lucene-Solr-trunk-Linux/solr/build/solr-core/test/J0/index3246332463tmp lockFactory=org.apache.lucene.store.NativeFSLockFactory@44f64b95),segFN=segments_2,generation=2,filenames=[segments_2]
[junit4:junit4]   2> 		commit{dir=MockDirWrapper(org.apache.lucene.store.NIOFSDirectory@/mnt/ssd/jenkins/workspace/Lucene-Solr-trunk-Linux/solr/build/solr-core/test/J0/index3246332463tmp lockFactory=org.apache.lucene.store.NativeFSLockFactory@44f64b95),segFN=segments_3,generation=3,filenames=[_0_Memory_0.ram, _0.nvd, _0_Direct_0.tim, _0_Asserting_0.dvd, _0_NestedPulsing_0.tim, _0_Direct_0.tip, _0_Direct_0.doc, _0_Lucene41_0.tip, _0_NestedPulsing_0.doc, _0.fdx, _0_NestedPulsing_0.tip, _0.si, _0_Asserting_0.dvm, _0.fdt, _0_Lucene41_0.tim, _0_Lucene41_0.pos, _0.nvm, _0_Lucene41_0.doc, _0_NestedPulsing_0.pos, segments_3, _0_Direct_0.pos, _0.fnm]
[junit4:junit4]   2> 		commit{dir=MockDirWrapper(org.apache.lucene.store.NIOFSDirectory@/mnt/ssd/jenkins/workspace/Lucene-Solr-trunk-Linux/solr/build/solr-core/test/J0/index3246332463tmp lockFactory=org.apache.lucene.store.NativeFSLockFactory@44f64b95),segFN=segments_4,generation=4,filenames=[_0_Memory_0.ram, _0.nvd, _0_Direct_0.tim, _0_Asserting_0.dvd, _0_NestedPulsing_0.tim, _0_Direct_0.tip, _0_Direct_0.doc, _0_Lucene41_0.tip, _0_NestedPulsing_0.doc, _0.fdx, _0_NestedPulsing_0.tip, _0.si, _0_Asserting_0.dvm, _0.fdt, _0_Lucene41_0.tim, _0_Lucene41_0.pos, segments_4, _0.nvm, _0_Lucene41_0.doc, _0_NestedPulsing_0.pos, _0_Direct_0.pos, _0.fnm]
[junit4:junit4]   2> 22242 T68 C4 P42161 oasc.SolrDeletionPolicy.updateCommits newest commit = 4[_0_Memory_0.ram, _0.nvd, _0_Direct_0.tim, _0_Asserting_0.dvd, _0_NestedPulsing_0.tim, _0_Direct_0.tip, _0_Direct_0.doc, _0_Lucene41_0.tip, _0_NestedPulsing_0.doc, _0.fdx, _0_NestedPulsing_0.tip, _0.si, _0_Asserting_0.dvm, _0.fdt, _0_Lucene41_0.tim, _0_Lucene41_0.pos, segments_4, _0.nvm, _0_Lucene41_0.doc, _0_NestedPulsing_0.pos, _0_Direct_0.pos, _0.fnm]
[junit4:junit4]   2> 22243 T68 C4 P42161 oasu.DirectUpdateHandler2.commit end_commit_flush
[junit4:junit4]   2> 22243 T68 C4 P42161 /update {version=2&openSearcher=false&wt=javabin&softCommit=false&commit=true&commit_end_point=true&waitSearcher=true} {commit=} 0 7
[junit4:junit4]   2> 22244 T128 C5 P48725 oash.ReplicationHandler.inform Commits will be reserved for  10000
[junit4:junit4]   2> 22245 T128 C5 P48725 oash.SnapPuller.<init>  No value set for 'pollInterval'. Timer Task not started.
[junit4:junit4]   2> 22248 T70 C4 P42161 REQ /replication {command=indexversion&version=2&qt=/replication&wt=javabin} status=0 QTime=0 
[junit4:junit4]   2> 22249 T128 C5 P48725 oash.SnapPuller.fetchLatestIndex Master's generation: 4
[junit4:junit4]   2> 22249 T128 C5 P48725 oash.SnapPuller.fetchLatestIndex Slave's generation: 1
[junit4:junit4]   2> 22249 T128 C5 P48725 oash.SnapPuller.fetchLatestIndex Starting replication process
[junit4:junit4]   2> 22253 T71 C4 P42161 REQ /replication {command=filelist&generation=4&version=2&qt=/replication&wt=javabin} status=0 QTime=1 
[junit4:junit4]   2> 22254 T128 C5 P48725 oash.SnapPuller.fetchLatestIndex Number of files in latest index in master: 22
[junit4:junit4]   2> 22255 T128 C5 P48725 oasc.CachingDirectoryFactory.get return new directory for /mnt/ssd/jenkins/workspace/Lucene-Solr-trunk-Linux/solr/build/solr-core/test/J0/./solrtest-UnloadDistributedZkTest-1363702663669/1363702681318unloadcollection_3n/index.20130319091805906 forceNew: false
[junit4:junit4]   2> 22257 T128 C5 P48725 oash.SnapPuller.fetchLatestIndex Starting download to MockDirWrapper(org.apache.lucene.store.RAMDirectory@3d1fd636 lockFactory=org.apache.lucene.store.NativeFSLockFactory@13ea23b7) fullCopy=false
[junit4:junit4]   2> 22261 T68 C4 P42161 REQ /replication {command=filecontent&generation=4&checksum=true&wt=filestream&qt=/replication&file=_0_Memory_0.ram} status=0 QTime=0 
[junit4:junit4]   2> 22265 T69 C4 P42161 REQ /replication {command=filecontent&generation=4&checksum=true&wt=filestream&qt=/replication&file=_0_Asserting_0.dvd} status=0 QTime=0 
[junit4:junit4]   2> 22269 T70 C4 P42161 REQ /replication {command=filecontent&generation=4&checksum=true&wt=filestream&qt=/replication&file=_0_Direct_0.tim} status=0 QTime=0 
[junit4:junit4]   2> 22273 T71 C4 P42161 REQ /replication {command=filecontent&generation=4&checksum=true&wt=filestream&qt=/replication&file=_0.nvd} status=0 QTime=0 
[junit4:junit4]   2> 22277 T68 C4 P42161 REQ /replication {command=filecontent&generation=4&checksum=true&wt=filestream&qt=/replication&file=_0_NestedPulsing_0.tim} status=0 QTime=0 
[junit4:junit4]   2> 22281 T69 C4 P42161 REQ /replication {command=filecontent&generation=4&checksum=true&wt=filestream&qt=/replication&file=_0_Direct_0.tip} status=0 QTime=0 
[junit4:junit4]   2> 22286 T70 C4 P42161 REQ /replication {command=filecontent&generation=4&checksum=true&wt=filestream&qt=/replication&file=_0_Direct_0.doc} status=0 QTime=0 
[junit4:junit4]   2> 22290 T71 C4 P42161 REQ /replication {command=filecontent&generation=4&checksum=true&wt=filestream&qt=/replication&file=_0_NestedPulsing_0.doc} status=0 QTime=0 
[junit4:junit4]   2> 22295 T68 C4 P42161 REQ /replication {command=filecontent&generation=4&checksum=true&wt=filestream&qt=/replication&file=_0_Lucene41_0.tip} status=0 QTime=1 
[junit4:junit4]   2> 22299 T69 C4 P42161 REQ /replication {command=filecontent&generation=4&checksum=true&wt=filestream&qt=/replication&file=_0.fdx} status=0 QTime=0 
[junit4:junit4]   2> 22303 T70 C4 P42161 REQ /replication {command=filecontent&generation=4&checksum=true&wt=filestream&qt=/replication&file=_0_NestedPulsing_0.tip} status=0 QTime=0 
[junit4:junit4]   2> 22307 T71 C4 P42161 REQ /replication {command=filecontent&generation=4&checksum=true&wt=filestream&qt=/replication&file=_0.si} status=0 QTime=0 
[junit4:junit4]   2> 22311 T68 C4 P42161 REQ /replication {command=filecontent&generation=4&checksum=true&wt=filestream&qt=/replication&file=_0.fdt} status=0 QTime=0 
[junit4:junit4]   2> 22315 T69 C4 P42161 REQ /replication {command=filecontent&generation=4&checksum=true&wt=filestream&qt=/replication&file=_0_Asserting_0.dvm} status=0 QTime=0 
[junit4:junit4]   2> 22319 T70 C4 P42161 REQ /replication {command=filecontent&generation=4&checksum=true&wt=filestream&qt=/replication&file=_0_Lucene41_0.tim} status=0 QTime=0 
[junit4:junit4]   2> 22323 T71 C4 P42161 REQ /replication {command=filecontent&generation=4&checksum=true&wt=filestream&qt=/replication&file=segments_4} status=0 QTime=0 
[junit4:junit4]   2> 22328 T68 C4 P42161 REQ /replication {command=filecontent&generation=4&checksum=true&wt=filestream&qt=/replication&file=_0_Lucene41_0.pos} status=0 QTime=1 
[junit4:junit4]   2> 22332 T69 C4 P42161 REQ /replication {command=filecontent&generation=4&checksum=true&wt=filestream&qt=/replication&file=_0.nvm} status=0 QTime=0 
[junit4:junit4]   2> 22337 T70 C4 P42161 REQ /replication {command=filecontent&generation=4&checksum=true&wt=filestream&qt=/replication&file=_0_NestedPulsing_0.pos} status=0 QTime=0 
[junit4:junit4]   2> 22391 T71 C4 P42161 REQ /replication {command=filecontent&generation=4&checksum=true&wt=filestream&qt=/replication&file=_0_Lucene41_0.doc} status=0 QTime=0 
[junit4:junit4]   2> 22396 T68 C4 P42161 REQ /replication {command=filecontent&generation=4&checksum=true&wt=filestream&qt=/replication&file=_0.fnm} status=0 QTime=0 
[junit4:junit4]   2> 22401 T69 C4 P42161 REQ /replication {command=filecontent&generation=4&checksum=true&wt=filestream&qt=/replication&file=_0_Direct_0.pos} status=0 QTime=1 
[junit4:junit4]   2> 22402 T128 C5 P48725 oash.SnapPuller.fetchLatestIndex Total time taken for download : 0 secs
[junit4:junit4]   2> 22409 T128 C5 P48725 oasu.DefaultSolrCoreState.newIndexWriter Creating new IndexWriter...
[junit4:junit4]   2> 22409 T128 C5 P48725 oasu.DefaultSolrCoreState.newIndexWriter Waiting until IndexWriter is unused... core=unloadcollection3
[junit4:junit4]   2> 22415 T128 C5 P48725 oasc.SolrDeletionPolicy.onInit SolrDeletionPolicy.onInit: commits:num=2
[junit4:junit4]   2> 		commit{dir=MockDirWrapper(org.apache.lucene.store.NIOFSDirectory@/mnt/ssd/jenkins/workspace/Lucene-Solr-trunk-Linux/solr/build/solr-core/test/J0/index3246332465tmp lockFactory=org.apache.lucene.store.NativeFSLockFactory@3290b690),segFN=segments_1,generation=1,filenames=[segments_1]
[junit4:junit4]   2> 		commit{dir=MockDirWrapper(org.apache.lucene.store.NIOFSDirectory@/mnt/ssd/jenkins/workspace/Lucene-Solr-trunk-Linux/solr/build/solr-core/test/J0/index3246332465tmp lockFactory=org.apache.lucene.store.NativeFSLockFactory@3290b690),segFN=segments_4,generation=4,filenames=[_0_Memory_0.ram, _0.nvd, _0_Direct_0.tim, _0_Asserting_0.dvd, _0_NestedPulsing_0.tim, _0_Direct_0.tip, _0_Direct_0.doc, _0_Lucene41_0.tip, _0_NestedPulsing_0.doc, _0.fdx, _0_NestedPulsing_0.tip, _0.si, _0.fdt, _0_Asserting_0.dvm, _0_Lucene41_0.tim, _0_Lucene41_0.pos, segments_4, _0.nvm, _0_NestedPulsing_0.pos, _0_Lucene41_0.doc, _0.fnm, _0_Direct_0.pos]
[junit4:junit4]   2> 22416 T128 C5 P48725 oasc.SolrDeletionPolicy.updateCommits newest commit = 4[_0_Memory_0.ram, _0.nvd, _0_Direct_0.tim, _0_Asserting_0.dvd, _0_NestedPulsing_0.tim, _0_Direct_0.tip, _0_Direct_0.doc, _0_Lucene41_0.tip, _0_NestedPulsing_0.doc, _0.fdx, _0_NestedPulsing_0.tip, _0.si, _0.fdt, _0_Asserting_0.dvm, _0_Lucene41_0.tim, _0_Lucene41_0.pos, segments_4, _0.nvm, _0_NestedPulsing_0.pos, _0_Lucene41_0.doc, _0.fnm, _0_Direct_0.pos]
[junit4:junit4]   2> 22416 T128 C5 P48725 oasu.DefaultSolrCoreState.newIndexWriter New IndexWriter is ready to be used.
[junit4:junit4]   2> 22423 T128 C5 P48725 oass.SolrIndexSearcher.<init> Opening Searcher@339aaff6 main
[junit4:junit4]   2> 22425 T127 oasc.SolrCore.registerSearcher [unloadcollection3] Registered new searcher Searcher@339aaff6 main{StandardDirectoryReader(segments_4:3:nrt _0(5.0):C3)}
[junit4:junit4]   2> 22425 T128 C5 P48725 oasc.RecoveryStrategy.replay No replay needed. core=unloadcollection3
[junit4:junit4]   2> 22426 T128 C5 P48725 oasc.RecoveryStrategy.doRecovery Replication Recovery was successful - registering as Active. core=unloadcollection3
[junit4:junit4]   2> 22426 T128 C5 P48725 oasc.ZkController.publish publishing core=unloadcollection3 state=active
[junit4:junit4]   2> 22426 T128 C5 P48725 oasc.ZkController.publish numShards not found on descriptor - reading it from system property
[junit4:junit4]   2> 22428 T128 C5 P48725 oasc.RecoveryStrategy.doRecovery Finished recovery process. core=unloadcollection3
[junit4:junit4]   2> 22880 T58 oascc.ZkStateReader.updateClusterState Updating cloud state from ZooKeeper... 
[junit4:junit4]   2> 22881 T58 oasc.Overseer$ClusterStateUpdater.updateState Update state numShards=2 message={
[junit4:junit4]   2> 	  "core_node_name":"127.0.0.1:48725__unloadcollection3",
[junit4:junit4]   2> 	  "numShards":"2",
[junit4:junit4]   2> 	  "core":"unloadcollection3",
[junit4:junit4]   2> 	  "collection":"unloadcollection",
[junit4:junit4]   2> 	  "roles":null,
[junit4:junit4]   2> 	  "node_name":"127.0.0.1:48725_",
[junit4:junit4]   2> 	  "base_url":"http://127.0.0.1:48725",
[junit4:junit4]   2> 	  "operation":"state",
[junit4:junit4]   2> 	  "state":"active",
[junit4:junit4]   2> 	  "shard":"shard1"}
[junit4:junit4]   2> 22902 T57 oascc.ZkStateReader$2.process A cluster state change: WatchedEvent state:SyncConnected type:NodeDataChanged path:/clusterstate.json, has occurred - updating... (live nodes size: 5)
[junit4:junit4]   2> 22902 T117 oascc.ZkStateReader$2.process A cluster state change: WatchedEvent state:SyncConnected type:NodeDataChanged path:/clusterstate.json, has occurred - updating... (live nodes size: 5)
[junit4:junit4]   2> 22903 T121 oascc.ZkStateReader$2.process A cluster state change: WatchedEvent state:SyncConnected type:NodeDataChanged path:/clusterstate.json, has occurred - updating... (live nodes size: 5)
[junit4:junit4]   2> 22902 T62 oascc.ZkStateReader$2.process A cluster state change: WatchedEvent state:SyncConnected type:NodeDataChanged path:/clusterstate.json, has occurred - updating... (live nodes size: 5)
[junit4:junit4]   2> 22902 T89 oascc.ZkStateReader$2.process A cluster state change: WatchedEvent state:SyncConnected type:NodeDataChanged path:/clusterstate.json, has occurred - updating... (live nodes size: 5)
[junit4:junit4]   2> 22902 T75 oascc.ZkStateReader$2.process A cluster state change: WatchedEvent state:SyncConnected type:NodeDataChanged path:/clusterstate.json, has occurred - updating... (live nodes size: 5)
[junit4:junit4]   2> 22902 T103 oascc.ZkStateReader$2.process A cluster state change: WatchedEvent state:SyncConnected type:NodeDataChanged path:/clusterstate.json, has occurred - updating... (live nodes size: 5)
[junit4:junit4]   2> 23236 T34 oascc.ZkStateReader.updateClusterState Updating cloud state from ZooKeeper... 
[junit4:junit4]   2> 23237 T34 oasc.AbstractDistribZkTestBase.waitForRecoveriesToFinish Recoveries finished - collection: unloadcollection
[junit4:junit4]   2> 23238 T34 oascsi.HttpClientUtil.createClient Creating new http client, config:maxConnections=128&maxConnectionsPerHost=32&followRedirects=false
[junit4:junit4]   2> 23266 T83 C3 P33731 /update {version=2&distrib.from=http://127.0.0.1:42161/unloadcollection1/&wt=javabin&update.distrib=FROMLEADER} {add=[20 (1429945908620951552)]} 0 8
[junit4:junit4]   2>  C5_STATE=coll:unloadcollection core:unloadcollection3 props:{core=unloadcollection3, collection=unloadcollection, node_name=127.0.0.1:48725_, base_url=http://127.0.0.1:48725, state=active, shard=shard1}
[junit4:junit4]   2> 23267 T99 C5 P48725 /update {version=2&distrib.from=http://127.0.0.1:42161/unloadcollection1/&wt=javabin&update.distrib=FROMLEADER} {add=[20 (1429945908620951552)]} 0 10
[junit4:junit4]   2> 23268 T70 C4 P42161 /update {version=2&distrib.from=http://127.0.0.1:48725/unloadcollection3/&wt=javabin&update.distrib=TOLEADER} {add=[20 (1429945908620951552)]} 0 17
[junit4:junit4]   2> 23269 T96 C5 P48725 /update {version=2&wt=javabin} {add=[20]} 0 22
[junit4:junit4]   2> 23284 T82 C3 P33731 /update {version=2&distrib.from=http://127.0.0.1:42161/unloadcollection1/&wt=javabin&update.distrib=FROMLEADER} {add=[21 (1429945908646117376)]} 0 4
[junit4:junit4]   2> 23284 T98 C5 P48725 /update {version=2&distrib.from=http://127.0.0.1:42161/unloadcollection1/&wt=javabin&update.distrib=FROMLEADER} {add=[21 (1429945908646117376)]} 0 4
[junit4:junit4]   2> 23285 T71 C4 P42161 /update {version=2&distrib.from=http://127.0.0.1:48725/unloadcollection3/&wt=javabin&update.distrib=TOLEADER} {add=[21 (1429945908646117376)]} 0 10
[junit4:junit4]   2> 23286 T97 C5 P48725 /update {version=2&wt=javabin} {add=[21]} 0 14
[junit4:junit4]   2> 23298 T98 C5 P48725 /update {version=2&distrib.from=http://127.0.0.1:42161/unloadcollection1/&wt=javabin&update.distrib=FROMLEADER} {add=[22 (1429945908663943168)]} 0 2
[junit4:junit4]   2> 23298 T83 C3 P33731 /update {version=2&distrib.from=http://127.0.0.1:42161/unloadcollection1/&wt=javabin&update.distrib=FROMLEADER} {add=[22 (1429945908663943168)]} 0 2
[junit4:junit4]   2> 23299 T68 C4 P42161 /update {version=2&distrib.from=http://127.0.0.1:48725/unloadcollection3/&wt=javabin&update.distrib=TOLEADER} {add=[22 (1429945908663943168)]} 0 7
[junit4:junit4]   2> 23300 T96 C5 P48725 /update {version=2&wt=javabin} {add=[22]} 0 11
[junit4:junit4]   2> 23313 T85 C3 P33731 /update {version=2&distrib.from=http://127.0.0.1:42161/unloadcollection1/&wt=javabin&update.distrib=FROMLEADER} {add=[23 (1429945908678623232)]} 0 3
[junit4:junit4]   2> 23313 T99 C5 P48725 /update {version=2&distrib.from=http://127.0.0.1:42161/unloadcollection1/&wt=javabin&update.distrib=FROMLEADER} {add=[23 (1429945908678623232)]} 0 3
[junit4:junit4]   2> 23314 T69 C4 P42161 /update {version=2&distrib.from=http://127.0.0.1:48725/unloadcollection3/&wt=javabin&update.distrib=TOLEADER} {add=[23 (1429945908678623232)]} 0 8
[junit4:junit4]   2> 23314 T97 C5 P48725 /update {version=2&wt=javabin} {add=[23]} 0 11
[junit4:junit4]   2> 23329 T84 C3 P33731 /update {version=2&distrib.from=http://127.0.0.1:42161/unloadcollection1/&wt=javabin&update.distrib=FROMLEADER} {add=[24 (1429945908693303296)]} 0 4
[junit4:junit4]   2> 23329 T96 C5 P48725 /update {version=2&distrib.from=http://127.0.0.1:42161/unloadcollection1/&wt=javabin&update.distrib=FROMLEADER} {add=[24 (1429945908693303296)]} 0 4
[junit4:junit4]   2> 23330 T70 C4 P42161 /update {version=2&distrib.from=http://127.0.0.1:48725/unloadcollection3/&wt=javabin&update.distrib=TOLEADER} {add=[24 (1429945908693303296)]} 0 10
[junit4:junit4]   2> 23331 T98 C5 P48725 /update {version=2&wt=javabin} {add=[24]} 0 14
[junit4:junit4]   2> 23344 T82 C3 P33731 /update {version=2&distrib.from=http://127.0.0.1:42161/unloadcollection1/&wt=javabin&update.distrib=FROMLEADER} {add=[25 (1429945908711129088)]} 0 2
[junit4:junit4]   2> 23345 T97 C5 P48725 /update {version=2&distrib.from=http://127.0.0.1:42161/unloadcollection1/&wt=javabin&update.distrib=FROMLEADER} {add=[25 (1429945908711129088)]} 0 3
[junit4:junit4]   2> 23346 T71 C4 P42161 /update {version=2&distrib.from=http://127.0.0.1:48725/unloadcollection3/&wt=javabin&update.distrib=TOLEADER} {add=[25 (1429945908711129088)]} 0 9
[junit4:junit4]   2> 23346 T99 C5 P48725 /update {version=2&wt=javabin} {add=[25]} 0 12
[junit4:junit4]   2> 23359 T98 C5 P48725 /update {version=2&distrib.from=http://127.0.0.1:42161/unloadcollection1/&wt=javabin&update.distrib=FROMLEADER} {add=[26 (1429945908726857728)]} 0 2
[junit4:junit4]   2> 23360 T83 C3 P33731 /update {version=2&distrib.from=http://127.0.0.1:42161/unloadcollection1/&wt=javabin&update.distrib=FROMLEADER} {add=[26 (1429945908726857728)]} 0 3
[junit4:junit4]   2> 23361 T68 C4 P42161 /update {version=2&distrib.from=http://127.0.0.1:48725/unloadcollection3/&wt=javabin&update.distrib=TOLEADER} {add=[26 (1429945908726857728)]} 0 9
[junit4:junit4]   2> 23361 T96 C5 P48725 /update {version=2&wt=javabin} {add=[26]} 0 12
[junit4:junit4]   2> 23375 T85 C3 P33731 /update {version=2&distrib.from=http://127.0.0.1:42161/unloadcollection1/&wt=javabin&update.distrib=FROMLEADER} {add=[27 (1429945908743634944)]} 0 3
[junit4:junit4]   2> 23375 T99 C5 P48725 /update {version=2&distrib.from=http://127.0.0.1:42161/unloadcollection1/&wt=javabin&update.distrib=FROMLEADER} {add=[27 (1429945908743634944)]} 0 2
[junit4:junit4]   2> 23376 T69 C4 P42161 /update {version=2&distrib.from=http://127.0.0.1:48725/unloadcollection3/&wt=javabin&update.distrib=TOLEADER} {add=[27 (1429945908743634944)]} 0 9
[junit4:junit4]   2> 23377 T97 C5 P48725 /update {version=2&wt=javabin} {add=[27]} 0 12
[junit4:junit4]   2> 23390 T84 C3 P33731 /update {version=2&distrib.from=http://127.0.0.1:42161/unloadcollection1/&wt=javabin&update.distrib=FROMLEADER} {add=[28 (1429945908759363584)]} 0 2
[junit4:junit4]   2> 23391 T96 C5 P48725 /update {version=2&distrib.from=http://127.0.0.1:42161/unloadcollection1/&wt=javabin&update.distrib=FROMLEADER} {add=[28 (1429945908759363584)]} 0 3
[junit4:junit4]   2> 23392 T70 C4 P42161 /update {version=2&distrib.from=http://127.0.0.1:48725/unloadcollection3/&wt=javabin&update.distrib=TOLEADER} {add=[28 (1429945908759363584)]} 0 9
[junit4:junit4]   2> 23392 T98 C5 P48725 /update {version=2&wt=javabin} {add=[28]} 0 12
[junit4:junit4]   2> 23405 T82 C3 P33731 /update {version=2&distrib.from=http://127.0.0.1:42161/unloadcollection1/&wt=javabin&update.distrib=FROMLEADER} {add=[29 (1429945908775092224)]} 0 2
[junit4:junit4]   2> 23405 T97 C5 P48725 /update {version=2&distrib.from=http://127.0.0.1:42161/unloadcollection1/&wt=javabin&update.distrib=FROMLEADER} {add=[29 (1429945908775092224)]} 0 2
[junit4:junit4]   2> 23406 T71 C4 P42161 /update {version=2&distrib.from=http://127.0.0.1:48725/unloadcollection3/&wt=javabin&update.distrib=TOLEADER} {add=[29 (1429945908775092224)]} 0 8
[junit4:junit4]   2> 23407 T99 C5 P48725 /update {version=2&wt=javabin} {add=[29]} 0 12
[junit4:junit4]   2> 23422 T98 C5 P48725 /update {version=2&distrib.from=http://127.0.0.1:42161/unloadcollection1/&wt=javabin&update.distrib=FROMLEADER} {add=[30 (1429945908791869440)]} 0 3
[junit4:junit4]   2> 23422 T83 C3 P33731 /update {version=2&distrib.from=http://127.0.0.1:42161/unloadcollection1/&wt=javabin&update.distrib=FROMLEADER} {add=[30 (1429945908791869440)]} 0 2
[junit4:junit4]   2> 23424 T68 C4 P42161 /update {version=2&distrib.from=http://127.0.0.1:48725/unloadcollection3/&wt=javabin&update.distrib=TOLEADER} {add=[30 (1429945908791869440)]} 0 11
[junit4:junit4]   2> 23424 T96 C5 P48725 /update {version=2&wt=javabin} {add=[30]} 0 14
[junit4:junit4]   2> 23438 T99 C5 P48725 /update {version=2&distrib.from=http://127.0.0.1:42161/unloadcollection1/&wt=javabin&update.distrib=FROMLEADER} {add=[31 (1429945908809695232)]} 0 2
[junit4:junit4]   2> 23438 T85 C3 P33731 /update {version=2&distrib.from=http://127.0.0.1:42161/unloadcollection1/&wt=javabin&update.distrib=FROMLEADER} {add=[31 (1429945908809695232)]} 0 2
[junit4:junit4]   2> 23439 T69 C4 P42161 /update {version=2&distrib.from=http://127.0.0.1:48725/unloadcollection3/&wt=javabin&update.distrib=TOLEADER} {add=[31 (1429945908809695232)]} 0 9
[junit4:junit4]   2> 23440 T97 C5 P48725 /update {version=2&wt=javabin} {add=[31]} 0 13
[junit4:junit4]   2> 23453 T96 C5 P48725 /update {version=2&distrib.from=http://127.0.0.1:42161/unloadcollection1/&wt=javabin&update.distrib=FROMLEADER} {add=[32 (1429945908825423872)]} 0 3
[junit4:junit4]   2> 23453 T84 C3 P33731 /update {version=2&distrib.from=http://127.0.0.1:42161/unloadcollection1/&wt=javabin&update.distrib=FROMLEADER} {add=[32 (1429945908825423872)]} 0 3
[junit4:junit4]   2> 23454 T70 C4 P42161 /update {version=2&distrib.from=http://127.0.0.1:48725/unloadcollection3/&wt=javabin&update.distrib=TOLEADER} {add=[32 (1429945908825423872)]} 0 8
[junit4:junit4]   2> 23455 T98 C5 P48725 /update {version=2&wt=javabin} {add=[32]} 0 12
[junit4:junit4]   2> 23469 T82 C3 P33731 /update {version=2&distrib.from=http://127.0.0.1:42161/unloadcollection1/&wt=javabin&update.distrib=FROMLEADER} {add=[33 (1429945908842201088)]} 0 3
[junit4:junit4]   2> 23469 T97 C5 P48725 /update {version=2&distrib.from=http://127.0.0.1:42161/unloadcollection1/&wt=javabin&update.distrib=FROMLEADER} {add=[33 (1429945908842201088)]} 0 3
[junit4:junit4]   2> 23470 T68 C4 P42161 /update {version=2&distrib.from=http://127.0.0.1:48725/unloadcollection3/&wt=javabin&update.distrib=TOLEADER} {add=[33 (1429945908842201088)]} 0 9
[junit4:junit4]   2> 23471 T99 C5 P48725 /update {version=2&wt=javabin} {add=[33]} 0 13
[junit4:junit4]   2> 23485 T83 C3 P33731 /update {version=2&distrib.from=http://127.0.0.1:42161/unloadcollection1/&wt=javabin&update.distrib=FROMLEADER} {add=[34 (1429945908857929728)]} 0 3
[junit4:junit4]   2> 23485 T98 C5 P48725 /update {version=2&distrib.from=http://127.0.0.1:42161/unloadcollection1/&wt=javabin&update.distrib=FROMLEADER} {add=[34 (1429945908857929728)]} 0 3
[junit4:junit4]   2> 23486 T69 C4 P42161 /update {version=2&distrib.from=http://127.0.0.1:48725/unloadcollection3/&wt=javabin&update.distrib=TOLEADER} {add=[34 (1429945908857929728)]} 0 9
[junit4:junit4]   2> 23487 T96 C5 P48725 /update {version=2&wt=javabin} {add=[34]} 0 13
[junit4:junit4]   2> 23500 T99 C5 P48725 /update {version=2&distrib.from=http://127.0.0.1:42161/unloadcollection1/&wt=javabin&update.distrib=FROMLEADER} {add=[35 (1429945908875755520)]} 0 2
[junit4:junit4]   2> 23501 T85 C3 P33731 /update {version=2&distrib.from=http://127.0.0.1:42161/unloadcollection1/&wt=javabin&update.distrib=FROMLEADER} {add=[35 (1429945908875755520)]} 0 3
[junit4:junit4]   2> 23502 T71 C4 P42161 /update {version=2&distrib.from=http://127.0.0.1:48725/unloadcollection3/&wt=javabin&update.distrib=TOLEADER} {add=[35 (1429945908875755520)]} 0 9
[junit4:junit4]   2> 23503 T97 C5 P48725 /update {version=2&wt=javabin} {add=[35]} 0 12
[junit4:junit4]   2> 23515 T96 C5 P48725 /update {version=2&distrib.from=http://127.0.0.1:42161/unloadcollection1/&wt=javabin&update.distrib=FROMLEADER} {add=[36 (1429945908890435584)]} 0 2
[junit4:junit4]   2> 23515 T84 C3 P33731 /update {version=2&distrib.from=http://127.0.0.1:42161/unloadcollection1/&wt=javabin&update.distrib=FROMLEADER} {add=[36 (1429945908890435584)]} 0 2
[junit4:junit4]   2> 23516 T70 C4 P42161 /update {version=2&distrib.from=http://127.0.0.1:48725/unloadcollection3/&wt=javabin&update.distrib=TOLEADER} {add=[36 (1429945908890435584)]} 0 8
[junit4:junit4]   2> 23517 T98 C5 P48725 /update {version=2&wt=javabin} {add=[36]} 0 12
[junit4:junit4]   2> 23530 T82 C3 P33731 /update {version=2&distrib.from=http://127.0.0.1:42161/unloadcollection1/&wt=javabin&update.distrib=FROMLEADER} {add=[37 (1429945908906164224)]} 0 2
[junit4:junit4]   2> 23530 T97 C5 P48725 /update {version=2&distrib.from=http://127.0.0.1:42161/unloadcollection1/&wt=javabin&update.distrib=FROMLEADER} {add=[37 (1429945908906164224)]} 0 2
[junit4:junit4]   2> 23532 T68 C4 P42161 /update {version=2&distrib.from=http://127.0.0.1:48725/unloadcollection3/&wt=javabin&update.distrib=TOLEADER} {add=[37 (1429945908906164224)]} 0 9
[junit4:junit4]   2> 23533 T99 C5 P48725 /update {version=2&wt=javabin} {add=[37]} 0 13
[junit4:junit4]   2> 23546 T98 C5 P48725 /update {version=2&distrib.from=http://127.0.0.1:42161/unloadcollection1/&wt=javabin&update.distrib=FROMLEADER} {add=[38 (1429945908921892864)]} 0 3
[junit4:junit4]   2> 23546 T83 C3 P33731 /update {version=2&distrib.from=http://127.0.0.1:42161/unloadcollection1/&wt=javabin&update.distrib=FROMLEADER} {add=[38 (1429945908921892864)]} 0 3
[junit4:junit4]   2> 23547 T69 C4 P42161 /update {version=2&distrib.from=http://127.0.0.1:48725/unloadcollection3/&wt=javabin&update.distrib=TOLEADER} {add=[38 (1429945908921892864)]} 0 9
[junit4:junit4]   2> 23548 T96 C5 P48725 /update {version=2&wt=javabin} {add=[38]} 0 12
[junit4:junit4]   2> 23560 T85 C3 P33731 /update {version=2&distrib.from=http://127.0.0.1:42161/unloadcollection1/&wt=javabin&update.distrib=FROMLEADER} {add=[39 (1429945908938670080)]} 0 2
[junit4:junit4]   2> 23560 T99 C5 P48725 /update {version=2&distrib.from=http://127.0.0.1:42161/unloadcollection1/&wt=javabin&update.distrib=FROMLEADER} {add=[39 (1429945908938670080)]} 0 2
[junit4:junit4]   2> 23561 T71 C4 P42161 /update {version=2&distrib.from=http://127.0.0.1:48725/unloadcollection3/&wt=javabin&update.distrib=TOLEADER} {add=[39 (1429945908938670080)]} 0 8
[junit4:junit4]   2> 23562 T97 C5 P48725 /update {version=2&wt=javabin} {add=[39]} 0 11
[junit4:junit4]   2> 23574 T96 C5 P48725 /update {version=2&distrib.from=http://127.0.0.1:42161/unloadcollection1/&wt=javabin&update.distrib=FROMLEADER} {add=[40 (1429945908952301568)]} 0 2
[junit4:junit4]   2> 23574 T84 C3 P33731 /update {version=2&distrib.from=http://127.0.0.1:42161/unloadcollection1/&wt=javabin&update.distrib=FROMLEADER} {add=[40 (1429945908952301568)]} 0 3
[junit4:junit4]   2> 23575 T70 C4 P42161 /update {version=2&distrib.from=http://127.0.0.1:48725/unloadcollection3/&wt=javabin&update.distrib=TOLEADER} {add=[40 (1429945908952301568)]} 0 8
[junit4:junit4]   2> 23575 T98 C5 P48725 /update {version=2&wt=javabin} {add=[40]} 0 10
[junit4:junit4]   2> 23589 T82 C3 P33731 /update {version=2&distrib.from=http://127.0.0.1:42161/unloadcollection1/&wt=javabin&update.distrib=FROMLEADER} {add=[41 (1429945908966981632)]} 0 3
[junit4:junit4]   2> 23589 T97 C5 P48725 /update {version=2&distrib.from=http://127.0.0.1:42161/unloadcollection1/&wt=javabin&update.distrib=FROMLEADER} {add=[41 (1429945908966981632)]} 0 2
[junit4:junit4]   2> 23590 T68 C4 P42161 /update {version=2&distrib.from=http://127.0.0.1:48725/unloadcollection3/&wt=javabin&update.distrib=TOLEADER} {add=[41 (1429945908966981632)]} 0 9
[junit4:junit4]   2> 23591 T99 C5 P48725 /update {version=2&wt=javabin} {add=[41]} 0 13
[junit4:junit4]   2> 23602 T98 C5 P48725 /update {version=2&distrib.from=http://127.0.0.1:42161/unloadcollection1/&wt=javabin&update.distrib=FROMLEADER} {add=[42 (1429945908982710272)]} 0 2
[junit4:junit4]   2> 23602 T83 C3 P33731 /update {version=2&distrib.from=http://127.0.0.1:42161/unloadcollection1/&wt=javabin&update.distrib=FROMLEADER} {add=[42 (1429945908982710272)]} 0 2
[junit4:junit4]   2> 23604 T69 C4 P42161 /update {version=2&distrib.from=http://127.0.0.1:48725/unloadcollection3/&wt=javabin&update.distrib=TOLEADER} {add=[42 (1429945908982710272)]} 0 8
[junit4:junit4]   2> 23604 T96 C5 P48725 /update {version=2&wt=javabin} {add=[42]} 0 11
[junit4:junit4]   2> 23616 T99 C5 P48725 /update {version=2&distrib.from=http://127.0.0.1:42161/unloadcollection1/&wt=javabin&update.distrib=FROMLEADER} {add=[43 (1429945908997390336)]} 0 3
[junit4:junit4]   2> 23616 T85 C3 P33731 /update {version=2&distrib.from=http://127.0.0.1:42161/unloadcollection1/&wt=javabin&update.distrib=FROMLEADER} {add=[43 (1429945908997390336)]} 0 3
[junit4:junit4]   2> 23617 T71 C4 P42161 /update {version=2&distrib.from=http://127.0.0.1:48725/unloadcollection3/&wt=javabin&update.distrib=TOLEADER} {add=[43 (1429945908997390336)]} 0 8
[junit4:junit4]   2> 23618 T97 C5 P48725 /update {version=2&wt=javabin} {add=[43]} 0 11
[junit4:junit4]   2> 23630 T84 C3 P33731 /update {version=2&distrib.from=http://127.0.0.1:42161/unloadcollection1/&wt=javabin&update.distrib=FROMLEADER} {add=[44 (1429945909012070400)]} 0 2
[junit4:junit4]   2> 23630 T96 C5 P48725 /update {version=2&distrib.from=http://127.0.0.1:42161/unloadcollection1/&wt=javabin&update.distrib=FROMLEADER} {add=[44 (1429945909012070400)]} 0 2
[junit4:junit4]   2> 23631 T70 C4 P42161 /update {version=2&distrib.from=http://127.0.0.1:48725/unloadcollection3/&wt=javabin&update.distrib=TOLEADER} {add=[44 (1429945909012070400)]} 0 8
[junit4:junit4]   2> 23632 T98 C5 P48725 /update {version=2&wt=javabin} {add=[44]} 0 11
[junit4:junit4]   2> 23643 T96 C5 P48725 /update {version=2&distrib.from=http://127.0.0.1:42161/unloadcollection1/&wt=javabin&update.distrib=FROMLEADER} {add=[45 (1429945909025701888)]} 0 2
[junit4:junit4]   2> 23643 T82 C3 P33731 /update {version=2&distrib.from=http://127.0.0.1:42161/unloadcollection1/&wt=javabin&update.distrib=FROMLEADER} {add=[45 (1429945909025701888)]} 0 2
[junit4:junit4]   2> 23644 T68 C4 P42161 /update {version=2&distrib.from=http://127.0.0.1:48725/unloadcollection3/&wt=javabin&update.distrib=TOLEADER} {add=[45 (1429945909025701888)]} 0 7
[junit4:junit4]   2> 23645 T97 C5 P48725 /update {version=2&wt=javabin} {add=[45]} 0 11
[junit4:junit4]   2> 23656 T83 C3 P33731 /update {version=2&distrib.from=http://127.0.0.1:42161/unloadcollection1/&wt=javabin&update.distrib=FROMLEADER} {add=[46 (1429945909039333376)]} 0 2
[junit4:junit4]   2> 23656 T98 C5 P48725 /update {version=2&distrib.from=http://127.0.0.1:42161/unloadcollection1/&wt=javabin&update.distrib=FROMLEADER} {add=[46 (1429945909039333376)]} 0 2
[junit4:junit4]   2> 23657 T69 C4 P42161 /update {version=2&distrib.from=http://127.0.0.1:48725/unloadcollection3/&wt=javabin&update.distrib=TOLEADER} {add=[46 (1429945909039333376)]} 0 7
[junit4:junit4]   2> 23658 T99 C5 P48725 /update {version=2&wt=javabin} {add=[46]} 0 10
[junit4:junit4]   2> 23670 T85 C3 P33731 /update {version=2&distrib.from=http://127.0.0.1:42161/unloadcollection1/&wt=javabin&update.distrib=FROMLEADER} {add=[47 (1429945909054013440)]} 0 3
[junit4:junit4]   2> 23670 T97 C5 P48725 /update {version=2&distrib.from=http://127.0.0.1:42161/unloadcollection1/&wt=javabin&update.distrib=FROMLEADER} {add=[47 (1429945909054013440)]} 0 3
[junit4:junit4]   2> 23671 T70 C4 P42161 /update {version=2&distrib.from=http://127.0.0.1:48725/unloadcollection3/&wt=javabin&update.distrib=TOLEADER} {add=[47 (1429945909054013440)]} 0 8
[junit4:junit4]   2> 23671 T96 C5 P48725 /update {version=2&wt=javabin} {add=[47]} 0 10
[junit4:junit4]   2> 23683 T84 C3 P33731 /update {version=2&distrib.from=http://127.0.0.1:42161/unloadcollection1/&wt=javabin&update.distrib=FROMLEADER} {add=[48 (1429945909067644928)]} 0 2
[junit4:junit4]   2> 23683 T99 C5 P48725 /update {version=2&distrib.from=http://127.0.0.1:42161/unloadcollection1/&wt=javabin&update.distrib=FROMLEADER} {add=[48 (1429945909067644928)]} 0 2
[junit4:junit4]   2> 23684 T68 C4 P42161 /update {version=2&distrib.from=http://127.0.0.1:48725/unloadcollection3/&wt=javabin&update.distrib=TOLEADER} {add=[48 (1429945909067644928)]} 0 7
[junit4:junit4]   2> 23684 T98 C5 P48725 /update {version=2&wt=javabin} {add=[48]} 0 10
[junit4:junit4]   2> 23697 T96 C5 P48725 /update {version=2&distrib.from=http://127.0.0.1:42161/unloadcollection1/&wt=javabin&update.distrib=FROMLEADER} {add=[49 (1429945909081276416)]} 0 2
[junit4:junit4]   2> 23697 T83 C3 P33731 /update {version=2&distrib.from=http://127.0.0.1:42161/unloadcollection1/&wt=javabin&update.distrib=FROMLEADER} {add=[49 (1429945909081276416)]} 0 2
[junit4:junit4]   2> 23698 T69 C4 P42161 /update {version=2&distrib.from=http://127.0.0.1:48725/unloadcollection3/&wt=javabin&update.distrib=TOLEADER} {add=[49 (1429945909081276416)]} 0 8
[junit4:junit4]   2> 23699 T97 C5 P48725 /update {version=2&wt=javabin} {add=[49]} 0 12
[junit4:junit4]   2> 23711 T85 C3 P33731 /update {version=2&distrib.from=http://127.0.0.1:42161/unloadcollection1/&wt=javabin&update.distrib=FROMLEADER} {add=[50 (1429945909097005056)]} 0 2
[junit4:junit4]   2> 23711 T96 C5 P48725 /update {version=2&distrib.from=http://127.0.0.1:42161/unloadcollection1/&wt=javabin&update.distrib=FROMLEADER} {add=[50 (1429945909097005056)]} 0 2
[junit4:junit4]   2> 23712 T71 C4 P42161 /update {version=2&distrib.from=http://127.0.0.1:48725/unloadcollection3/&wt=javabin&update.distrib=TOLEADER} {add=[50 (1429945909097005056)]} 0 8
[junit4:junit4]   2> 23713 T98 C5 P48725 /update {version=2&wt=javabin} {add=[50]} 0 11
[junit4:junit4]   2> 23725 T82 C3 P33731 /update {version=2&distrib.from=http://127.0.0.1:42161/unloadcollection1/&wt=javabin&update.distrib=FROMLEADER} {add=[51 (1429945909110636544)]} 0 2
[junit4:junit4]   2> 23726 T99 C5 P48725 /update {version=2&distrib.from=http://127.0.0.1:42161/unloadcollection1/&wt=javabin&update.distrib=FROMLEADER} {add=[51 (1429945909110636544)]} 0 3
[junit4:junit4]   2> 23727 T70 C4 P42161 /update {version=2&distrib.from=http://127.0.0.1:48725/unloadcollection3/&wt=javabin&update.distrib=TOLEADER} {add=[51 (1429945909110636544)]} 0 9
[junit4:junit4]   2> 23727 T97 C5 P48725 /update {version=2&wt=javabin} {add=[51]} 0 12
[junit4:junit4]   2> 23740 T84 C3 P33731 /update {version=2&distrib.from=http://127.0.0.1:42161/unloadcollection1/&wt=javabin&update.distrib=FROMLEADER} {add=[52 (1429945909127413760)]} 0 2
[junit4:junit4]   2> 23740 T98 C5 P48725 /update {version=2&distrib.from=http://127.0.0.1:42161/unloadcollection1/&wt=javabin&update.distrib=FROMLEADER} {add=[52 (1429945909127413760)]} 0 2
[junit4:junit4]   2> 23742 T68 C4 P42161 /update {version=2&distrib.from=http://127.0.0.1:48725/unloadcollection3/&wt=javabin&update.distrib=TOLEADER} {add=[52 (1429945909127413760)]} 0 9
[junit4:junit4]   2> 23743 T96 C5 P48725 /update {version=2&wt=javabin} {add=[52]} 0 13
[junit4:junit4] 

[...truncated too long message...]

eeperServer.shutdown shutting down
[junit4:junit4]   2> 32294 T314 oazs.SessionTrackerImpl.shutdown Shutting down
[junit4:junit4]   2> 32294 T314 oazs.PrepRequestProcessor.shutdown Shutting down
[junit4:junit4]   2> 32295 T314 oazs.SyncRequestProcessor.shutdown Shutting down
[junit4:junit4]   2> 32295 T314 oazs.FinalRequestProcessor.shutdown shutdown of request processor complete
[junit4:junit4]   1>     /solr/overseer_elect/election/89371626741628938-127.0.0.1:38372_u_zfl%2Fh-n_0000000003 (0)
[junit4:junit4]   1>     /solr/overseer_elect/election/89371626741628940-127.0.0.1:43082_u_zfl%2Fh-n_0000000004 (0)
[junit4:junit4]   1>     /solr/overseer_elect/election/89371626741628936-127.0.0.1:53197_u_zfl%2Fh-n_0000000002 (0)
[junit4:junit4]   1>     /solr/overseer_elect/election/89371626741628934-127.0.0.1:35460_u_zfl%2Fh-n_0000000001 (0)
[junit4:junit4]   1> 
[junit4:junit4]   2> NOTE: reproduce with: ant test  -Dtestcase=BasicDistributedZk2Test -Dtests.method=testDistribSearch -Dtests.seed=CB0075E55D2C5B43 -Dtests.multiplier=3 -Dtests.slow=true -Dtests.locale=ko -Dtests.timezone=America/Bahia_Banderas -Dtests.file.encoding=US-ASCII
[junit4:junit4] ERROR   32.3s J1 | BasicDistributedZk2Test.testDistribSearch <<<
[junit4:junit4]    > Throwable #1: org.apache.solr.common.SolrException: Server at http://127.0.0.1:53197/u_zfl/h/onenodecollectioncore returned non ok status:404, message:Can not find: /u_zfl/h/onenodecollectioncore/update
[junit4:junit4]    > 	at __randomizedtesting.SeedInfo.seed([CB0075E55D2C5B43:4AE6FBFD2A733B7F]:0)
[junit4:junit4]    > 	at org.apache.solr.client.solrj.impl.HttpSolrServer.request(HttpSolrServer.java:375)
[junit4:junit4]    > 	at org.apache.solr.client.solrj.impl.HttpSolrServer.request(HttpSolrServer.java:181)
[junit4:junit4]    > 	at org.apache.solr.client.solrj.request.AbstractUpdateRequest.process(AbstractUpdateRequest.java:117)
[junit4:junit4]    > 	at org.apache.solr.client.solrj.SolrServer.add(SolrServer.java:116)
[junit4:junit4]    > 	at org.apache.solr.client.solrj.SolrServer.add(SolrServer.java:102)
[junit4:junit4]    > 	at org.apache.solr.cloud.BasicDistributedZk2Test.testNodeWithoutCollectionForwarding(BasicDistributedZk2Test.java:196)
[junit4:junit4]    > 	at org.apache.solr.cloud.BasicDistributedZk2Test.doTest(BasicDistributedZk2Test.java:89)
[junit4:junit4]    > 	at org.apache.solr.BaseDistributedSearchTestCase.testDistribSearch(BaseDistributedSearchTestCase.java:806)
[junit4:junit4]    > 	at sun.reflect.NativeMethodAccessorImpl.invoke0(Native Method)
[junit4:junit4]    > 	at sun.reflect.NativeMethodAccessorImpl.invoke(NativeMethodAccessorImpl.java:57)
[junit4:junit4]    > 	at sun.reflect.DelegatingMethodAccessorImpl.invoke(DelegatingMethodAccessorImpl.java:43)
[junit4:junit4]    > 	at java.lang.reflect.Method.invoke(Method.java:487)
[junit4:junit4]    > 	at com.carrotsearch.randomizedtesting.RandomizedRunner.invoke(RandomizedRunner.java:1559)
[junit4:junit4]    > 	at com.carrotsearch.randomizedtesting.RandomizedRunner.access$600(RandomizedRunner.java:79)
[junit4:junit4]    > 	at com.carrotsearch.randomizedtesting.RandomizedRunner$6.evaluate(RandomizedRunner.java:737)
[junit4:junit4]    > 	at com.carrotsearch.randomizedtesting.RandomizedRunner$7.evaluate(RandomizedRunner.java:773)
[junit4:junit4]    > 	at com.carrotsearch.randomizedtesting.RandomizedRunner$8.evaluate(RandomizedRunner.java:787)
[junit4:junit4]    > 	at com.carrotsearch.randomizedtesting.rules.SystemPropertiesRestoreRule$1.evaluate(SystemPropertiesRestoreRule.java:53)
[junit4:junit4]    > 	at org.apache.lucene.util.TestRuleSetupTeardownChained$1.evaluate(TestRuleSetupTeardownChained.java:50)
[junit4:junit4]    > 	at org.apache.lucene.util.TestRuleFieldCacheSanity$1.evaluate(TestRuleFieldCacheSanity.java:51)
[junit4:junit4]    > 	at org.apache.lucene.util.AbstractBeforeAfterRule$1.evaluate(AbstractBeforeAfterRule.java:46)
[junit4:junit4]    > 	at com.carrotsearch.randomizedtesting.rules.SystemPropertiesInvariantRule$1.evaluate(SystemPropertiesInvariantRule.java:55)
[junit4:junit4]    > 	at org.apache.lucene.util.TestRuleThreadAndTestName$1.evaluate(TestRuleThreadAndTestName.java:49)
[junit4:junit4]    > 	at org.apache.lucene.util.TestRuleIgnoreAfterMaxFailures$1.evaluate(TestRuleIgnoreAfterMaxFailures.java:70)
[junit4:junit4]    > 	at org.apache.lucene.util.TestRuleMarkFailure$1.evaluate(TestRuleMarkFailure.java:48)
[junit4:junit4]    > 	at com.carrotsearch.randomizedtesting.rules.StatementAdapter.evaluate(StatementAdapter.java:36)
[junit4:junit4]    > 	at com.carrotsearch.randomizedtesting.ThreadLeakControl$StatementRunner.run(ThreadLeakControl.java:358)
[junit4:junit4]    > 	at com.carrotsearch.randomizedtesting.ThreadLeakControl.forkTimeoutingTask(ThreadLeakControl.java:782)
[junit4:junit4]    > 	at com.carrotsearch.randomizedtesting.ThreadLeakControl$3.evaluate(ThreadLeakControl.java:442)
[junit4:junit4]    > 	at com.carrotsearch.randomizedtesting.RandomizedRunner.runSingleTest(RandomizedRunner.java:746)
[junit4:junit4]    > 	at com.carrotsearch.randomizedtesting.RandomizedRunner$3.evaluate(RandomizedRunner.java:648)
[junit4:junit4]    > 	at com.carrotsearch.randomizedtesting.RandomizedRunner$4.evaluate(RandomizedRunner.java:682)
[junit4:junit4]    > 	at com.carrotsearch.randomizedtesting.RandomizedRunner$5.evaluate(RandomizedRunner.java:693)
[junit4:junit4]    > 	at com.carrotsearch.randomizedtesting.rules.StatementAdapter.evaluate(StatementAdapter.java:36)
[junit4:junit4]    > 	at com.carrotsearch.randomizedtesting.rules.SystemPropertiesRestoreRule$1.evaluate(SystemPropertiesRestoreRule.java:53)
[junit4:junit4]    > 	at org.apache.lucene.util.AbstractBeforeAfterRule$1.evaluate(AbstractBeforeAfterRule.java:46)
[junit4:junit4]    > 	at org.apache.lucene.util.TestRuleStoreClassName$1.evaluate(TestRuleStoreClassName.java:42)
[junit4:junit4]    > 	at com.carrotsearch.randomizedtesting.rules.SystemPropertiesInvariantRule$1.evaluate(SystemPropertiesInvariantRule.java:55)
[junit4:junit4]    > 	at com.carrotsearch.randomizedtesting.rules.NoShadowingOrOverridesOnMethodsRule$1.evaluate(NoShadowingOrOverridesOnMethodsRule.java:39)
[junit4:junit4]    > 	at com.carrotsearch.randomizedtesting.rules.NoShadowingOrOverridesOnMethodsRule$1.evaluate(NoShadowingOrOverridesOnMethodsRule.java:39)
[junit4:junit4]    > 	at com.carrotsearch.randomizedtesting.rules.StatementAdapter.evaluate(StatementAdapter.java:36)
[junit4:junit4]    > 	at org.apache.lucene.util.TestRuleAssertionsRequired$1.evaluate(TestRuleAssertionsRequired.java:43)
[junit4:junit4]    > 	at org.apache.lucene.util.TestRuleMarkFailure$1.evaluate(TestRuleMarkFailure.java:48)
[junit4:junit4]    > 	at org.apache.lucene.util.TestRuleIgnoreAfterMaxFailures$1.evaluate(TestRuleIgnoreAfterMaxFailures.java:70)
[junit4:junit4]    > 	at org.apache.lucene.util.TestRuleIgnoreTestSuites$1.evaluate(TestRuleIgnoreTestSuites.java:55)
[junit4:junit4]    > 	at com.carrotsearch.randomizedtesting.rules.StatementAdapter.evaluate(StatementAdapter.java:36)
[junit4:junit4]    > 	at com.carrotsearch.randomizedtesting.ThreadLeakControl$StatementRunner.run(ThreadLeakControl.java:358)
[junit4:junit4]    > 	at java.lang.Thread.run(Thread.java:722)
[junit4:junit4]   2> 32346 T314 oas.SolrTestCaseJ4.deleteCore ###deleteCore
[junit4:junit4]   2> 32350 T313 ccr.ThreadLeakControl.checkThreadLeaks WARNING Will linger awaiting termination of 2 leaked thread(s).
[junit4:junit4]   2> 32385 T317 oazs.SessionTrackerImpl.run SessionTrackerImpl exited loop!
[junit4:junit4]   2> 32422 T389 oascc.ZkStateReader$2.process WARNING ZooKeeper watch triggered, but Solr cannot talk to ZK
[junit4:junit4]   2> 32422 T389 oascc.ZkStateReader$3.process WARNING ZooKeeper watch triggered, but Solr cannot talk to ZK
[junit4:junit4]   2> 32423 T389 oaz.ClientCnxn$EventThread.run EventThread shut down
[junit4:junit4]   2> NOTE: test params are: codec=Lucene42: {}, docValues:{}, sim=DefaultSimilarity, locale=ko, timezone=America/Bahia_Banderas
[junit4:junit4]   2> NOTE: Linux 3.2.0-39-generic amd64/Oracle Corporation 1.8.0-ea (64-bit)/cpus=8,threads=3,free=87866160,total=235667456
[junit4:junit4]   2> NOTE: All tests run in this JVM: [TestShardHandlerFactory, TestQuerySenderNoQuery, TestStressLucene, DistanceFunctionTest, TestRangeQuery, ZkSolrClientTest, TestFastOutputStream, LeaderElectionIntegrationTest, TestElisionMultitermQuery, BasicZkTest, CachingDirectoryFactoryTest, TestPartialUpdateDeduplication, TestNumberUtils, TestIndexSearcher, HardAutoCommitTest, DateMathParserTest, TestWordDelimiterFilterFactory, EchoParamsTest, OpenExchangeRatesOrgProviderTest, SolrRequestParserTest, IndexReaderFactoryTest, BasicDistributedZk2Test]
[junit4:junit4] Completed on J1 in 32.63s, 1 test, 1 error <<< FAILURES!

[...truncated 761 lines...]
BUILD FAILED
/mnt/ssd/jenkins/workspace/Lucene-Solr-trunk-Linux/build.xml:375: The following error occurred while executing this line:
/mnt/ssd/jenkins/workspace/Lucene-Solr-trunk-Linux/build.xml:355: The following error occurred while executing this line:
/mnt/ssd/jenkins/workspace/Lucene-Solr-trunk-Linux/build.xml:39: The following error occurred while executing this line:
/mnt/ssd/jenkins/workspace/Lucene-Solr-trunk-Linux/solr/build.xml:183: The following error occurred while executing this line:
/mnt/ssd/jenkins/workspace/Lucene-Solr-trunk-Linux/solr/common-build.xml:449: The following error occurred while executing this line:
/mnt/ssd/jenkins/workspace/Lucene-Solr-trunk-Linux/lucene/common-build.xml:1210: The following error occurred while executing this line:
/mnt/ssd/jenkins/workspace/Lucene-Solr-trunk-Linux/lucene/common-build.xml:874: There were test failures: 272 suites, 1144 tests, 1 error, 1 failure, 13 ignored (7 assumptions)

Total time: 38 minutes 36 seconds
Build step 'Invoke Ant' marked build as failure
Archiving artifacts
Recording test results
Description set: Java: 64bit/jdk1.8.0-ea-b79 -XX:+UseParallelGC
Email was triggered for: Failure
Sending email for trigger: Failure



Mime
View raw message