lucene-dev mailing list archives

Site index · List index
Message view « Date » · « Thread »
Top « Date » · « Thread »
From Apache Jenkins Server <jenk...@builds.apache.org>
Subject [JENKINS] Lucene-Solr-Tests-4.x-java7 - Build # 1080 - Still Failing
Date Tue, 19 Mar 2013 00:03:32 GMT
Build: https://builds.apache.org/job/Lucene-Solr-Tests-4.x-java7/1080/

1 tests failed.
FAILED:  org.apache.solr.cloud.SyncSliceTest.testDistribSearch

Error Message:
Test Setup Failure: shard1 should have just been set up to be inconsistent - but it's still consistent. Leader:http://127.0.0.1:25448/rf_vkg/collection1 Dead Guy:http://127.0.0.1:53616/rf_vkg/collection1skip list:[CloudJettyRunner [url=http://127.0.0.1:18575/rf_vkg/collection1], CloudJettyRunner [url=http://127.0.0.1:52385/rf_vkg/collection1]]

Stack Trace:
java.lang.AssertionError: Test Setup Failure: shard1 should have just been set up to be inconsistent - but it's still consistent. Leader:http://127.0.0.1:25448/rf_vkg/collection1 Dead Guy:http://127.0.0.1:53616/rf_vkg/collection1skip list:[CloudJettyRunner [url=http://127.0.0.1:18575/rf_vkg/collection1], CloudJettyRunner [url=http://127.0.0.1:52385/rf_vkg/collection1]]
	at __randomizedtesting.SeedInfo.seed([62DFB2ADE0E9B13D:E3393CB597B6D101]:0)
	at org.junit.Assert.fail(Assert.java:93)
	at org.junit.Assert.assertTrue(Assert.java:43)
	at org.junit.Assert.assertNotNull(Assert.java:526)
	at org.apache.solr.cloud.SyncSliceTest.doTest(SyncSliceTest.java:212)
	at org.apache.solr.BaseDistributedSearchTestCase.testDistribSearch(BaseDistributedSearchTestCase.java:806)
	at sun.reflect.NativeMethodAccessorImpl.invoke0(Native Method)
	at sun.reflect.NativeMethodAccessorImpl.invoke(NativeMethodAccessorImpl.java:57)
	at sun.reflect.DelegatingMethodAccessorImpl.invoke(DelegatingMethodAccessorImpl.java:43)
	at java.lang.reflect.Method.invoke(Method.java:601)
	at com.carrotsearch.randomizedtesting.RandomizedRunner.invoke(RandomizedRunner.java:1559)
	at com.carrotsearch.randomizedtesting.RandomizedRunner.access$600(RandomizedRunner.java:79)
	at com.carrotsearch.randomizedtesting.RandomizedRunner$6.evaluate(RandomizedRunner.java:737)
	at com.carrotsearch.randomizedtesting.RandomizedRunner$7.evaluate(RandomizedRunner.java:773)
	at com.carrotsearch.randomizedtesting.RandomizedRunner$8.evaluate(RandomizedRunner.java:787)
	at com.carrotsearch.randomizedtesting.rules.SystemPropertiesRestoreRule$1.evaluate(SystemPropertiesRestoreRule.java:53)
	at org.apache.lucene.util.TestRuleSetupTeardownChained$1.evaluate(TestRuleSetupTeardownChained.java:50)
	at org.apache.lucene.util.TestRuleFieldCacheSanity$1.evaluate(TestRuleFieldCacheSanity.java:51)
	at org.apache.lucene.util.AbstractBeforeAfterRule$1.evaluate(AbstractBeforeAfterRule.java:46)
	at com.carrotsearch.randomizedtesting.rules.SystemPropertiesInvariantRule$1.evaluate(SystemPropertiesInvariantRule.java:55)
	at org.apache.lucene.util.TestRuleThreadAndTestName$1.evaluate(TestRuleThreadAndTestName.java:49)
	at org.apache.lucene.util.TestRuleIgnoreAfterMaxFailures$1.evaluate(TestRuleIgnoreAfterMaxFailures.java:70)
	at org.apache.lucene.util.TestRuleMarkFailure$1.evaluate(TestRuleMarkFailure.java:48)
	at com.carrotsearch.randomizedtesting.rules.StatementAdapter.evaluate(StatementAdapter.java:36)
	at com.carrotsearch.randomizedtesting.ThreadLeakControl$StatementRunner.run(ThreadLeakControl.java:358)
	at com.carrotsearch.randomizedtesting.ThreadLeakControl.forkTimeoutingTask(ThreadLeakControl.java:782)
	at com.carrotsearch.randomizedtesting.ThreadLeakControl$3.evaluate(ThreadLeakControl.java:442)
	at com.carrotsearch.randomizedtesting.RandomizedRunner.runSingleTest(RandomizedRunner.java:746)
	at com.carrotsearch.randomizedtesting.RandomizedRunner$3.evaluate(RandomizedRunner.java:648)
	at com.carrotsearch.randomizedtesting.RandomizedRunner$4.evaluate(RandomizedRunner.java:682)
	at com.carrotsearch.randomizedtesting.RandomizedRunner$5.evaluate(RandomizedRunner.java:693)
	at com.carrotsearch.randomizedtesting.rules.StatementAdapter.evaluate(StatementAdapter.java:36)
	at com.carrotsearch.randomizedtesting.rules.SystemPropertiesRestoreRule$1.evaluate(SystemPropertiesRestoreRule.java:53)
	at org.apache.lucene.util.AbstractBeforeAfterRule$1.evaluate(AbstractBeforeAfterRule.java:46)
	at org.apache.lucene.util.TestRuleStoreClassName$1.evaluate(TestRuleStoreClassName.java:42)
	at com.carrotsearch.randomizedtesting.rules.SystemPropertiesInvariantRule$1.evaluate(SystemPropertiesInvariantRule.java:55)
	at com.carrotsearch.randomizedtesting.rules.NoShadowingOrOverridesOnMethodsRule$1.evaluate(NoShadowingOrOverridesOnMethodsRule.java:39)
	at com.carrotsearch.randomizedtesting.rules.NoShadowingOrOverridesOnMethodsRule$1.evaluate(NoShadowingOrOverridesOnMethodsRule.java:39)
	at com.carrotsearch.randomizedtesting.rules.StatementAdapter.evaluate(StatementAdapter.java:36)
	at org.apache.lucene.util.TestRuleAssertionsRequired$1.evaluate(TestRuleAssertionsRequired.java:43)
	at org.apache.lucene.util.TestRuleMarkFailure$1.evaluate(TestRuleMarkFailure.java:48)
	at org.apache.lucene.util.TestRuleIgnoreAfterMaxFailures$1.evaluate(TestRuleIgnoreAfterMaxFailures.java:70)
	at org.apache.lucene.util.TestRuleIgnoreTestSuites$1.evaluate(TestRuleIgnoreTestSuites.java:55)
	at com.carrotsearch.randomizedtesting.rules.StatementAdapter.evaluate(StatementAdapter.java:36)
	at com.carrotsearch.randomizedtesting.ThreadLeakControl$StatementRunner.run(ThreadLeakControl.java:358)
	at java.lang.Thread.run(Thread.java:722)




Build Log:
[...truncated 9474 lines...]
[junit4:junit4] Suite: org.apache.solr.cloud.SyncSliceTest
[junit4:junit4]   2> 0 T1769 oas.BaseDistributedSearchTestCase.initHostContext Setting hostContext system property: /rf_vkg/
[junit4:junit4]   2> 6 T1769 oas.SolrTestCaseJ4.setUp ###Starting testDistribSearch
[junit4:junit4]   2> Creating dataDir: /usr/home/hudson/hudson-slave/workspace/Lucene-Solr-Tests-4.x-java7/solr/build/solr-core/test/J1/./solrtest-SyncSliceTest-1363650706641
[junit4:junit4]   2> 7 T1769 oasc.ZkTestServer.run STARTING ZK TEST SERVER
[junit4:junit4]   2> 8 T1770 oasc.ZkTestServer$ZKServerMain.runFromConfig Starting server
[junit4:junit4]   2> 11 T1770 oazs.ZooKeeperServer.setTickTime tickTime set to 1000
[junit4:junit4]   2> 11 T1770 oazs.ZooKeeperServer.setMinSessionTimeout minSessionTimeout set to -1
[junit4:junit4]   2> 11 T1770 oazs.ZooKeeperServer.setMaxSessionTimeout maxSessionTimeout set to -1
[junit4:junit4]   2> 12 T1770 oazs.NIOServerCnxnFactory.configure binding to port 0.0.0.0/0.0.0.0:0
[junit4:junit4]   2> 13 T1770 oazsp.FileTxnSnapLog.save Snapshotting: 0x0 to /usr/home/hudson/hudson-slave/workspace/Lucene-Solr-Tests-4.x-java7/solr/build/solr-core/test/J1/./org.apache.solr.cloud.SyncSliceTest-1363650706640/zookeeper/server1/data/version-2/snapshot.0
[junit4:junit4]   2> 109 T1769 oasc.ZkTestServer.run start zk server on port:14485
[junit4:junit4]   2> 109 T1769 oaz.ZooKeeper.<init> Initiating client connection, connectString=127.0.0.1:14485 sessionTimeout=10000 watcher=org.apache.solr.common.cloud.ConnectionManager@22a560b0
[junit4:junit4]   2> 110 T1769 oascc.ConnectionManager.waitForConnected Waiting for client to connect to ZooKeeper
[junit4:junit4]   2> 111 T1775 oaz.ClientCnxn$SendThread.logStartConnect Opening socket connection to server localhost/127.0.0.1:14485. Will not attempt to authenticate using SASL (access denied ("javax.security.auth.AuthPermission" "getLoginConfiguration"))
[junit4:junit4]   2> 112 T1775 oaz.ClientCnxn$SendThread.primeConnection Socket connection established to localhost/127.0.0.1:14485, initiating session
[junit4:junit4]   2> 112 T1771 oazs.NIOServerCnxnFactory.run Accepted socket connection from /140.211.11.196:14486
[junit4:junit4]   2> 113 T1771 oazs.ZooKeeperServer.processConnectRequest Client attempting to establish new session at /140.211.11.196:14486
[junit4:junit4]   2> 113 T1773 oazsp.FileTxnLog.append Creating new log file: log.1
[junit4:junit4]   2> 139 T1773 oazs.ZooKeeperServer.finishSessionInit Established session 0x13d7fea7cd80000 with negotiated timeout 10000 for client /140.211.11.196:14486
[junit4:junit4]   2> 139 T1775 oaz.ClientCnxn$SendThread.onConnected Session establishment complete on server localhost/127.0.0.1:14485, sessionid = 0x13d7fea7cd80000, negotiated timeout = 10000
[junit4:junit4]   2> 140 T1776 oascc.ConnectionManager.process Watcher org.apache.solr.common.cloud.ConnectionManager@22a560b0 name:ZooKeeperConnection Watcher:127.0.0.1:14485 got event WatchedEvent state:SyncConnected type:None path:null path:null type:None
[junit4:junit4]   2> 140 T1769 oascc.ConnectionManager.waitForConnected Client is connected to ZooKeeper
[junit4:junit4]   2> 140 T1769 oascc.SolrZkClient.makePath makePath: /solr
[junit4:junit4]   2> 144 T1774 oazs.PrepRequestProcessor.pRequest2Txn Processed session termination for sessionid: 0x13d7fea7cd80000
[junit4:junit4]   2> 156 T1776 oaz.ClientCnxn$EventThread.run EventThread shut down
[junit4:junit4]   2> 156 T1769 oaz.ZooKeeper.close Session: 0x13d7fea7cd80000 closed
[junit4:junit4]   2> 157 T1771 oazs.NIOServerCnxn.closeSock Closed socket connection for client /140.211.11.196:14486 which had sessionid 0x13d7fea7cd80000
[junit4:junit4]   2> 157 T1769 oaz.ZooKeeper.<init> Initiating client connection, connectString=127.0.0.1:14485/solr sessionTimeout=10000 watcher=org.apache.solr.common.cloud.ConnectionManager@75302100
[junit4:junit4]   2> 158 T1769 oascc.ConnectionManager.waitForConnected Waiting for client to connect to ZooKeeper
[junit4:junit4]   2> 158 T1777 oaz.ClientCnxn$SendThread.logStartConnect Opening socket connection to server localhost/127.0.0.1:14485. Will not attempt to authenticate using SASL (access denied ("javax.security.auth.AuthPermission" "getLoginConfiguration"))
[junit4:junit4]   2> 159 T1777 oaz.ClientCnxn$SendThread.primeConnection Socket connection established to localhost/127.0.0.1:14485, initiating session
[junit4:junit4]   2> 159 T1771 oazs.NIOServerCnxnFactory.run Accepted socket connection from /140.211.11.196:14487
[junit4:junit4]   2> 160 T1771 oazs.ZooKeeperServer.processConnectRequest Client attempting to establish new session at /140.211.11.196:14487
[junit4:junit4]   2> 161 T1773 oazs.ZooKeeperServer.finishSessionInit Established session 0x13d7fea7cd80001 with negotiated timeout 10000 for client /140.211.11.196:14487
[junit4:junit4]   2> 161 T1777 oaz.ClientCnxn$SendThread.onConnected Session establishment complete on server localhost/127.0.0.1:14485, sessionid = 0x13d7fea7cd80001, negotiated timeout = 10000
[junit4:junit4]   2> 161 T1778 oascc.ConnectionManager.process Watcher org.apache.solr.common.cloud.ConnectionManager@75302100 name:ZooKeeperConnection Watcher:127.0.0.1:14485/solr got event WatchedEvent state:SyncConnected type:None path:null path:null type:None
[junit4:junit4]   2> 162 T1769 oascc.ConnectionManager.waitForConnected Client is connected to ZooKeeper
[junit4:junit4]   2> 162 T1769 oascc.SolrZkClient.makePath makePath: /collections/collection1
[junit4:junit4]   2> 173 T1769 oascc.SolrZkClient.makePath makePath: /collections/collection1/shards
[junit4:junit4]   2> 176 T1769 oascc.SolrZkClient.makePath makePath: /collections/control_collection
[junit4:junit4]   2> 178 T1769 oascc.SolrZkClient.makePath makePath: /collections/control_collection/shards
[junit4:junit4]   2> 181 T1769 oasc.AbstractZkTestCase.putConfig put /usr/home/hudson/hudson-slave/workspace/Lucene-Solr-Tests-4.x-java7/solr/build/solr-core/test-files/solr/collection1/conf/solrconfig-tlog.xml to /configs/conf1/solrconfig.xml
[junit4:junit4]   2> 182 T1769 oascc.SolrZkClient.makePath makePath: /configs/conf1/solrconfig.xml
[junit4:junit4]   2> 196 T1769 oasc.AbstractZkTestCase.putConfig put /usr/home/hudson/hudson-slave/workspace/Lucene-Solr-Tests-4.x-java7/solr/build/solr-core/test-files/solr/collection1/conf/schema.xml to /configs/conf1/schema.xml
[junit4:junit4]   2> 197 T1769 oascc.SolrZkClient.makePath makePath: /configs/conf1/schema.xml
[junit4:junit4]   2> 303 T1769 oasc.AbstractZkTestCase.putConfig put /usr/home/hudson/hudson-slave/workspace/Lucene-Solr-Tests-4.x-java7/solr/build/solr-core/test-files/solr/collection1/conf/stopwords.txt to /configs/conf1/stopwords.txt
[junit4:junit4]   2> 303 T1769 oascc.SolrZkClient.makePath makePath: /configs/conf1/stopwords.txt
[junit4:junit4]   2> 307 T1769 oasc.AbstractZkTestCase.putConfig put /usr/home/hudson/hudson-slave/workspace/Lucene-Solr-Tests-4.x-java7/solr/build/solr-core/test-files/solr/collection1/conf/protwords.txt to /configs/conf1/protwords.txt
[junit4:junit4]   2> 307 T1769 oascc.SolrZkClient.makePath makePath: /configs/conf1/protwords.txt
[junit4:junit4]   2> 316 T1769 oasc.AbstractZkTestCase.putConfig put /usr/home/hudson/hudson-slave/workspace/Lucene-Solr-Tests-4.x-java7/solr/build/solr-core/test-files/solr/collection1/conf/currency.xml to /configs/conf1/currency.xml
[junit4:junit4]   2> 317 T1769 oascc.SolrZkClient.makePath makePath: /configs/conf1/currency.xml
[junit4:junit4]   2> 320 T1769 oasc.AbstractZkTestCase.putConfig put /usr/home/hudson/hudson-slave/workspace/Lucene-Solr-Tests-4.x-java7/solr/build/solr-core/test-files/solr/collection1/conf/open-exchange-rates.json to /configs/conf1/open-exchange-rates.json
[junit4:junit4]   2> 321 T1769 oascc.SolrZkClient.makePath makePath: /configs/conf1/open-exchange-rates.json
[junit4:junit4]   2> 324 T1769 oasc.AbstractZkTestCase.putConfig put /usr/home/hudson/hudson-slave/workspace/Lucene-Solr-Tests-4.x-java7/solr/build/solr-core/test-files/solr/collection1/conf/mapping-ISOLatin1Accent.txt to /configs/conf1/mapping-ISOLatin1Accent.txt
[junit4:junit4]   2> 324 T1769 oascc.SolrZkClient.makePath makePath: /configs/conf1/mapping-ISOLatin1Accent.txt
[junit4:junit4]   2> 327 T1769 oasc.AbstractZkTestCase.putConfig put /usr/home/hudson/hudson-slave/workspace/Lucene-Solr-Tests-4.x-java7/solr/build/solr-core/test-files/solr/collection1/conf/old_synonyms.txt to /configs/conf1/old_synonyms.txt
[junit4:junit4]   2> 328 T1769 oascc.SolrZkClient.makePath makePath: /configs/conf1/old_synonyms.txt
[junit4:junit4]   2> 331 T1769 oasc.AbstractZkTestCase.putConfig put /usr/home/hudson/hudson-slave/workspace/Lucene-Solr-Tests-4.x-java7/solr/build/solr-core/test-files/solr/collection1/conf/synonyms.txt to /configs/conf1/synonyms.txt
[junit4:junit4]   2> 331 T1769 oascc.SolrZkClient.makePath makePath: /configs/conf1/synonyms.txt
[junit4:junit4]   2> 339 T1774 oazs.PrepRequestProcessor.pRequest2Txn Processed session termination for sessionid: 0x13d7fea7cd80001
[junit4:junit4]   2> 340 T1778 oaz.ClientCnxn$EventThread.run EventThread shut down
[junit4:junit4]   2> 340 T1769 oaz.ZooKeeper.close Session: 0x13d7fea7cd80001 closed
[junit4:junit4]   2> 340 T1771 oazs.NIOServerCnxn.closeSock Closed socket connection for client /140.211.11.196:14487 which had sessionid 0x13d7fea7cd80001
[junit4:junit4]   2> 533 T1769 oejs.Server.doStart jetty-8.1.8.v20121106
[junit4:junit4]   2> 538 T1769 oejs.AbstractConnector.doStart Started SocketConnector@127.0.0.1:14488
[junit4:junit4]   2> 539 T1769 oass.SolrDispatchFilter.init SolrDispatchFilter.init()
[junit4:junit4]   2> 539 T1769 oasc.SolrResourceLoader.locateSolrHome JNDI not configured for solr (NoInitialContextEx)
[junit4:junit4]   2> 540 T1769 oasc.SolrResourceLoader.locateSolrHome using system property solr.solr.home: /usr/home/hudson/hudson-slave/workspace/Lucene-Solr-Tests-4.x-java7/solr/build/solr-core/test/J1/./org.apache.solr.cloud.SyncSliceTest-controljetty-1363650706975
[junit4:junit4]   2> 540 T1769 oasc.CoreContainer$Initializer.initialize looking for solr config file: /usr/home/hudson/hudson-slave/workspace/Lucene-Solr-Tests-4.x-java7/solr/build/solr-core/test/J1/./org.apache.solr.cloud.SyncSliceTest-controljetty-1363650706975/solr.xml
[junit4:junit4]   2> 541 T1769 oasc.CoreContainer.<init> New CoreContainer 1734504101
[junit4:junit4]   2> 541 T1769 oasc.CoreContainer.load Loading CoreContainer using Solr Home: '/usr/home/hudson/hudson-slave/workspace/Lucene-Solr-Tests-4.x-java7/solr/build/solr-core/test/J1/./org.apache.solr.cloud.SyncSliceTest-controljetty-1363650706975/'
[junit4:junit4]   2> 542 T1769 oasc.SolrResourceLoader.<init> new SolrResourceLoader for directory: '/usr/home/hudson/hudson-slave/workspace/Lucene-Solr-Tests-4.x-java7/solr/build/solr-core/test/J1/./org.apache.solr.cloud.SyncSliceTest-controljetty-1363650706975/'
[junit4:junit4]   2> 604 T1769 oashc.HttpShardHandlerFactory.getParameter Setting socketTimeout to: 120000
[junit4:junit4]   2> 605 T1769 oashc.HttpShardHandlerFactory.getParameter Setting urlScheme to: http://
[junit4:junit4]   2> 606 T1769 oashc.HttpShardHandlerFactory.getParameter Setting connTimeout to: 15000
[junit4:junit4]   2> 606 T1769 oashc.HttpShardHandlerFactory.getParameter Setting maxConnectionsPerHost to: 20
[junit4:junit4]   2> 606 T1769 oashc.HttpShardHandlerFactory.getParameter Setting corePoolSize to: 0
[junit4:junit4]   2> 607 T1769 oashc.HttpShardHandlerFactory.getParameter Setting maximumPoolSize to: 2147483647
[junit4:junit4]   2> 607 T1769 oashc.HttpShardHandlerFactory.getParameter Setting maxThreadIdleTime to: 5
[junit4:junit4]   2> 608 T1769 oashc.HttpShardHandlerFactory.getParameter Setting sizeOfQueue to: -1
[junit4:junit4]   2> 608 T1769 oashc.HttpShardHandlerFactory.getParameter Setting fairnessPolicy to: false
[junit4:junit4]   2> 609 T1769 oascsi.HttpClientUtil.createClient Creating new http client, config:maxConnectionsPerHost=20&maxConnections=10000&socketTimeout=120000&connTimeout=15000&retry=false
[junit4:junit4]   2> 631 T1769 oasc.CoreContainer.load Registering Log Listener
[junit4:junit4]   2> 651 T1769 oasc.CoreContainer.initZooKeeper Zookeeper client=127.0.0.1:14485/solr
[junit4:junit4]   2> 651 T1769 oasc.ZkController.checkChrootPath zkHost includes chroot
[junit4:junit4]   2> 652 T1769 oaz.ZooKeeper.<init> Initiating client connection, connectString=127.0.0.1:14485 sessionTimeout=60000 watcher=org.apache.solr.common.cloud.ConnectionManager@69a915d4
[junit4:junit4]   2> 653 T1769 oascc.ConnectionManager.waitForConnected Waiting for client to connect to ZooKeeper
[junit4:junit4]   2> 653 T1788 oaz.ClientCnxn$SendThread.logStartConnect Opening socket connection to server localhost/127.0.0.1:14485. Will not attempt to authenticate using SASL (access denied ("javax.security.auth.AuthPermission" "getLoginConfiguration"))
[junit4:junit4]   2> 654 T1788 oaz.ClientCnxn$SendThread.primeConnection Socket connection established to localhost/127.0.0.1:14485, initiating session
[junit4:junit4]   2> 654 T1771 oazs.NIOServerCnxnFactory.run Accepted socket connection from /140.211.11.196:14489
[junit4:junit4]   2> 655 T1771 oazs.ZooKeeperServer.processConnectRequest Client attempting to establish new session at /140.211.11.196:14489
[junit4:junit4]   2> 657 T1773 oazs.ZooKeeperServer.finishSessionInit Established session 0x13d7fea7cd80002 with negotiated timeout 20000 for client /140.211.11.196:14489
[junit4:junit4]   2> 657 T1788 oaz.ClientCnxn$SendThread.onConnected Session establishment complete on server localhost/127.0.0.1:14485, sessionid = 0x13d7fea7cd80002, negotiated timeout = 20000
[junit4:junit4]   2> 657 T1789 oascc.ConnectionManager.process Watcher org.apache.solr.common.cloud.ConnectionManager@69a915d4 name:ZooKeeperConnection Watcher:127.0.0.1:14485 got event WatchedEvent state:SyncConnected type:None path:null path:null type:None
[junit4:junit4]   2> 657 T1769 oascc.ConnectionManager.waitForConnected Client is connected to ZooKeeper
[junit4:junit4]   2> 659 T1774 oazs.PrepRequestProcessor.pRequest2Txn Processed session termination for sessionid: 0x13d7fea7cd80002
[junit4:junit4]   2> 670 T1789 oaz.ClientCnxn$EventThread.run EventThread shut down
[junit4:junit4]   2> 670 T1771 oazs.NIOServerCnxn.closeSock Closed socket connection for client /140.211.11.196:14489 which had sessionid 0x13d7fea7cd80002
[junit4:junit4]   2> 670 T1769 oaz.ZooKeeper.close Session: 0x13d7fea7cd80002 closed
[junit4:junit4]   2> 671 T1769 oascsi.HttpClientUtil.createClient Creating new http client, config:maxConnections=500&maxConnectionsPerHost=16&socketTimeout=120000&connTimeout=15000
[junit4:junit4]   2> 683 T1769 oaz.ZooKeeper.<init> Initiating client connection, connectString=127.0.0.1:14485/solr sessionTimeout=30000 watcher=org.apache.solr.common.cloud.ConnectionManager@7608c602
[junit4:junit4]   2> 684 T1769 oascc.ConnectionManager.waitForConnected Waiting for client to connect to ZooKeeper
[junit4:junit4]   2> 684 T1790 oaz.ClientCnxn$SendThread.logStartConnect Opening socket connection to server localhost/127.0.0.1:14485. Will not attempt to authenticate using SASL (access denied ("javax.security.auth.AuthPermission" "getLoginConfiguration"))
[junit4:junit4]   2> 685 T1790 oaz.ClientCnxn$SendThread.primeConnection Socket connection established to localhost/127.0.0.1:14485, initiating session
[junit4:junit4]   2> 685 T1771 oazs.NIOServerCnxnFactory.run Accepted socket connection from /140.211.11.196:14490
[junit4:junit4]   2> 685 T1771 oazs.ZooKeeperServer.processConnectRequest Client attempting to establish new session at /140.211.11.196:14490
[junit4:junit4]   2> 686 T1773 oazs.ZooKeeperServer.finishSessionInit Established session 0x13d7fea7cd80003 with negotiated timeout 20000 for client /140.211.11.196:14490
[junit4:junit4]   2> 686 T1790 oaz.ClientCnxn$SendThread.onConnected Session establishment complete on server localhost/127.0.0.1:14485, sessionid = 0x13d7fea7cd80003, negotiated timeout = 20000
[junit4:junit4]   2> 687 T1791 oascc.ConnectionManager.process Watcher org.apache.solr.common.cloud.ConnectionManager@7608c602 name:ZooKeeperConnection Watcher:127.0.0.1:14485/solr got event WatchedEvent state:SyncConnected type:None path:null path:null type:None
[junit4:junit4]   2> 687 T1769 oascc.ConnectionManager.waitForConnected Client is connected to ZooKeeper
[junit4:junit4]   2> 690 T1769 oascc.SolrZkClient.makePath makePath: /overseer/queue
[junit4:junit4]   2> 693 T1774 oazs.PrepRequestProcessor.pRequest Got user-level KeeperException when processing sessionid:0x13d7fea7cd80003 type:create cxid:0x7 zxid:0x1b txntype:-1 reqpath:n/a Error Path:/solr/overseer Error:KeeperErrorCode = NodeExists for /solr/overseer
[junit4:junit4]   2> 701 T1769 oascc.SolrZkClient.makePath makePath: /overseer/collection-queue-work
[junit4:junit4]   2> 704 T1769 oascc.SolrZkClient.makePath makePath: /live_nodes
[junit4:junit4]   2> 707 T1769 oasc.ZkController.createEphemeralLiveNode Register node as live in ZooKeeper:/live_nodes/127.0.0.1:14488_rf_vkg
[junit4:junit4]   2> 707 T1774 oazs.PrepRequestProcessor.pRequest Got user-level KeeperException when processing sessionid:0x13d7fea7cd80003 type:delete cxid:0x12 zxid:0x1e txntype:-1 reqpath:n/a Error Path:/solr/live_nodes/127.0.0.1:14488_rf_vkg Error:KeeperErrorCode = NoNode for /solr/live_nodes/127.0.0.1:14488_rf_vkg
[junit4:junit4]   2> 708 T1769 oascc.SolrZkClient.makePath makePath: /live_nodes/127.0.0.1:14488_rf_vkg
[junit4:junit4]   2> 720 T1769 oascc.SolrZkClient.makePath makePath: /overseer_elect/election
[junit4:junit4]   2> 731 T1774 oazs.PrepRequestProcessor.pRequest Got user-level KeeperException when processing sessionid:0x13d7fea7cd80003 type:delete cxid:0x20 zxid:0x23 txntype:-1 reqpath:n/a Error Path:/solr/overseer_elect/leader Error:KeeperErrorCode = NoNode for /solr/overseer_elect/leader
[junit4:junit4]   2> 733 T1769 oascc.SolrZkClient.makePath makePath: /overseer_elect/leader
[junit4:junit4]   2> 735 T1769 oasc.Overseer.start Overseer (id=89368212710883331-127.0.0.1:14488_rf_vkg-n_0000000000) starting
[junit4:junit4]   2> 736 T1774 oazs.PrepRequestProcessor.pRequest Got user-level KeeperException when processing sessionid:0x13d7fea7cd80003 type:create cxid:0x25 zxid:0x25 txntype:-1 reqpath:n/a Error Path:/solr/overseer Error:KeeperErrorCode = NodeExists for /solr/overseer
[junit4:junit4]   2> 737 T1774 oazs.PrepRequestProcessor.pRequest Got user-level KeeperException when processing sessionid:0x13d7fea7cd80003 type:create cxid:0x26 zxid:0x26 txntype:-1 reqpath:n/a Error Path:/solr/overseer Error:KeeperErrorCode = NodeExists for /solr/overseer
[junit4:junit4]   2> 745 T1774 oazs.PrepRequestProcessor.pRequest Got user-level KeeperException when processing sessionid:0x13d7fea7cd80003 type:create cxid:0x28 zxid:0x27 txntype:-1 reqpath:n/a Error Path:/solr/overseer Error:KeeperErrorCode = NodeExists for /solr/overseer
[junit4:junit4]   2> 746 T1769 oascc.SolrZkClient.makePath makePath: /overseer/queue-work
[junit4:junit4]   2> 749 T1774 oazs.PrepRequestProcessor.pRequest Got user-level KeeperException when processing sessionid:0x13d7fea7cd80003 type:create cxid:0x2e zxid:0x29 txntype:-1 reqpath:n/a Error Path:/solr/overseer Error:KeeperErrorCode = NodeExists for /solr/overseer
[junit4:junit4]   2> 758 T1793 oasc.OverseerCollectionProcessor.run Process current queue of collection creations
[junit4:junit4]   2> 759 T1769 oascc.SolrZkClient.makePath makePath: /clusterstate.json
[junit4:junit4]   2> 761 T1769 oascc.SolrZkClient.makePath makePath: /aliases.json
[junit4:junit4]   2> 763 T1769 oascc.ZkStateReader.createClusterStateWatchersAndUpdate Updating cluster state from ZooKeeper... 
[junit4:junit4]   2> 766 T1792 oasc.Overseer$ClusterStateUpdater.run Starting to work on the main queue
[junit4:junit4]   2> 770 T1794 oasc.CoreContainer.create Creating SolrCore 'collection1' using instanceDir: /usr/home/hudson/hudson-slave/workspace/Lucene-Solr-Tests-4.x-java7/solr/build/solr-core/test/J1/./org.apache.solr.cloud.SyncSliceTest-controljetty-1363650706975/collection1
[junit4:junit4]   2> 770 T1794 oasc.ZkController.createCollectionZkNode Check for collection zkNode:control_collection
[junit4:junit4]   2> 771 T1794 oasc.ZkController.createCollectionZkNode Collection zkNode exists
[junit4:junit4]   2> 771 T1794 oasc.ZkController.readConfigName Load collection config from:/collections/control_collection
[junit4:junit4]   2> 773 T1794 oasc.SolrResourceLoader.<init> new SolrResourceLoader for directory: '/usr/home/hudson/hudson-slave/workspace/Lucene-Solr-Tests-4.x-java7/solr/build/solr-core/test/J1/./org.apache.solr.cloud.SyncSliceTest-controljetty-1363650706975/collection1/'
[junit4:junit4]   2> 774 T1794 oasc.SolrResourceLoader.replaceClassLoader Adding 'file:/usr/home/hudson/hudson-slave/workspace/Lucene-Solr-Tests-4.x-java7/solr/build/solr-core/test/J1/org.apache.solr.cloud.SyncSliceTest-controljetty-1363650706975/collection1/lib/classes/' to classloader
[junit4:junit4]   2> 775 T1794 oasc.SolrResourceLoader.replaceClassLoader Adding 'file:/usr/home/hudson/hudson-slave/workspace/Lucene-Solr-Tests-4.x-java7/solr/build/solr-core/test/J1/org.apache.solr.cloud.SyncSliceTest-controljetty-1363650706975/collection1/lib/README' to classloader
[junit4:junit4]   2> 825 T1794 oasc.SolrConfig.<init> Using Lucene MatchVersion: LUCENE_43
[junit4:junit4]   2> 887 T1794 oasc.SolrConfig.<init> Loaded SolrConfig: solrconfig.xml
[junit4:junit4]   2> 988 T1794 oass.IndexSchema.readSchema Reading Solr Schema
[junit4:junit4]   2> 994 T1794 oass.IndexSchema.readSchema Schema name=test
[junit4:junit4]   2> 1630 T1794 oass.OpenExchangeRatesOrgProvider.init Initialized with rates=open-exchange-rates.json, refreshInterval=1440.
[junit4:junit4]   2> 1638 T1794 oass.IndexSchema.readSchema default search field in schema is text
[junit4:junit4]   2> 1640 T1794 oass.IndexSchema.readSchema unique key field: id
[junit4:junit4]   2> 1652 T1794 oass.FileExchangeRateProvider.reload Reloading exchange rates from file currency.xml
[junit4:junit4]   2> 1656 T1794 oass.FileExchangeRateProvider.reload Reloading exchange rates from file currency.xml
[junit4:junit4]   2> 1660 T1794 oass.OpenExchangeRatesOrgProvider.reload Reloading exchange rates from open-exchange-rates.json
[junit4:junit4]   2> 1660 T1794 oass.OpenExchangeRatesOrgProvider$OpenExchangeRates.<init> WARNING Unknown key IMPORTANT NOTE
[junit4:junit4]   2> 1661 T1794 oass.OpenExchangeRatesOrgProvider$OpenExchangeRates.<init> WARNING Expected key, got STRING
[junit4:junit4]   2> 1661 T1794 oass.OpenExchangeRatesOrgProvider.reload Reloading exchange rates from open-exchange-rates.json
[junit4:junit4]   2> 1662 T1794 oass.OpenExchangeRatesOrgProvider$OpenExchangeRates.<init> WARNING Unknown key IMPORTANT NOTE
[junit4:junit4]   2> 1662 T1794 oass.OpenExchangeRatesOrgProvider$OpenExchangeRates.<init> WARNING Expected key, got STRING
[junit4:junit4]   2> 1662 T1794 oasc.SolrCore.initDirectoryFactory solr.NRTCachingDirectoryFactory
[junit4:junit4]   2> 1685 T1794 oasc.SolrCore.<init> [collection1] Opening new SolrCore at /usr/home/hudson/hudson-slave/workspace/Lucene-Solr-Tests-4.x-java7/solr/build/solr-core/test/J1/./org.apache.solr.cloud.SyncSliceTest-controljetty-1363650706975/collection1/, dataDir=./org.apache.solr.cloud.SyncSliceTest-1363650706640/control/data/
[junit4:junit4]   2> 1685 T1794 oasc.JmxMonitoredMap.<init> JMX monitoring is enabled. Adding Solr mbeans to JMX Server: com.sun.jmx.mbeanserver.JmxMBeanServer@740ba142
[junit4:junit4]   2> 1685 T1794 oasc.SolrCore.initDirectoryFactory solr.NRTCachingDirectoryFactory
[junit4:junit4]   2> 1686 T1794 oasc.CachingDirectoryFactory.get return new directory for /usr/home/hudson/hudson-slave/workspace/Lucene-Solr-Tests-4.x-java7/solr/build/solr-core/test/J1/org.apache.solr.cloud.SyncSliceTest-1363650706640/control/data forceNew: false
[junit4:junit4]   2> 1687 T1794 oasc.SolrCore.getNewIndexDir New index directory detected: old=null new=./org.apache.solr.cloud.SyncSliceTest-1363650706640/control/data/index/
[junit4:junit4]   2> 1687 T1794 oasc.SolrCore.initIndex WARNING [collection1] Solr index directory './org.apache.solr.cloud.SyncSliceTest-1363650706640/control/data/index' doesn't exist. Creating new index...
[junit4:junit4]   2> 1688 T1794 oasc.CachingDirectoryFactory.get return new directory for /usr/home/hudson/hudson-slave/workspace/Lucene-Solr-Tests-4.x-java7/solr/build/solr-core/test/J1/org.apache.solr.cloud.SyncSliceTest-1363650706640/control/data/index forceNew: false
[junit4:junit4]   2> 1717 T1794 oasc.SolrDeletionPolicy.onCommit SolrDeletionPolicy.onCommit: commits:num=1
[junit4:junit4]   2> 		commit{dir=NRTCachingDirectory(org.apache.lucene.store.NIOFSDirectory@/usr/home/hudson/hudson-slave/workspace/Lucene-Solr-Tests-4.x-java7/solr/build/solr-core/test/J1/org.apache.solr.cloud.SyncSliceTest-1363650706640/control/data/index lockFactory=org.apache.lucene.store.NativeFSLockFactory@1b0c793c; maxCacheMB=48.0 maxMergeSizeMB=4.0),segFN=segments_1,generation=1,filenames=[segments_1]
[junit4:junit4]   2> 1717 T1794 oasc.SolrDeletionPolicy.updateCommits newest commit = 1[segments_1]
[junit4:junit4]   2> 1719 T1794 oasup.UpdateRequestProcessorChain.init inserting DistributedUpdateProcessorFactory into updateRequestProcessorChain "dedupe"
[junit4:junit4]   2> 1719 T1794 oasup.UpdateRequestProcessorChain.init inserting DistributedUpdateProcessorFactory into updateRequestProcessorChain "stored_sig"
[junit4:junit4]   2> 1720 T1794 oasup.UpdateRequestProcessorChain.init inserting DistributedUpdateProcessorFactory into updateRequestProcessorChain "distrib-dup-test-chain-implicit"
[junit4:junit4]   2> 1720 T1794 oasc.RequestHandlers.initHandlersFromConfig created standard: solr.StandardRequestHandler
[junit4:junit4]   2> 1720 T1794 oasc.RequestHandlers.initHandlersFromConfig created /get: solr.RealTimeGetHandler
[junit4:junit4]   2> 1721 T1794 oasc.RequestHandlers.initHandlersFromConfig adding lazy requestHandler: solr.ReplicationHandler
[junit4:junit4]   2> 1721 T1794 oasc.RequestHandlers.initHandlersFromConfig created /replication: solr.ReplicationHandler
[junit4:junit4]   2> 1721 T1794 oasc.RequestHandlers.initHandlersFromConfig created /update: solr.UpdateRequestHandler
[junit4:junit4]   2> 1721 T1794 oasc.RequestHandlers.initHandlersFromConfig created /admin/: org.apache.solr.handler.admin.AdminHandlers
[junit4:junit4]   2> 1730 T1794 oashl.XMLLoader.init xsltCacheLifetimeSeconds=60
[junit4:junit4]   2> 1736 T1794 oass.SolrIndexSearcher.<init> Opening Searcher@26ab0044 main
[junit4:junit4]   2> 1736 T1794 oasu.CommitTracker.<init> Hard AutoCommit: disabled
[junit4:junit4]   2> 1736 T1794 oasu.CommitTracker.<init> Soft AutoCommit: disabled
[junit4:junit4]   2> 1739 T1795 oasc.SolrCore.registerSearcher [collection1] Registered new searcher Searcher@26ab0044 main{StandardDirectoryReader(segments_1:1)}
[junit4:junit4]   2> 1739 T1794 oasc.ZkController.publish publishing core=collection1 state=down
[junit4:junit4]   2> 1740 T1794 oasc.ZkController.publish numShards not found on descriptor - reading it from system property
[junit4:junit4]   2> 2269 T1792 oascc.ZkStateReader.updateClusterState Updating cloud state from ZooKeeper... 
[junit4:junit4]   2> 2270 T1792 oasc.Overseer$ClusterStateUpdater.updateState Update state numShards=1 message={
[junit4:junit4]   2> 	  "operation":"state",
[junit4:junit4]   2> 	  "core_node_name":null,
[junit4:junit4]   2> 	  "numShards":"1",
[junit4:junit4]   2> 	  "shard":null,
[junit4:junit4]   2> 	  "roles":null,
[junit4:junit4]   2> 	  "state":"down",
[junit4:junit4]   2> 	  "core":"collection1",
[junit4:junit4]   2> 	  "collection":"control_collection",
[junit4:junit4]   2> 	  "node_name":"127.0.0.1:14488_rf_vkg",
[junit4:junit4]   2> 	  "base_url":"http://127.0.0.1:14488/rf_vkg"}
[junit4:junit4]   2> 2270 T1792 oasc.Overseer$ClusterStateUpdater.createCollection Create collection control_collection with numShards 1
[junit4:junit4]   2> 2271 T1792 oasc.Overseer$ClusterStateUpdater.updateState Assigning new node to shard shard=shard1
[junit4:junit4]   2> 2275 T1791 oascc.ZkStateReader$2.process A cluster state change: WatchedEvent state:SyncConnected type:NodeDataChanged path:/clusterstate.json, has occurred - updating... (live nodes size: 1)
[junit4:junit4]   2> 2742 T1794 oasc.CoreContainer.registerCore registering core: collection1
[junit4:junit4]   2> 2742 T1794 oasc.ZkController.register Register replica - core:collection1 address:http://127.0.0.1:14488/rf_vkg collection:control_collection shard:shard1
[junit4:junit4]   2> 2743 T1794 oascc.SolrZkClient.makePath makePath: /collections/control_collection/leader_elect/shard1/election
[junit4:junit4]   2> 2759 T1774 oazs.PrepRequestProcessor.pRequest Got user-level KeeperException when processing sessionid:0x13d7fea7cd80003 type:delete cxid:0x82 zxid:0x35 txntype:-1 reqpath:n/a Error Path:/solr/collections/control_collection/leaders Error:KeeperErrorCode = NoNode for /solr/collections/control_collection/leaders
[junit4:junit4]   2> 2760 T1794 oasc.ShardLeaderElectionContext.runLeaderProcess Running the leader process.
[junit4:junit4]   2> 2761 T1774 oazs.PrepRequestProcessor.pRequest Got user-level KeeperException when processing sessionid:0x13d7fea7cd80003 type:create cxid:0x83 zxid:0x36 txntype:-1 reqpath:n/a Error Path:/solr/overseer Error:KeeperErrorCode = NodeExists for /solr/overseer
[junit4:junit4]   2> 2772 T1794 oasc.ShardLeaderElectionContext.waitForReplicasToComeUp Enough replicas found to continue.
[junit4:junit4]   2> 2772 T1794 oasc.ShardLeaderElectionContext.runLeaderProcess I may be the new leader - try and sync
[junit4:junit4]   2> 2772 T1794 oasc.SyncStrategy.sync Sync replicas to http://127.0.0.1:14488/rf_vkg/collection1/
[junit4:junit4]   2> 2773 T1794 oasc.SyncStrategy.syncReplicas Sync Success - now sync replicas to me
[junit4:junit4]   2> 2773 T1794 oasc.SyncStrategy.syncToMe http://127.0.0.1:14488/rf_vkg/collection1/ has no replicas
[junit4:junit4]   2> 2773 T1794 oasc.ShardLeaderElectionContext.runLeaderProcess I am the new leader: http://127.0.0.1:14488/rf_vkg/collection1/
[junit4:junit4]   2> 2773 T1794 oascc.SolrZkClient.makePath makePath: /collections/control_collection/leaders/shard1
[junit4:junit4]   2> 2778 T1774 oazs.PrepRequestProcessor.pRequest Got user-level KeeperException when processing sessionid:0x13d7fea7cd80003 type:create cxid:0x8e zxid:0x3a txntype:-1 reqpath:n/a Error Path:/solr/overseer Error:KeeperErrorCode = NodeExists for /solr/overseer
[junit4:junit4]   2> 3779 T1792 oascc.ZkStateReader.updateClusterState Updating cloud state from ZooKeeper... 
[junit4:junit4]   2> 3827 T1791 oascc.ZkStateReader$2.process A cluster state change: WatchedEvent state:SyncConnected type:NodeDataChanged path:/clusterstate.json, has occurred - updating... (live nodes size: 1)
[junit4:junit4]   2> 3859 T1794 oasc.ZkController.register We are http://127.0.0.1:14488/rf_vkg/collection1/ and leader is http://127.0.0.1:14488/rf_vkg/collection1/
[junit4:junit4]   2> 3859 T1794 oasc.ZkController.register No LogReplay needed for core=collection1 baseURL=http://127.0.0.1:14488/rf_vkg
[junit4:junit4]   2> 3859 T1794 oasc.ZkController.checkRecovery I am the leader, no recovery necessary
[junit4:junit4]   2> 3859 T1794 oasc.ZkController.publish publishing core=collection1 state=active
[junit4:junit4]   2> 3860 T1794 oasc.ZkController.publish numShards not found on descriptor - reading it from system property
[junit4:junit4]   2> 3862 T1794 oascc.ZkStateReader.updateClusterState Updating cloud state from ZooKeeper... 
[junit4:junit4]   2> 3863 T1769 oass.SolrDispatchFilter.init user.dir=/usr/home/hudson/hudson-slave/workspace/Lucene-Solr-Tests-4.x-java7/solr/build/solr-core/test/J1
[junit4:junit4]   2> 3864 T1769 oass.SolrDispatchFilter.init SolrDispatchFilter.init() done
[junit4:junit4]   2> 3864 T1769 oascsi.HttpClientUtil.createClient Creating new http client, config:maxConnections=128&maxConnectionsPerHost=32&followRedirects=false
[junit4:junit4]   2> 3880 T1769 oascsi.HttpClientUtil.createClient Creating new http client, config:
[junit4:junit4]   2> 3881 T1769 oaz.ZooKeeper.<init> Initiating client connection, connectString=127.0.0.1:14485/solr sessionTimeout=10000 watcher=org.apache.solr.common.cloud.ConnectionManager@c5ea741
[junit4:junit4]   2> 3882 T1769 oascc.ConnectionManager.waitForConnected Waiting for client to connect to ZooKeeper
[junit4:junit4]   2> 3883 T1797 oaz.ClientCnxn$SendThread.logStartConnect Opening socket connection to server localhost/127.0.0.1:14485. Will not attempt to authenticate using SASL (access denied ("javax.security.auth.AuthPermission" "getLoginConfiguration"))
[junit4:junit4]   2> 3883 T1797 oaz.ClientCnxn$SendThread.primeConnection Socket connection established to localhost/127.0.0.1:14485, initiating session
[junit4:junit4]   2> 3883 T1771 oazs.NIOServerCnxnFactory.run Accepted socket connection from /140.211.11.196:10207
[junit4:junit4]   2> 3884 T1771 oazs.ZooKeeperServer.processConnectRequest Client attempting to establish new session at /140.211.11.196:10207
[junit4:junit4]   2> 3885 T1773 oazs.ZooKeeperServer.finishSessionInit Established session 0x13d7fea7cd80004 with negotiated timeout 10000 for client /140.211.11.196:10207
[junit4:junit4]   2> 3885 T1797 oaz.ClientCnxn$SendThread.onConnected Session establishment complete on server localhost/127.0.0.1:14485, sessionid = 0x13d7fea7cd80004, negotiated timeout = 10000
[junit4:junit4]   2> 3885 T1798 oascc.ConnectionManager.process Watcher org.apache.solr.common.cloud.ConnectionManager@c5ea741 name:ZooKeeperConnection Watcher:127.0.0.1:14485/solr got event WatchedEvent state:SyncConnected type:None path:null path:null type:None
[junit4:junit4]   2> 3886 T1769 oascc.ConnectionManager.waitForConnected Client is connected to ZooKeeper
[junit4:junit4]   2> 3887 T1769 oascc.ZkStateReader.createClusterStateWatchersAndUpdate Updating cluster state from ZooKeeper... 
[junit4:junit4]   2> 3889 T1769 oasc.ChaosMonkey.monkeyLog monkey: init - expire sessions:true cause connection loss:true
[junit4:junit4]   2> 4084 T1769 oejs.Server.doStart jetty-8.1.8.v20121106
[junit4:junit4]   2> 4087 T1769 oejs.AbstractConnector.doStart Started SocketConnector@127.0.0.1:53616
[junit4:junit4]   2> 4087 T1769 oass.SolrDispatchFilter.init SolrDispatchFilter.init()
[junit4:junit4]   2> 4088 T1769 oasc.SolrResourceLoader.locateSolrHome JNDI not configured for solr (NoInitialContextEx)
[junit4:junit4]   2> 4088 T1769 oasc.SolrResourceLoader.locateSolrHome using system property solr.solr.home: /usr/home/hudson/hudson-slave/workspace/Lucene-Solr-Tests-4.x-java7/solr/build/solr-core/test/J1/./org.apache.solr.cloud.SyncSliceTest-jetty1-1363650710524
[junit4:junit4]   2> 4089 T1769 oasc.CoreContainer$Initializer.initialize looking for solr config file: /usr/home/hudson/hudson-slave/workspace/Lucene-Solr-Tests-4.x-java7/solr/build/solr-core/test/J1/./org.apache.solr.cloud.SyncSliceTest-jetty1-1363650710524/solr.xml
[junit4:junit4]   2> 4089 T1769 oasc.CoreContainer.<init> New CoreContainer 892101868
[junit4:junit4]   2> 4090 T1769 oasc.CoreContainer.load Loading CoreContainer using Solr Home: '/usr/home/hudson/hudson-slave/workspace/Lucene-Solr-Tests-4.x-java7/solr/build/solr-core/test/J1/./org.apache.solr.cloud.SyncSliceTest-jetty1-1363650710524/'
[junit4:junit4]   2> 4091 T1769 oasc.SolrResourceLoader.<init> new SolrResourceLoader for directory: '/usr/home/hudson/hudson-slave/workspace/Lucene-Solr-Tests-4.x-java7/solr/build/solr-core/test/J1/./org.apache.solr.cloud.SyncSliceTest-jetty1-1363650710524/'
[junit4:junit4]   2> 4154 T1769 oashc.HttpShardHandlerFactory.getParameter Setting socketTimeout to: 120000
[junit4:junit4]   2> 4154 T1769 oashc.HttpShardHandlerFactory.getParameter Setting urlScheme to: http://
[junit4:junit4]   2> 4155 T1769 oashc.HttpShardHandlerFactory.getParameter Setting connTimeout to: 15000
[junit4:junit4]   2> 4155 T1769 oashc.HttpShardHandlerFactory.getParameter Setting maxConnectionsPerHost to: 20
[junit4:junit4]   2> 4156 T1769 oashc.HttpShardHandlerFactory.getParameter Setting corePoolSize to: 0
[junit4:junit4]   2> 4156 T1769 oashc.HttpShardHandlerFactory.getParameter Setting maximumPoolSize to: 2147483647
[junit4:junit4]   2> 4157 T1769 oashc.HttpShardHandlerFactory.getParameter Setting maxThreadIdleTime to: 5
[junit4:junit4]   2> 4157 T1769 oashc.HttpShardHandlerFactory.getParameter Setting sizeOfQueue to: -1
[junit4:junit4]   2> 4158 T1769 oashc.HttpShardHandlerFactory.getParameter Setting fairnessPolicy to: false
[junit4:junit4]   2> 4158 T1769 oascsi.HttpClientUtil.createClient Creating new http client, config:maxConnectionsPerHost=20&maxConnections=10000&socketTimeout=120000&connTimeout=15000&retry=false
[junit4:junit4]   2> 4180 T1769 oasc.CoreContainer.load Registering Log Listener
[junit4:junit4]   2> 4200 T1769 oasc.CoreContainer.initZooKeeper Zookeeper client=127.0.0.1:14485/solr
[junit4:junit4]   2> 4201 T1769 oasc.ZkController.checkChrootPath zkHost includes chroot
[junit4:junit4]   2> 4201 T1769 oaz.ZooKeeper.<init> Initiating client connection, connectString=127.0.0.1:14485 sessionTimeout=60000 watcher=org.apache.solr.common.cloud.ConnectionManager@439483
[junit4:junit4]   2> 4202 T1769 oascc.ConnectionManager.waitForConnected Waiting for client to connect to ZooKeeper
[junit4:junit4]   2> 4203 T1808 oaz.ClientCnxn$SendThread.logStartConnect Opening socket connection to server localhost/127.0.0.1:14485. Will not attempt to authenticate using SASL (access denied ("javax.security.auth.AuthPermission" "getLoginConfiguration"))
[junit4:junit4]   2> 4203 T1808 oaz.ClientCnxn$SendThread.primeConnection Socket connection established to localhost/127.0.0.1:14485, initiating session
[junit4:junit4]   2> 4204 T1771 oazs.NIOServerCnxnFactory.run Accepted socket connection from /140.211.11.196:42522
[junit4:junit4]   2> 4204 T1771 oazs.ZooKeeperServer.processConnectRequest Client attempting to establish new session at /140.211.11.196:42522
[junit4:junit4]   2> 4206 T1773 oazs.ZooKeeperServer.finishSessionInit Established session 0x13d7fea7cd80005 with negotiated timeout 20000 for client /140.211.11.196:42522
[junit4:junit4]   2> 4206 T1808 oaz.ClientCnxn$SendThread.onConnected Session establishment complete on server localhost/127.0.0.1:14485, sessionid = 0x13d7fea7cd80005, negotiated timeout = 20000
[junit4:junit4]   2> 4206 T1809 oascc.ConnectionManager.process Watcher org.apache.solr.common.cloud.ConnectionManager@439483 name:ZooKeeperConnection Watcher:127.0.0.1:14485 got event WatchedEvent state:SyncConnected type:None path:null path:null type:None
[junit4:junit4]   2> 4206 T1769 oascc.ConnectionManager.waitForConnected Client is connected to ZooKeeper
[junit4:junit4]   2> 4208 T1774 oazs.PrepRequestProcessor.pRequest2Txn Processed session termination for sessionid: 0x13d7fea7cd80005
[junit4:junit4]   2> 4209 T1809 oaz.ClientCnxn$EventThread.run EventThread shut down
[junit4:junit4]   2> 4209 T1771 oazs.NIOServerCnxn.closeSock Closed socket connection for client /140.211.11.196:42522 which had sessionid 0x13d7fea7cd80005
[junit4:junit4]   2> 4209 T1769 oaz.ZooKeeper.close Session: 0x13d7fea7cd80005 closed
[junit4:junit4]   2> 4210 T1769 oascsi.HttpClientUtil.createClient Creating new http client, config:maxConnections=500&maxConnectionsPerHost=16&socketTimeout=120000&connTimeout=15000
[junit4:junit4]   2> 4222 T1769 oaz.ZooKeeper.<init> Initiating client connection, connectString=127.0.0.1:14485/solr sessionTimeout=30000 watcher=org.apache.solr.common.cloud.ConnectionManager@3efb82c3
[junit4:junit4]   2> 4223 T1769 oascc.ConnectionManager.waitForConnected Waiting for client to connect to ZooKeeper
[junit4:junit4]   2> 4223 T1810 oaz.ClientCnxn$SendThread.logStartConnect Opening socket connection to server localhost/127.0.0.1:14485. Will not attempt to authenticate using SASL (access denied ("javax.security.auth.AuthPermission" "getLoginConfiguration"))
[junit4:junit4]   2> 4224 T1810 oaz.ClientCnxn$SendThread.primeConnection Socket connection established to localhost/127.0.0.1:14485, initiating session
[junit4:junit4]   2> 4224 T1771 oazs.NIOServerCnxnFactory.run Accepted socket connection from /140.211.11.196:24656
[junit4:junit4]   2> 4224 T1771 oazs.ZooKeeperServer.processConnectRequest Client attempting to establish new session at /140.211.11.196:24656
[junit4:junit4]   2> 4226 T1773 oazs.ZooKeeperServer.finishSessionInit Established session 0x13d7fea7cd80006 with negotiated timeout 20000 for client /140.211.11.196:24656
[junit4:junit4]   2> 4226 T1810 oaz.ClientCnxn$SendThread.onConnected Session establishment complete on server localhost/127.0.0.1:14485, sessionid = 0x13d7fea7cd80006, negotiated timeout = 20000
[junit4:junit4]   2> 4226 T1811 oascc.ConnectionManager.process Watcher org.apache.solr.common.cloud.ConnectionManager@3efb82c3 name:ZooKeeperConnection Watcher:127.0.0.1:14485/solr got event WatchedEvent state:SyncConnected type:None path:null path:null type:None
[junit4:junit4]   2> 4226 T1769 oascc.ConnectionManager.waitForConnected Client is connected to ZooKeeper
[junit4:junit4]   2> 4227 T1774 oazs.PrepRequestProcessor.pRequest Got user-level KeeperException when processing sessionid:0x13d7fea7cd80006 type:create cxid:0x1 zxid:0x48 txntype:-1 reqpath:n/a Error Path:/solr/overseer Error:KeeperErrorCode = NodeExists for /solr/overseer
[junit4:junit4]   2> 4229 T1774 oazs.PrepRequestProcessor.pRequest Got user-level KeeperException when processing sessionid:0x13d7fea7cd80006 type:create cxid:0x3 zxid:0x49 txntype:-1 reqpath:n/a Error Path:/solr/overseer Error:KeeperErrorCode = NodeExists for /solr/overseer
[junit4:junit4]   2> 4238 T1769 oascc.ZkStateReader.createClusterStateWatchersAndUpdate Updating cluster state from ZooKeeper... 
[junit4:junit4]   2> 5241 T1769 oasc.ZkController.createEphemeralLiveNode Register node as live in ZooKeeper:/live_nodes/127.0.0.1:53616_rf_vkg
[junit4:junit4]   2> 5242 T1774 oazs.PrepRequestProcessor.pRequest Got user-level KeeperException when processing sessionid:0x13d7fea7cd80006 type:delete cxid:0xd zxid:0x4a txntype:-1 reqpath:n/a Error Path:/solr/live_nodes/127.0.0.1:53616_rf_vkg Error:KeeperErrorCode = NoNode for /solr/live_nodes/127.0.0.1:53616_rf_vkg
[junit4:junit4]   2> 5244 T1769 oascc.SolrZkClient.makePath makePath: /live_nodes/127.0.0.1:53616_rf_vkg
[junit4:junit4]   2> 5248 T1791 oascc.ZkStateReader$3.process Updating live nodes... (2)
[junit4:junit4]   2> 5248 T1798 oascc.ZkStateReader$3.process Updating live nodes... (2)
[junit4:junit4]   2> 5248 T1791 oascc.ZkStateReader$2.process A cluster state change: WatchedEvent state:SyncConnected type:NodeChildrenChanged path:/live_nodes, has occurred - updating... (live nodes size: 2)
[junit4:junit4]   2> 5248 T1811 oascc.ZkStateReader$3.process Updating live nodes... (2)
[junit4:junit4]   2> 5263 T1812 oasc.CoreContainer.create Creating SolrCore 'collection1' using instanceDir: /usr/home/hudson/hudson-slave/workspace/Lucene-Solr-Tests-4.x-java7/solr/build/solr-core/test/J1/./org.apache.solr.cloud.SyncSliceTest-jetty1-1363650710524/collection1
[junit4:junit4]   2> 5263 T1812 oasc.ZkController.createCollectionZkNode Check for collection zkNode:collection1
[junit4:junit4]   2> 5264 T1812 oasc.ZkController.createCollectionZkNode Collection zkNode exists
[junit4:junit4]   2> 5264 T1812 oasc.ZkController.readConfigName Load collection config from:/collections/collection1
[junit4:junit4]   2> 5266 T1812 oasc.SolrResourceLoader.<init> new SolrResourceLoader for directory: '/usr/home/hudson/hudson-slave/workspace/Lucene-Solr-Tests-4.x-java7/solr/build/solr-core/test/J1/./org.apache.solr.cloud.SyncSliceTest-jetty1-1363650710524/collection1/'
[junit4:junit4]   2> 5267 T1812 oasc.SolrResourceLoader.replaceClassLoader Adding 'file:/usr/home/hudson/hudson-slave/workspace/Lucene-Solr-Tests-4.x-java7/solr/build/solr-core/test/J1/org.apache.solr.cloud.SyncSliceTest-jetty1-1363650710524/collection1/lib/classes/' to classloader
[junit4:junit4]   2> 5267 T1812 oasc.SolrResourceLoader.replaceClassLoader Adding 'file:/usr/home/hudson/hudson-slave/workspace/Lucene-Solr-Tests-4.x-java7/solr/build/solr-core/test/J1/org.apache.solr.cloud.SyncSliceTest-jetty1-1363650710524/collection1/lib/README' to classloader
[junit4:junit4]   2> 5317 T1812 oasc.SolrConfig.<init> Using Lucene MatchVersion: LUCENE_43
[junit4:junit4]   2> 5338 T1792 oascc.ZkStateReader.updateClusterState Updating cloud state from ZooKeeper... 
[junit4:junit4]   2> 5339 T1792 oasc.Overseer$ClusterStateUpdater.updateState Update state numShards=1 message={
[junit4:junit4]   2> 	  "operation":"state",
[junit4:junit4]   2> 	  "core_node_name":"127.0.0.1:14488_rf_vkg_collection1",
[junit4:junit4]   2> 	  "numShards":"1",
[junit4:junit4]   2> 	  "shard":"shard1",
[junit4:junit4]   2> 	  "roles":null,
[junit4:junit4]   2> 	  "state":"active",
[junit4:junit4]   2> 	  "core":"collection1",
[junit4:junit4]   2> 	  "collection":"control_collection",
[junit4:junit4]   2> 	  "node_name":"127.0.0.1:14488_rf_vkg",
[junit4:junit4]   2> 	  "base_url":"http://127.0.0.1:14488/rf_vkg"}
[junit4:junit4]   2> 5353 T1798 oascc.ZkStateReader$2.process A cluster state change: WatchedEvent state:SyncConnected type:NodeDataChanged path:/clusterstate.json, has occurred - updating... (live nodes size: 2)
[junit4:junit4]   2> 5353 T1791 oascc.ZkStateReader$2.process A cluster state change: WatchedEvent state:SyncConnected type:NodeDataChanged path:/clusterstate.json, has occurred - updating... (live nodes size: 2)
[junit4:junit4]   2> 5353 T1811 oascc.ZkStateReader$2.process A cluster state change: WatchedEvent state:SyncConnected type:NodeDataChanged path:/clusterstate.json, has occurred - updating... (live nodes size: 2)
[junit4:junit4]   2> 5379 T1812 oasc.SolrConfig.<init> Loaded SolrConfig: solrconfig.xml
[junit4:junit4]   2> 5479 T1812 oass.IndexSchema.readSchema Reading Solr Schema
[junit4:junit4]   2> 5485 T1812 oass.IndexSchema.readSchema Schema name=test
[junit4:junit4]   2> 6104 T1812 oass.OpenExchangeRatesOrgProvider.init Initialized with rates=open-exchange-rates.json, refreshInterval=1440.
[junit4:junit4]   2> 6112 T1812 oass.IndexSchema.readSchema default search field in schema is text
[junit4:junit4]   2> 6114 T1812 oass.IndexSchema.readSchema unique key field: id
[junit4:junit4]   2> 6124 T1812 oass.FileExchangeRateProvider.reload Reloading exchange rates from file currency.xml
[junit4:junit4]   2> 6128 T1812 oass.FileExchangeRateProvider.reload Reloading exchange rates from file currency.xml
[junit4:junit4]   2> 6131 T1812 oass.OpenExchangeRatesOrgProvider.reload Reloading exchange rates from open-exchange-rates.json
[junit4:junit4]   2> 6132 T1812 oass.OpenExchangeRatesOrgProvider$OpenExchangeRates.<init> WARNING Unknown key IMPORTANT NOTE
[junit4:junit4]   2> 6132 T1812 oass.OpenExchangeRatesOrgProvider$OpenExchangeRates.<init> WARNING Expected key, got STRING
[junit4:junit4]   2> 6132 T1812 oass.OpenExchangeRatesOrgProvider.reload Reloading exchange rates from open-exchange-rates.json
[junit4:junit4]   2> 6133 T1812 oass.OpenExchangeRatesOrgProvider$OpenExchangeRates.<init> WARNING Unknown key IMPORTANT NOTE
[junit4:junit4]   2> 6133 T1812 oass.OpenExchangeRatesOrgProvider$OpenExchangeRates.<init> WARNING Expected key, got STRING
[junit4:junit4]   2> 6134 T1812 oasc.SolrCore.initDirectoryFactory solr.NRTCachingDirectoryFactory
[junit4:junit4]   2> 6134 T1812 oasc.SolrCore.<init> [collection1] Opening new SolrCore at /usr/home/hudson/hudson-slave/workspace/Lucene-Solr-Tests-4.x-java7/solr/build/solr-core/test/J1/./org.apache.solr.cloud.SyncSliceTest-jetty1-1363650710524/collection1/, dataDir=./org.apache.solr.cloud.SyncSliceTest-1363650706640/jetty1/
[junit4:junit4]   2> 6134 T1812 oasc.JmxMonitoredMap.<init> JMX monitoring is enabled. Adding Solr mbeans to JMX Server: com.sun.jmx.mbeanserver.JmxMBeanServer@740ba142
[junit4:junit4]   2> 6134 T1812 oasc.SolrCore.initDirectoryFactory solr.NRTCachingDirectoryFactory
[junit4:junit4]   2> 6135 T1812 oasc.CachingDirectoryFactory.get return new directory for /usr/home/hudson/hudson-slave/workspace/Lucene-Solr-Tests-4.x-java7/solr/build/solr-core/test/J1/org.apache.solr.cloud.SyncSliceTest-1363650706640/jetty1 forceNew: false
[junit4:junit4]   2> 6135 T1812 oasc.SolrCore.getNewIndexDir New index directory detected: old=null new=./org.apache.solr.cloud.SyncSliceTest-1363650706640/jetty1/index/
[junit4:junit4]   2> 6136 T1812 oasc.SolrCore.initIndex WARNING [collection1] Solr index directory './org.apache.solr.cloud.SyncSliceTest-1363650706640/jetty1/index' doesn't exist. Creating new index...
[junit4:junit4]   2> 6136 T1812 oasc.CachingDirectoryFactory.get return new directory for /usr/home/hudson/hudson-slave/workspace/Lucene-Solr-Tests-4.x-java7/solr/build/solr-core/test/J1/org.apache.solr.cloud.SyncSliceTest-1363650706640/jetty1/index forceNew: false
[junit4:junit4]   2> 6142 T1812 oasc.SolrDeletionPolicy.onCommit SolrDeletionPolicy.onCommit: commits:num=1
[junit4:junit4]   2> 		commit{dir=NRTCachingDirectory(org.apache.lucene.store.NIOFSDirectory@/usr/home/hudson/hudson-slave/workspace/Lucene-Solr-Tests-4.x-java7/solr/build/solr-core/test/J1/org.apache.solr.cloud.SyncSliceTest-1363650706640/jetty1/index lockFactory=org.apache.lucene.store.NativeFSLockFactory@4ed52565; maxCacheMB=48.0 maxMergeSizeMB=4.0),segFN=segments_1,generation=1,filenames=[segments_1]
[junit4:junit4]   2> 6142 T1812 oasc.SolrDeletionPolicy.updateCommits newest commit = 1[segments_1]
[junit4:junit4]   2> 6144 T1812 oasup.UpdateRequestProcessorChain.init inserting DistributedUpdateProcessorFactory into updateRequestProcessorChain "dedupe"
[junit4:junit4]   2> 6145 T1812 oasup.UpdateRequestProcessorChain.init inserting DistributedUpdateProcessorFactory into updateRequestProcessorChain "stored_sig"
[junit4:junit4]   2> 6145 T1812 oasup.UpdateRequestProcessorChain.init inserting DistributedUpdateProcessorFactory into updateRequestProcessorChain "distrib-dup-test-chain-implicit"
[junit4:junit4]   2> 6145 T1812 oasc.RequestHandlers.initHandlersFromConfig created standard: solr.StandardRequestHandler
[junit4:junit4]   2> 6146 T1812 oasc.RequestHandlers.initHandlersFromConfig created /get: solr.RealTimeGetHandler
[junit4:junit4]   2> 6146 T1812 oasc.RequestHandlers.initHandlersFromConfig adding lazy requestHandler: solr.ReplicationHandler
[junit4:junit4]   2> 6146 T1812 oasc.RequestHandlers.initHandlersFromConfig created /replication: solr.ReplicationHandler
[junit4:junit4]   2> 6147 T1812 oasc.RequestHandlers.initHandlersFromConfig created /update: solr.UpdateRequestHandler
[junit4:junit4]   2> 6147 T1812 oasc.RequestHandlers.initHandlersFromConfig created /admin/: org.apache.solr.handler.admin.AdminHandlers
[junit4:junit4]   2> 6155 T1812 oashl.XMLLoader.init xsltCacheLifetimeSeconds=60
[junit4:junit4]   2> 6160 T1812 oass.SolrIndexSearcher.<init> Opening Searcher@71678175 main
[junit4:junit4]   2> 6161 T1812 oasu.CommitTracker.<init> Hard AutoCommit: disabled
[junit4:junit4]   2> 6161 T1812 oasu.CommitTracker.<init> Soft AutoCommit: disabled
[junit4:junit4]   2> 6164 T1813 oasc.SolrCore.registerSearcher [collection1] Registered new searcher Searcher@71678175 main{StandardDirectoryReader(segments_1:1)}
[junit4:junit4]   2> 6166 T1812 oasc.ZkController.publish publishing core=collection1 state=down
[junit4:junit4]   2> 6166 T1812 oasc.ZkController.publish numShards not found on descriptor - reading it from system property
[junit4:junit4]   2> 6858 T1792 oascc.ZkStateReader.updateClusterState Updating cloud state from ZooKeeper... 
[junit4:junit4]   2> 6859 T1792 oasc.Overseer$ClusterStateUpdater.updateState Update state numShards=1 message={
[junit4:junit4]   2> 	  "operation":"state",
[junit4:junit4]   2> 	  "core_node_name":null,
[junit4:junit4]   2> 	  "numShards":"1",
[junit4:junit4]   2> 	  "shard":null,
[junit4:junit4]   2> 	  "roles":null,
[junit4:junit4]   2> 	  "state":"down",
[junit4:junit4]   2> 	  "core":"collection1",
[junit4:junit4]   2> 	  "collection":"collection1",
[junit4:junit4]   2> 	  "node_name":"127.0.0.1:53616_rf_vkg",
[junit4:junit4]   2> 	  "base_url":"http://127.0.0.1:53616/rf_vkg"}
[junit4:junit4]   2> 6859 T1792 oasc.Overseer$ClusterStateUpdater.createCollection Create collection collection1 with numShards 1
[junit4:junit4]   2> 6859 T1792 oasc.Overseer$ClusterStateUpdater.updateState Assigning new node to shard shard=shard1
[junit4:junit4]   2> 6891 T1811 oascc.ZkStateReader$2.process A cluster state change: WatchedEvent state:SyncConnected type:NodeDataChanged path:/clusterstate.json, has occurred - updating... (live nodes size: 2)
[junit4:junit4]   2> 6891 T1798 oascc.ZkStateReader$2.process A cluster state change: WatchedEvent state:SyncConnected type:NodeDataChanged path:/clusterstate.json, has occurred - updating... (live nodes size: 2)
[junit4:junit4]   2> 6891 T1791 oascc.ZkStateReader$2.process A cluster state change: WatchedEvent state:SyncConnected type:NodeDataChanged path:/clusterstate.json, has occurred - updating... (live nodes size: 2)
[junit4:junit4]   2> 7168 T1812 oasc.CoreContainer.registerCore registering core: collection1
[junit4:junit4]   2> 7168 T1812 oasc.ZkController.register Register replica - core:collection1 address:http://127.0.0.1:53616/rf_vkg collection:collection1 shard:shard1
[junit4:junit4]   2> 7169 T1812 oascc.SolrZkClient.makePath makePath: /collections/collection1/leader_elect/shard1/election
[junit4:junit4]   2> 7185 T1774 oazs.PrepRequestProcessor.pRequest Got user-level KeeperException when processing sessionid:0x13d7fea7cd80006 type:delete cxid:0x4a zxid:0x5a txntype:-1 reqpath:n/a Error Path:/solr/collections/collection1/leaders Error:KeeperErrorCode = NoNode for /solr/collections/collection1/leaders
[junit4:junit4]   2> 7186 T1812 oasc.ShardLeaderElectionContext.runLeaderProcess Running the leader process.
[junit4:junit4]   2> 7187 T1774 oazs.PrepRequestProcessor.pRequest Got user-level KeeperException when processing sessionid:0x13d7fea7cd80006 type:create cxid:0x4b zxid:0x5b txntype:-1 reqpath:n/a Error Path:/solr/overseer Error:KeeperErrorCode = NodeExists for /solr/overseer
[junit4:junit4]   2> 7197 T1812 oasc.ShardLeaderElectionContext.waitForReplicasToComeUp Enough replicas found to continue.
[junit4:junit4]   2> 7197 T1812 oasc.ShardLeaderElectionContext.runLeaderProcess I may be the new leader - try and sync
[junit4:junit4]   2> 7198 T1812 oasc.SyncStrategy.sync Sync replicas to http://127.0.0.1:53616/rf_vkg/collection1/
[junit4:junit4]   2> 7198 T1812 oasc.SyncStrategy.syncReplicas Sync Success - now sync replicas to me
[junit4:junit4]   2> 7198 T1812 oasc.SyncStrategy.syncToMe http://127.0.0.1:53616/rf_vkg/collection1/ has no replicas
[junit4:junit4]   2> 7198 T1812 oasc.ShardLeaderElectionContext.runLeaderProcess I am the new leader: http://127.0.0.1:53616/rf_vkg/collection1/
[junit4:junit4]   2> 7198 T1812 oascc.SolrZkClient.makePath makePath: /collections/collection1/leaders/shard1
[junit4:junit4]   2> 7202 T1774 oazs.PrepRequestProcessor.pRequest Got user-level KeeperException when processing sessionid:0x13d7fea7cd80006 type:create cxid:0x56 zxid:0x5f txntype:-1 reqpath:n/a Error Path:/solr/overseer Error:KeeperErrorCode = NodeExists for /solr/overseer
[junit4:junit4]   2> 8408 T1792 oascc.ZkStateReader.updateClusterState Updating cloud state from ZooKeeper... 
[junit4:junit4]   2> 8427 T1791 oascc.ZkStateReader$2.process A cluster state change: WatchedEvent state:SyncConnected type:NodeDataChanged path:/clusterstate.json, has occurred - updating... (live nodes size: 2)
[junit4:junit4]   2> 8427 T1798 oascc.ZkStateReader$2.process A cluster state change: WatchedEvent state:SyncConnected type:NodeDataChanged path:/clusterstate.json, has occurred - updating... (live nodes size: 2)
[junit4:junit4]   2> 8427 T1811 oascc.ZkStateReader$2.process A cluster state change: WatchedEvent state:SyncConnected type:NodeDataChanged path:/clusterstate.json, has occurred - updating... (live nodes size: 2)
[junit4:junit4]   2> 8429 T1812 oasc.ZkController.register We are http://127.0.0.1:53616/rf_vkg/collection1/ and leader is http://127.0.0.1:53616/rf_vkg/collection1/
[junit4:junit4]   2> 8429 T1812 oasc.ZkController.register No LogReplay needed for core=collection1 baseURL=http://127.0.0.1:53616/rf_vkg
[junit4:junit4]   2> 8429 T1812 oasc.ZkController.checkRecovery I am the leader, no recovery necessary
[junit4:junit4]   2> 8429 T1812 oasc.ZkController.publish publishing core=collection1 state=active
[junit4:junit4]   2> 8430 T1812 oasc.ZkController.publish numShards not found on descriptor - reading it from system property
[junit4:junit4]   2> 8431 T1812 oascc.ZkStateReader.updateClusterState Updating cloud state from ZooKeeper... 
[junit4:junit4]   2> 8432 T1769 oass.SolrDispatchFilter.init user.dir=/usr/home/hudson/hudson-slave/workspace/Lucene-Solr-Tests-4.x-java7/solr/build/solr-core/test/J1
[junit4:junit4]   2> 8433 T1769 oass.SolrDispatchFilter.init SolrDispatchFilter.init() done
[junit4:junit4]   2> 8433 T1769 oascsi.HttpClientUtil.createClient Creating new http client, config:maxConnections=128&maxConnectionsPerHost=32&followRedirects=false
[junit4:junit4]   2> 8640 T1769 oejs.Server.doStart jetty-8.1.8.v20121106
[junit4:junit4]   2> 8644 T1769 oejs.AbstractConnector.doStart Started SocketConnector@127.0.0.1:25448
[junit4:junit4]   2> 8645 T1769 oass.SolrDispatchFilter.init SolrDispatchFilter.init()
[junit4:junit4]   2> 8645 T1769 oasc.SolrResourceLoader.locateSolrHome JNDI not configured for solr (NoInitialContextEx)
[junit4:junit4]   2> 8645 T1769 oasc.SolrResourceLoader.locateSolrHome using system property solr.solr.home: /usr/home/hudson/hudson-slave/workspace/Lucene-Solr-Tests-4.x-java7/solr/build/solr-core/test/J1/./org.apache.solr.cloud.SyncSliceTest-jetty2-1363650715082
[junit4:junit4]   2> 8646 T1769 oasc.CoreContainer$Initializer.initialize looking for solr config file: /usr/home/hudson/hudson-slave/workspace/Lucene-Solr-Tests-4.x-java7/solr/build/solr-core/test/J1/./org.apache.solr.cloud.SyncSliceTest-jetty2-1363650715082/solr.xml
[junit4:junit4]   2> 8646 T1769 oasc.CoreContainer.<init> New CoreContainer 1182731299
[junit4:junit4]   2> 8647 T1769 oasc.CoreContainer.load Loading CoreContainer using Solr Home: '/usr/home/hudson/hudson-slave/workspace/Lucene-Solr-Tests-4.x-java7/solr/build/solr-core/test/J1/./org.apache.solr.cloud.SyncSliceTest-jetty2-1363650715082/'
[junit4:junit4]   2> 8648 T1769 oasc.SolrResourceLoader.<init> new SolrResourceLoader for directory: '/usr/home/hudson/hudson-slave/workspace/Lucene-Solr-Tests-4.x-java7/solr/build/solr-core/test/J1/./org.apache.solr.cloud.SyncSliceTest-jetty2-1363650715082/'
[junit4:junit4]   2> 8711 T1769 oashc.HttpShardHandlerFactory.getParameter Setting socketTimeout to: 120000
[junit4:junit4]   2> 8712 T1769 oashc.HttpShardHandlerFactory.getParameter Setting urlScheme to: http://
[junit4:junit4]   2> 8712 T1769 oashc.HttpShardHandlerFactory.getParameter Setting connTimeout to: 15000
[junit4:junit4]   2> 8713 T1769 oashc.HttpShardHandlerFactory.getParameter Setting maxConnectionsPerHost to: 20
[junit4:junit4]   2> 8713 T1769 oashc.HttpShardHandlerFactory.getParameter Setting corePoolSize to: 0
[junit4:junit4]   2> 8713 T1769 oashc.HttpShardHandlerFactory.getParameter Setting maximumPoolSize to: 2147483647
[junit4:junit4]   2> 8714 T1769 oashc.HttpShardHandlerFactory.getParameter Setting maxThreadIdleTime to: 5
[junit4:junit4]   2> 8714 T1769 oashc.HttpShardHandlerFactory.getParameter Setting sizeOfQueue to: -1
[junit4:junit4]   2> 8715 T1769 oashc.HttpShardHandlerFactory.getParameter Setting fairnessPolicy to: false
[junit4:junit4]   2> 8715 T1769 oascsi.HttpClientUtil.createClient Creating new http client, config:maxConnectionsPerHost=20&maxConnections=10000&socketTimeout=120000&connTimeout=15000&retry=false
[junit4:junit4]   2> 8736 T1769 oasc.CoreContainer.load Registering Log Listener
[junit4:junit4]   2> 8756 T1769 oasc.CoreContainer.initZooKeeper Zookeeper client=127.0.0.1:14485/solr
[junit4:junit4]   2> 8756 T1769 oasc.ZkController.checkChrootPath zkHost includes chroot
[junit4:junit4]   2> 8757 T1769 oaz.ZooKeeper.<init> Initiating client connection, connectString=127.0.0.1:14485 sessionTimeout=60000 watcher=org.apache.solr.common.cloud.ConnectionManager@5f1df5b
[junit4:junit4]   2> 8758 T1769 oascc.ConnectionManager.waitForConnected Waiting for client to connect to ZooKeeper
[junit4:junit4]   2> 8758 T1824 oaz.ClientCnxn$SendThread.logStartConnect Opening socket connection to server localhost/127.0.0.1:14485. Will not attempt to authenticate using SASL (access denied ("javax.security.auth.AuthPermission" "getLoginConfiguration"))
[junit4:junit4]   2> 8759 T1824 oaz.ClientCnxn$SendThread.primeConnection Socket connection established to localhost/127.0.0.1:14485, initiating session
[junit4:junit4]   2> 8759 T1771 oazs.NIOServerCnxnFactory.run Accepted socket connection from /140.211.11.196:23677
[junit4:junit4]   2> 8760 T1771 oazs.ZooKeeperServer.processConnectRequest Client attempting to establish new session at /140.211.11.196:23677
[junit4:junit4]   2> 8762 T1773 oazs.ZooKeeperServer.finishSessionInit Established session 0x13d7fea7cd80007 with negotiated timeout 20000 for client /140.211.11.196:23677
[junit4:junit4]   2> 8762 T1824 oaz.ClientCnxn$SendThread.onConnected Session establishment complete on server localhost/127.0.0.1:14485, sessionid = 0x13d7fea7cd80007, negotiated timeout = 20000
[junit4:junit4]   2> 8762 T1825 oascc.ConnectionManager.process Watcher org.apache.solr.common.cloud.ConnectionManager@5f1df5b name:ZooKeeperConnection Watcher:127.0.0.1:14485 got event WatchedEvent state:SyncConnected type:None path:null path:null type:None
[junit4:junit4]   2> 8763 T1769 oascc.ConnectionManager.waitForConnected Client is connected to ZooKeeper
[junit4:junit4]   2> 8764 T1774 oazs.PrepRequestProcessor.pRequest2Txn Processed session termination for sessionid: 0x13d7fea7cd80007
[junit4:junit4]   2> 8778 T1825 oaz.ClientCnxn$EventThread.run EventThread shut down
[junit4:junit4]   2> 8779 T1771 oazs.NIOServerCnxn.closeSock Closed socket connection for client /140.211.11.196:23677 which had sessionid 0x13d7fea7cd80007
[junit4:junit4]   2> 8778 T1769 oaz.ZooKeeper.close Session: 0x13d7fea7cd80007 closed
[junit4:junit4]   2> 8779 T1769 oascsi.HttpClientUtil.createClient Creating new http client, config:maxConnections=500&maxConnectionsPerHost=16&socketTimeout=120000&connTimeout=15000
[junit4:junit4]   2> 8789 T1769 oaz.ZooKeeper.<init> Initiating client connection, connectString=127.0.0.1:14485/solr sessionTimeout=30000 watcher=org.apache.solr.common.cloud.ConnectionManager@5032a49b
[junit4:junit4]   2> 8790 T1769 oascc.ConnectionManager.waitForConnected Waiting for client to connect to ZooKeeper
[junit4:junit4]   2> 8791 T1826 oaz.ClientCnxn$SendThread.logStartConnect Opening socket connection to server localhost/127.0.0.1:14485. Will not attempt to authenticate using SASL (access denied ("javax.security.auth.AuthPermission" "getLoginConfiguration"))
[junit4:junit4]   2> 8791 T1826 oaz.ClientCnxn$SendThread.primeConnection Socket connection established to localhost/127.0.0.1:14485, initiating session
[junit4:junit4]   2> 8792 T1771 oazs.NIOServerCnxnFactory.run Accepted socket connection from /140.211.11.196:57403
[junit4:junit4]   2> 8792 T1771 oazs.ZooKeeperServer.processConnectRequest Client attempting to establish new session at /140.211.11.196:57403
[junit4:junit4]   2> 8793 T1773 oazs.ZooKeeperServer.finishSessionInit Established session 0x13d7fea7cd80008 with negotiated timeout 20000 for client /140.211.11.196:57403
[junit4:junit4]   2> 8793 T1826 oaz.ClientCnxn$SendThread.onConnected Session establishment complete on server localhost/127.0.0.1:14485, sessionid = 0x13d7fea7cd80008, negotiated timeout = 20000
[junit4:junit4]   2> 8794 T1827 oascc.ConnectionManager.process Watcher org.apache.solr.common.cloud.ConnectionManager@5032a49b name:ZooKeeperConnection Watcher:127.0.0.1:14485/solr got event WatchedEvent state:SyncConnected type:None path:null path:null type:None
[junit4:junit4]   2> 8794 T1769 oascc.ConnectionManager.waitForConnected Client is connected to ZooKeeper
[junit4:junit4]   2> 8795 T1774 oazs.PrepRequestProcessor.pRequest Got user-level KeeperException when processing sessionid:0x13d7fea7cd80008 type:create cxid:0x1 zxid:0x6c txntype:-1 reqpath:n/a Error Path:/solr/overseer Error:KeeperErrorCode = NodeExists for /solr/overseer
[junit4:junit4]   2> 8801 T1774 oazs.PrepRequestProcessor.pRequest Got user-level KeeperException when processing sessionid:0x13d7fea7cd80008 type:create cxid:0x3 zxid:0x6d txntype:-1 reqpath:n/a Error Path:/solr/overseer Error:KeeperErrorCode = NodeExists for /solr/overseer
[junit4:junit4]   2> 8803 T1769 oascc.ZkStateReader.createClusterStateWatchersAndUpdate Updating cluster state from ZooKeeper... 
[junit4:junit4]   2> 9806 T1769 oasc.ZkController.createEphemeralLiveNode Register node as live in ZooKeeper:/live_nodes/127.0.0.1:25448_rf_vkg
[junit4:junit4]   2> 9807 T1774 oazs.PrepRequestProcessor.pRequest Got user-level KeeperException when processing sessionid:0x13d7fea7cd80008 type:delete cxid:0xd zxid:0x6e txntype:-1 reqpath:n/a Error Path:/solr/live_nodes/127.0.0.1:25448_rf_vkg Error:KeeperErrorCode = NoNode for /solr/live_nodes/127.0.0.1:25448_rf_vkg
[junit4:junit4]   2> 9811 T1769 oascc.SolrZkClient.makePath makePath: /live_nodes/127.0.0.1:25448_rf_vkg
[junit4:junit4]   2> 9830 T1798 oascc.ZkStateReader$3.process Updating live nodes... (3)
[junit4:junit4]   2> 9830 T1811 oascc.ZkStateReader$3.process Updating live nodes... (3)
[junit4:junit4]   2> 9830 T1827 oascc.ZkStateReader$3.process Updating live nodes... (3)
[junit4:junit4]   2> 9830 T1798 oascc.ZkStateReader$2.process A cluster state change: WatchedEvent state:SyncConnected type:NodeChildrenChanged path:/live_nodes, has occurred - updating... (live nodes size: 3)
[junit4:junit4]   2> 9830 T1791 oascc.ZkStateReader$3.process Updating live nodes... (3)
[junit4:junit4]   2> 9830 T1811 oascc.ZkStateReader$2.process A cluster state change: WatchedEvent state:SyncConnected type:NodeChildrenChanged path:/live_nodes, has occurred - updating... (live nodes size: 3)
[junit4:junit4]   2> 9831 T1791 oascc.ZkStateReader$2.process A cluster state change: WatchedEvent state:SyncConnected type:NodeChildrenChanged path:/live_nodes, has occurred - updating... (live nodes size: 3)
[junit4:junit4]   2> 9845 T1828 oasc.CoreContainer.create Creating SolrCore 'collection1' using instanceDir: /usr/home/hudson/hudson-slave/workspace/Lucene-Solr-Tests-4.x-java7/solr/build/solr-core/test/J1/./org.apache.solr.cloud.SyncSliceTest-jetty2-1363650715082/collection1
[junit4:junit4]   2> 9845 T1828 oasc.ZkController.createCollectionZkNode Check for collection zkNode:collection1
[junit4:junit4]   2> 9846 T1828 oasc.ZkController.createCollectionZkNode Collection zkNode exists
[junit4:junit4]   2> 9846 T1828 oasc.ZkController.readConfigName Load collection config from:/collections/collection1
[junit4:junit4]   2> 9848 T1828 oasc.SolrResourceLoader.<init> new SolrResourceLoader for directory: '/usr/home/hudson/hudson-slave/workspace/Lucene-Solr-Tests-4.x-java7/solr/build/solr-core/test/J1/./org.apache.solr.cloud.SyncSliceTest-jetty2-1363650715082/collection1/'
[junit4:junit4]   2> 9849 T1828 oasc.SolrResourceLoader.replaceClassLoader Adding 'file:/usr/home/hudson/hudson-slave/workspace/Lucene-Solr-Tests-4.x-java7/solr/build/solr-core/test/J1/org.apache.solr.cloud.SyncSliceTest-jetty2-1363650715082/collection1/lib/classes/' to classloader
[junit4:junit4]   2> 9849 T1828 oasc.SolrResourceLoader.replaceClassLoader Adding 'file:/usr/home/hudson/hudson-slave/workspace/Lucene-Solr-Tests-4.x-java7/solr/build/solr-core/test/J1/org.apache.solr.cloud.SyncSliceTest-jetty2-1363650715082/collection1/lib/README' to classloader
[junit4:junit4]   2> 9899 T1828 oasc.SolrConfig.<init> Using Lucene MatchVersion: LUCENE_43
[junit4:junit4]   2> 9933 T1792 oascc.ZkStateReader.updateClusterState Updating cloud state from ZooKeeper... 
[junit4:junit4]   2> 9934 T1792 oasc.Overseer$ClusterStateUpdater.updateState Update state numShards=1 message={
[junit4:junit4]   2> 	  "operation":"state",
[junit4:junit4]   2> 	  "core_node_name":"127.0.0.1:53616_rf_vkg_collection1",
[junit4:junit4]   2> 	  "numShards":"1",
[junit4:junit4]   2> 	  "shard":"shard1",
[junit4:junit4]   2> 	  "roles":null,
[junit4:junit4]   2> 	  "state":"active",
[junit4:junit4]   2> 	  "core":"collection1",
[junit4:junit4]   2> 	  "collection":"collection1",
[junit4:junit4]   2> 	  "node_name":"127.0.0.1:53616_rf_vkg",
[junit4:junit4]   2> 	  "base_url":"http://127.0.0.1:53616/rf_vkg"}
[junit4:junit4]   2> 9959 T1828 oasc.SolrConfig.<init> Loaded SolrConfig: solrconfig.xml
[junit4:junit4]   2> 9982 T1791 oascc.ZkStateReader$2.process A cluster state change: WatchedEvent state:SyncConnected type:NodeDataChanged path:/clusterstate.json, has occurred - updating... (live nodes size: 3)
[junit4:junit4]   2> 9982 T1811 oascc.ZkStateReader$2.process A cluster state change: WatchedEvent state:SyncConnected type:NodeDataChanged path:/clusterstate.json, has occurred - updating... (live nodes size: 3)
[junit4:junit4]   2> 9982 T1798 oascc.ZkStateReader$2.process A cluster state change: WatchedEvent state:SyncConnected type:NodeDataChanged path:/clusterstate.json, has occurred - updating... (live nodes size: 3)
[junit4:junit4]   2> 10063 T1828 oass.IndexSchema.readSchema Reading Solr Schema
[junit4:junit4]   2> 10063 T1827 oascc.ZkStateReader$2.process A cluster state change: WatchedEvent state:SyncConnected type:NodeDataChanged path:/clusterstate.json, has occurred - updating... (live nodes size: 3)
[junit4:junit4]   2> 10070 T1828 oass.IndexSchema.readSchema Schema name=test
[junit4:junit4]   2> 10687 T1828 oass.OpenExchangeRatesOrgProvider.init Initialized with rates=open-exchange-rates.json, refreshInterval=1440.
[junit4:junit4]   2> 10698 T1828 oass.IndexSchema.readSchema default search field in schema is text
[junit4:junit4]   2> 10701 T1828 oass.IndexSchema.readSchema unique key field: id
[junit4:junit4]   2> 10715 T1828 oass.FileExchangeRateProvider.reload Reloading exchange rates from file currency.xml
[junit4:junit4]   2> 10720 T1828 oass.FileExchangeRateProvider.reload Reloading exchange rates from file currency.xml
[junit4:junit4]   2> 10724 T1828 oass.OpenExchangeRatesOrgProvider.reload Reloading exchange rates from open-exchange-rates.json
[junit4:junit4]   2> 10725 T1828 oass.OpenExchangeRatesOrgProvider$OpenExchangeRates.<init> WARNING Unknown key IMPORTANT NOTE
[junit4:junit4]   2> 10726 T1828 oass.OpenExchangeRatesOrgProvider$OpenExchangeRates.<init> WARNING Expected key, got STRING
[junit4:junit4]   2> 10726 T1828 oass.OpenExchangeRatesOrgProvider.reload Reloading exchange rates from open-exchange-rates.json
[junit4:junit4]   2> 10727 T1828 oass.OpenExchangeRatesOrgProvider$OpenExchangeRates.<init> WARNING Unknown key IMPORTANT NOTE
[junit4:junit4]   2> 10727 T1828 oass.OpenExchangeRatesOrgProvider$OpenExchangeRates.<init> WARNING Expected key, got STRING
[junit4:junit4]   2> 10727 T1828 oasc.SolrCore.initDirectoryFactory solr.NRTCachingDirectoryFactory
[junit4:junit4]   2> 10728 T1828 oasc.SolrCore.<init> [collection1] Opening new SolrCore at /usr/home/hudson/hudson-slave/workspace/Lucene-Solr-Tests-4.x-java7/solr/build/solr-core/test/J1/./org.apache.solr.cloud.SyncSliceTest-jetty2-1363650715082/collection1/, dataDir=./org.apache.solr.cloud.SyncSliceTest-1363650706640/jetty2/
[junit4:junit4]   2> 10728 T1828 oasc.JmxMonitoredMap.<init> JMX monitoring is enabled. Adding Solr mbeans to JMX Server: com.sun.jmx.mbeanserver.JmxMBeanServer@740ba142
[junit4:junit4]   2> 10728 T1828 oasc.SolrCore.initDirectoryFactory solr.NRTCachingDirectoryFactory
[junit4:junit4]   2> 10729 T1828 oasc.CachingDirectoryFactory.get return new directory for /usr/home/hudson/hudson-slave/workspace/Lucene-Solr-Tests-4.x-java7/solr/build/solr-core/test/J1/org.apache.solr.cloud.SyncSliceTest-1363650706640/jetty2 forceNew: false
[junit4:junit4]   2> 10730 T1828 oasc.SolrCore.getNewIndexDir New index directory detected: old=null new=./org.apache.solr.cloud.SyncSliceTest-1363650706640/jetty2/index/
[junit4:junit4]   2> 10730 T1828 oasc.SolrCore.initIndex WARNING [collection1] Solr index directory './org.apache.solr.cloud.SyncSliceTest-1363650706640/jetty2/index' doesn't exist. Creating new index...
[junit4:junit4]   2> 10731 T1828 oasc.CachingDirectoryFactory.get return new directory for /usr/home/hudson/hudson-slave/workspace/Lucene-Solr-Tests-4.x-java7/solr/build/solr-core/test/J1/org.apache.solr.cloud.SyncSliceTest-1363650706640/jetty2/index forceNew: false
[junit4:junit4]   2> 10736 T1828 oasc.SolrDeletionPolicy.onCommit SolrDeletionPolicy.onCommit: commits:num=1
[junit4:junit4]   2> 		commit{dir=NRTCachingDirectory(org.apache.lucene.store.NIOFSDirectory@/usr/home/hudson/hudson-slave/workspace/Lucene-Solr-Tests-4.x-java7/solr/build/solr-core/test/J1/org.apache.solr.cloud.SyncSliceTest-1363650706640/jetty2/index lockFactory=org.apache.lucene.store.NativeFSLockFactory@1dd65a66; maxCacheMB=48.0 maxMergeSizeMB=4.0),segFN=segments_1,generation=1,filenames=[segments_1]
[junit4:junit4]   2> 10737 T1828 oasc.SolrDeletionPolicy.updateCommits newest commit = 1[segments_1]
[junit4:junit4]   2> 10739 T1828 oasup.UpdateRequestProcessorChain.init inserting DistributedUpdateProcessorFactory into updateRequestProcessorChain "dedupe"
[junit4:junit4]   2> 10740 T1828 oasup.UpdateRequestProcessorChain.init inserting DistributedUpdateProcessorFactory into updateRequestProcessorChain "stored_sig"
[junit4:junit4]   2> 10740 T1828 oasup.UpdateRequestProcessorChain.init inserting DistributedUpdateProcessorFactory into updateRequestProcessorChain "distrib-dup-test-chain-implicit"
[junit4:junit4]   2> 10741 T1828 oasc.RequestHandlers.initHandlersFromConfig created standard: solr.StandardRequestHandler
[junit4:junit4]   2> 10741 T1828 oasc.RequestHandlers.initHandlersFromConfig created /get: solr.RealTimeGetHandler
[junit4:junit4]   2> 10742 T1828 oasc.RequestHandlers.initHandlersFromConfig adding lazy requestHandler: solr.ReplicationHandler
[junit4:junit4]   2> 10742 T1828 oasc.RequestHandlers.initHandlersFromConfig created /replication: solr.ReplicationHandler
[junit4:junit4]   2> 10742 T1828 oasc.RequestHandlers.initHandlersFromConfig created /update: solr.UpdateRequestHandler
[junit4:junit4]   2> 10743 T1828 oasc.RequestHandlers.initHandlersFromConfig created /admin/: org.apache.solr.handler.admin.AdminHandlers
[junit4:junit4]   2> 10755 T1828 oashl.XMLLoader.init xsltCacheLifetimeSeconds=60
[junit4:junit4]   2> 10762 T1828 oass.SolrIndexSearcher.<init> Opening Searcher@4a436832 main
[junit4:junit4]   2> 10763 T1828 oasu.CommitTracker.<init> Hard AutoCommit: disabled
[junit4:junit4]   2> 10763 T1828 oasu.CommitTracker.<init> Soft AutoCommit: disabled
[junit4:junit4]   2> 10767 T1829 oasc.SolrCore.registerSearcher [collection1] Registered new searcher Searcher@4a436832 main{StandardDirectoryReader(segments_1:1)}
[junit4:junit4]   2> 10769 T1828 oasc.ZkController.publish publishing core=collection1 state=down
[junit4:junit4]   2> 10769 T1828 oasc.ZkController.publish numShards not found on descriptor - reading it from system property
[junit4:junit4]   2> 11487 T1792 oascc.ZkStateReader.updateClusterState Updating cloud state from ZooKeeper... 
[junit4:junit4]   2> 11488 T1792 oasc.Overseer$ClusterStateUpdater.updateState Update state numShards=1 message={
[junit4:junit4]   2> 	  "operation":"state",
[junit4:junit4]   2> 	  "core_node_name":null,
[junit4:junit4]   2> 	  "numShards":"1",
[junit4:junit4]   2> 	  "shard":null,
[junit4:junit4]   2> 	  "roles":null,
[junit4:junit4]   2> 	  "state":"down",
[junit4:junit4]   2> 	  "core":"collection1",
[junit4:junit4]   2> 	  "collection":"collection1",
[junit4:junit4]   2> 	  "node_name":"127.0.0.1:25448_rf_vkg",
[junit4:junit4]   2> 	  "base_url":"http://127.0.0.1:25448/rf_vkg"}
[junit4:junit4]   2> 11488 T1792 oasc.Overseer$ClusterStateUpdater.updateState Collection already exists with numShards=1
[junit4:junit4]   2> 11489 T1792 oasc.Overseer$ClusterStateUpdater.updateState Assigning new node to shard shard=shard1
[junit4:junit4]   2> 11493 T1798 oascc.ZkStateReader$2.process A cluster state change: WatchedEvent state:SyncConnected type:NodeDataChanged path:/clusterstate.json, has occurred - updating... (live nodes size: 3)
[junit4:junit4]   2> 11493 T1791 oascc.ZkStateReader$2.process A cluster state change: WatchedEvent state:SyncConnected type:NodeDataChanged path:/clusterstate.json, has occurred - updating... (live nodes size: 3)
[junit4:junit4]   2> 11493 T1827 oascc.ZkStateReader$2.process A cluster state change: WatchedEvent state:SyncConnected type:NodeDataChanged path:/clusterstate.json, has occurred - updating... (live nodes size: 3)
[junit4:junit4]   2> 11493 T1811 oascc.ZkStateReader$2.process A cluster state change: WatchedEvent state:SyncConnected type:NodeDataChanged path:/clusterstate.json, has occurred - updating... (live nodes size: 3)
[junit4:junit4]   2> 11772 T1828 oasc.CoreContainer.registerCore registering core: collection1
[junit4:junit4]   2> 11772 T1828 oasc.ZkController.register Register replica - core:collection1 address:http://127.0.0.1:25448/rf_vkg collection:collection1 shard:shard1
[junit4:junit4]   2> 11775 T1828 oasc.ZkController.register We are http://127.0.0.1:25448/rf_vkg/collection1/ and leader is http://127.0.0.1:53616/rf_vkg/collection1/
[junit4:junit4]   2> 11775 T1828 oasc.ZkController.register No LogReplay needed for core=collection1 baseURL=http://127.0.0.1:25448/rf_vkg
[junit4:junit4]   2> 11775 T1828 oasc.ZkController.checkRecovery Core needs to recover:collection1
[junit4:junit4]   2> 11775 T1828 oasu.DefaultSolrCoreState.doRecovery Running recovery - first canceling any ongoing recovery
[junit4:junit4]   2> ASYNC  NEW_CORE C288 name=collection1 org.apache.solr.core.SolrCore@41ddb270 url=http://127.0.0.1:25448/rf_vkg/collection1 node=127.0.0.1:25448_rf_vkg C288_STATE=coll:collection1 core:collection1 props:{state=down, core=collection1, collection=collection1, node_name=127.0.0.1:25448_rf_vkg, base_url=http://127.0.0.1:25448/rf_vkg}
[junit4:junit4]   2> 11776 T1830 C288 P25448 oasc.RecoveryStrategy.run Starting recovery process.  core=collection1 recoveringAfterStartup=true
[junit4:junit4]   2> 11777 T1830 C288 P25448 oasc.RecoveryStrategy.doRecovery ###### startupVersions=[]
[junit4:junit4]   2> 11777 T1828 oascc.ZkStateReader.updateClusterState Updating cloud state from ZooKeeper... 
[junit4:junit4]   2> 11777 T1830 C288 P25448 oasc.ZkController.publish publishing core=collection1 state=recovering
[junit4:junit4]   2> 11777 T1830 C288 P25448 oasc.ZkController.publish numShards not found on descriptor - reading it from system property
[junit4:junit4]   2> 11778 T1769 oass.SolrDispatchFilter.init user.dir=/usr/home/hudson/hudson-slave/workspace/Lucene-Solr-Tests-4.x-java7/solr/build/solr-core/test/J1
[junit4:junit4]   2> 11779 T1830 C288 P25448 oascsi.HttpClientUtil.createClient Creating new http client, config:maxConnections=128&maxConnectionsPerHost=32&followRedirects=false
[junit4:junit4]   2> 11779 T1769 oass.SolrDispatchFilter.init SolrDispatchFilter.init() done
[junit4:junit4]   2> 11779 T1769 oascsi.HttpClientUtil.createClient Creating new http client, config:maxConnections=128&maxConnectionsPerHost=32&followRedirects=false
[junit4:junit4]   2> 11996 T1769 oejs.Server.doStart jetty-8.1.8.v20121106
[junit4:junit4]   2> 11999 T1769 oejs.AbstractConnector.doStart Started SocketConnector@127.0.0.1:18575
[junit4:junit4]   2> 12000 T1769 oass.SolrDispatchFilter.init SolrDispatchFilter.init()
[junit4:junit4]   2> 12000 T1769 oasc.SolrResourceLoader.locateSolrHome JNDI not configured for solr (NoInitialContextEx)
[junit4:junit4]   2> 12001 T1769 oasc.SolrResourceLoader.locateSolrHome using system property solr.solr.home: /usr/home/hudson/hudson-slave/workspace/Lucene-Solr-Tests-4.x-java7/solr/build/solr-core/test/J1/./org.apache.solr.cloud.SyncSliceTest-jetty3-1363650718433
[junit4:junit4]   2> 12001 T1769 oasc.CoreContainer$Initializer.initialize looking for solr config file: /usr/home/hudson/hudson-slave/workspace/Lucene-Solr-Tests-4.x-java7/solr/build/solr-core/test/J1/./org.apache.solr.cloud.SyncSliceTest-jetty3-1363650718433/solr.xml
[junit4:junit4]   2> 12002 T1769 oasc.CoreContainer.<init> New CoreContainer 236212974
[junit4:junit4]   2> 12003 T1769 oasc.CoreContainer.load Loading CoreContainer using Solr Home: '/usr/home/hudson/hudson-slave/workspace/Lucene-Solr-Tests-4.x-java7/solr/build/solr-core/test/J1/./org.apache.solr.cloud.SyncSliceTest-jetty3-1363650718433/'
[junit4:junit4]   2> 12003 T1769 oasc.SolrResourceLoader.<init> new SolrResourceLoader for directory: '/usr/home/hudson/hudson-slave/workspace/Lucene-Solr-Tests-4.x-java7/solr/build/solr-core/test/J1/./org.apache.solr.cloud.SyncSliceTest-jetty3-1363650718433/'
[junit4:junit4]   2> 12067 T1769 oashc.HttpShardHandlerFactory.getParameter Setting socketTimeout to: 120000
[junit4:junit4]   2> 12067 T1769 oashc.HttpShardHandlerFactory.getParameter Setting urlScheme to: http://
[junit4:junit4]   2> 12068 T1769 oashc.HttpShardHandlerFactory.getParameter Setting connTimeout to: 15000
[junit4:junit4]   2> 12068 T1769 oashc.HttpShardHandlerFactory.getParameter Setting maxConnectionsPerHost to: 20
[junit4:junit4]   2> 12069 T1769 oashc.HttpShardHandlerFactory.getParameter Setting corePoolSize to: 0
[junit4:junit4]   2> 12069 T1769 oashc.HttpShardHandlerFactory.getParameter Setting maximumPoolSize to: 2147483647
[junit4:junit4]   2> 12070 T1769 oashc.HttpShardHandlerFactory.getParameter Setting maxThreadIdleTime to: 5
[junit4:junit4]   2> 12070 T1769 oashc.HttpShardHandlerFactory.getParameter Setting sizeOfQueue to: -1
[junit4:junit4]   2> 12071 T1769 oashc.HttpShardHandlerFactory.getParameter Setting fairnessPolicy to: false
[junit4:junit4]   2> 12071 T1769 oascsi.HttpClientUtil.createClient Creating new http client, config:maxConnectionsPerHost=20&maxConnections=10000&socketTimeout=120000&connTimeout=15000&retry=false
[junit4:junit4]   2> 12094 T1769 oasc.CoreContainer.load Registering Log Listener
[junit4:junit4]   2> 12114 T1769 oasc.CoreContainer.initZooKeeper Zookeeper client=127.0.0.1:14485/solr
[junit4:junit4]   2> 12115 T1769 oasc.ZkController.checkChrootPath zkHost includes chroot
[junit4:junit4]   2> 12115 T1769 oaz.ZooKeeper.<init> Initiating client connection, connectString=127.0.0.1:14485 sessionTimeout=60000 watcher=org.apache.solr.common.cloud.ConnectionManager@44d670d9
[junit4:junit4]   2> 12116 T1769 oascc.ConnectionManager.waitForConnected Waiting for client to connect to ZooKeeper
[junit4:junit4]   2> 12117 T1841 oaz.ClientCnxn$SendThread.logStartConnect Opening socket connection to server localhost/127.0.0.1:14485. Will not attempt to authenticate using SASL (access denied ("javax.security.auth.AuthPermission" "getLoginConfiguration"))
[junit4:junit4]   2> 12117 T1841 oaz.ClientCnxn$SendThread.primeConnection Socket connection established to localhost/127.0.0.1:14485, initiating session
[junit4:junit4]   2> 12118 T1771 oazs.NIOServerCnxnFactory.run Accepted socket connection from /140.211.11.196:37480
[junit4:junit4]   2> 12118 T1771 oazs.ZooKeeperServer.processConnectRequest Client attempting to establish new session at /140.211.11.196:37480
[junit4:junit4]   2> 12120 T1773 oazs.ZooKeeperServer.finishSessionInit Established session 0x13d7fea7cd80009 with negotiated timeout 20000 for client /140.211.11.196:37480
[junit4:junit4]   2> 12120 T1841 oaz.ClientCnxn$SendThread.onConnected Session establishment complete on server localhost/127.0.0.1:14485, sessionid = 0x13d7fea7cd80009, negotiated timeout = 20000
[junit4:junit4]   2> 12121 T1842 oascc.ConnectionManager.process Watcher org.apache.solr.common.cloud.ConnectionManager@44d670d9 name:ZooKeeperConnection Watcher:127.0.0.1:14485 got event WatchedEvent state:SyncConnected type:None path:null path:null type:None
[junit4:junit4]   2> 12121 T1769 oascc.ConnectionManager.waitForConnected Client is connected to ZooKeeper
[junit4:junit4]   2> 12122 T1774 oazs.PrepRequestProcessor.pRequest2Txn Processed session termination for sessionid: 0x13d7fea7cd80009
[junit4:junit4]   2> 12138 T1842 oaz.ClientCnxn$EventThread.run EventThread shut down
[junit4:junit4]   2> 12138 T1771 oazs.NIOServerCnxn.closeSock Closed socket connection for client /140.211.11.196:37480 which had sessionid 0x13d7fea7cd80009
[junit4:junit4]   2> 12138 T1769 oaz.ZooKeeper.close Session: 0x13d7fea7cd80009 closed
[junit4:junit4]   2> 12139 T1769 oascsi.HttpClientUtil.createClient Creating new http client, config:maxConnections=500&maxConnectionsPerHost=16&socketTimeout=120000&connTimeout=15000
[junit4:junit4]   2> 12151 T1769 oaz.ZooKeeper.<init> Initiating client connection, connectString=127.0.0.1:14485/solr sessionTimeout=30000 watcher=org.apache.solr.common.cloud.ConnectionManager@39c68148
[junit4:junit4]   2> 12151 T1769 oascc.ConnectionManager.waitForConnected Waiting for client to connect to ZooKeeper
[junit4:junit4]   2> 12152 T1843 oaz.ClientCnxn$SendThread.logStartConnect Opening socket connection to server localhost/127.0.0.1:14485. Will not attempt to authenticate using SASL (access denied ("javax.security.auth.AuthPermission" "getLoginConfiguration"))
[junit4:junit4]   2> 12152 T1843 oaz.ClientCnxn$SendThread.primeConnection Socket connection established to localhost/127.0.0.1:14485, initiating session
[junit4:junit4]   2> 12153 T1771 oazs.NIOServerCnxnFactory.run Accepted socket connection from /140.211.11.196:54125
[junit4:junit4]   2> 12153 T1771 oazs.ZooKeeperServer.processConnectRequest Client attempting to establish new session at /140.211.11.196:54125
[junit4:junit4]   2> 12154 T1773 oazs.ZooKeeperServer.finishSessionInit Established session 0x13d7fea7cd8000a with negotiated timeout 20000 for client /140.211.11.196:54125
[junit4:junit4]   2> 12154 T1843 oaz.ClientCnxn$SendThread.onConnected Session establishment complete on server localhost/127.0.0.1:14485, sessionid = 0x13d7fea7cd8000a, negotiated timeout = 20000
[junit4:junit4]   2> 12154 T1844 oascc.ConnectionManager.process Watcher org.apache.solr.common.cloud.ConnectionManager@39c68148 name:ZooKeeperConnection Watcher:127.0.0.1:14485/solr got event WatchedEvent state:SyncConnected type:None path:null path:null type:None
[junit4:junit4]   2> 12155 T1769 oascc.ConnectionManager.waitForConnected Client is connected to ZooKeeper
[junit4:junit4]   2> 12156 T1774 oazs.PrepRequestProcessor.pRequest Got user-level KeeperException when processing sessionid:0x13d7fea7cd8000a type:create cxid:0x1 zxid:0x7f txntype:-1 reqpath:n/a Error Path:/solr/overseer Error:KeeperErrorCode = NodeExists for /solr/overseer
[junit4:junit4]   2> 12157 T1774 oazs.PrepRequestProcessor.pRequest Got user-level KeeperException when processing sessionid:0x13d7fea7cd8000a type:create cxid:0x3 zxid:0x80 txntype:-1 reqpath:n/a Error Path:/solr/overseer Error:KeeperErrorCode = NodeExists for /solr/overseer
[junit4:junit4]   2> 12167 T1769 oascc.ZkStateReader.createClusterStateWatchersAndUpdate Updating cluster state from ZooKeeper... 
[junit4:junit4]   2> 13010 T1792 oascc.ZkStateReader.updateClusterState Updating cloud state from ZooKeeper... 
[junit4:junit4]   2> 13011 T1792 oasc.Overseer$ClusterStateUpdater.updateState Update state numShards=1 message={
[junit4:junit4]   2> 	  "operation":"state",
[junit4:junit4]   2> 	  "core_node_name":"127.0.0.1:25448_rf_vkg_collection1",
[junit4:junit4]   2> 	  "numShards":"1",
[junit4:junit4]   2> 	  "shard":"shard1",
[junit4:junit4]   2> 	  "roles":null,
[junit4:junit4]   2> 	  "state":"recovering",
[junit4:junit4]   2> 	  "core":"collection1",
[junit4:junit4]   2> 	  "collection":"collection1",
[junit4:junit4]   2> 	  "node_name":"127.0.0.1:25448_rf_vkg",
[junit4:junit4]   2> 	  "base_url":"http://127.0.0.1:25448/rf_vkg"}
[junit4:junit4]   2> 13031 T1798 oascc.ZkStateReader$2.process A cluster state change: WatchedEvent state:SyncConnected type:NodeDataChanged path:/clusterstate.json, has occurred - updating... (live nodes size: 3)
[junit4:junit4]   2> 13031 T1811 oascc.ZkStateReader$2.process A cluster state change: WatchedEvent state:SyncConnected type:NodeDataChanged path:/clusterstate.json, has occurred - updating... (live nodes size: 3)
[junit4:junit4]   2> 13031 T1827 oascc.ZkStateReader$2.process A cluster state change: WatchedEvent state:SyncConnected type:NodeDataChanged path:/clusterstate.json, has occurred - updating... (live nodes size: 3)
[junit4:junit4]   2> 13031 T1844 oascc.ZkStateReader$2.process A cluster state change: WatchedEvent state:SyncConnected type:NodeDataChanged path:/clusterstate.json, has occurred - updating... (live nodes size: 3)
[junit4:junit4]   2> 13031 T1791 oascc.ZkStateReader$2.process A cluster state change: WatchedEvent state:SyncConnected type:NodeDataChanged path:/clusterstate.json, has occurred - updating... (live nodes size: 3)
[junit4:junit4]   2> 13170 T1769 oasc.ZkController.createEphemeralLiveNode Register node as live in ZooKeeper:/live_nodes/127.0.0.1:18575_rf_vkg
[junit4:junit4]   2> 13171 T1774 oazs.PrepRequestProcessor.pRequest Got user-level KeeperException when processing sessionid:0x13d7fea7cd8000a type:delete cxid:0xf zxid:0x85 txntype:-1 reqpath:n/a Error Path:/solr/live_nodes/127.0.0.1:18575_rf_vkg Error:KeeperErrorCode = NoNode for /solr/live_nodes/127.0.0.1:18575_rf_vkg
[junit4:junit4]   2> 13208 T1769 oascc.SolrZkClient.makePath makePath: /live_nodes/127.0.0.1:18575_rf_vkg
[junit4:junit4]   2> 13210 T1844 oascc.ZkStateReader$2.process A cluster state change: WatchedEvent state:SyncConnected type:NodeChildrenChanged path:/live_nodes, has occurred - updating... (live nodes size: 3)
[junit4:junit4]   2> 13210 T1827 oascc.ZkStateReader$2.process A cluster state change: WatchedEvent state:SyncConnected type:NodeChildrenChanged path:/live_nodes, has occurred - updating... (live nodes size: 3)
[junit4:junit4]   2> 13211 T1798 oascc.ZkStateReader$3.process Updating live nodes... (4)
[junit4:junit4]   2> 13211 T1791 oascc.ZkStateReader$3.process Updating live nodes... (4)
[junit4:junit4]   2> 13211 T1798 oascc.ZkStateReader$2.process A cluster state change: WatchedEvent state:SyncConnected type:NodeChildrenChanged path:/live_nodes, has occurred - updating... (live nodes size: 4)
[junit4:junit4]   2> 13211 T1811 oascc.ZkStateReader$3.process Updating live nodes... (4)
[junit4:junit4]   2> 13211 T1791 oascc.ZkStateReader$2.process A cluster state change: WatchedEvent state:SyncConnected type:NodeChildrenChanged path:/live_nodes, has occurred - updating... (live nodes size: 4)
[junit4:junit4]   2> 13212 T1811 oascc.ZkStateReader$2.process A cluster state change: WatchedEvent state:SyncConnected type:NodeChildrenChanged path:/live_nodes, has occurred - updating... (live nodes size: 4)
[junit4:junit4]   2> 13212 T1844 oascc.ZkStateReader$3.process Updating live nodes... (4)
[junit4:junit4]   2> 13220 T1827 oascc.ZkStateReader$3.process Updating live nodes... (4)
[junit4:junit4]   2> 13225 T1845 oasc.CoreContainer.create Creating SolrCore 'collection1' using instanceDir: /usr/home/hudson/hudson-slave/workspace/Lucene-Solr-Tests-4.x-java7/solr/build/solr-core/test/J1/./org.apache.solr.cloud.SyncSliceTest-jetty3-1363650718433/collection1
[junit4:junit4]   2> 13225 T1845 oasc.ZkController.createCollectionZkNode Check for collection zkNode:collection1
[junit4:junit4]   2> 13226 T1845 oasc.ZkController.createCollectionZkNode Collection zkNode exists
[junit4:junit4]   2> 13226 T1845 oasc.ZkController.readConfigName Load collection config from:/collections/collection1
[junit4:junit4]   2> 13227 T1845 oasc.SolrResourceLoader.<init> new SolrResourceLoader for directory: '/usr/home/hudson/hudson-slave/workspace/Lucene-Solr-Tests-4.x-java7/solr/build/solr-core/test/J1/./org.apache.solr.cloud.SyncSliceTest-jetty3-1363650718433/collection1/'
[junit4:junit4]   2> 13229 T1845 oasc.SolrResourceLoader.replaceClassLoader Adding 'file:/usr/home/hudson/hudson-slave/workspace/Lucene-Solr-Tests-4.x-java7/solr/build/solr-core/test/J1/org.apache.solr.cloud.SyncSliceTest-jetty3-1363650718433/collection1/lib/classes/' to classloader
[junit4:junit4]   2> 13229 T1845 oasc.SolrResourceLoader.replaceClassLoader Adding 'file:/usr/home/hudson/hudson-slave/workspace/Lucene-Solr-Tests-4.x-java7/solr/build/solr-core/test/J1/org.apache.solr.cloud.SyncSliceTest-jetty3-1363650718433/collection1/lib/README' to classloader
[junit4:junit4]   2> 13278 T1845 oasc.SolrConfig.<init> Using Lucene MatchVersion: LUCENE_43
[junit4:junit4]   2> 13338 T1845 oasc.SolrConfig.<init> Loaded SolrConfig: solrconfig.xml
[junit4:junit4]   2> 13438 T1845 oass.IndexSchema.readSchema Reading Solr Schema
[junit4:junit4]   2> 13444 T1845 oass.IndexSchema.readSchema Schema name=test
[junit4:junit4]   2> 13802 T1801 oass.SolrDispatchFilter.handleAdminRequest /admin/cores {coreNodeName=127.0.0.1:25448_rf_vkg_collection1&state=recovering&nodeName=127.0.0.1:25448_rf_vkg&action=PREPRECOVERY&checkLive=true&core=collection1&wt=javabin&onlyIfLeader=true&version=2} status=0 QTime=2002 
[junit4:junit4]   2> 14071 T1845 oass.OpenExchangeRatesOrgProvider.init Initialized with rates=open-exchange-rates.json, refreshInterval=1440.
[junit4:junit4]   2> 14082 T1845 oass.IndexSchema.readSchema default search field in schema is text
[junit4:junit4]   2> 14085 T1845 oass.IndexSchema.readSchema unique key field: id
[junit4:junit4]   2> 14099 T1845 oass.FileExchangeRateProvider.reload Reloading exchange rates from file currency.xml
[junit4:junit4]   2> 14103 T1845 oass.FileExchangeRateProvider.reload Reloading exchange rates from file currency.xml
[junit4:junit4]   2> 14108 T1845 oass.OpenExchangeRatesOrgProvider.reload Reloading exchange rates from open-exchange-rates.json
[junit4:junit4]   2> 14109 T1845 oass.OpenExchangeRatesOrgProvider$OpenExchangeRates.<init> WARNING Unknown key IMPORTANT NOTE
[junit4:junit4]   2> 14109 T1845 oass.OpenExchangeRatesOrgProvider$OpenExchangeRates.<init> WARNING Expected key, got STRING
[junit4:junit4]   2> 14109 T1845 oass.OpenExchangeRatesOrgProvider.reload Reloading exchange rates from open-exchange-rates.json
[junit4:junit4]   2> 14110 T1845 oass.OpenExchangeRatesOrgProvider$OpenExchangeRates.<init> WARNING Unknown key IMPORTANT NOTE
[junit4:junit4]   2> 14110 T1845 oass.OpenExchangeRatesOrgProvider$OpenExchangeRates.<init> WARNING Expected key, got STRING
[junit4:junit4]   2> 14111 T1845 oasc.SolrCore.initDirectoryFactory solr.NRTCachingDirectoryFactory
[junit4:junit4]   2> 14111 T1845 oasc.SolrCore.<init> [collection1] Opening new SolrCore at /usr/home/hudson/hudson-slave/workspace/Lucene-Solr-Tests-4.x-java7/solr/build/solr-core/test/J1/./org.apache.solr.cloud.SyncSliceTest-jetty3-1363650718433/collection1/, dataDir=./org.apache.solr.cloud.SyncSliceTest-1363650706640/jetty3/
[junit4:junit4]   2> 14111 T1845 oasc.JmxMonitoredMap.<init> JMX monitoring is enabled. Adding Solr mbeans to JMX Server: com.sun.jmx.mbeanserver.JmxMBeanServer@740ba142
[junit4:junit4]   2> 14112 T1845 oasc.SolrCore.initDirectoryFactory solr.NRTCachingDirectoryFactory
[junit4:junit4]   2> 14112 T1845 oasc.CachingDirectoryFactory.get return new directory for /usr/home/hudson/hudson-slave/workspace/Lucene-Solr-Tests-4.x-java7/solr/build/solr-core/test/J1/org.apache.solr.cloud.SyncSliceTest-1363650706640/jetty3 forceNew: false
[junit4:junit4]   2> 14113 T1845 oasc.SolrCore.getNewIndexDir New index directory detected: old=null new=./org.apache.solr.cloud.SyncSliceTest-1363650706640/jetty3/index/
[junit4:junit4]   2> 14114 T1845 oasc.SolrCore.initIndex WARNING [collection1] Solr index directory './org.apache.solr.cloud.SyncSliceTest-1363650706640/jetty3/index' doesn't exist. Creating new index...
[junit4:junit4]   2> 14114 T1845 oasc.CachingDirectoryFactory.get return new directory for /usr/home/hudson/hudson-slave/workspace/Lucene-Solr-Tests-4.x-java7/solr/build/solr-core/test/J1/org.apache.solr.cloud.SyncSliceTest-1363650706640/jetty3/index forceNew: false
[junit4:junit4]   2> 14120 T1845 oasc.SolrDeletionPolicy.onCommit SolrDeletionPolicy.onCommit: commits:num=1
[junit4:junit4]   2> 		commit{dir=NRTCachingDirectory(org.apache.lucene.store.NIOFSDirectory@/usr/home/hudson/hudson-slave/workspace/Lucene-Solr-Tests-4.x-java7/solr/build/solr-core/test/J1/org.apache.solr.cloud.SyncSliceTest-1363650706640/jetty3/index lockFactory=org.apache.lucene.store.NativeFSLockFactory@6a8afb33; maxCacheMB=48.0 maxMergeSizeMB=4.0),segFN=segments_1,generation=1,filenames=[segments_1]
[junit4:junit4]   2> 14120 T1845 oasc.SolrDeletionPolicy.updateCommits newest commit = 1[segments_1]
[junit4:junit4]   2> 14123 T1845 oasup.UpdateRequestProcessorChain.init inserting DistributedUpdateProcessorFactory into updateRequestProcessorChain "dedupe"
[junit4:junit4]   2> 14123 T1845 oasup.UpdateRequestProcessorChain.init inserting DistributedUpdateProcessorFactory into updateRequestProcessorChain "stored_sig"
[junit4:junit4]   2> 14124 T1845 oasup.UpdateRequestProcessorChain.init inserting DistributedUpdateProcessorFactory into updateRequestProcessorChain "distrib-dup-test-chain-implicit"
[junit4:junit4]   2> 14124 T1845 oasc.RequestHandlers.initHandlersFromConfig created standard: solr.StandardRequestHandler
[junit4:junit4]   2> 14125 T1845 oasc.RequestHandlers.initHandlersFromConfig created /get: solr.RealTimeGetHandler
[junit4:junit4]   2> 14125 T1845 oasc.RequestHandlers.initHandlersFromConfig adding lazy requestHandler: solr.ReplicationHandler
[junit4:junit4]   2> 14125 T1845 oasc.RequestHandlers.initHandlersFromConfig created /replication: solr.ReplicationHandler
[junit4:junit4]   2> 14126 T1845 oasc.RequestHandlers.initHandlersFromConfig created /update: solr.UpdateRequestHandler
[junit4:junit4]   2> 14126 T1845 oasc.RequestHandlers.initHandlersFromConfig created /admin/: org.apache.solr.handler.admin.AdminHandlers
[junit4:junit4]   2> 14138 T1845 oashl.XMLLoader.init xsltCacheLifetimeSeconds=60
[junit4:junit4]   2> 14146 T1845 oass.SolrIndexSearcher.<init> Opening Searcher@7d106e50 main
[junit4:junit4]   2> 14147 T1845 oasu.CommitTracker.<init> Hard AutoCommit: disabled
[junit4:junit4]   2> 14147 T1845 oasu.CommitTracker.<init> Soft AutoCommit: disabled
[junit4:junit4]   2> 14151 T1846 oasc.SolrCore.registerSearcher [collection1] Registered new searcher Searcher@7d106e50 main{StandardDirectoryReader(segments_1:1)}
[junit4:junit4]   2> 14153 T1845 oasc.ZkController.publish publishing core=collection1 state=down
[junit4:junit4]   2> 14153 T1845 oasc.ZkController.publish numShards not found on descriptor - reading it from system property
[junit4:junit4]   2> 14537 T1792 oascc.ZkStateReader.updateClusterState Updating cloud state from ZooKeeper... 
[junit4:junit4]   2> 14538 T1792 oasc.Overseer$ClusterStateUpdater.updateState Update state numShards=1 message={
[junit4:junit4]   2> 	  "operation":"state",
[junit4:junit4]   2> 	  "core_node_name":null,
[junit4:junit4]   2> 	  "numShards":"1",
[junit4:junit4]   2> 	  "shard":null,
[junit4:junit4]   2> 	  "roles":null,
[junit4:junit4]   2> 	  "state":"down",
[junit4:junit4]   2> 	  "core":"collection1",
[junit4:junit4]   2> 	  "collection":"collection1",
[junit4:junit4]   2> 	  "node_name":"127.0.0.1:18575_rf_vkg",
[junit4:junit4]   2> 	  "base_url":"http://127.0.0.1:18575/rf_vkg"}
[junit4:junit4]   2> 14538 T1792 oasc.Overseer$ClusterStateUpdater.updateState Collection already exists with numShards=1
[junit4:junit4]   2> 14538 T1792 oasc.Overseer$ClusterStateUpdater.updateState Assigning new node to shard shard=shard1
[junit4:junit4]   2> 14543 T1798 oascc.ZkStateReader$2.process A cluster state change: WatchedEvent state:SyncConnected type:NodeDataChanged path:/clusterstate.json, has occurred - updating... (live nodes size: 4)
[junit4:junit4]   2> 14543 T1844 oascc.ZkStateReader$2.process A cluster state change: WatchedEvent state:SyncConnected type:NodeDataChanged path:/clusterstate.json, has occurred - updating... (live nodes size: 4)
[junit4:junit4]   2> 14543 T1827 oascc.ZkStateReader$2.process A cluster state change: WatchedEvent state:SyncConnected type:NodeDataChanged path:/clusterstate.json, has occurred - updating... (live nodes size: 4)
[junit4:junit4]   2> 14543 T1811 oascc.ZkStateReader$2.process A cluster state change: WatchedEvent state:SyncConnected type:NodeDataChanged path:/clusterstate.json, has occurred - updating... (live nodes size: 4)
[junit4:junit4]   2> 14543 T1791 oascc.ZkStateReader$2.process A cluster state change: WatchedEvent state:SyncConnected type:NodeDataChanged path:/clusterstate.json, has occurred - updating... (live nodes size: 4)
[junit4:junit4]   2> 15155 T1845 oasc.CoreContainer.registerCore registering core: collection1
[junit4:junit4]   2> 15155 T1845 oasc.ZkController.register Register replica - core:collection1 address:http://127.0.0.1:18575/rf_vkg collection:collection1 shard:shard1
[junit4:junit4]   2> 15159 T1845 oasc.ZkController.register We are http://127.0.0.1:18575/rf_vkg/collection1/ and leader is http://127.0.0.1:53616/rf_vkg/collection1/
[junit4:junit4]   2> 15159 T1845 oasc.ZkController.register No LogReplay needed for core=collection1 baseURL=http://127.0.0.1:18575/rf_vkg
[junit4:junit4]   2> 15159 T1845 oasc.ZkController.checkRecovery Core needs to recover:collection1
[junit4:junit4]   2> 15159 T1845 oasu.DefaultSolrCoreState.doRecovery Running recovery - first canceling any ongoing recovery
[junit4:junit4]   2> ASYNC  NEW_CORE C289 name=collection1 org.apache.solr.core.SolrCore@347d460f url=http://127.0.0.1:18575/rf_vkg/collection1 node=127.0.0.1:18575_rf_vkg C289_STATE=coll:collection1 core:collection1 props:{state=down, core=collection1, collection=collection1, node_name=127.0.0.1:18575_rf_vkg, base_url=http://127.0.0.1:18575/rf_vkg}
[junit4:junit4]   2> 15160 T1847 C289 P18575 oasc.RecoveryStrategy.run Starting recovery process.  core=collection1 recoveringAfterStartup=true
[junit4:junit4]   2> 15161 T1847 C289 P18575 oasc.RecoveryStrategy.doRecovery ###### startupVersions=[]
[junit4:junit4]   2> 15161 T1847 C289 P18575 oasc.ZkController.publish publishing core=collection1 state=recovering
[junit4:junit4]   2> 15161 T1845 oascc.ZkStateReader.updateClusterState Updating cloud state from ZooKeeper... 
[junit4:junit4]   2> 15161 T1847 C289 P18575 oasc.ZkController.publish numShards not found on descriptor - reading it from system property
[junit4:junit4]   2> 15162 T1769 oass.SolrDispatchFilter.init user.dir=/usr/home/hudson/hudson-slave/workspace/Lucene-Solr-Tests-4.x-java7/solr/build/solr-core/test/J1
[junit4:junit4]   2> 15163 T1847 C289 P18575 oascsi.HttpClientUtil.createClient Creating new http client, config:maxConnections=128&maxConnectionsPerHost=32&followRedirects=false
[junit4:junit4]   2> 15163 T1769 oass.SolrDispatchFilter.init SolrDispatchFilter.init() done
[junit4:junit4]   2> 15163 T1769 oascsi.HttpClientUtil.createClient Creating new http client, config:maxConnections=128&maxConnectionsPerHost=32&followRedirects=false
[junit4:junit4]   2> 15373 T1769 oejs.Server.doStart jetty-8.1.8.v20121106
[junit4:junit4]   2> 15376 T1769 oejs.AbstractConnector.doStart Started SocketConnector@127.0.0.1:52385
[junit4:junit4]   2> 15377 T1769 oass.SolrDispatchFilter.init SolrDispatchFilter.init()
[junit4:junit4]   2> 15377 T1769 oasc.SolrResourceLoader.locateSolrHome JNDI not configured for solr (NoInitialContextEx)
[junit4:junit4]   2> 15378 T1769 oasc.SolrResourceLoader.locateSolrHome using system property solr.solr.home: /usr/home/hudson/hudson-slave/workspace/Lucene-Solr-Tests-4.x-java7/solr/build/solr-core/test/J1/./org.apache.solr.cloud.SyncSliceTest-jetty4-1363650721817
[junit4:junit4]   2> 15378 T1769 oasc.CoreContainer$Initializer.initialize looking for solr config file: /usr/home/hudson/hudson-slave/workspace/Lucene-Solr-Tests-4.x-java7/solr/build/solr-core/test/J1/./org.apache.solr.cloud.SyncSliceTest-jetty4-1363650721817/solr.xml
[junit4:junit4]   2> 15379 T1769 oasc.CoreContainer.<init> New CoreContainer 370626973
[junit4:junit4]   2> 15379 T1769 oasc.CoreContainer.load Loading CoreContainer using Solr Home: '/usr/home/hudson/hudson-slave/workspace/Lucene-Solr-Tests-4.x-java7/solr/build/solr-core/test/J1/./org.apache.solr.cloud.SyncSliceTest-jetty4-1363650721817/'
[junit4:junit4]   2> 15380 T1769 oasc.SolrResourceLoader.<init> new SolrResourceLoader for directory: '/usr/home/hudson/hudson-slave/workspace/Lucene-Solr-Tests-4.x-java7/solr/build/solr-core/test/J1/./org.apache.solr.cloud.SyncSliceTest-jetty4-1363650721817/'
[junit4:junit4]   2> 15442 T1769 oashc.HttpShardHandlerFactory.getParameter Setting socketTimeout to: 120000
[junit4:junit4]   2> 15443 T1769 oashc.HttpShardHandlerFactory.getParameter Setting urlScheme to: http://
[junit4:junit4]   2> 15444 T1769 oashc.HttpShardHandlerFactory.getParameter Setting connTimeout to: 15000
[junit4:junit4]   2> 15444 T1769 oashc.HttpShardHandlerFactory.getParameter Setting maxConnectionsPerHost to: 20
[junit4:junit4]   2> 15444 T1769 oashc.HttpShardHandlerFactory.getParameter Setting corePoolSize to: 0
[junit4:junit4]   2> 15445 T1769 oashc.HttpShardHandlerFactory.getParameter Setting maximumPoolSize to: 2147483647
[junit4:junit4]   2> 15445 T1769 oashc.HttpShardHandlerFactory.getParameter Setting maxThreadIdleTime to: 5
[junit4:junit4]   2> 15446 T1769 oashc.HttpShardHandlerFactory.getParameter Setting sizeOfQueue to: -1
[junit4:junit4]   2> 15446 T1769 oashc.HttpShardHandlerFactory.getParameter Setting fairnessPolicy to: false
[junit4:junit4]   2> 15447 T1769 oascsi.HttpClientUtil.createClient Creating new http client, config:maxConnectionsPerHost=20&maxConnections=10000&socketTimeout=120000&connTimeout=15000&retry=false
[junit4:junit4]   2> 15467 T1769 oasc.CoreContainer.load Registering Log Listener
[junit4:junit4]   2> 15486 T1769 oasc.CoreContainer.initZooKeeper Zookeeper client=127.0.0.1:14485/solr
[junit4:junit4]   2> 15487 T1769 oasc.ZkController.checkChrootPath zkHost includes chroot
[junit4:junit4]   2> 15488 T1769 oaz.ZooKeeper.<init> Initiating client connection, connectString=127.0.0.1:14485 sessionTimeout=60000 watcher=org.apache.solr.common.cloud.ConnectionManager@4e0ac14e
[junit4:junit4]   2> 15489 T1769 oascc.ConnectionManager.waitForConnected Waiting for client to connect to ZooKeeper
[junit4:junit4]   2> 15489 T1858 oaz.ClientCnxn$SendThread.logStartConnect Opening socket connection to server localhost/127.0.0.1:14485. Will not attempt to authenticate using SASL (access denied ("javax.security.auth.AuthPermission" "getLoginConfiguration"))
[junit4:junit4]   2> 15490 T1858 oaz.ClientCnxn$SendThread.primeConnection Socket connection established to localhost/127.0.0.1:14485, initiating session
[junit4:junit4]   2> 15490 T1771 oazs.NIOServerCnxnFactory.run Accepted socket connection from /140.211.11.196:29375
[junit4:junit4]   2> 15491 T1771 oazs.ZooKeeperServer.processConnectRequest Client attempting to establish new session at /140.211.11.196:29375
[junit4:junit4]   2> 15492 T1773 oazs.ZooKeeperServer.finishSessionInit Established session 0x13d7fea7cd8000b with negotiated timeout 20000 for client /140.211.11.196:29375
[junit4:junit4]   2> 15492 T1858 oaz.ClientCnxn$SendThread.onConnected Session establishment complete on server localhost/127.0.0.1:14485, sessionid = 0x13d7fea7cd8000b, negotiated timeout = 20000
[junit4:junit4]   2> 15493 T1859 oascc.ConnectionManager.process Watcher org.apache.solr.common.cloud.ConnectionManager@4e0ac14e name:ZooKeeperConnection Watcher:127.0.0.1:14485 got event WatchedEvent state:SyncConnected type:None path:null path:null type:None
[junit4:junit4]   2> 15493 T1769 oascc.ConnectionManager.waitForConnected Client is connected to ZooKeeper
[junit4:junit4]   2> 15495 T1774 oazs.PrepRequestProcessor.pRequest2Txn Processed session termination for sessionid: 0x13d7fea7cd8000b
[junit4:junit4]   2> 15502 T1859 oaz.ClientCnxn$EventThread.run EventThread shut down
[junit4:junit4]   2> 15502 T1771 oazs.NIOServerCnxn.closeSock Closed socket connection for client /140.211.11.196:29375 which had sessionid 0x13d7fea7cd8000b
[junit4:junit4]   2> 15502 T1769 oaz.ZooKeeper.close Session: 0x13d7fea7cd8000b closed
[junit4:junit4]   2> 15503 T1769 oascsi.HttpClientUtil.createClient Creating new http client, config:maxConnections=500&maxConnectionsPerHost=16&socketTimeout=120000&connTimeout=15000
[junit4:junit4]   2> 15516 T1769 oaz.ZooKeeper.<init> Initiating client connection, connectString=127.0.0.1:14485/solr sessionTimeout=30000 watcher=org.apache.solr.common.cloud.ConnectionManager@311276ad
[junit4:junit4]   2> 15517 T1769 oascc.ConnectionManager.waitForConnected Waiting for client to connect to ZooKeeper
[junit4:junit4]   2> 15517 T1860 oaz.ClientCnxn$SendThread.logStartConnect Opening socket connection to server localhost/127.0.0.1:14485. Will not attempt to authenticate using SASL (access denied ("javax.security.auth.AuthPermission" "getLoginConfiguration"))
[junit4:junit4]   2> 15518 T1860 oaz.ClientCnxn$SendThread.primeConnection Socket connection established to localhost/127.0.0.1:14485, initiating session
[junit4:junit4]   2> 15518 T1771 oazs.NIOServerCnxnFactory.run Accepted socket connection from /140.211.11.196:49283
[junit4:junit4]   2> 15518 T1771 oazs.ZooKeeperServer.processConnectRequest Client attempting to establish new session at /140.211.11.196:49283
[junit4:junit4]   2> 15519 T1773 oazs.ZooKeeperServer.finishSessionInit Established session 0x13d7fea7cd8000c with negotiated timeout 20000 for client /140.211.11.196:49283
[junit4:junit4]   2> 15519 T1860 oaz.ClientCnxn$SendThread.onConnected Session establishment complete on server localhost/127.0.0.1:14485, sessionid = 0x13d7fea7cd8000c, negotiated timeout = 20000
[junit4:junit4]   2> 15520 T1861 oascc.ConnectionManager.process Watcher org.apache.solr.common.cloud.ConnectionManager@311276ad name:ZooKeeperConnection Watcher:127.0.0.1:14485/solr got event WatchedEvent state:SyncConnected type:None path:null path:null type:None
[junit4:junit4]   2> 15520 T1769 oascc.ConnectionManager.waitForConnected Client is connected to ZooKeeper
[junit4:junit4]   2> 15521 T1774 oazs.PrepRequestProcessor.pRequest Got user-level KeeperException when processing sessionid:0x13d7fea7cd8000c type:create cxid:0x1 zxid:0x92 txntype:-1 reqpath:n/a Error Path:/solr/overseer Error:KeeperErrorCode = NodeExists for /solr/overseer
[junit4:junit4]   2> 15523 T1774 oazs.PrepRequestProcessor.pRequest Got user-level KeeperException when processing sessionid:0x13d7fea7cd8000c type:create cxid:0x3 zxid:0x93 txntype:-1 reqpath:n/a Error Path:/solr/overseer Error:KeeperErrorCode = NodeExists for /solr/overseer
[junit4:junit4]   2> 15534 T1769 oascc.ZkStateReader.createClusterStateWatchersAndUpdate Updating cluster state from ZooKeeper... 
[junit4:junit4]   2>  C288_STATE=coll:collection1 core:collection1 props:{shard=shard1, state=recovering, core=collection1, collection=collection1, node_name=127.0.0.1:25448_rf_vkg, base_url=http://127.0.0.1:25448/rf_vkg}
[junit4:junit4]   2> 15804 T1830 C288 P25448 oasc.RecoveryStrategy.doRecovery Attempting to PeerSync from http://127.0.0.1:53616/rf_vkg/collection1/ core=collection1 - recoveringAfterStartup=true
[junit4:junit4]   2> 15804 T1830 C288 P25448 oasu.PeerSync.sync PeerSync: core=collection1 url=http://127.0.0.1:25448/rf_vkg START replicas=[http://127.0.0.1:53616/rf_vkg/collection1/] nUpdates=100
[junit4:junit4]   2> 15804 T1830 C288 P25448 oasu.PeerSync.sync WARNING no frame of reference to tell of we've missed updates
[junit4:junit4]   2> 15805 T1830 C288 P25448 oasc.RecoveryStrategy.doRecovery PeerSync Recovery was not successful - trying replication. core=collection1
[junit4:junit4]   2> 15805 T1830 C288 P25448 oasc.RecoveryStrategy.doRecovery Starting Replication Recovery. core=collection1
[junit4:junit4]   2> 15805 T1830 C288 P25448 oasc.RecoveryStrategy.doRecovery Begin buffering updates. core=collection1
[junit4:junit4]   2> 15805 T1830 C288 P25448 oasu.UpdateLog.bufferUpdates Starting to buffer updates. FSUpdateLog{state=ACTIVE, tlog=null}
[junit4:junit4]   2> 15805 T1830 C288 P25448 oasc.RecoveryStrategy.replicate Attempting to replicate from http://127.0.0.1:53616/rf_vkg/collection1/. core=collection1
[junit4:junit4]   2> 15806 T1830 C288 P25448 oascsi.HttpClientUtil.createClient Creating new http client, config:maxConnections=128&maxConnectionsPerHost=32&followRedirects=false
[junit4:junit4]   2> ASYNC  NEW_CORE C290 name=collection1 org.apache.solr.core.SolrCore@2eac5af url=http://127.0.0.1:53616/rf_vkg/collection1 node=127.0.0.1:53616_rf_vkg C290_STATE=coll:collection1 core:collection1 props:{shard=shard1, state=active, core=collection1, collection=collection1, node_name=127.0.0.1:53616_rf_vkg, base_url=http://127.0.0.1:53616/rf_vkg, leader=true}
[junit4:junit4]   2> 15815 T1803 C290 P53616 REQ /get {getVersions=100&distrib=false&wt=javabin&qt=/get&version=2} status=0 QTime=1 
[junit4:junit4]   2> 15820 T1804 C290 P53616 oasu.DirectUpdateHandler2.commit start commit{,optimize=false,openSearcher=false,waitSearcher=true,expungeDeletes=false,softCommit=false,prepareCommit=false}
[junit4:junit4]   2> 15825 T1804 C290 P53616 oasc.SolrDeletionPolicy.onInit SolrDeletionPolicy.onInit: commits:num=1
[junit4:junit4]   2> 		commit{dir=NRTCachingDirectory(org.apache.lucene.store.NIOFSDirectory@/usr/home/hudson/hudson-slave/workspace/Lucene-Solr-Tests-4.x-java7/solr/build/solr-core/test/J1/org.apache.solr.cloud.SyncSliceTest-1363650706640/jetty1/index lockFactory=org.apache.lucene.store.NativeFSLockFactory@4ed52565; maxCacheMB=48.0 maxMergeSizeMB=4.0),segFN=segments_1,generation=1,filenames=[segments_1]
[junit4:junit4]   2> 15825 T1804 C290 P53616 oasc.SolrDeletionPolicy.updateCommits newest commit = 1[segments_1]
[junit4:junit4]   2> 15830 T1804 C290 P53616 oasc.SolrDeletionPolicy.onCommit SolrDeletionPolicy.onCommit: commits:num=2
[junit4:junit4]   2> 		commit{dir=NRTCachingDirectory(org.apache.lucene.store.NIOFSDirectory@/usr/home/hudson/hudson-slave/workspace/Lucene-Solr-Tests-4.x-java7/solr/build/solr-core/test/J1/org.apache.solr.cloud.SyncSliceTest-1363650706640/jetty1/index lockFactory=org.apache.lucene.store.NativeFSLockFactory@4ed52565; maxCacheMB=48.0 maxMergeSizeMB=4.0),segFN=segments_1,generation=1,filenames=[segments_1]
[junit4:junit4]   2> 		commit{dir=NRTCachingDirectory(org.apache.lucene.store.NIOFSDirectory@/usr/home/hudson/hudson-slave/workspace/Lucene-Solr-Tests-4.x-java7/solr/build/solr-core/test/J1/org.apache.solr.cloud.SyncSliceTest-1363650706640/jetty1/index lockFactory=org.apache.lucene.store.NativeFSLockFactory@4ed52565; maxCacheMB=48.0 maxMergeSizeMB=4.0),segFN=segments_2,generation=2,filenames=[segments_2]
[junit4:junit4]   2> 15830 T1804 C290 P53616 oasc.SolrDeletionPolicy.updateCommits newest commit = 2[segments_2]
[junit4:junit4]   2> 15831 T1804 C290 P53616 oass.SolrIndexSearcher.<init> Opening Searcher@1729158a realtime
[junit4:junit4]   2> 15832 T1804 C290 P53616 oasu.DirectUpdateHandler2.commit end_commit_flush
[junit4:junit4]   2> 15832 T1804 C290 P53616 /update {waitSearcher=true&openSearcher=false&commit=true&wt=javabin&commit_end_point=true&version=2&softCommit=false} {commit=} 0 12
[junit4:junit4]   2> 15833 T1830 C288 P25448 oash.ReplicationHandler.inform Commits will be reserved for  10000
[junit4:junit4]   2> 15833 T1830 C288 P25448 oash.SnapPuller.<init>  No value set for 'pollInterval'. Timer Task not started.
[junit4:junit4]   2> 15835 T1805 C290 P53616 oash.ReplicationHandler.inform Commits will be reserved for  10000
[junit4:junit4]   2> 15836 T1805 C290 P53616 REQ /replication {command=indexversion&qt=/replication&wt=javabin&version=2} status=0 QTime=2 
[junit4:junit4]   2> 15836 T1830 C288 P25448 oash.SnapPuller.fetchLatestIndex Master's generation: 2
[junit4:junit4]   2> 15836 T1830 C288 P25448 oash.SnapPuller.fetchLatestIndex Slave's generation: 1
[junit4:junit4]   2> 15837 T1830 C288 P25448 oash.SnapPuller.fetchLatestIndex Starting replication process
[junit4:junit4]   2> 15840 T1805 C290 P53616 REQ /replication {command=filelist&qt=/replication&wt=javabin&generation=2&version=2} status=0 QTime=1 
[junit4:junit4]   2> 15840 T1830 C288 P25448 oash.SnapPuller.fetchLatestIndex Number of files in latest index in master: 1
[junit4:junit4]   2> 15841 T1830 C288 P25448 oasc.CachingDirectoryFactory.get return new directory for /usr/home/hudson/hudson-slave/workspace/Lucene-Solr-Tests-4.x-java7/solr/build/solr-core/test/J1/org.apache.solr.cloud.SyncSliceTest-1363650706640/jetty2/index.20130318185202475 forceNew: false
[junit4:junit4]   2> 15843 T1830 C288 P25448 oash.SnapPuller.fetchLatestIndex Starting download to NRTCachingDirectory(org.apache.lucene.store.NIOFSDirectory@/usr/home/hudson/hudson-slave/workspace/Lucene-Solr-Tests-4.x-java7/solr/build/solr-core/test/J1/org.apache.solr.cloud.SyncSliceTest-1363650706640/jetty2/index.20130318185202475 lockFactory=org.apache.lucene.store.NativeFSLockFactory@71ec8ada; maxCacheMB=48.0 maxMergeSizeMB=4.0) fullCopy=false
[junit4:junit4]   2> 15846 T1805 C290 P53616 REQ /replication {file=segments_2&command=filecontent&checksum=true&wt=filestream&qt=/replication&generation=2} status=0 QTime=0 
[junit4:junit4]   2> 15847 T1830 C288 P25448 oash.SnapPuller.fetchLatestIndex Total time taken for download : 0 secs
[junit4:junit4]   2> 15850 T1830 C288 P25448 oasu.DefaultSolrCoreState.newIndexWriter Creating new IndexWriter...
[junit4:junit4]   2> 15850 T1830 C288 P25448 oasu.DefaultSolrCoreState.newIndexWriter Waiting until IndexWriter is unused... core=collection1
[junit4:junit4]   2> 15854 T1830 C288 P25448 oasc.SolrDeletionPolicy.onInit SolrDeletionPolicy.onInit: commits:num=2
[junit4:junit4]   2> 		commit{dir=NRTCachingDirectory(org.apache.lucene.store.NIOFSDirectory@/usr/home/hudson/hudson-slave/workspace/Lucene-Solr-Tests-4.x-java7/solr/build/solr-core/test/J1/org.apache.solr.cloud.SyncSliceTest-1363650706640/jetty2/index lockFactory=org.apache.lucene.store.NativeFSLockFactory@1dd65a66; maxCacheMB=48.0 maxMergeSizeMB=4.0),segFN=segments_1,generation=1,filenames=[segments_1]
[junit4:junit4]   2> 		commit{dir=NRTCachingDirectory(org.apache.lucene.store.NIOFSDirectory@/usr/home/hudson/hudson-slave/workspace/Lucene-Solr-Tests-4.x-java7/solr/build/solr-core/test/J1/org.apache.solr.cloud.SyncSliceTest-1363650706640/jetty2/index lockFactory=org.apache.lucene.store.NativeFSLockFactory@1dd65a66; maxCacheMB=48.0 maxMergeSizeMB=4.0),segFN=segments_2,generation=2,filenames=[segments_2]
[junit4:junit4]   2> 15854 T1830 C288 P25448 oasc.SolrDeletionPolicy.updateCommits newest commit = 2[segments_2]
[junit4:junit4]   2> 15855 T1830 C288 P25448 oasu.DefaultSolrCoreState.newIndexWriter New IndexWriter is ready to be used.
[junit4:junit4]   2> 15855 T1830 C288 P25448 oass.SolrIndexSearcher.<init> Opening Searcher@bb351ff main
[junit4:junit4]   2> 15857 T1829 oasc.SolrCore.registerSearcher [collection1] Registered new searcher Searcher@bb351ff main{StandardDirectoryReader(segments_2:1:nrt)}
[junit4:junit4]   2> 15857 T1830 C288 P25448 oasc.RecoveryStrategy.replay No replay needed. core=collection1
[junit4:junit4]   2> 15857 T1830 C288 P25448 oasc.RecoveryStrategy.doRecovery Replication Recovery was successful - registering as Active. core=collection1
[junit4:junit4]   2> 15857 T1830 C288 P25448 oasc.ZkController.publish publishing core=collection1 state=active
[junit4:junit4]   2> 15858 T1830 C288 P25448 oasc.ZkController.publish numShards not found on descriptor - reading it from system property
[junit4:junit4]   2> 15859 T1830 C288 P25448 oasc.RecoveryStrategy.doRecovery Finished recovery process. core=collection1
[junit4:junit4]   2> 16059 T1792 oascc.ZkStateReader.updateClusterState Updating cloud state from ZooKeeper... 
[junit4:junit4]   2> 16060 T1792 oasc.Overseer$ClusterStateUpdater.updateState Update state numShards=1 message={
[junit4:junit4]   2> 	  "operation":"state",
[junit4:junit4]   2> 	  "core_node_name":"127.0.0.1:18575_rf_vkg_collection1",
[junit4:junit4]   2> 	  "numShards":"1",
[junit4:junit4]   2> 	  "shard":"shard1",
[junit4:junit4]   2> 	  "roles":null,
[junit4:junit4]   2> 	  "state":"recovering",
[junit4:junit4]   2> 	  "core":"collection1",
[junit4:junit4]   2> 	  "collection":"collection1",
[junit4:junit4]   2> 	  "node_name":"127.0.0.1:18575_rf_vkg",
[junit4:junit4]   2> 	  "base_url":"http://127.0.0.1:18575/rf_vkg"}
[junit4:junit4]   2> 16064 T1792 oasc.Overseer$ClusterStateUpdater.updateState Update state numShards=1 message={
[junit4:junit4]   2> 	  "operation":"state",
[junit4:junit4]   2> 	  "core_node_name":"127.0.0.1:25448_rf_vkg_collection1",
[junit4:junit4]   2> 	  "numShards":"1",
[junit4:junit4]   2> 	  "shard":"shard1",
[junit4:junit4]   2> 	  "roles":null,
[junit4:junit4]   2> 	  "state":"active",
[junit4:junit4]   2> 	  "core":"collection1",
[junit4:junit4]   2> 	  "collection":"collection1",
[junit4:junit4]   2> 	  "node_name":"127.0.0.1:25448_rf_vkg",
[junit4:junit4]   2> 	  "base_url":"http://127.0.0.1:25448/rf_vkg"}
[junit4:junit4]   2> 16080 T1798 oascc.ZkStateReader$2.process A cluster state change: WatchedEvent state:SyncConnected type:NodeDataChanged path:/clusterstate.json, has occurred - updating... (live nodes size: 4)
[junit4:junit4]   2> 16080 T1844 oascc.ZkStateReader$2.process A cluster state change: WatchedEvent state:SyncConnected type:NodeDataChanged path:/clusterstate.json, has occurred - updating... (live nodes size: 4)
[junit4:junit4]   2> 16081 T1861 oascc.ZkStateReader$2.process A cluster state change: WatchedEvent state:SyncConnected type:NodeDataChanged path:/clusterstate.json, has occurred - updating... (live nodes size: 4)
[junit4:junit4]   2> 16081 T1791 oascc.ZkStateReader$2.process A cluster state change: WatchedEvent state:SyncConnected type:NodeDataChanged path:/clusterstate.json, has occurred - updating... (live nodes size: 4)
[junit4:junit4]   2> 16081 T1811 oascc.ZkStateReader$2.process A cluster state change: WatchedEvent state:SyncConnected type:NodeDataChanged path:/clusterstate.json, has occurred - updating... (live nodes size: 4)
[junit4:junit4]   2> 16081 T1827 oascc.ZkStateReader$2.process A cluster state change: WatchedEvent state:SyncConnected type:NodeDataChanged path:/clusterstate.json, has occurred - updating... (live nodes size: 4)
[junit4:junit4]   2> 16185 T1802 oass.SolrDispatchFilter.handleAdminRequest /admin/cores {coreNodeName=127.0.0.1:18575_rf_vkg_collection1&state=recovering&nodeName=127.0.0.1:18575_rf_vkg&action=PREPRECOVERY&checkLive=true&core=collection1&wt=javabin&onlyIfLeader=true&version=2} status=0 QTime=1001 
[junit4:junit4]   2> 16537 T1769 oasc.ZkController.createEphemeralLiveNode Register node as live in ZooKeeper:/live_nodes/127.0.0.1:52385_rf_vkg
[junit4:junit4]   2> 16538 T1774 oazs.PrepRequestProcessor.pRequest Got user-level KeeperException when processing sessionid:0x13d7fea7cd8000c type:delete cxid:0xf zxid:0x9c txntype:-1 reqpath:n/a Error Path:/solr/live_nodes/127.0.0.1:52385_rf_vkg Error:KeeperErrorCode = NoNode for /solr/live_nodes/127.0.0.1:52385_rf_vkg
[junit4:junit4]   2> 16539 T1769 oascc.SolrZkClient.makePath makePath: /live_nodes/127.0.0.1:52385_rf_vkg
[junit4:junit4]   2> 16541 T1861 oascc.ZkStateReader$2.process A cluster state change: WatchedEvent state:SyncConnected type:NodeChildrenChanged path:/live_nodes, has occurred - updating... (live nodes size: 4)
[junit4:junit4]   2> 16541 T1844 oascc.ZkStateReader$2.process A cluster state change: WatchedEvent state:SyncConnected type:NodeChildrenChanged path:/live_nodes, has occurred - updating... (live nodes size: 4)
[junit4:junit4]   2> 16541 T1827 oascc.ZkStateReader$2.process A cluster state change: WatchedEvent state:SyncConnected type:NodeChildrenChanged path:/live_nodes, has occurred - updating... (live nodes size: 4)
[junit4:junit4]   2> 16542 T1811 oascc.ZkStateReader$3.process Updating live nodes... (5)
[junit4:junit4]   2> 16542 T1798 oascc.ZkStateReader$3.process Updating live nodes... (5)
[junit4:junit4]   2> 16542 T1811 oascc.ZkStateReader$2.process A cluster state change: WatchedEvent state:SyncConnected type:NodeChildrenChanged path:/live_nodes, has occurred - updating... (live nodes size: 5)
[junit4:junit4]   2> 16542 T1798 oascc.ZkStateReader$2.process A cluster state change: WatchedEvent state:SyncConnected type:NodeChildrenChanged path:/live_nodes, has occurred - updating... (live nodes size: 5)
[junit4:junit4]   2> 16542 T1791 oascc.ZkStateReader$3.process Updating live nodes... (5)
[junit4:junit4]   2> 16543 T1791 oascc.ZkStateReader$2.process A cluster state change: WatchedEvent state:SyncConnected type:NodeChildrenChanged path:/live_nodes, has occurred - updating... (live nodes size: 5)
[junit4:junit4]   2> 16543 T1844 oascc.ZkStateReader$3.process Updating live nodes... (5)
[junit4:junit4]   2> 16543 T1861 oascc.ZkStateReader$3.process Updating live nodes... (5)
[junit4:junit4]   2> 16551 T1827 oascc.ZkStateReader$3.process Updating live nodes... (5)
[junit4:junit4]   2> 16559 T1864 oasc.CoreContainer.create Creating SolrCore 'collection1' using instanceDir: /usr/home/hudson/hudson-slave/workspace/Lucene-Solr-Tests-4.x-java7/solr/build/solr-core/test/J1/./org.apache.solr.cloud.SyncSliceTest-jetty4-1363650721817/collection1
[junit4:junit4]   2> 16559 T1864 oasc.ZkController.createCollectionZkNode Check for collection zkNode:collection1
[junit4:junit4]   2> 16560 T1864 oasc.ZkController.createCollectionZkNode Collection zkNode exists
[junit4:junit4]   2> 16560 T1864 oasc.ZkController.readConfigName Load collection config from:/collections/collection1
[junit4:junit4]   2> 16562 T1864 oasc.SolrResourceLoader.<init> new SolrResourceLoader for directory: '/usr/home/hudson/hudson-slave/workspace/Lucene-Solr-Tests-4.x-java7/solr/build/solr-core/test/J1/./org.apache.solr.cloud.SyncSliceTest-jetty4-1363650721817/collection1/'
[junit4:junit4]   2> 16563 T1864 oasc.SolrResourceLoader.replaceClassLoader Adding 'file:/usr/home/hudson/hudson-slave/workspace/Lucene-Solr-Tests-4.x-java7/solr/build/solr-core/test/J1/org.apache.solr.cloud.SyncSliceTest-jetty4-1363650721817/collection1/lib/README' to classloader
[junit4:junit4]   2> 16563 T1864 oasc.SolrResourceLoader.replaceClassLoader Adding 'file:/usr/home/hudson/hudson-slave/workspace/Lucene-Solr-Tests-4.x-java7/solr/build/solr-core/test/J1/org.apache.solr.cloud.SyncSliceTest-jetty4-1363650721817/collection1/lib/classes/' to classloader
[junit4:junit4]   2> 16636 T1864 oasc.SolrConfig.<init> Using Lucene MatchVersion: LUCENE_43
[junit4:junit4]   2> 16695 T1864 oasc.SolrConfig.<init> Loaded SolrConfig: solrconfig.xml
[junit4:junit4]   2> 16796 T1864 oass.IndexSchema.readSchema Reading Solr Schema
[junit4:junit4]   2> 16802 T1864 oass.IndexSchema.readSchema Schema name=test
[junit4:junit4]   2> 17425 T1864 oass.OpenExchangeRatesOrgProvider.init Initialized with rates=open-exchange-rates.json, refreshInterval=1440.
[junit4:junit4]   2> 17436 T1864 oass.IndexSchema.readSchema default search field in schema is text
[junit4:junit4]   2> 17440 T1864 oass.IndexSchema.readSchema unique key field: id
[junit4:junit4]   2> 17454 T1864 oass.FileExchangeRateProvider.reload Reloading exchange rates from file currency.xml
[junit4:junit4]   2> 17459 T1864 oass.FileExchangeRateProvider.reload Reloading exchange rates from file currency.xml
[junit4:junit4]   2> 17463 T1864 oass.OpenExchangeRatesOrgProvider.reload Reloading exchange rates from open-exchange-rates.json
[junit4:junit4]   2> 17464 T1864 oass.OpenExchangeRatesOrgProvider$OpenExchangeRates.<init> WARNING Unknown key IMPORTANT NOTE
[junit4:junit4]   2> 17465 T1864 oass.OpenExchangeRatesOrgProvider$OpenExchangeRates.<init> WARNING Expected key, got STRING
[junit4:junit4]   2> 17465 T1864 oass.OpenExchangeRatesOrgProvider.reload Reloading exchange rates from open-exchange-rates.json
[junit4:junit4]   2> 17466 T1864 oass.OpenExchangeRatesOrgProvider$OpenExchangeRates.<init> WARNING Unknown key IMPORTANT NOTE
[junit4:junit4]   2> 17466 T1864 oass.OpenExchangeRatesOrgProvider$OpenExchangeRates.<init> WARNING Expected key, got STRING
[junit4:junit4]   2> 17466 T1864 oasc.SolrCore.initDirectoryFactory solr.NRTCachingDirectoryFactory
[junit4:junit4]   2> 17467 T1864 oasc.SolrCore.<init> [collection1] Opening new SolrCore at /usr/home/hudson/hudson-slave/workspace/Lucene-Solr-Tests-4.x-java7/solr/build/solr-core/test/J1/./org.apache.solr.cloud.SyncSliceTest-jetty4-1363650721817/collection1/, dataDir=./org.apache.solr.cloud.SyncSliceTest-1363650706640/jetty4/
[junit4:junit4]   2> 17467 T1864 oasc.JmxMonitoredMap.<init> JMX monitoring is enabled. Adding Solr mbeans to JMX Server: com.sun.jmx.mbeanserver.JmxMBeanServer@740ba142
[junit4:junit4]   2> 17468 T1864 oasc.SolrCore.initDirectoryFactory solr.NRTCachingDirectoryFactory
[junit4:junit4]   2> 17468 T1864 oasc.CachingDirectoryFactory.get return new directory for /usr/home/hudson/hudson-slave/workspace/Lucene-Solr-Tests-4.x-java7/solr/build/solr-core/test/J1/org.apache.solr.cloud.SyncSliceTest-1363650706640/jetty4 forceNew: false
[junit4:junit4]   2> 17469 T1864 oasc.SolrCore.getNewIndexDir New index directory detected: old=null new=./org.apache.solr.cloud.SyncSliceTest-1363650706640/jetty4/index/
[junit4:junit4]   2> 17470 T1864 oasc.SolrCore.initIndex WARNING [collection1] Solr index directory './org.apache.solr.cloud.SyncSliceTest-1363650706640/jetty4/index' doesn't exist. Creating new index...
[junit4:junit4]   2> 17470 T1864 oasc.CachingDirectoryFactory.get return new directory for /usr/home/hudson/hudson-slave/workspace/Lucene-Solr-Tests-4.x-java7/solr/build/solr-core/test/J1/org.apache.solr.cloud.SyncSliceTest-1363650706640/jetty4/index forceNew: false
[junit4:junit4]   2> 17477 T1864 oasc.SolrDeletionPolicy.onCommit SolrDeletionPolicy.onCommit: commits:num=1
[junit4:junit4]   2> 		commit{dir=NRTCachingDirectory(org.apache.lucene.store.NIOFSDirectory@/usr/home/hudson/hudson-slave/workspace/Lucene-Solr-Tests-4.x-java7/solr/build/solr-core/test/J1/org.apache.solr.cloud.SyncSliceTest-1363650706640/jetty4/index lockFactory=org.apache.lucene.store.NativeFSLockFactory@54db2d97; maxCacheMB=48.0 maxMergeSizeMB=4.0),segFN=segments_1,generation=1,filenames=[segments_1]
[junit4:junit4]   2> 17478 T1864 oasc.SolrDeletionPolicy.updateCommits newest commit = 1[segments_1]
[junit4:junit4]   2> 17480 T1864 oasup.UpdateRequestProcessorChain.init inserting DistributedUpdateProcessorFactory into updateRequestProcessorChain "dedupe"
[junit4:junit4]   2> 17481 T1864 oasup.UpdateRequestProcessorChain.init inserting DistributedUpdateProcessorFactory into updateRequestProcessorChain "stored_sig"
[junit4:junit4]   2> 17481 T1864 oasup.UpdateRequestProcessorChain.init inserting DistributedUpdateProcessorFactory into updateRequestProcessorChain "distrib-dup-test-chain-implicit"
[junit4:junit4]   2> 17482 T1864 oasc.RequestHandlers.initHandlersFromConfig created standard: solr.StandardRequestHandler
[junit4:junit4]   2> 17483 T1864 oasc.RequestHandlers.initHandlersFromConfig created /get: solr.RealTimeGetHandler
[junit4:junit4]   2> 17483 T1864 oasc.RequestHandlers.initHandlersFromConfig adding lazy requestHandler: solr.ReplicationHandler
[junit4:junit4]   2> 17483 T1864 oasc.RequestHandlers.initHandlersFromConfig created /replication: solr.ReplicationHandler
[junit4:junit4]   2> 17484 T1864 oasc.RequestHandlers.initHandlersFromConfig created /update: solr.UpdateRequestHandler
[junit4:junit4]   2> 17484 T1864 oasc.RequestHandlers.initHandlersFromConfig created /admin/: org.apache.solr.handler.admin.AdminHandlers
[junit4:junit4]   2> 17497 T1864 oashl.XMLLoader.init xsltCacheLifetimeSeconds=60
[junit4:junit4]   2> 17505 T1864 oass.SolrIndexSearcher.<init> Opening Searcher@3aace6f8 main
[junit4:junit4]   2> 17506 T1864 oasu.CommitTracker.<init> Hard AutoCommit: disabled
[junit4:junit4]   2> 17506 T1864 oasu.CommitTracker.<init> Soft AutoCommit: disabled
[junit4:junit4]   2> 17511 T1865 oasc.SolrCore.registerSearcher [collection1] Registered new searcher Searcher@3aace6f8 main{StandardDirectoryReader(segments_1:1)}
[junit4:junit4]   2> 17513 T1864 oasc.ZkController.publish publishing core=collection1 state=down
[junit4:junit4]   2> 17513 T1864 oasc.ZkController.publish numShards not found on descriptor - reading it from system property
[junit4:junit4]   2> 17587 T1792 oascc.ZkStateReader.updateClusterState Updating cloud state from ZooKeeper... 
[junit4:junit4]   2> 17588 T1792 oasc.Overseer$ClusterStateUpdater.updateState Update state numShards=1 message={
[junit4:junit4]   2> 	  "operation":"state",
[junit4:junit4]   2> 	  "core_node_name":null,
[junit4:junit4]   2> 	  "numShards":"1",
[junit4:junit4]   2> 	  "shard":null,
[junit4:junit4]   2> 	  "roles":null,
[junit4:junit4]   2> 	  "state":"down",
[junit4:junit4]   2> 	  "core":"collection1",
[junit4:junit4]   2> 	  "collection":"collection1",
[junit4:junit4]   2> 	  "node_name":"127.0.0.1:52385_rf_vkg",
[junit4:junit4]   2> 	  "base_url":"http://127.0.0.1:52385/rf_vkg"}
[junit4:junit4]   2> 17588 T1792 oasc.Overseer$ClusterStateUpdater.updateState Collection already exists with numShards=1
[junit4:junit4]   2> 17588 T1792 oasc.Overseer$ClusterStateUpdater.updateState Assigning new node to shard shard=shard1
[junit4:junit4]   2> 17600 T1798 oascc.ZkStateReader$2.process A cluster state change: WatchedEvent state:SyncConnected type:NodeDataChanged path:/clusterstate.json, has occurred - updating... (live nodes size: 5)
[junit4:junit4]   2> 17600 T1811 oascc.ZkStateReader$2.process A cluster state change: WatchedEvent state:SyncConnected type:NodeDataChanged path:/clusterstate.json, has occurred - updating... (live nodes size: 5)
[junit4:junit4]   2> 17601 T1827 oascc.ZkStateReader$2.process A cluster state change: WatchedEvent state:SyncConnected type:NodeDataChanged path:/clusterstate.json, has occurred - updating... (live nodes size: 5)
[junit4:junit4]   2> 17600 T1844 oascc.ZkStateReader$2.process A cluster state change: WatchedEvent state:SyncConnected type:NodeDataChanged path:/clusterstate.json, has occurred - updating... (live nodes size: 5)
[junit4:junit4]   2> 17600 T1791 oascc.ZkStateReader$2.process A cluster state change: WatchedEvent state:SyncConnected type:NodeDataChanged path:/clusterstate.json, has occurred - updating... (live nodes size: 5)
[junit4:junit4]   2> 17600 T1861 oascc.ZkStateReader$2.process A cluster state change: WatchedEvent state:SyncConnected type:NodeDataChanged path:/clusterstate.json, has occurred - updating... (live nodes size: 5)
[junit4:junit4]   2>  C289_STATE=coll:collection1 core:collection1 props:{shard=shard1, state=recovering, core=collection1, collection=collection1, node_name=127.0.0.1:18575_rf_vkg, base_url=http://127.0.0.1:18575/rf_vkg}
[junit4:junit4]   2> 18186 T1847 C289 P18575 oasc.RecoveryStrategy.doRecovery Attempting to PeerSync from http://127.0.0.1:53616/rf_vkg/collection1/ core=collection1 - recoveringAfterStartup=true
[junit4:junit4]   2> 18186 T1847 C289 P18575 oasu.PeerSync.sync PeerSync: core=collection1 url=http://127.0.0.1:18575/rf_vkg START replicas=[http://127.0.0.1:53616/rf_vkg/collection1/] nUpdates=100
[junit4:junit4]   2> 18187 T1847 C289 P18575 oasu.PeerSync.sync WARNING no frame of reference to tell of we've missed updates
[junit4:junit4]   2> 18187 T1847 C289 P18575 oasc.RecoveryStrategy.doRecovery PeerSync Recovery was not successful - trying replication. core=collection1
[junit4:junit4]   2> 18187 T1847 C289 P18575 oasc.RecoveryStrategy.doRecovery Starting Replication Recovery. core=collection1
[junit4:junit4]   2> 18187 T1847 C289 P18575 oasc.RecoveryStrategy.doRecovery Begin buffering updates. core=collection1
[junit4:junit4]   2> 18187 T1847 C289 P18575 oasu.UpdateLog.bufferUpdates Starting to buffer updates. FSUpdateLog{state=ACTIVE, tlog=null}
[junit4:junit4]   2> 18187 T1847 C289 P18575 oasc.RecoveryStrategy.replicate Attempting to replicate from http://127.0.0.1:53616/rf_vkg/collection1/. core=collection1
[junit4:junit4]   2> 18188 T1847 C289 P18575 oascsi.HttpClientUtil.createClient Creating new http client, config:maxConnections=128&maxConnectionsPerHost=32&followRedirects=false
[junit4:junit4]   2> 18189 T1803 C290 P53616 REQ /get {getVersions=100&distrib=false&wt=javabin&qt=/get&version=2} status=0 QTime=0 
[junit4:junit4]   2> 18203 T1806 C290 P53616 oasu.DirectUpdateHandler2.commit start commit{,optimize=false,openSearcher=false,waitSearcher=true,expungeDeletes=false,softCommit=false,prepareCommit=false}
[junit4:junit4]   2> 18207 T1806 C290 P53616 oasc.SolrDeletionPolicy.onCommit SolrDeletionPolicy.onCommit: commits:num=2
[junit4:junit4]   2> 		commit{dir=NRTCachingDirectory(org.apache.lucene.store.NIOFSDirectory@/usr/home/hudson/hudson-slave/workspace/Lucene-Solr-Tests-4.x-java7/solr/build/solr-core/test/J1/org.apache.solr.cloud.SyncSliceTest-1363650706640/jetty1/index lockFactory=org.apache.lucene.store.NativeFSLockFactory@4ed52565; maxCacheMB=48.0 maxMergeSizeMB=4.0),segFN=segments_2,generation=2,filenames=[segments_2]
[junit4:junit4]   2> 		commit{dir=NRTCachingDirectory(org.apache.lucene.store.NIOFSDirectory@/usr/home/hudson/hudson-slave/workspace/Lucene-Solr-Tests-4.x-java7/solr/build/solr-core/test/J1/org.apache.solr.cloud.SyncSliceTest-1363650706640/jetty1/index lockFactory=org.apache.lucene.store.NativeFSLockFactory@4ed52565; maxCacheMB=48.0 maxMergeSizeMB=4.0),segFN=segments_3,generation=3,filenames=[segments_3]
[junit4:junit4]   2> 18208 T1806 C290 P53616 oasc.SolrDeletionPolicy.updateCommits newest commit = 3[segments_3]
[junit4:junit4]   2> 18208 T1806 C290 P53616 oasu.DirectUpdateHandler2.commit end_commit_flush
[junit4:junit4]   2> 18209 T1806 C290 P53616 /update {waitSearcher=true&openSearcher=false&commit=true&wt=javabin&commit_end_point=true&version=2&softCommit=false} {commit=} 0 6
[junit4:junit4]   2> 18210 T1847 C289 P18575 oash.ReplicationHandler.inform Commits will be reserved for  10000
[junit4:junit4]   2> 18210 T1847 C289 P18575 oash.SnapPuller.<init>  No value set for 'pollInterval'. Timer Task not started.
[junit4:junit4]   2> 18212 T1805 C290 P53616 REQ /replication {command=indexversion&qt=/replication&wt=javabin&version=2} status=0 QTime=0 
[junit4:junit4]   2> 18213 T1847 C289 P18575 oash.SnapPuller.fetchLatestIndex Master's generation: 3
[junit4:junit4]   2> 18213 T1847 C289 P18575 oash.SnapPuller.fetchLatestIndex Slave's generation: 1
[junit4:junit4]   2> 18213 T1847 C289 P18575 oash.SnapPuller.fetchLatestIndex Starting replication process
[junit4:junit4]   2> 18216 T1805 C290 P53616 REQ /replication {command=filelist&qt=/replication&wt=javabin&generation=3&version=2} status=0 QTime=1 
[junit4:junit4]   2> 18216 T1847 C289 P18575 oash.SnapPuller.fetchLatestIndex Number of files in latest index in master: 1
[junit4:junit4]   2> 18218 T1847 C289 P18575 oasc.CachingDirectoryFactory.get return new directory for /usr/home/hudson/hudson-slave/workspace/Lucene-Solr-Tests-4.x-java7/solr/build/solr-core/test/J1/org.apache.solr.cloud.SyncSliceTest-1363650706640/jetty3/index.20130318185204851 forceNew: false
[junit4:junit4]   2> 18219 T1847 C289 P18575 oash.SnapPuller.fetchLatestIndex Starting download to NRTCachingDirectory(org.apache.lucene.store.NIOFSDirectory@/usr/home/hudson/hudson-slave/workspace/Lucene-Solr-Tests-4.x-java7/solr/build/solr-core/test/J1/org.apache.solr.cloud.SyncSliceTest-1363650706640/jetty3/index.20130318185204851 lockFactory=org.apache.lucene.store.NativeFSLockFactory@7014893c; maxCacheMB=48.0 maxMergeSizeMB=4.0) fullCopy=false
[junit4:junit4]   2> 18222 T1805 C290 P53616 REQ /replication {file=segments_3&command=filecontent&checksum=true&wt=filestream&qt=/replication&generation=3} status=0 QTime=0 
[junit4:junit4]   2> 18223 T1847 C289 P18575 oash.SnapPuller.fetchLatestIndex Total time taken for download : 0 secs
[junit4:junit4]   2> 18226 T1847 C289 P18575 oasu.DefaultSolrCoreState.newIndexWriter Creating new IndexWriter...
[junit4:junit4]   2> 18226 T1847 C289 P18575 oasu.DefaultSolrCoreState.newIndexWriter Waiting until IndexWriter is unused... core=collection1
[junit4:junit4]   2> 18230 T1847 C289 P18575 oasc.SolrDeletionPolicy.onInit SolrDeletionPolicy.onInit: commits:num=2
[junit4:junit4]   2> 		commit{dir=NRTCachingDirectory(org.apache.lucene.store.NIOFSDirectory@/usr/home/hudson/hudson-slave/workspace/Lucene-Solr-Tests-4.x-java7/solr/build/solr-core/test/J1/org.apache.solr.cloud.SyncSliceTest-1363650706640/jetty3/index lockFactory=org.apache.lucene.store.NativeFSLockFactory@6a8afb33; maxCacheMB=48.0 maxMergeSizeMB=4.0),segFN=segments_1,generation=1,filenames=[segments_1]
[junit4:junit4]   2> 		commit{dir=NRTCachingDirectory(org.apache.lucene.store.NIOFSDirectory@/usr/home/hudson/hudson-slave/workspace/Lucene-Solr-Tests-4.x-java7/solr/build/solr-core/test/J1/org.apache.solr.cloud.SyncSliceTest-1363650706640/jetty3/index lockFactory=org.apache.lucene.store.NativeFSLockFactory@6a8afb33; maxCacheMB=48.0 maxMergeSizeMB=4.0),segFN=segments_3,generation=3,filenames=[segments_3]
[junit4:junit4]   2> 18230 T1847 C289 P18575 oasc.SolrDeletionPolicy.updateCommits newest commit = 3[segments_3]
[junit4:junit4]   2> 18231 T1847 C289 P18575 oasu.DefaultSolrCoreState.newIndexWriter New IndexWriter is ready to be used.
[junit4:junit4]   2> 18231 T1847 C289 P18575 oass.SolrIndexSearcher.<init> Opening Searcher@2ca129b8 main
[junit4:junit4]   2> 18232 T1846 oasc.SolrCore.registerSearcher [collection1] Registered new searcher Searcher@2ca129b8 main{StandardDirectoryReader(segments_3:1:nrt)}
[junit4:junit4]   2> 18233 T1847 C289 P18575 oasc.RecoveryStrategy.replay No replay needed. core=collection1
[junit4:junit4]   2> 18233 T1847 C289 P18575 oasc.RecoveryStrategy.doRecovery Replication Recovery was successful - registering as Active. core=collection1
[junit4:junit4]   2> 18233 T1847 C289 P18575 oasc.ZkController.publish publishing core=collection1 state=active
[junit4:junit4]   2> 18234 T1847 C289 P18575 oasc.ZkController.publish numShards not found on descriptor - reading it from system property
[junit4:junit4]   2> 18235 T1847 C289 P18575 oasc.RecoveryStrategy.doRecovery Finished recovery process. core=collection1
[junit4:junit4]   2> 18515 T1864 oasc.CoreContainer.registerCore registering core: collection1
[junit4:junit4]   2> 18515 T1864 oasc.ZkController.register Register replica - core:collection1 address:http://127.0.0.1:52385/rf_vkg collection:collection1 shard:shard1
[junit4:junit4]   2> 18518 T1864 oasc.ZkController.register We are http://127.0.0.1:52385/rf_vkg/collection1/ and leader is http://127.0.0.1:53616/rf_vkg/collection1/
[junit4:junit4]   2> 18518 T1864 oasc.ZkController.register No LogReplay needed for core=collection1 baseURL=http://127.0.0.1:52385/rf_vkg
[junit4:junit4]   2> 18518 T1864 oasc.ZkController.checkRecovery Core needs to recover:collection1
[junit4:junit4]   2> 18519 T1864 oasu.DefaultSolrCoreState.doRecovery Running recovery - first canceling any ongoing recovery
[junit4:junit4]   2> ASYNC  NEW_CORE C291 name=collection1 org.apache.solr.core.SolrCore@649d4cc0 url=http://127.0.0.1:52385/rf_vkg/collection1 node=127.0.0.1:52385_rf_vkg C291_STATE=coll:collection1 core:collection1 props:{state=down, core=collection1, collection=collection1, node_name=127.0.0.1:52385_rf_vkg, base_url=http://127.0.0.1:52385/rf_vkg}
[junit4:junit4]   2> 18519 T1868 C291 P52385 oasc.RecoveryStrategy.run Starting recovery process.  core=collection1 recoveringAfterStartup=true
[junit4:junit4]   2> 18520 T1868 C291 P52385 oasc.RecoveryStrategy.doRecovery ###### startupVersions=[]
[junit4:junit4]   2> 18520 T1864 oascc.ZkStateReader.updateClusterState Updating cloud state from ZooKeeper... 
[junit4:junit4]   2> 18520 T1868 C291 P52385 oasc.ZkController.publish publishing core=collection1 state=recovering
[junit4:junit4]   2> 18520 T1868 C291 P52385 oasc.ZkController.publish numShards not found on descriptor - reading it from system property
[junit4:junit4]   2> 18521 T1769 oass.SolrDispatchFilter.init user.dir=/usr/home/hudson/hudson-slave/workspace/Lucene-Solr-Tests-4.x-java7/solr/build/solr-core/test/J1
[junit4:junit4]   2> 18521 T1769 oass.SolrDispatchFilter.init SolrDispatchFilter.init() done
[junit4:junit4]   2> 18522 T1769 oascsi.HttpClientUtil.createClient Creating new http client, config:maxConnections=128&maxConnectionsPerHost=32&followRedirects=false
[junit4:junit4]   2> 18522 T1868 C291 P52385 oascsi.HttpClientUtil.createClient Creating new http client, config:maxConnections=128&maxConnectionsPerHost=32&followRedirects=false
[junit4:junit4]   2> 18545 T1769 oascc.ZkStateReader.updateClusterState Updating cloud state from ZooKeeper... 
[junit4:junit4]   2> 18546 T1769 oasc.AbstractFullDistribZkTestBase.waitForThingsToLevelOut Wait for recoveries to finish - wait 15 for each attempt
[junit4:junit4]   2> 18547 T1769 oasc.AbstractDistribZkTestBase.waitForRecoveriesToFinish Wait for recoveries to finish - collection: collection1 failOnTimeout:true timeout (sec):15
[junit4:junit4]   2> 18547 T1769 oascc.ZkStateReader.updateClusterState Updating cloud state from ZooKeeper... 
[junit4:junit4]   2> 19105 T1792 oascc.ZkStateReader.updateClusterState Updating cloud state from ZooKeeper... 
[junit4:junit4]   2> 19106 T1792 oasc.Overseer$ClusterStateUpdater.updateState Update state numShards=1 message={
[junit4:junit4]   2> 	  "operation":"state",
[junit4:junit4]   2> 	  "core_node_name":"127.0.0.1:18575_rf_vkg_collection1",
[junit4:junit4]   2> 	  "numShards":"1",
[junit4:junit4]   2> 	  "shard":"shard1",
[junit4:junit4]   2> 	  "roles":null,
[junit4:junit4]   2> 	  "state":"active",
[junit4:junit4]   2> 	  "core":"collection1",
[junit4:junit4]   2> 	  "collection":"collection1",
[junit4:junit4]   2> 	  "node_name":"127.0.0.1:18575_rf_vkg",
[junit4:junit4]   2> 	  "base_url":"http://127.0.0.1:18575/rf_vkg"}
[junit4:junit4]   2> 19136 T1792 oasc.Overseer$ClusterStateUpdater.updateState Update state numShards=1 message={
[junit4:junit4]   2> 	  "operation":"state",
[junit4:junit4]   2> 	  "core_node_name":"127.0.0.1:52385_rf_vkg_collection1",
[junit4:junit4]   2> 	  "numShards":"1",
[junit4:junit4]   2> 	  "shard":"shard1",
[junit4:junit4]   2> 	  "roles":null,
[junit4:junit4]   2> 	  "state":"recovering",
[junit4:junit4]   2> 	  "core":"collection1",
[junit4:junit4]   2> 	  "collection":"collection1",
[junit4:junit4]   2> 	  "node_name":"127.0.0.1:52385_rf_vkg",
[junit4:junit4]   2> 	  "base_url":"http://127.0.0.1:52385/rf_vkg"}
[junit4:junit4]   2> 19148 T1798 oascc.ZkStateReader$2.process A cluster state change: WatchedEvent state:SyncConnected type:NodeDataChanged path:/clusterstate.json, has occurred - updating... (live nodes size: 5)
[junit4:junit4]   2> 19148 T1791 oascc.ZkStateReader$2.process A cluster state change: WatchedEvent state:SyncConnected type:NodeDataChanged path:/clusterstate.json, has occurred - updating... (live nodes size: 5)
[junit4:junit4]   2> 19148 T1827 oascc.ZkStateReader$2.process A cluster state change: WatchedEvent state:SyncConnected type:NodeDataChanged path:/clusterstate.json, has occurred - updating... (live nodes size: 5)
[junit4:junit4]   2> 19148 T1811 oascc.ZkStateReader$2.process A cluster state change: WatchedEvent state:SyncConnected type:NodeDataChanged path:/clusterstate.json, has occurred - updating... (live nodes size: 5)
[junit4:junit4]   2> 19148 T1844 oascc.ZkStateReader$2.process A cluster state change: WatchedEvent state:SyncConnected type:NodeDataChanged path:/clusterstate.json, has occurred - updating... (live nodes size: 5)
[junit4:junit4]   2> 19148 T1861 oascc.ZkStateReader$2.process A cluster state change: WatchedEvent state:SyncConnected type:NodeDataChanged path:/clusterstate.json, has occurred - updating... (live nodes size: 5)
[junit4:junit4]   2> 19547 T1807 oass.SolrDispatchFilter.handleAdminRequest /admin/cores {coreNodeName=127.0.0.1:52385_rf_vkg_collection1&state=recovering&nodeName=127.0.0.1:52385_rf_vkg&action=PREPRECOVERY&checkLive=true&core=collection1&wt=javabin&onlyIfLeader=true&version=2} status=0 QTime=1001 
[junit4:junit4]   2> 19549 T1769 oascc.ZkStateReader.updateClusterState Updating cloud state from ZooKeeper... 
[junit4:junit4]   2> 20551 T1769 oascc.ZkStateReader.updateClusterState Updating cloud state from ZooKeeper... 
[junit4:junit4]   2>  C291_STATE=coll:collection1 core:collection1 props:{shard=shard1, state=recovering, core=collection1, collection=collection1, node_name=127.0.0.1:52385_rf_vkg, base_url=http://127.0.0.1:52385/rf_vkg}
[junit4:junit4]   2> 21548 T1868 C291 P52385 oasc.RecoveryStrategy.doRecovery Attempting to PeerSync from http://127.0.0.1:53616/rf_vkg/collection1/ core=collection1 - recoveringAfterStartup=true
[junit4:junit4]   2> 21548 T1868 C291 P52385 oasu.PeerSync.sync PeerSync: core=collection1 url=http://127.0.0.1:52385/rf_vkg START replicas=[http://127.0.0.1:53616/rf_vkg/collection1/] nUpdates=100
[junit4:junit4]   2> 21549 T1868 C291 P52385 oasu.PeerSync.sync WARNING no frame of reference to tell of we've missed updates
[junit4:junit4]   2> 21549 T1868 C291 P52385 oasc.RecoveryStrategy.doRecovery PeerSync Recovery was not successful - trying replication. core=collection1
[junit4:junit4]   2> 21549 T1868 C291 P52385 oasc.RecoveryStrategy.doRecovery Starting Replication Recovery. core=collection1
[junit4:junit4]   2> 21549 T1868 C291 P52385 oasc.RecoveryStrategy.doRecovery Begin buffering updates. core=collection1
[junit4:junit4]   2> 21549 T1868 C291 P52385 oasu.UpdateLog.bufferUpdates Starting to buffer updates. FSUpdateLog{state=ACTIVE, tlog=null}
[junit4:junit4]   2> 21550 T1868 C291 P52385 oasc.RecoveryStrategy.replicate Attempting to replicate from http://127.0.0.1:53616/rf_vkg/collection1/. core=collection1
[junit4:junit4]   2> 21550 T1868 C291 P52385 oascsi.HttpClientUtil.createClient Creating new http client, config:maxConnections=128&maxConnectionsPerHost=32&followRedirects=false
[junit4:junit4]   2> 21551 T1803 C290 P53616 REQ /get {getVersions=100&distrib=false&wt=javabin&qt=/get&version=2} status=0 QTime=0 
[junit4:junit4]   2> 21553 T1769 oascc.ZkStateReader.updateClusterState Updating cloud state from ZooKeeper... 
[junit4:junit4]   2> 21560 T1801 C290 P53616 oasu.DirectUpdateHandler2.commit start commit{,optimize=false,openSearcher=false,waitSearcher=true,expungeDeletes=false,softCommit=false,prepareCommit=false}
[junit4:junit4]   2> 21564 T1801 C290 P53616 oasc.SolrDeletionPolicy.onCommit SolrDeletionPolicy.onCommit: commits:num=3
[junit4:junit4]   2> 		commit{dir=NRTCachingDirectory(org.apache.lucene.store.NIOFSDirectory@/usr/home/hudson/hudson-slave/workspace/Lucene-Solr-Tests-4.x-java7/solr/build/solr-core/test/J1/org.apache.solr.cloud.SyncSliceTest-1363650706640/jetty1/index lockFactory=org.apache.lucene.store.NativeFSLockFactory@4ed52565; maxCacheMB=48.0 maxMergeSizeMB=4.0),segFN=segments_2,generation=2,filenames=[segments_2]
[junit4:junit4]   2> 		commit{dir=NRTCachingDirectory(org.apache.lucene.store.NIOFSDirectory@/usr/home/hudson/hudson-slave/workspace/Lucene-Solr-Tests-4.x-java7/solr/build/solr-core/test/J1/org.apache.solr.cloud.SyncSliceTest-1363650706640/jetty1/index lockFactory=org.apache.lucene.store.NativeFSLockFactory@4ed52565; maxCacheMB=48.0 maxMergeSizeMB=4.0),segFN=segments_3,generation=3,filenames=[segments_3]
[junit4:junit4]   2> 		commit{dir=NRTCachingDirectory(org.apache.lucene.store.NIOFSDirectory@/usr/home/hudson/hudson-slave/workspace/Lucene-Solr-Tests-4.x-java7/solr/build/solr-core/test/J1/org.apache.solr.cloud.SyncSliceTest-1363650706640/jetty1/index lockFactory=org.apache.lucene.store.NativeFSLockFactory@4ed52565; maxCacheMB=48.0 maxMergeSizeMB=4.0),segFN=segments_4,generation=4,filenames=[segments_4]
[junit4:junit4]   2> 21565 T1801 C290 P53616 oasc.SolrDeletionPolicy.updateCommits newest commit = 4[segments_4]
[junit4:junit4]   2> 21566 T1801 C290 P53616 oasu.DirectUpdateHandler2.commit end_commit_flush
[junit4:junit4]   2> 21566 T1801 C290 P53616 /update {waitSearcher=true&openSearcher=false&commit=true&wt=javabin&commit_end_point=true&version=2&softCommit=false} {commit=} 0 6
[junit4:junit4]   2> 21567 T1868 C291 P52385 oash.ReplicationHandler.inform Commits will be reserved for  10000
[junit4:junit4]   2> 21567 T1868 C291 P52385 oash.SnapPuller.<init>  No value set for 'pollInterval'. Timer Task not started.
[junit4:junit4]   2> 21570 T1805 C290 P53616 REQ /replication {command=indexversion&qt=/replication&wt=javabin&version=2} status=0 QTime=0 
[junit4:junit4]   2> 21571 T1868 C291 P52385 oash.SnapPuller.fetchLatestIndex Master's generation: 4
[junit4:junit4]   2> 21571 T1868 C291 P52385 oash.SnapPuller.fetchLatestIndex Slave's generation: 1
[junit4:junit4]   2> 21571 T1868 C291 P52385 oash.SnapPuller.fetchLatestIndex Starting replication process
[junit4:junit4]   2> 21574 T1805 C290 P53616 REQ /replication {command=filelist&qt=/replication&wt=javabin&generation=4&version=2} status=0 QTime=1 
[junit4:junit4]   2> 21574 T1868 C291 P52385 oash.SnapPuller.fetchLatestIndex Number of files in latest index in master: 1
[junit4:junit4]   2> 21576 T1868 C291 P52385 oasc.CachingDirectoryFactory.get return new directory for /usr/home/hudson/hudson-slave/workspace/Lucene-Solr-Tests-4.x-java7/solr/build/solr-core/test/J1/org.apache.solr.cloud.SyncSliceTest-1363650706640/jetty4/index.20130318185208209 forceNew: false
[junit4:junit4]   2> 21577 T1868 C291 P52385 oash.SnapPuller.fetchLatestIndex Starting download to NRTCachingDirectory(org.apache.lucene.store.NIOFSDirectory@/usr/home/hudson/hudson-slave/workspace/Lucene-Solr-Tests-4.x-java7/solr/build/solr-core/test/J1/org.apache.solr.cloud.SyncSliceTest-1363650706640/jetty4/index.20130318185208209 lockFactory=org.apache.lucene.store.NativeFSLockFactory@40507c5d; maxCacheMB=48.0 maxMergeSizeMB=4.0) fullCopy=false
[junit4:junit4]   2> 21580 T1805 C290 P53616 REQ /replication {file=segments_4&command=filecontent&checksum=true&wt=filestream&qt=/replication&generation=4} status=0 QTime=0 
[junit4:junit4]   2> 21581 T1868 C291 P52385 oash.SnapPuller.fetchLatestIndex Total time taken for download : 0 secs
[junit4:junit4]   2> 21583 T1868 C291 P52385 oasu.DefaultSolrCoreState.newIndexWriter Creating new IndexWriter...
[junit4:junit4]   2> 21584 T1868 C291 P52385 oasu.DefaultSolrCoreState.newIndexWriter Waiting until IndexWriter is unused... core=collection1
[junit4:junit4]   2> 21588 T1868 C291 P52385 oasc.SolrDeletionPolicy.onInit SolrDeletionPolicy.onInit: commits:num=2
[junit4:junit4]   2> 		commit{dir=NRTCachingDirectory(org.apache.lucene.store.NIOFSDirectory@/usr/home/hudson/hudson-slave/workspace/Lucene-Solr-Tests-4.x-java7/solr/build/solr-core/test/J1/org.apache.solr.cloud.SyncSliceTest-1363650706640/jetty4/index lockFactory=org.apache.lucene.store.NativeFSLockFactory@54db2d97; maxCacheMB=48.0 maxMergeSizeMB=4.0),segFN=segments_1,generation=1,filenames=[segments_1]
[junit4:junit4]   2> 		commit{dir=NRTCachingDirectory(org.apache.lucene.store.NIOFSDirectory@/usr/home/hudson/hudson-slave/workspace/Lucene-Solr-Tests-4.x-java7/solr/build/solr-core/test/J1/org.apache.solr.cloud.SyncSliceTest-1363650706640/jetty4/index lockFactory=org.apache.lucene.store.NativeFSLockFactory@54db2d97; maxCacheMB=48.0 maxMergeSizeMB=4.0),segFN=segments_4,generation=4,filenames=[segments_4]
[junit4:junit4]   2> 21588 T1868 C291 P52385 oasc.SolrDeletionPolicy.updateCommits newest commit = 4[segments_4]
[junit4:junit4]   2> 21589 T1868 C291 P52385 oasu.DefaultSolrCoreState.newIndexWriter New IndexWriter is ready to be used.
[junit4:junit4]   2> 21589 T1868 C291 P52385 oass.SolrIndexSearcher.<init> Opening Searcher@70493388 main
[junit4:junit4]   2> 21591 T1865 oasc.SolrCore.registerSearcher [collection1] Registered new searcher Searcher@70493388 main{StandardDirectoryReader(segments_4:1:nrt)}
[junit4:junit4]   2> 21591 T1868 C291 P52385 oasc.RecoveryStrategy.replay No replay needed. core=collection1
[junit4:junit4]   2> 21591 T1868 C291 P52385 oasc.RecoveryStrategy.doRecovery Replication Recovery was successful - registering as Active. core=collection1
[junit4:junit4]   2> 21591 T1868 C291 P52385 oasc.ZkController.publish publishing core=collection1 state=active
[junit4:junit4]   2> 21592 T1868 C291 P52385 oasc.ZkController.publish numShards not found on descriptor - reading it from system property
[junit4:junit4]   2> 21593 T1868 C291 P52385 oasc.RecoveryStrategy.doRecovery Finished recovery process. core=collection1
[junit4:junit4]   2> 22163 T1792 oascc.ZkStateReader.updateClusterState Updating cloud state from ZooKeeper... 
[junit4:junit4]   2> 22164 T1792 oasc.Overseer$ClusterStateUpdater.updateState Update state numShards=1 message={
[junit4:junit4]   2> 	  "operation":"state",
[junit4:junit4]   2> 	  "core_node_name":"127.0.0.1:52385_rf_vkg_collection1",
[junit4:junit4]   2> 	  "numShards":"1",
[junit4:junit4]   2> 	  "shard":"shard1",
[junit4:junit4]   2> 	  "roles":null,
[junit4:junit4]   2> 	  "state":"active",
[junit4:junit4]   2> 	  "core":"collection1",
[junit4:junit4]   2> 	  "collection":"collection1",
[junit4:junit4]   2> 	  "node_name":"127.0.0.1:52385_rf_vkg",
[junit4:junit4]   2> 	  "base_url":"http://127.0.0.1:52385/rf_vkg"}
[junit4:junit4]   2> 22180 T1798 oascc.ZkStateReader$2.process A cluster state change: WatchedEvent state:SyncConnected type:NodeDataChanged path:/clusterstate.json, has occurred - updating... (live nodes size: 5)
[junit4:junit4]   2> 22180 T1827 oascc.ZkStateReader$2.process A cluster state change: WatchedEvent state:SyncConnected type:NodeDataChanged path:/clusterstate.json, has occurred - updating... (live nodes size: 5)
[junit4:junit4]   2> 22180 T1861 oascc.ZkStateReader$2.process A cluster state change: WatchedEvent state:SyncConnected type:NodeDataChanged path:/clusterstate.json, has occurred - updating... (live nodes size: 5)
[junit4:junit4]   2> 22180 T1791 oascc.ZkStateReader$2.process A cluster state change: WatchedEvent state:SyncConnected type:NodeDataChanged path:/clusterstate.json, has occurred - updating... (live nodes size: 5)
[junit4:junit4]   2> 22180 T1811 oascc.ZkStateReader$2.process A cluster state change: WatchedEvent state:SyncConnected type:NodeDataChanged path:/clusterstate.json, has occurred - updating... (live nodes size: 5)
[junit4:junit4]   2> 22180 T1844 oascc.ZkStateReader$2.process A cluster state change: WatchedEvent state:SyncConnected type:NodeDataChanged path:/clusterstate.json, has occurred - updating... (live nodes size: 5)
[junit4:junit4]   2> 22555 T1769 oascc.ZkStateReader.updateClusterState Updating cloud state from ZooKeeper... 
[junit4:junit4]   2> 22556 T1769 oasc.AbstractDistribZkTestBase.waitForRecoveriesToFinish Recoveries finished - collection: collection1
[junit4:junit4]   2> ASYNC  NEW_CORE C292 name=collection1 org.apache.solr.core.SolrCore@2bd67ab9 url=http://127.0.0.1:14488/rf_vkg/collection1 node=127.0.0.1:14488_rf_vkg C292_STATE=coll:control_collection core:collection1 props:{shard=shard1, state=active, core=collection1, collection=control_collection, node_name=127.0.0.1:14488_rf_vkg, base_url=http://127.0.0.1:14488/rf_vkg, leader=true}
[junit4:junit4]   2> 22566 T1781 C292 P14488 oasu.DirectUpdateHandler2.commit start commit{,optimize=false,openSearcher=true,waitSearcher=true,expungeDeletes=false,softCommit=false,prepareCommit=false}
[junit4:junit4]   2> 22571 T1781 C292 P14488 oasc.SolrDeletionPolicy.onInit SolrDeletionPolicy.onInit: commits:num=1
[junit4:junit4]   2> 		commit{dir=NRTCachingDirectory(org.apache.lucene.store.NIOFSDirectory@/usr/home/hudson/hudson-slave/workspace/Lucene-Solr-Tests-4.x-java7/solr/build/solr-core/test/J1/org.apache.solr.cloud.SyncSliceTest-1363650706640/control/data/index lockFactory=org.apache.lucene.store.NativeFSLockFactory@1b0c793c; maxCacheMB=48.0 maxMergeSizeMB=4.0),segFN=segments_1,generation=1,filenames=[segments_1]
[junit4:junit4]   2> 22572 T1781 C292 P14488 oasc.SolrDeletionPolicy.updateCommits newest commit = 1[segments_1]
[junit4:junit4]   2> 22576 T1781 C292 P14488 oasc.SolrDeletionPolicy.onCommit SolrDeletionPolicy.onCommit: commits:num=2
[junit4:junit4]   2> 		commit{dir=NRTCachingDirectory(org.apache.lucene.store.NIOFSDirectory@/usr/home/hudson/hudson-slave/workspace/Lucene-Solr-Tests-4.x-java7/solr/build/solr-core/test/J1/org.apache.solr.cloud.SyncSliceTest-1363650706640/control/data/index lockFactory=org.apache.lucene.store.NativeFSLockFactory@1b0c793c; maxCacheMB=48.0 maxMergeSizeMB=4.0),segFN=segments_1,generation=1,filenames=[segments_1]
[junit4:junit4]   2> 		commit{dir=NRTCachingDirectory(org.apache.lucene.store.NIOFSDirectory@/usr/home/hudson/hudson-slave/workspace/Lucene-Solr-Tests-4.x-java7/solr/build/solr-core/test/J1/org.apache.solr.cloud.SyncSliceTest-1363650706640/control/data/index lockFactory=org.apache.lucene.store.NativeFSLockFactory@1b0c793c; maxCacheMB=48.0 maxMergeSizeMB=4.0),segFN=segments_2,generation=2,filenames=[segments_2]
[junit4:junit4]   2> 22576 T1781 C292 P14488 oasc.SolrDeletionPolicy.updateCommits newest commit = 2[segments_2]
[junit4:junit4]   2> 22580 T1781 C292 P14488 oass.SolrIndexSearcher.<init> Opening Searcher@1053034a main
[junit4:junit4]   2> 22580 T1781 C292 P14488 oasu.DirectUpdateHandler2.commit end_commit_flush
[junit4:junit4]   2> 22581 T1795 oasc.SolrCore.registerSearcher [collection1] Registered new searcher Searcher@1053034a main{StandardDirectoryReader(segments_1:1)}
[junit4:junit4]   2> 22582 T1781 C292 P14488 /update {waitSearcher=true&commit=true&wt=javabin&version=2&softCommit=false} {commit=} 0 16
[junit4:junit4]   2> 22593 T1804 C290 P53616 oasu.DirectUpdateHandler2.commit start commit{,optimize=false,openSearcher=true,waitSearcher=true,expungeDeletes=false,softCommit=false,prepareCommit=false}
[junit4:junit4]   2> 22596 T1804 C290 P53616 oasc.SolrDeletionPolicy.onCommit SolrDeletionPolicy.onCommit: commits:num=4
[junit4:junit4]   2> 		commit{dir=NRTCachingDirectory(org.apache.lucene.store.NIOFSDirectory@/usr/home/hudson/hudson-slave/workspace/Lucene-Solr-Tests-4.x-java7/solr/build/solr-core/test/J1/org.apache.solr.cloud.SyncSliceTest-1363650706640/jetty1/index lockFactory=org.apache.lucene.store.NativeFSLockFactory@4ed52565; maxCacheMB=48.0 maxMergeSizeMB=4.0),segFN=segments_2,generation=2,filenames=[segments_2]
[junit4:junit4]   2> 		commit{dir=NRTCachingDirectory(org.apache.lucene.store.NIOFSDirectory@/usr/home/hudson/hudson-slave/workspace/Lucene-Solr-Tests-4.x-java7/solr/build/solr-core/test/J1/org.apache.solr.cloud.SyncSliceTest-1363650706640/jetty1/index lockFactory=org.apache.lucene.store.NativeFSLockFactory@4ed52565; maxCacheMB=48.0 maxMergeSizeMB=4.0),segFN=segments_3,generation=3,filenames=[segments_3]
[junit4:junit4]   2> 		commit{dir=NRTCachingDirectory(org.apache.lucene.store.NIOFSDirectory@/usr/home/hudson/hudson-slave/workspace/Lucene-Solr-Tests-4.x-java7/solr/build/solr-core/test/J1/org.apache.solr.cloud.SyncSliceTest-1363650706640/jetty1/index lockFactory=org.apache.lucene.store.NativeFSLockFactory@4ed52565; maxCacheMB=48.0 maxMergeSizeMB=4.0),segFN=segments_4,generation=4,filenames=[segments_4]
[junit4:junit4]   2> 		commit{dir=NRTCachingDirectory(org.apache.lucene.store.NIOFSDirectory@/usr/home/hudson/hudson-slave/workspace/Lucene-Solr-Tests-4.x-java7/solr/build/solr-core/test/J1/org.apache.solr.cloud.SyncSliceTest-1363650706640/jetty1/index lockFactory=org.apache.lucene.store.NativeFSLockFactory@4ed52565; maxCacheMB=48.0 maxMergeSizeMB=4.0),segFN=segments_5,generation=5,filenames=[segments_5]
[junit4:junit4]   2> 22597 T1804 C290 P53616 oasc.SolrDeletionPolicy.updateCommits newest commit = 5[segments_5]
[junit4:junit4]   2> 22598 T1804 C290 P53616 oass.SolrIndexSearcher.<init> Opening Searcher@3094b691 main
[junit4:junit4]   2> 22599 T1804 C290 P53616 oasu.DirectUpdateHandler2.commit end_commit_flush
[junit4:junit4]   2> 22600 T1813 oasc.SolrCore.registerSearcher [collection1] Registered new searcher Searcher@3094b691 main{StandardDirectoryReader(segments_2:1:nrt)}
[junit4:junit4]   2> 22600 T1804 C290 P53616 oasu.SolrCmdDistributor.distribCommit Distrib commit to:[StdNode: http://127.0.0.1:25448/rf_vkg/collection1/, StdNode: http://127.0.0.1:18575/rf_vkg/collection1/, StdNode: http://127.0.0.1:52385/rf_vkg/collection1/] params:commit_end_point=true&commit=true&softCommit=false&waitSearcher=true&expungeDeletes=false
[junit4:junit4]   2>  C291_STATE=coll:collection1 core:collection1 props:{shard=shard1, state=active, core=collection1, collection=collection1, node_name=127.0.0.1:52385_rf_vkg, base_url=http://127.0.0.1:52385/rf_vkg}
[junit4:junit4]   2> 22614 T1851 C291 P52385 oasu.DirectUpdateHandler2.commit start commit{,optimize=false,openSearcher=true,waitSearcher=true,expungeDeletes=false,softCommit=false,prepareCommit=false}
[junit4:junit4]   2> 22620 T1851 C291 P52385 oasc.SolrDeletionPolicy.onCommit SolrDeletionPolicy.onCommit: commits:num=2
[junit4:junit4]   2> 		commit{dir=NRTCachingDirectory(org.apache.lucene.store.NIOFSDirectory@/usr/home/hudson/hudson-slave/workspace/Lucene-Solr-Tests-4.x-java7/solr/build/solr-core/test/J1/org.apache.solr.cloud.SyncSliceTest-1363650706640/jetty4/index lockFactory=org.apache.lucene.store.NativeFSLockFactory@54db2d97; maxCacheMB=48.0 maxMergeSizeMB=4.0),segFN=segments_4,generation=4,filenames=[segments_4]
[junit4:junit4]   2> 		commit{dir=NRTCachingDirectory(org.apache.lucene.store.NIOFSDirectory@/usr/home/hudson/hudson-slave/workspace/Lucene-Solr-Tests-4.x-java7/solr/build/solr-core/test/J1/org.apache.solr.cloud.SyncSliceTest-1363650706640/jetty4/index lockFactory=org.apache.lucene.store.NativeFSLockFactory@54db2d97; maxCacheMB=48.0 maxMergeSizeMB=4.0),segFN=segments_5,generation=5,filenames=[segments_5]
[junit4:junit4]   2> 22620 T1851 C291 P52385 oasc.SolrDeletionPolicy.updateCommits newest commit = 5[segments_5]
[junit4:junit4]   2> 22623 T1851 C291 P52385 oass.SolrIndexSearcher.<init> Opening Searcher@59c026d0 main
[junit4:junit4]   2> 22623 T1851 C291 P52385 oasu.DirectUpdateHandler2.commit end_commit_flush
[junit4:junit4]   2>  C288_STATE=coll:collection1 core:collection1 props:{shard=shard1, state=active, core=collection1, collection=collection1, node_name=127.0.0.1:25448_rf_vkg, base_url=http://127.0.0.1:25448/rf_vkg}
[junit4:junit4]   2> 22624 T1817 C288 P25448 oasu.DirectUpdateHandler2.commit start commit{,optimize=false,openSearcher=true,waitSearcher=true,expungeDeletes=false,softCommit=false,prepareCommit=false}
[junit4:junit4]   2>  C289_STATE=coll:collection1 core:collection1 props:{shard=shard1, state=active, core=collection1, collection=collection1, node_name=127.0.0.1:18575_rf_vkg, base_url=http://127.0.0.1:18575/rf_vkg}
[junit4:junit4]   2> 22624 T1834 C289 P18575 oasu.DirectUpdateHandler2.commit start commit{,optimize=false,openSearcher=true,waitSearcher=true,expungeDeletes=false,softCommit=false,prepareCommit=false}
[junit4:junit4]   2> 22624 T1865 oasc.SolrCore.registerSearcher [collection1] Registered new searcher Searcher@59c026d0 main{StandardDirectoryReader(segments_4:1:nrt)}
[junit4:junit4]   2> 22625 T1851 C291 P52385 /update {waitSearcher=true&commit=true&wt=javabin&expungeDeletes=false&commit_end_point=true&version=2&softCommit=false} {commit=} 0 11
[junit4:junit4]   2> 22629 T1817 C288 P25448 oasc.SolrDeletionPolicy.onCommit SolrDeletionPolicy.onCommit: commits:num=2
[junit4:junit4]   2> 		commit{dir=NRTCachingDirectory(org.apache.lucene.store.NIOFSDirectory@/usr/home/hudson/hudson-slave/workspace/Lucene-Solr-Tests-4.x-java7/solr/build/solr-core/test/J1/org.apache.solr.cloud.SyncSliceTest-1363650706640/jetty2/index lockFactory=org.apache.lucene.store.NativeFSLockFactory@1dd65a66; maxCacheMB=48.0 maxMergeSizeMB=4.0),segFN=segments_2,generation=2,filenames=[segments_2]
[junit4:junit4]   2> 		commit{dir=NRTCachingDirectory(org.apache.lucene.store.NIOFSDirectory@/usr/home/hudson/hudson-slave/workspace/Lucene-Solr-Tests-4.x-java7/solr/build/solr-core/test/J1/org.apache.solr.cloud.SyncSliceTest-1363650706640/jetty2/index lockFactory=org.apache.lucene.store.NativeFSLockFactory@1dd65a66; maxCacheMB=48.0 maxMergeSizeMB=4.0),segFN=segments_3,generation=3,filenames=[segments_3]
[junit4:junit4]   2> 22630 T1817 C288 P25448 oasc.SolrDeletionPolicy.updateCommits newest commit = 3[segments_3]
[junit4:junit4]   2> 22632 T1817 C288 P25448 oass.SolrIndexSearcher.<init> Opening Searcher@30758d56 main
[junit4:junit4]   2> 22632 T1817 C288 P25448 oasu.DirectUpdateHandler2.commit end_commit_flush
[junit4:junit4]   2> 22633 T1829 oasc.SolrCore.registerSearcher [collection1] Registered new searcher Searcher@30758d56 main{StandardDirectoryReader(segments_2:1:nrt)}
[junit4:junit4]   2> 22633 T1817 C288 P25448 /update {waitSearcher=true&commit=true&wt=javabin&expungeDeletes=false&commit_end_point=true&version=2&softCommit=false} {commit=} 0 9
[junit4:junit4]   2> 22637 T1834 C289 P18575 oasc.SolrDeletionPolicy.onCommit SolrDeletionPolicy.onCommit: commits:num=2
[junit4:junit4]   2> 		commit{dir=NRTCachingDirectory(org.apache.lucene.store.NIOFSDirectory@/usr/home/hudson/hudson-slave/workspace/Lucene-Solr-Tests-4.x-java7/solr/build/solr-core/test/J1/org.apache.solr.cloud.SyncSliceTest-1363650706640/jetty3/index lockFactory=org.apache.lucene.store.NativeFSLockFactory@6a8afb33; maxCacheMB=48.0 maxMergeSizeMB=4.0),segFN=segments_3,generation=3,filenames=[segments_3]
[junit4:junit4]   2> 		commit{dir=NRTCachingDirectory(org.apache.lucene.store.NIOFSDirectory@/usr/home/hudson/hudson-slave/workspace/Lucene-Solr-Tests-4.x-java7/solr/build/solr-core/test/J1/org.apache.solr.cloud.SyncSliceTest-1363650706640/jetty3/index lockFactory=org.apache.lucene.store.NativeFSLockFactory@6a8afb33; maxCacheMB=48.0 maxMergeSizeMB=4.0),segFN=segments_4,generation=4,filenames=[segments_4]
[junit4:junit4]   2> 22638 T1834 C289 P18575 oasc.SolrDeletionPolicy.updateCommits newest commit = 4[segments_4]
[junit4:junit4]   2> 22639 T1834 C289 P18575 oass.SolrIndexSearcher.<init> Opening Searcher@7bb24966 main
[junit4:junit4]   2> 22640 T1834 C289 P18575 oasu.DirectUpdateHandler2.commit end_commit_flush
[junit4:junit4]   2> 22641 T1846 oasc.SolrCore.registerSearcher [collection1] Registered new searcher Searcher@7bb24966 main{StandardDirectoryReader(segments_3:1:nrt)}
[junit4:junit4]   2> 22641 T1834 C289 P18575 /update {waitSearcher=true&commit=true&wt=javabin&expungeDeletes=false&commit_end_point=true&version=2&softCommit=false} {commit=} 0 17
[junit4:junit4]   2> 22642 T1804 C290 P53616 /update {waitSearcher=true&commit=true&wt=javabin&version=2&softCommit=false} {commit=} 0 49
[junit4:junit4]   2> 22643 T1769 oascc.ZkStateReader.updateClusterState Updating cloud state from ZooKeeper... 
[junit4:junit4]   2> 22645 T1802 C290 P53616 REQ /select {tests=checkShardConsistency&q=*:*&distrib=false&wt=javabin&version=2&rows=0} hits=0 status=0 QTime=0 
[junit4:junit4]   2> 22647 T1818 C288 P25448 REQ /select {tests=checkShardConsistency&q=*:*&distrib=false&wt=javabin&version=2&rows=0} hits=0 status=0 QTime=0 
[junit4:junit4]   2> 22649 T1835 C289 P18575 REQ /select {tests=checkShardConsistency&q=*:*&distrib=false&wt=javabin&version=2&rows=0} hits=0 status=0 QTime=0 
[junit4:junit4]   2> 22651 T1852 C291 P52385 REQ /select {tests=checkShardConsistency&q=*:*&distrib=false&wt=javabin&version=2&rows=0} hits=0 status=0 QTime=0 
[junit4:junit4]   2> 24662 T1781 C292 P14488 oass.SolrIndexSearcher.<init> Opening Searcher@31b8b8c6 realtime
[junit4:junit4]   2> 24662 T1781 C292 P14488 /update {wt=javabin&version=2} {deleteByQuery=*:* (-1429891429213143040)} 0 7
[junit4:junit4]   2> 24671 T1834 C289 P18575 /update {update.distrib=FROMLEADER&_version_=-1429891429222580224&update.from=http://127.0.0.1:53616/rf_vkg/collection1/&wt=javabin&version=2} {deleteByQuery=*:* (-1429891429222580224)} 0 2
[junit4:junit4]   2> 24671 T1817 C288 P25448 /update {update.distrib=FROMLEADER&_version_=-1429891429222580224&update.from=http://127.0.0.1:53616/rf_vkg/collection1/&wt=javabin&version=2} {deleteByQuery=*:* (-1429891429222580224)} 0 2
[junit4:junit4]   2> 24671 T1851 C291 P52385 /update {update.distrib=FROMLEADER&_version_=-1429891429222580224&update.from=http://127.0.0.1:53616/rf_vkg/collection1/&wt=javabin&version=2} {deleteByQuery=*:* (-1429891429222580224)} 0 2
[junit4:junit4]   2> 24672 T1804 C290 P53616 /update {wt=javabin&version=2} {deleteByQuery=*:* (-1429891429222580224)} 0 7
[junit4:junit4]   2> 24676 T1781 C292 P14488 /update {wt=javabin&version=2} {add=[0 (1429891429232017408)]} 0 2
[junit4:junit4]   2> 24685 T1817 C288 P25448 /update {distrib.from=http://127.0.0.1:53616/rf_vkg/collection1/&update.distrib=FROMLEADER&wt=javabin&version=2} {add=[0 (1429891429237260288)]} 0 2
[junit4:junit4]   2> 24685 T1851 C291 P52385 /update {distrib.from=http://127.0.0.1:53616/rf_vkg/collection1/&update.distrib=FROMLEADER&wt=javabin&version=2} {add=[0 (1429891429237260288)]} 0 2
[junit4:junit4]   2> 24686 T1834 C289 P18575 /update {distrib.from=http://127.0.0.1:53616/rf_vkg/collection1/&update.distrib=FROMLEADER&wt=javabin&version=2} {add=[0 (1429891429237260288)]} 0 2
[junit4:junit4]   2> 24686 T1804 C290 P53616 /update {wt=javabin&version=2} {add=[0 (1429891429237260288)]} 0 7
[junit4:junit4]   2> 24690 T1781 C292 P14488 /update {wt=javabin&version=2} {add=[1 (1429891429247746048)]} 0 1
[junit4:junit4]   2> 24696 T1817 C288 P25448 /update {distrib.from=http://127.0.0.1:53616/rf_vkg/collection1/&update.distrib=FROMLEADER&wt=javabin&version=2} {add=[1 (1429891429250891776)]} 0 1
[junit4:junit4]   2> 24696 T1834 C289 P18575 /update {distrib.from=http://127.0.0.1:53616/rf_vkg/collection1/&update.distrib=FROMLEADER&wt=javabin&version=2} {add=[1 (1429891429250891776)]} 0 1
[junit4:junit4]   2> 24696 T1851 C291 P52385 /update {distrib.from=http://127.0.0.1:53616/rf_vkg/collection1/&update.distrib=FROMLEADER&wt=javabin&version=2} {add=[1 (1429891429250891776)]} 0 1
[junit4:junit4]   2> 24696 T1804 C290 P53616 /update {wt=javabin&version=2} {add=[1 (1429891429250891776)]} 0 4
[junit4:junit4]   2> 24700 T1781 C292 P14488 /update {wt=javabin&version=2} {add=[2 (1429891429258231808)]} 0 1
[junit4:junit4]   2> 24706 T1834 C289 P18575 /update {distrib.from=http://127.0.0.1:53616/rf_vkg/collection1/&update.distrib=FROMLEADER&wt=javabin&version=2} {add=[2 (1429891429261377536)]} 0 1
[junit4:junit4]   2> 24706 T1851 C291 P52385 /update {distrib.from=http://127.0.0.1:53616/rf_vkg/collection1/&update.distrib=FROMLEADER&wt=javabin&version=2} {add=[2 (1429891429261377536)]} 0 1
[junit4:junit4]   2> 24706 T1804 C290 P53616 /update {test.distrib.skip.servers=http://127.0.0.1:25448/rf_vkg/collection1/&wt=javabin&version=2} {add=[2 (1429891429261377536)]} 0 4
[junit4:junit4]   2> 24710 T1781 C292 P14488 /update {wt=javabin&version=2} {add=[3 (1429891429268717568)]} 0 1
[junit4:junit4]   2> 24717 T1851 C291 P52385 /update {distrib.from=http://127.0.0.1:53616/rf_vkg/collection1/&update.distrib=FROMLEADER&wt=javabin&version=2} {add=[3 (1429891429272911872)]} 0 1
[junit4:junit4]   2> 24717 T1804 C290 P53616 /update {test.distrib.skip.servers=http://127.0.0.1:25448/rf_vkg/collection1/&test.distrib.skip.servers=http://127.0.0.1:18575/rf_vkg/collection1/&wt=javabin&version=2} {add=[3 (1429891429272911872)]} 0 4
[junit4:junit4]   2> 24720 T1781 C292 P14488 oasu.DirectUpdateHandler2.commit start commit{,optimize=false,openSearcher=true,waitSearcher=true,expungeDeletes=false,softCommit=false,prepareCommit=false}
[junit4:junit4]   2> 25027 T1781 C292 P14488 oasc.SolrDeletionPolicy.onCommit SolrDeletionPolicy.onCommit: commits:num=2
[junit4:junit4]   2> 		commit{dir=NRTCachingDirectory(org.apache.lucene.store.NIOFSDirectory@/usr/home/hudson/hudson-slave/workspace/Lucene-Solr-Tests-4.x-java7/solr/build/solr-core/test/J1/org.apache.solr.cloud.SyncSliceTest-1363650706640/control/data/index lockFactory=org.apache.lucene.store.NativeFSLockFactory@1b0c793c; maxCacheMB=48.0 maxMergeSizeMB=4.0),segFN=segments_2,generation=2,filenames=[segments_2]
[junit4:junit4]   2> 		commit{dir=NRTCachingDirectory(org.apache.lucene.store.NIOFSDirectory@/usr/home/hudson/hudson-slave/workspace/Lucene-Solr-Tests-4.x-java7/solr/build/solr-core/test/J1/org.apache.solr.cloud.SyncSliceTest-1363650706640/control/data/index lockFactory=org.apache.lucene.store.NativeFSLockFactory@1b0c793c; maxCacheMB=48.0 maxMergeSizeMB=4.0),segFN=segments_3,generation=3,filenames=[_0_Lucene41WithOrds_0.tib, _0.fnm, _0_Lucene41WithOrds_0.doc, _0_TestBloomFilteredLucene41Postings_0.blm, _0_Memory_0.ram, _0_TestBloomFilteredLucene41Postings_0.tim, _0_Lucene41WithOrds_0.tii, _0_Lucene41WithOrds_0.pos, _0_TestBloomFilteredLucene41Postings_0.tip, _0.nvm, _0_TestBloomFilteredLucene41Postings_0.pos, _0_Direct_0.doc, _0.nvd, _0_Direct_0.pos, _0_TestBloomFilteredLucene41Postings_0.doc, _0_Direct_0.tip, _0.fdx, _0.si, _0_Direct_0.tim, _0.fdt, segments_3]
[junit4:junit4]   2> 25028 T1781 C292 P14488 oasc.SolrDeletionPolicy.updateCommits newest commit = 3[_0_Lucene41WithOrds_0.tib, _0.fnm, _0_Lucene41WithOrds_0.doc, _0_TestBloomFilteredLucene41Postings_0.blm, _0_Memory_0.ram, _0_TestBloomFilteredLucene41Postings_0.tim, _0_Lucene41WithOrds_0.tii, _0_Lucene41WithOrds_0.pos, _0_TestBloomFilteredLucene41Postings_0.tip, _0.nvm, _0_TestBloomFilteredLucene41Postings_0.pos, _0_Direct_0.doc, _0.nvd, _0_Direct_0.pos, _0_TestBloomFilteredLucene41Postings_0.doc, _0_Direct_0.tip, _0.fdx, _0.si, _0_Direct_0.tim, _0.fdt, segments_3]
[junit4:junit4]   2> 25038 T1781 C292 P14488 oass.SolrIndexSearcher.<init> Opening Searcher@7ef70057 main
[junit4:junit4]   2> 25039 T1781 C292 P14488 oasu.DirectUpdateHandler2.commit end_commit_flush
[junit4:junit4]   2> 25039 T1795 oasc.SolrCore.registerSearcher [collection1] Registered new searcher Searcher@7ef70057 main{StandardDirectoryReader(segments_3:3:nrt _0(4.3):C4)}
[junit4:junit4]   2> 25040 T1781 C292 P14488 /update {waitSearcher=true&commit=true&wt=javabin&version=2&softCommit=false} {commit=} 0 320
[junit4:junit4]   2> 25043 T1804 C290 P53616 oasu.DirectUpdateHandler2.commit start commit{,optimize=false,openSearcher=true,waitSearcher=true,expungeDeletes=false,softCommit=false,prepareCommit=false}
[junit4:junit4]   2> 25159 T1804 C290 P53616 oasc.SolrDeletionPolicy.onCommit SolrDeletionPolicy.onCommit: commits:num=5
[junit4:junit4]   2> 		commit{dir=NRTCachingDirectory(org.apache.lucene.store.NIOFSDirectory@/usr/home/hudson/hudson-slave/workspace/Lucene-Solr-Tests-4.x-java7/solr/build/solr-core/test/J1/org.apache.solr.cloud.SyncSliceTest-1363650706640/jetty1/index lockFactory=org.apache.lucene.store.NativeFSLockFactory@4ed52565; maxCacheMB=48.0 maxMergeSizeMB=4.0),segFN=segments_2,generation=2,filenames=[segments_2]
[junit4:junit4]   2> 		commit{dir=NRTCachingDirectory(org.apache.lucene.store.NIOFSDirectory@/usr/home/hudson/hudson-slave/workspace/Lucene-Solr-Tests-4.x-java7/solr/build/solr-core/test/J1/org.apache.solr.cloud.SyncSliceTest-1363650706640/jetty1/index lockFactory=org.apache.lucene.store.NativeFSLockFactory@4ed52565; maxCacheMB=48.0 maxMergeSizeMB=4.0),segFN=segments_3,generation=3,filenames=[segments_3]
[junit4:junit4]   2> 		commit{dir=NRTCachingDirectory(org.apache.lucene.store.NIOFSDirectory@/usr/home/hudson/hudson-slave/workspace/Lucene-Solr-Tests-4.x-java7/solr/build/solr-core/test/J1/org.apache.solr.cloud.SyncSliceTest-1363650706640/jetty1/index lockFactory=org.apache.lucene.store.NativeFSLockFactory@4ed52565; maxCacheMB=48.0 maxMergeSizeMB=4.0),segFN=segments_4,generation=4,filenames=[segments_4]
[junit4:junit4]   2> 		commit{dir=NRTCachingDirectory(org.apache.lucene.store.NIOFSDirectory@/usr/home/hudson/hudson-slave/workspace/Lucene-Solr-Tests-4.x-java7/solr/build/solr-core/test/J1/org.apache.solr.cloud.SyncSliceTest-1363650706640/jetty1/index lockFactory=org.apache.lucene.store.NativeFSLockFactory@4ed52565; maxCacheMB=48.0 maxMergeSizeMB=4.0),segFN=segments_5,generation=5,filenames=[segments_5]
[junit4:junit4]   2> 		commit{dir=NRTCachingDirectory(org.apache.lucene.store.NIOFSDirectory@/usr/home/hudson/hudson-slave/workspace/Lucene-Solr-Tests-4.x-java7/solr/build/solr-core/test/J1/org.apache.solr.cloud.SyncSliceTest-1363650706640/jetty1/index lockFactory=org.apache.lucene.store.NativeFSLockFactory@4ed52565; maxCacheMB=48.0 maxMergeSizeMB=4.0),segFN=segments_6,generation=6,filenames=[_0_Lucene41WithOrds_0.tib, _0.fnm, _0_Lucene41WithOrds_0.doc, _0_TestBloomFilteredLucene41Postings_0.blm, _0_Memory_0.ram, _0_TestBloomFilteredLucene41Postings_0.tim, _0_Lucene41WithOrds_0.tii, _0_Lucene41WithOrds_0.pos, _0_TestBloomFilteredLucene41Postings_0.tip, _0.nvm, _0_TestBloomFilteredLucene41Postings_0.pos, _0_Direct_0.doc, _0.nvd, _0_Direct_0.pos, _0_TestBloomFilteredLucene41Postings_0.doc, _0_Direct_0.tip, _0.fdx, _0.si, _0_Direct_0.tim, segments_6, _0.fdt]
[junit4:junit4]   2> 25160 T1804 C290 P53616 oasc.SolrDeletionPolicy.updateCommits newest commit = 6[_0_Lucene41WithOrds_0.tib, _0.fnm, _0_Lucene41WithOrds_0.doc, _0_TestBloomFilteredLucene41Postings_0.blm, _0_Memory_0.ram, _0_TestBloomFilteredLucene41Postings_0.tim, _0_Lucene41WithOrds_0.tii, _0_Lucene41WithOrds_0.pos, _0_TestBloomFilteredLucene41Postings_0.tip, _0.nvm, _0_TestBloomFilteredLucene41Postings_0.pos, _0_Direct_0.doc, _0.nvd, _0_Direct_0.pos, _0_TestBloomFilteredLucene41Postings_0.doc, _0_Direct_0.tip, _0.fdx, _0.si, _0_Direct_0.tim, segments_6, _0.fdt]
[junit4:junit4]   2> 25169 T1804 C290 P53616 oass.SolrIndexSearcher.<init> Opening Searcher@1b2ac18d main
[junit4:junit4]   2> 25170 T1804 C290 P53616 oasu.DirectUpdateHandler2.commit end_commit_flush
[junit4:junit4]   2> 25171 T1813 oasc.SolrCore.registerSearcher [collection1] Registered new searcher Searcher@1b2ac18d main{StandardDirectoryReader(segments_6:3:nrt _0(4.3):C4)}
[junit4:junit4]   2> 25171 T1804 C290 P53616 oasu.SolrCmdDistributor.distribCommit Distrib commit to:[StdNode: http://127.0.0.1:25448/rf_vkg/collection1/, StdNode: http://127.0.0.1:18575/rf_vkg/collection1/, StdNode: http://127.0.0.1:52385/rf_vkg/collection1/] params:commit_end_point=true&commit=true&softCommit=false&waitSearcher=true&expungeDeletes=false
[junit4:junit4]   2> 25174 T1851 C291 P52385 oasu.DirectUpdateHandler2.commit start commit{,optimize=false,openSearcher=true,waitSearcher=true,expungeDeletes=false,softCommit=false,prepareCommit=false}
[junit4:junit4]   2> 25174 T1834 C289 P18575 oasu.DirectUpdateHandler2.commit start commit{,optimize=false,openSearcher=true,waitSearcher=true,expungeDeletes=false,softCommit=false,prepareCommit=false}
[junit4:junit4]   2> 25174 T1817 C288 P25448 oasu.DirectUpdateHandler2.commit start commit{,optimize=false,openSearcher=true,waitSearcher=true,expungeDeletes=false,softCommit=false,prepareCommit=false}
[junit4:junit4]   2> 25313 T1834 C289 P18575 oasc.SolrDeletionPolicy.onCommit SolrDeletionPolicy.onCommit: commits:num=2
[junit4:junit4]   2> 		commit{dir=NRTCachingDirectory(org.apache.lucene.store.NIOFSDirectory@/usr/home/hudson/hudson-slave/workspace/Lucene-Solr-Tests-4.x-java7/solr/build/solr-core/test/J1/org.apache.solr.cloud.SyncSliceTest-1363650706640/jetty3/index lockFactory=org.apache.lucene.store.NativeFSLockFactory@6a8afb33; maxCacheMB=48.0 maxMergeSizeMB=4.0),segFN=segments_4,generation=4,filenames=[segments_4]
[junit4:junit4]   2> 		commit{dir=NRTCachingDirectory(org.apache.lucene.store.NIOFSDirectory@/usr/home/hudson/hudson-slave/workspace/Lucene-Solr-Tests-4.x-java7/solr/build/solr-core/test/J1/org.apache.solr.cloud.SyncSliceTest-1363650706640/jetty3/index lockFactory=org.apache.lucene.store.NativeFSLockFactory@6a8afb33; maxCacheMB=48.0 maxMergeSizeMB=4.0),segFN=segments_5,generation=5,filenames=[_0_Lucene41WithOrds_0.tib, _0.fnm, _0_Lucene41WithOrds_0.doc, _0_TestBloomFilteredLucene41Postings_0.blm, _0_Memory_0.ram, _0_TestBloomFilteredLucene41Postings_0.tim, _0_Lucene41WithOrds_0.tii, _0_Lucene41WithOrds_0.pos, _0_TestBloomFilteredLucene41Postings_0.tip, _0.nvm, _0_TestBloomFilteredLucene41Postings_0.pos, _0_Direct_0.doc, _0.nvd, _0_Direct_0.pos, _0_TestBloomFilteredLucene41Postings_0.doc, _0_Direct_0.tip, _0.fdx, _0.si, segments_5, _0_Direct_0.tim, _0.fdt]
[junit4:junit4]   2> 25314 T1834 C289 P18575 oasc.SolrDeletionPolicy.updateCommits newest commit = 5[_0_Lucene41WithOrds_0.tib, _0.fnm, _0_Lucene41WithOrds_0.doc, _0_TestBloomFilteredLucene41Postings_0.blm, _0_Memory_0.ram, _0_TestBloomFilteredLucene41Postings_0.tim, _0_Lucene41WithOrds_0.tii, _0_Lucene41WithOrds_0.pos, _0_TestBloomFilteredLucene41Postings_0.tip, _0.nvm, _0_TestBloomFilteredLucene41Postings_0.pos, _0_Direct_0.doc, _0.nvd, _0_Direct_0.p

[...truncated too long message...]

C291 P52385 oasu.TransactionLog.forceClose SEVERE Error: Forcing close of tlog{file=./org.apache.solr.cloud.SyncSliceTest-1363650706640/jetty4/tlog/tlog.0000000000000000005 refcount=1}
[junit4:junit4]   2> 168639 T1861 oasc.SolrCore.closeSearcher [collection1] Closing main searcher on request.
[junit4:junit4]   2> 168641 T1861 oasc.CachingDirectoryFactory.close Closing directory when closing factory: /usr/home/hudson/hudson-slave/workspace/Lucene-Solr-Tests-4.x-java7/solr/build/solr-core/test/J1/org.apache.solr.cloud.SyncSliceTest-1363650706640/jetty4
[junit4:junit4]   2> 168641 T1861 oasc.CachingDirectoryFactory.closeDirectory Closing directory: /usr/home/hudson/hudson-slave/workspace/Lucene-Solr-Tests-4.x-java7/solr/build/solr-core/test/J1/org.apache.solr.cloud.SyncSliceTest-1363650706640/jetty4
[junit4:junit4]   2> 168642 T1861 oasc.CachingDirectoryFactory.close Closing directory when closing factory: /usr/home/hudson/hudson-slave/workspace/Lucene-Solr-Tests-4.x-java7/solr/build/solr-core/test/J1/org.apache.solr.cloud.SyncSliceTest-1363650706640/jetty4/index
[junit4:junit4]   2> 168642 T1861 oasc.CachingDirectoryFactory.closeDirectory Closing directory: /usr/home/hudson/hudson-slave/workspace/Lucene-Solr-Tests-4.x-java7/solr/build/solr-core/test/J1/org.apache.solr.cloud.SyncSliceTest-1363650706640/jetty4/index
[junit4:junit4]   2> 168642 T1861 oasc.CachingDirectoryFactory.close Closing directory when closing factory: /usr/home/hudson/hudson-slave/workspace/Lucene-Solr-Tests-4.x-java7/solr/build/solr-core/test/J1/org.apache.solr.cloud.SyncSliceTest-1363650706640/jetty4/index.20130318185208209
[junit4:junit4]   2> 168642 T1861 oasc.CachingDirectoryFactory.closeDirectory Removing directory: /usr/home/hudson/hudson-slave/workspace/Lucene-Solr-Tests-4.x-java7/solr/build/solr-core/test/J1/org.apache.solr.cloud.SyncSliceTest-1363650706640/jetty4/index.20130318185208209
[junit4:junit4]   2> 168643 T1861 oasc.CachingDirectoryFactory.closeDirectory Closing directory: /usr/home/hudson/hudson-slave/workspace/Lucene-Solr-Tests-4.x-java7/solr/build/solr-core/test/J1/org.apache.solr.cloud.SyncSliceTest-1363650706640/jetty4/index.20130318185208209
[junit4:junit4]   2> 168643 T1861 oascc.SolrZkClient.makePath makePath: /collections/collection1/leaders/shard1
[junit4:junit4]   2> 168644 T1861 oasc.LeaderElector$1.process WARNING  org.apache.zookeeper.KeeperException$SessionExpiredException: KeeperErrorCode = Session expired for /collections/collection1/leader_elect/shard1/election/89368212710883340-127.0.0.1:52385_rf_vkg_collection1-n_0000000003
[junit4:junit4]   2> 	at org.apache.zookeeper.KeeperException.create(KeeperException.java:127)
[junit4:junit4]   2> 	at org.apache.zookeeper.KeeperException.create(KeeperException.java:51)
[junit4:junit4]   2> 	at org.apache.zookeeper.ZooKeeper.delete(ZooKeeper.java:873)
[junit4:junit4]   2> 	at org.apache.solr.common.cloud.SolrZkClient$2.execute(SolrZkClient.java:152)
[junit4:junit4]   2> 	at org.apache.solr.common.cloud.SolrZkClient$2.execute(SolrZkClient.java:149)
[junit4:junit4]   2> 	at org.apache.solr.common.cloud.ZkCmdExecutor.retryOperation(ZkCmdExecutor.java:65)
[junit4:junit4]   2> 	at org.apache.solr.common.cloud.SolrZkClient.delete(SolrZkClient.java:149)
[junit4:junit4]   2> 	at org.apache.solr.cloud.ElectionContext.cancelElection(ElectionContext.java:63)
[junit4:junit4]   2> 	at org.apache.solr.cloud.ShardLeaderElectionContext.runLeaderProcess(ElectionContext.java:246)
[junit4:junit4]   2> 	at org.apache.solr.cloud.LeaderElector.runIamLeaderProcess(LeaderElector.java:156)
[junit4:junit4]   2> 	at org.apache.solr.cloud.LeaderElector.checkIfIamLeader(LeaderElector.java:100)
[junit4:junit4]   2> 	at org.apache.solr.cloud.LeaderElector.access$000(LeaderElector.java:55)
[junit4:junit4]   2> 	at org.apache.solr.cloud.LeaderElector$1.process(LeaderElector.java:129)
[junit4:junit4]   2> 	at org.apache.zookeeper.ClientCnxn$EventThread.processEvent(ClientCnxn.java:519)
[junit4:junit4]   2> 	at org.apache.zookeeper.ClientCnxn$EventThread.run(ClientCnxn.java:495)
[junit4:junit4]   2> 
[junit4:junit4]   2> 168644 T1861 oascc.ZkStateReader$2.process A cluster state change: WatchedEvent state:SyncConnected type:NodeChildrenChanged path:/live_nodes, has occurred - updating... (live nodes size: 2)
[junit4:junit4]   2> 168644 T1861 oascc.ZkStateReader$2.process WARNING ZooKeeper watch triggered, but Solr cannot talk to ZK
[junit4:junit4]   2> 168645 T1861 oascc.ZkStateReader$3.process WARNING ZooKeeper watch triggered, but Solr cannot talk to ZK
[junit4:junit4]   2> 168645 T1861 oasc.LeaderElector$1.process WARNING  org.apache.zookeeper.KeeperException$SessionExpiredException: KeeperErrorCode = Session expired for /overseer_elect/election
[junit4:junit4]   2> 	at org.apache.zookeeper.KeeperException.create(KeeperException.java:127)
[junit4:junit4]   2> 	at org.apache.zookeeper.KeeperException.create(KeeperException.java:51)
[junit4:junit4]   2> 	at org.apache.zookeeper.ZooKeeper.getChildren(ZooKeeper.java:1468)
[junit4:junit4]   2> 	at org.apache.solr.common.cloud.SolrZkClient$6.execute(SolrZkClient.java:235)
[junit4:junit4]   2> 	at org.apache.solr.common.cloud.SolrZkClient$6.execute(SolrZkClient.java:232)
[junit4:junit4]   2> 	at org.apache.solr.common.cloud.ZkCmdExecutor.retryOperation(ZkCmdExecutor.java:65)
[junit4:junit4]   2> 	at org.apache.solr.common.cloud.SolrZkClient.getChildren(SolrZkClient.java:232)
[junit4:junit4]   2> 	at org.apache.solr.cloud.LeaderElector.checkIfIamLeader(LeaderElector.java:84)
[junit4:junit4]   2> 	at org.apache.solr.cloud.LeaderElector.access$000(LeaderElector.java:55)
[junit4:junit4]   2> 	at org.apache.solr.cloud.LeaderElector$1.process(LeaderElector.java:129)
[junit4:junit4]   2> 	at org.apache.zookeeper.ClientCnxn$EventThread.processEvent(ClientCnxn.java:519)
[junit4:junit4]   2> 	at org.apache.zookeeper.ClientCnxn$EventThread.run(ClientCnxn.java:495)
[junit4:junit4]   2> 
[junit4:junit4]   2> 168645 T1861 oaz.ClientCnxn$EventThread.run EventThread shut down
[junit4:junit4]   2> NOTE: test params are: codec=Lucene42: {range_facet_l=PostingsFormat(name=TestBloomFilteredLucene41Postings), text=PostingsFormat(name=Memory doPackFST= true), _version_=PostingsFormat(name=TestBloomFilteredLucene41Postings), rnd_b=PostingsFormat(name=Lucene41WithOrds), intDefault=PostingsFormat(name=TestBloomFilteredLucene41Postings), timestamp=PostingsFormat(name=TestBloomFilteredLucene41Postings), id=PostingsFormat(name=Lucene41WithOrds), a_t=PostingsFormat(name=TestBloomFilteredLucene41Postings), range_facet_sl=PostingsFormat(name=Memory doPackFST= true), range_facet_si=PostingsFormat(name=Direct), other_tl1=PostingsFormat(name=TestBloomFilteredLucene41Postings), multiDefault=PostingsFormat(name=Direct), a_si=PostingsFormat(name=Direct)}, docValues:{}, sim=RandomSimilarityProvider(queryNorm=true,coord=crazy): {}, locale=ca_ES, timezone=America/Panama
[junit4:junit4]   2> NOTE: FreeBSD 9.0-RELEASE amd64/Oracle Corporation 1.7.0_17 (64-bit)/cpus=16,threads=3,free=167631528,total=486539264
[junit4:junit4]   2> NOTE: All tests run in this JVM: [QueryParsingTest, LeaderElectionIntegrationTest, DirectSolrConnectionTest, TestBM25SimilarityFactory, ConvertedLegacyTest, TestSolrDeletionPolicy1, ExternalFileFieldSortTest, TestNumberUtils, SolrRequestParserTest, SpellPossibilityIteratorTest, TestSolrDeletionPolicy2, CoreContainerCoreInitFailuresTest, CoreAdminHandlerTest, DateMathParserTest, TestRemoteStreaming, RecoveryZkTest, CurrencyFieldXmlFileTest, PluginInfoTest, BadComponentTest, CollectionsAPIDistributedZkTest, TestFoldingMultitermQuery, JsonLoaderTest, TestSolrJ, TestSolrIndexConfig, WordBreakSolrSpellCheckerTest, TestConfig, CircularListTest, XsltUpdateRequestHandlerTest, TestHashPartitioner, TestSort, OpenCloseCoreStressTest, MultiTermTest, TestWordDelimiterFilterFactory, SolrCoreTest, DebugComponentTest, TestAtomicUpdateErrorCases, UniqFieldsUpdateProcessorFactoryTest, SolrIndexConfigTest, TestMergePolicyConfig, TestWriterPerf, TestDocSet, PrimitiveFieldTypeTest, DocumentAnalysisRequestHandlerTest, StatelessScriptUpdateProcessorFactoryTest, HighlighterTest, UpdateRequestProcessorFactoryTest, JSONWriterTest, TestDynamicFieldCollectionResource, SolrInfoMBeanTest, CacheHeaderTest, TestMultiCoreConfBootstrap, TestXIncludeConfig, TermVectorComponentDistributedTest, AutoCommitTest, TestDocumentBuilder, TestCoreContainer, TestDynamicFieldResource, TestSuggestSpellingConverter, OutputWriterTest, SuggesterFSTTest, TestPHPSerializedResponseWriter, TestStressLucene, TestQuerySenderNoQuery, PrimUtilsTest, BasicDistributedZk2Test, SyncSliceTest]
[junit4:junit4] Completed on J1 in 169.05s, 1 test, 1 failure <<< FAILURES!

[...truncated 420 lines...]
BUILD FAILED
/usr/home/hudson/hudson-slave/workspace/Lucene-Solr-Tests-4.x-java7/build.xml:381: The following error occurred while executing this line:
/usr/home/hudson/hudson-slave/workspace/Lucene-Solr-Tests-4.x-java7/build.xml:361: The following error occurred while executing this line:
/usr/home/hudson/hudson-slave/workspace/Lucene-Solr-Tests-4.x-java7/build.xml:39: The following error occurred while executing this line:
/usr/home/hudson/hudson-slave/workspace/Lucene-Solr-Tests-4.x-java7/solr/build.xml:183: The following error occurred while executing this line:
/usr/home/hudson/hudson-slave/workspace/Lucene-Solr-Tests-4.x-java7/solr/common-build.xml:449: The following error occurred while executing this line:
/usr/home/hudson/hudson-slave/workspace/Lucene-Solr-Tests-4.x-java7/lucene/common-build.xml:1213: The following error occurred while executing this line:
/usr/home/hudson/hudson-slave/workspace/Lucene-Solr-Tests-4.x-java7/lucene/common-build.xml:877: There were test failures: 273 suites, 1147 tests, 1 failure, 27 ignored (8 assumptions)

Total time: 50 minutes 49 seconds
Build step 'Invoke Ant' marked build as failure
Archiving artifacts
Recording test results
Email was triggered for: Failure
Sending email for trigger: Failure



Mime
View raw message