lucene-dev mailing list archives

Site index · List index
Message view « Date » · « Thread »
Top « Date » · « Thread »
From Policeman Jenkins Server <jenk...@thetaphi.de>
Subject [JENKINS] Lucene-Solr-4.x-Linux (32bit/jdk1.8.0-ea-b82) - Build # 4800 - Still Failing!
Date Sun, 24 Mar 2013 03:49:33 GMT
Build: http://jenkins.thetaphi.de/job/Lucene-Solr-4.x-Linux/4800/
Java: 32bit/jdk1.8.0-ea-b82 -client -XX:+UseConcMarkSweepGC

3 tests failed.
FAILED:  junit.framework.TestSuite.org.apache.solr.cloud.RecoveryZkTest

Error Message:
Resource in scope SUITE failed to close. Resource was registered from thread Thread[id=80, name=coreLoadExecutor-33-thread-1, state=RUNNABLE, group=TGRP-RecoveryZkTest], registration stack trace below.

Stack Trace:
com.carrotsearch.randomizedtesting.ResourceDisposalError: Resource in scope SUITE failed to close. Resource was registered from thread Thread[id=80, name=coreLoadExecutor-33-thread-1, state=RUNNABLE, group=TGRP-RecoveryZkTest], registration stack trace below.
	at java.lang.Thread.getStackTrace(Thread.java:1569)
	at com.carrotsearch.randomizedtesting.RandomizedContext.closeAtEnd(RandomizedContext.java:150)
	at org.apache.lucene.util.LuceneTestCase.closeAfterSuite(LuceneTestCase.java:525)
	at org.apache.lucene.util.LuceneTestCase.wrapDirectory(LuceneTestCase.java:991)
	at org.apache.lucene.util.LuceneTestCase.newDirectory(LuceneTestCase.java:883)
	at org.apache.lucene.util.LuceneTestCase.newDirectory(LuceneTestCase.java:875)
	at org.apache.solr.core.MockDirectoryFactory.create(MockDirectoryFactory.java:37)
	at org.apache.solr.core.CachingDirectoryFactory.get(CachingDirectoryFactory.java:329)
	at org.apache.solr.core.SolrCore.getNewIndexDir(SolrCore.java:244)
	at org.apache.solr.core.SolrCore.initIndex(SolrCore.java:458)
	at org.apache.solr.core.SolrCore.<init>(SolrCore.java:746)
	at org.apache.solr.core.SolrCore.<init>(SolrCore.java:619)
	at org.apache.solr.core.CoreContainer.createFromZk(CoreContainer.java:872)
	at org.apache.solr.core.CoreContainer.create(CoreContainer.java:955)
	at org.apache.solr.core.CoreContainer$2.call(CoreContainer.java:579)
	at org.apache.solr.core.CoreContainer$2.call(CoreContainer.java:574)
	at java.util.concurrent.FutureTask.run(FutureTask.java:262)
	at java.util.concurrent.Executors$RunnableAdapter.call(Executors.java:471)
	at java.util.concurrent.FutureTask.run(FutureTask.java:262)
	at java.util.concurrent.ThreadPoolExecutor.runWorker(ThreadPoolExecutor.java:1145)
	at java.util.concurrent.ThreadPoolExecutor$Worker.run(ThreadPoolExecutor.java:615)
	at java.lang.Thread.run(Thread.java:722)
Caused by: java.lang.AssertionError: Directory not closed: MockDirWrapper(RateLimitedDirectoryWrapper(org.apache.lucene.store.RAMDirectory@2df345 lockFactory=org.apache.lucene.store.NativeFSLockFactory@1269c62))
	at org.junit.Assert.fail(Assert.java:93)
	at org.apache.lucene.util.CloseableDirectory.close(CloseableDirectory.java:47)
	at com.carrotsearch.randomizedtesting.RandomizedRunner$2$1.apply(RandomizedRunner.java:602)
	at com.carrotsearch.randomizedtesting.RandomizedRunner$2$1.apply(RandomizedRunner.java:599)
	at com.carrotsearch.randomizedtesting.RandomizedContext.closeResources(RandomizedContext.java:167)
	at com.carrotsearch.randomizedtesting.RandomizedRunner$2.afterAlways(RandomizedRunner.java:615)
	at com.carrotsearch.randomizedtesting.rules.StatementAdapter.evaluate(StatementAdapter.java:43)
	at com.carrotsearch.randomizedtesting.ThreadLeakControl$StatementRunner.run(ThreadLeakControl.java:358)
	... 1 more


FAILED:  junit.framework.TestSuite.org.apache.solr.cloud.RecoveryZkTest

Error Message:
Resource in scope SUITE failed to close. Resource was registered from thread Thread[id=82, name=RecoveryThread, state=RUNNABLE, group=TGRP-RecoveryZkTest], registration stack trace below.

Stack Trace:
com.carrotsearch.randomizedtesting.ResourceDisposalError: Resource in scope SUITE failed to close. Resource was registered from thread Thread[id=82, name=RecoveryThread, state=RUNNABLE, group=TGRP-RecoveryZkTest], registration stack trace below.
	at java.lang.Thread.getStackTrace(Thread.java:1569)
	at com.carrotsearch.randomizedtesting.RandomizedContext.closeAtEnd(RandomizedContext.java:150)
	at org.apache.lucene.util.LuceneTestCase.closeAfterSuite(LuceneTestCase.java:525)
	at org.apache.lucene.util.LuceneTestCase.wrapDirectory(LuceneTestCase.java:991)
	at org.apache.lucene.util.LuceneTestCase.newDirectory(LuceneTestCase.java:883)
	at org.apache.lucene.util.LuceneTestCase.newDirectory(LuceneTestCase.java:875)
	at org.apache.solr.core.MockDirectoryFactory.create(MockDirectoryFactory.java:37)
	at org.apache.solr.core.CachingDirectoryFactory.get(CachingDirectoryFactory.java:329)
	at org.apache.solr.handler.SnapPuller.fetchLatestIndex(SnapPuller.java:383)
	at org.apache.solr.handler.ReplicationHandler.doFetch(ReplicationHandler.java:281)
	at org.apache.solr.cloud.RecoveryStrategy.replicate(RecoveryStrategy.java:153)
	at org.apache.solr.cloud.RecoveryStrategy.doRecovery(RecoveryStrategy.java:409)
	at org.apache.solr.cloud.RecoveryStrategy.run(RecoveryStrategy.java:223)
Caused by: java.lang.AssertionError: Directory not closed: MockDirWrapper(RateLimitedDirectoryWrapper(org.apache.lucene.store.RAMDirectory@2118fe lockFactory=org.apache.lucene.store.NativeFSLockFactory@cc9ace))
	at org.junit.Assert.fail(Assert.java:93)
	at org.apache.lucene.util.CloseableDirectory.close(CloseableDirectory.java:47)
	at com.carrotsearch.randomizedtesting.RandomizedRunner$2$1.apply(RandomizedRunner.java:602)
	at com.carrotsearch.randomizedtesting.RandomizedRunner$2$1.apply(RandomizedRunner.java:599)
	at com.carrotsearch.randomizedtesting.RandomizedContext.closeResources(RandomizedContext.java:167)
	at com.carrotsearch.randomizedtesting.RandomizedRunner$2.afterAlways(RandomizedRunner.java:615)
	at com.carrotsearch.randomizedtesting.rules.StatementAdapter.evaluate(StatementAdapter.java:43)
	at com.carrotsearch.randomizedtesting.ThreadLeakControl$StatementRunner.run(ThreadLeakControl.java:358)
	at java.lang.Thread.run(Thread.java:722)


FAILED:  org.apache.solr.cloud.BasicDistributedZk2Test.testDistribSearch

Error Message:
Server at http://127.0.0.1:56093/aukb/onenodecollectioncore returned non ok status:404, message:Can not find: /aukb/onenodecollectioncore/update

Stack Trace:
org.apache.solr.common.SolrException: Server at http://127.0.0.1:56093/aukb/onenodecollectioncore returned non ok status:404, message:Can not find: /aukb/onenodecollectioncore/update
	at __randomizedtesting.SeedInfo.seed([2197086ECB033A40:A0718676BC5C5A7C]:0)
	at org.apache.solr.client.solrj.impl.HttpSolrServer.request(HttpSolrServer.java:375)
	at org.apache.solr.client.solrj.impl.HttpSolrServer.request(HttpSolrServer.java:181)
	at org.apache.solr.client.solrj.request.AbstractUpdateRequest.process(AbstractUpdateRequest.java:117)
	at org.apache.solr.client.solrj.SolrServer.add(SolrServer.java:116)
	at org.apache.solr.client.solrj.SolrServer.add(SolrServer.java:102)
	at org.apache.solr.cloud.BasicDistributedZk2Test.testNodeWithoutCollectionForwarding(BasicDistributedZk2Test.java:197)
	at org.apache.solr.cloud.BasicDistributedZk2Test.doTest(BasicDistributedZk2Test.java:89)
	at org.apache.solr.BaseDistributedSearchTestCase.testDistribSearch(BaseDistributedSearchTestCase.java:806)
	at sun.reflect.NativeMethodAccessorImpl.invoke0(Native Method)
	at sun.reflect.NativeMethodAccessorImpl.invoke(NativeMethodAccessorImpl.java:57)
	at sun.reflect.DelegatingMethodAccessorImpl.invoke(DelegatingMethodAccessorImpl.java:43)
	at java.lang.reflect.Method.invoke(Method.java:487)
	at com.carrotsearch.randomizedtesting.RandomizedRunner.invoke(RandomizedRunner.java:1559)
	at com.carrotsearch.randomizedtesting.RandomizedRunner.access$600(RandomizedRunner.java:79)
	at com.carrotsearch.randomizedtesting.RandomizedRunner$6.evaluate(RandomizedRunner.java:737)
	at com.carrotsearch.randomizedtesting.RandomizedRunner$7.evaluate(RandomizedRunner.java:773)
	at com.carrotsearch.randomizedtesting.RandomizedRunner$8.evaluate(RandomizedRunner.java:787)
	at com.carrotsearch.randomizedtesting.rules.SystemPropertiesRestoreRule$1.evaluate(SystemPropertiesRestoreRule.java:53)
	at org.apache.lucene.util.TestRuleSetupTeardownChained$1.evaluate(TestRuleSetupTeardownChained.java:50)
	at org.apache.lucene.util.TestRuleFieldCacheSanity$1.evaluate(TestRuleFieldCacheSanity.java:51)
	at org.apache.lucene.util.AbstractBeforeAfterRule$1.evaluate(AbstractBeforeAfterRule.java:46)
	at com.carrotsearch.randomizedtesting.rules.SystemPropertiesInvariantRule$1.evaluate(SystemPropertiesInvariantRule.java:55)
	at org.apache.lucene.util.TestRuleThreadAndTestName$1.evaluate(TestRuleThreadAndTestName.java:49)
	at org.apache.lucene.util.TestRuleIgnoreAfterMaxFailures$1.evaluate(TestRuleIgnoreAfterMaxFailures.java:70)
	at org.apache.lucene.util.TestRuleMarkFailure$1.evaluate(TestRuleMarkFailure.java:48)
	at com.carrotsearch.randomizedtesting.rules.StatementAdapter.evaluate(StatementAdapter.java:36)
	at com.carrotsearch.randomizedtesting.ThreadLeakControl$StatementRunner.run(ThreadLeakControl.java:358)
	at com.carrotsearch.randomizedtesting.ThreadLeakControl.forkTimeoutingTask(ThreadLeakControl.java:782)
	at com.carrotsearch.randomizedtesting.ThreadLeakControl$3.evaluate(ThreadLeakControl.java:442)
	at com.carrotsearch.randomizedtesting.RandomizedRunner.runSingleTest(RandomizedRunner.java:746)
	at com.carrotsearch.randomizedtesting.RandomizedRunner$3.evaluate(RandomizedRunner.java:648)
	at com.carrotsearch.randomizedtesting.RandomizedRunner$4.evaluate(RandomizedRunner.java:682)
	at com.carrotsearch.randomizedtesting.RandomizedRunner$5.evaluate(RandomizedRunner.java:693)
	at com.carrotsearch.randomizedtesting.rules.StatementAdapter.evaluate(StatementAdapter.java:36)
	at com.carrotsearch.randomizedtesting.rules.SystemPropertiesRestoreRule$1.evaluate(SystemPropertiesRestoreRule.java:53)
	at org.apache.lucene.util.AbstractBeforeAfterRule$1.evaluate(AbstractBeforeAfterRule.java:46)
	at org.apache.lucene.util.TestRuleStoreClassName$1.evaluate(TestRuleStoreClassName.java:42)
	at com.carrotsearch.randomizedtesting.rules.SystemPropertiesInvariantRule$1.evaluate(SystemPropertiesInvariantRule.java:55)
	at com.carrotsearch.randomizedtesting.rules.NoShadowingOrOverridesOnMethodsRule$1.evaluate(NoShadowingOrOverridesOnMethodsRule.java:39)
	at com.carrotsearch.randomizedtesting.rules.NoShadowingOrOverridesOnMethodsRule$1.evaluate(NoShadowingOrOverridesOnMethodsRule.java:39)
	at com.carrotsearch.randomizedtesting.rules.StatementAdapter.evaluate(StatementAdapter.java:36)
	at org.apache.lucene.util.TestRuleAssertionsRequired$1.evaluate(TestRuleAssertionsRequired.java:43)
	at org.apache.lucene.util.TestRuleMarkFailure$1.evaluate(TestRuleMarkFailure.java:48)
	at org.apache.lucene.util.TestRuleIgnoreAfterMaxFailures$1.evaluate(TestRuleIgnoreAfterMaxFailures.java:70)
	at org.apache.lucene.util.TestRuleIgnoreTestSuites$1.evaluate(TestRuleIgnoreTestSuites.java:55)
	at com.carrotsearch.randomizedtesting.rules.StatementAdapter.evaluate(StatementAdapter.java:36)
	at com.carrotsearch.randomizedtesting.ThreadLeakControl$StatementRunner.run(ThreadLeakControl.java:358)
	at java.lang.Thread.run(Thread.java:722)




Build Log:
[...truncated 8937 lines...]
[junit4:junit4] Suite: org.apache.solr.cloud.RecoveryZkTest
[junit4:junit4]   2> 0 T20 oas.BaseDistributedSearchTestCase.initHostContext Setting hostContext system property: /zr_/xh
[junit4:junit4]   2> 4 T20 oas.SolrTestCaseJ4.setUp ###Starting testDistribSearch
[junit4:junit4]   2> Creating dataDir: /mnt/ssd/jenkins/workspace/Lucene-Solr-4.x-Linux/solr/build/solr-core/test/J0/./solrtest-RecoveryZkTest-1364095908100
[junit4:junit4]   2> 7 T20 oasc.ZkTestServer.run STARTING ZK TEST SERVER
[junit4:junit4]   2> 9 T21 oasc.ZkTestServer$ZKServerMain.runFromConfig Starting server
[junit4:junit4]   2> 31 T21 oaz.Environment.logEnv Server environment:zookeeper.version=3.4.5-1392090, built on 09/30/2012 17:52 GMT
[junit4:junit4]   2> 32 T21 oaz.Environment.logEnv Server environment:host.name=serv1
[junit4:junit4]   2> 32 T21 oaz.Environment.logEnv Server environment:java.version=1.8.0-ea
[junit4:junit4]   2> 32 T21 oaz.Environment.logEnv Server environment:java.vendor=Oracle Corporation
[junit4:junit4]   2> 32 T21 oaz.Environment.logEnv Server environment:java.home=/var/lib/jenkins/tools/java/32bit/jdk1.8.0-ea-b82/jre
[junit4:junit4]   2> 32 T21 oaz.Environment.logEnv Server environment:java.class.path=/mnt/ssd/jenkins/workspace/Lucene-Solr-4.x-Linux/solr/build/solr-core/classes/test:/mnt/ssd/jenkins/workspace/Lucene-Solr-4.x-Linux/solr/build/solr-test-framework/classes/java:/mnt/ssd/jenkins/workspace/Lucene-Solr-4.x-Linux/solr/build/solr-core/test-files:/mnt/ssd/jenkins/workspace/Lucene-Solr-4.x-Linux/lucene/build/test-framework/classes/java:/mnt/ssd/jenkins/workspace/Lucene-Solr-4.x-Linux/lucene/build/codecs/classes/java:/mnt/ssd/jenkins/workspace/Lucene-Solr-4.x-Linux/solr/build/solr-solrj/classes/java:/mnt/ssd/jenkins/workspace/Lucene-Solr-4.x-Linux/solr/build/solr-core/classes/java:/mnt/ssd/jenkins/workspace/Lucene-Solr-4.x-Linux/lucene/build/analysis/common/lucene-analyzers-common-4.3-SNAPSHOT.jar:/mnt/ssd/jenkins/workspace/Lucene-Solr-4.x-Linux/lucene/build/analysis/kuromoji/lucene-analyzers-kuromoji-4.3-SNAPSHOT.jar:/mnt/ssd/jenkins/workspace/Lucene-Solr-4.x-Linux/lucene/build/analysis/phonetic/lucene-analyzers-phonetic-4.3-SNAPSHOT.jar:/mnt/ssd/jenkins/workspace/Lucene-Solr-4.x-Linux/lucene/build/codecs/lucene-codecs-4.3-SNAPSHOT.jar:/mnt/ssd/jenkins/workspace/Lucene-Solr-4.x-Linux/lucene/build/highlighter/lucene-highlighter-4.3-SNAPSHOT.jar:/mnt/ssd/jenkins/workspace/Lucene-Solr-4.x-Linux/lucene/build/memory/lucene-memory-4.3-SNAPSHOT.jar:/mnt/ssd/jenkins/workspace/Lucene-Solr-4.x-Linux/lucene/build/misc/lucene-misc-4.3-SNAPSHOT.jar:/mnt/ssd/jenkins/workspace/Lucene-Solr-4.x-Linux/lucene/build/spatial/lucene-spatial-4.3-SNAPSHOT.jar:/mnt/ssd/jenkins/workspace/Lucene-Solr-4.x-Linux/lucene/build/suggest/lucene-suggest-4.3-SNAPSHOT.jar:/mnt/ssd/jenkins/workspace/Lucene-Solr-4.x-Linux/lucene/build/grouping/lucene-grouping-4.3-SNAPSHOT.jar:/mnt/ssd/jenkins/workspace/Lucene-Solr-4.x-Linux/lucene/build/queries/lucene-queries-4.3-SNAPSHOT.jar:/mnt/ssd/jenkins/workspace/Lucene-Solr-4.x-Linux/lucene/build/queryparser/lucene-queryparser-4.3-SNAPSHOT.jar:/mnt/ssd/jenkins/workspace/Lucene-Solr-4.x-Linux/solr/core/lib/cglib-nodep-2.2.jar:/mnt/ssd/jenkins/workspace/Lucene-Solr-4.x-Linux/solr/core/lib/commons-cli-1.2.jar:/mnt/ssd/jenkins/workspace/Lucene-Solr-4.x-Linux/solr/core/lib/commons-codec-1.7.jar:/mnt/ssd/jenkins/workspace/Lucene-Solr-4.x-Linux/solr/core/lib/commons-fileupload-1.2.1.jar:/mnt/ssd/jenkins/workspace/Lucene-Solr-4.x-Linux/solr/core/lib/commons-lang-2.6.jar:/mnt/ssd/jenkins/workspace/Lucene-Solr-4.x-Linux/solr/core/lib/easymock-3.0.jar:/mnt/ssd/jenkins/workspace/Lucene-Solr-4.x-Linux/solr/core/lib/guava-13.0.1.jar:/mnt/ssd/jenkins/workspace/Lucene-Solr-4.x-Linux/solr/core/lib/javax.servlet-api-3.0.1.jar:/mnt/ssd/jenkins/workspace/Lucene-Solr-4.x-Linux/solr/core/lib/objenesis-1.2.jar:/mnt/ssd/jenkins/workspace/Lucene-Solr-4.x-Linux/solr/core/lib/org.restlet-2.1.1.jar:/mnt/ssd/jenkins/workspace/Lucene-Solr-4.x-Linux/solr/core/lib/org.restlet.ext.servlet-2.1.1.jar:/mnt/ssd/jenkins/workspace/Lucene-Solr-4.x-Linux/solr/core/lib/spatial4j-0.3.jar:/mnt/ssd/jenkins/workspace/Lucene-Solr-4.x-Linux/solr/solrj/lib/commons-io-2.1.jar:/mnt/ssd/jenkins/workspace/Lucene-Solr-4.x-Linux/solr/solrj/lib/httpclient-4.2.3.jar:/mnt/ssd/jenkins/workspace/Lucene-Solr-4.x-Linux/solr/solrj/lib/httpcore-4.2.2.jar:/mnt/ssd/jenkins/workspace/Lucene-Solr-4.x-Linux/solr/solrj/lib/httpmime-4.2.3.jar:/mnt/ssd/jenkins/workspace/Lucene-Solr-4.x-Linux/solr/solrj/lib/jcl-over-slf4j-1.6.4.jar:/mnt/ssd/jenkins/workspace/Lucene-Solr-4.x-Linux/solr/solrj/lib/noggit-0.5.jar:/mnt/ssd/jenkins/workspace/Lucene-Solr-4.x-Linux/solr/solrj/lib/slf4j-api-1.6.4.jar:/mnt/ssd/jenkins/workspace/Lucene-Solr-4.x-Linux/solr/solrj/lib/slf4j-jdk14-1.6.4.jar:/mnt/ssd/jenkins/workspace/Lucene-Solr-4.x-Linux/solr/solrj/lib/wstx-asl-3.2.7.jar:/mnt/ssd/jenkins/workspace/Lucene-Solr-4.x-Linux/solr/solrj/lib/zookeeper-3.4.5.jar:/mnt/ssd/jenkins/workspace/Lucene-Solr-4.x-Linux/solr/example/lib/jetty-continuation-8.1.8.v20121106.jar:/mnt/ssd/jenkins/workspace/Lucene-Solr-4.x-Linux/solr/example/lib/jetty-deploy-8.1.8.v20121106.jar:/mnt/ssd/jenkins/workspace/Lucene-Solr-4.x-Linux/solr/example/lib/jetty-http-8.1.8.v20121106.jar:/mnt/ssd/jenkins/workspace/Lucene-Solr-4.x-Linux/solr/example/lib/jetty-io-8.1.8.v20121106.jar:/mnt/ssd/jenkins/workspace/Lucene-Solr-4.x-Linux/solr/example/lib/jetty-jmx-8.1.8.v20121106.jar:/mnt/ssd/jenkins/workspace/Lucene-Solr-4.x-Linux/solr/example/lib/jetty-security-8.1.8.v20121106.jar:/mnt/ssd/jenkins/workspace/Lucene-Solr-4.x-Linux/solr/example/lib/jetty-server-8.1.8.v20121106.jar:/mnt/ssd/jenkins/workspace/Lucene-Solr-4.x-Linux/solr/example/lib/jetty-servlet-8.1.8.v20121106.jar:/mnt/ssd/jenkins/workspace/Lucene-Solr-4.x-Linux/solr/example/lib/jetty-util-8.1.8.v20121106.jar:/mnt/ssd/jenkins/workspace/Lucene-Solr-4.x-Linux/solr/example/lib/jetty-webapp-8.1.8.v20121106.jar:/mnt/ssd/jenkins/workspace/Lucene-Solr-4.x-Linux/solr/example/lib/jetty-xml-8.1.8.v20121106.jar:/mnt/ssd/jenkins/workspace/Lucene-Solr-4.x-Linux/solr/example/lib/servlet-api-3.0.jar:/mnt/ssd/jenkins/workspace/Lucene-Solr-4.x-Linux/solr/example/example-DIH/solr/db/lib/derby-10.9.1.0.jar:/mnt/ssd/jenkins/workspace/Lucene-Solr-4.x-Linux/solr/example/example-DIH/solr/db/lib/hsqldb-1.8.0.10.jar:/mnt/ssd/jenkins/workspace/Lucene-Solr-4.x-Linux/lucene/build/core/classes/java:/mnt/ssd/jenkins/workspace/Lucene-Solr-4.x-Linux/lucene/test-framework/lib/junit-4.10.jar:/mnt/ssd/jenkins/workspace/Lucene-Solr-4.x-Linux/lucene/test-framework/lib/randomizedtesting-runner-2.0.8.jar:/var/lib/jenkins/tools/hudson.tasks.Ant_AntInstallation/ANT_1.8.2/lib/ant-launcher.jar:/var/lib/jenkins/.ant/lib/ivy-2.3.0.jar:/var/lib/jenkins/tools/hudson.tasks.Ant_AntInstallation/ANT_1.8.2/lib/ant-jai.jar:/var/lib/jenkins/tools/hudson.tasks.Ant_AntInstallation/ANT_1.8.2/lib/ant-swing.jar:/var/lib/jenkins/tools/hudson.tasks.Ant_AntInstallation/ANT_1.8.2/lib/ant-apache-oro.jar:/var/lib/jenkins/tools/hudson.tasks.Ant_AntInstallation/ANT_1.8.2/lib/ant-jmf.jar:/var/lib/jenkins/tools/hudson.tasks.Ant_AntInstallation/ANT_1.8.2/lib/ant-apache-xalan2.jar:/var/lib/jenkins/tools/hudson.tasks.Ant_AntInstallation/ANT_1.8.2/lib/ant-javamail.jar:/var/lib/jenkins/tools/hudson.tasks.Ant_AntInstallation/ANT_1.8.2/lib/ant-apache-resolver.jar:/var/lib/jenkins/tools/hudson.tasks.Ant_AntInstallation/ANT_1.8.2/lib/ant-testutil.jar:/var/lib/jenkins/tools/hudson.tasks.Ant_AntInstallation/ANT_1.8.2/lib/ant-commons-logging.jar:/var/lib/jenkins/tools/hudson.tasks.Ant_AntInstallation/ANT_1.8.2/lib/ant-apache-log4j.jar:/var/lib/jenkins/tools/hudson.tasks.Ant_AntInstallation/ANT_1.8.2/lib/ant-junit.jar:/var/lib/jenkins/tools/hudson.tasks.Ant_AntInstallation/ANT_1.8.2/lib/ant-jsch.jar:/var/lib/jenkins/tools/hudson.tasks.Ant_AntInstallation/ANT_1.8.2/lib/ant-commons-net.jar:/var/lib/jenkins/tools/hudson.tasks.Ant_AntInstallation/ANT_1.8.2/lib/ant-apache-bsf.jar:/var/lib/jenkins/tools/hudson.tasks.Ant_AntInstallation/ANT_1.8.2/lib/ant-jdepend.jar:/var/lib/jenkins/tools/hudson.tasks.Ant_AntInstallation/ANT_1.8.2/lib/ant-netrexx.jar:/var/lib/jenkins/tools/hudson.tasks.Ant_AntInstallation/ANT_1.8.2/lib/ant-apache-regexp.jar:/var/lib/jenkins/tools/hudson.tasks.Ant_AntInstallation/ANT_1.8.2/lib/ant-junit4.jar:/var/lib/jenkins/tools/hudson.tasks.Ant_AntInstallation/ANT_1.8.2/lib/ant.jar:/var/lib/jenkins/tools/hudson.tasks.Ant_AntInstallation/ANT_1.8.2/lib/ant-apache-bcel.jar:/var/lib/jenkins/tools/hudson.tasks.Ant_AntInstallation/ANT_1.8.2/lib/ant-antlr.jar:/var/lib/jenkins/tools/java/32bit/jdk1.8.0-ea-b82/lib/tools.jar:/var/lib/jenkins/.ivy2/cache/com.carrotsearch.randomizedtesting/junit4-ant/jars/junit4-ant-2.0.8.jar
[junit4:junit4]   2> 34 T21 oaz.Environment.logEnv Server environment:java.library.path=/usr/java/packages/lib/i386:/lib:/usr/lib
[junit4:junit4]   2> 34 T21 oaz.Environment.logEnv Server environment:java.io.tmpdir=.
[junit4:junit4]   2> 34 T21 oaz.Environment.logEnv Server environment:java.compiler=<NA>
[junit4:junit4]   2> 34 T21 oaz.Environment.logEnv Server environment:os.name=Linux
[junit4:junit4]   2> 34 T21 oaz.Environment.logEnv Server environment:os.arch=i386
[junit4:junit4]   2> 34 T21 oaz.Environment.logEnv Server environment:os.version=3.2.0-39-generic
[junit4:junit4]   2> 35 T21 oaz.Environment.logEnv Server environment:user.name=jenkins
[junit4:junit4]   2> 35 T21 oaz.Environment.logEnv Server environment:user.home=/var/lib/jenkins
[junit4:junit4]   2> 35 T21 oaz.Environment.logEnv Server environment:user.dir=/mnt/ssd/jenkins/workspace/Lucene-Solr-4.x-Linux/solr/build/solr-core/test/J0
[junit4:junit4]   2> 47 T21 oazs.ZooKeeperServer.setTickTime tickTime set to 1000
[junit4:junit4]   2> 47 T21 oazs.ZooKeeperServer.setMinSessionTimeout minSessionTimeout set to -1
[junit4:junit4]   2> 47 T21 oazs.ZooKeeperServer.setMaxSessionTimeout maxSessionTimeout set to -1
[junit4:junit4]   2> 54 T21 oazs.NIOServerCnxnFactory.configure binding to port 0.0.0.0/0.0.0.0:0
[junit4:junit4]   2> 86 T21 oazsp.FileTxnSnapLog.save Snapshotting: 0x0 to /mnt/ssd/jenkins/workspace/Lucene-Solr-4.x-Linux/solr/build/solr-core/test/J0/./org.apache.solr.cloud.RecoveryZkTest-1364095908099/zookeeper/server1/data/version-2/snapshot.0
[junit4:junit4]   2> 109 T20 oasc.ZkTestServer.run start zk server on port:55277
[junit4:junit4]   2> 129 T20 oaz.Environment.logEnv Client environment:zookeeper.version=3.4.5-1392090, built on 09/30/2012 17:52 GMT
[junit4:junit4]   2> 129 T20 oaz.Environment.logEnv Client environment:host.name=serv1
[junit4:junit4]   2> 130 T20 oaz.Environment.logEnv Client environment:java.version=1.8.0-ea
[junit4:junit4]   2> 130 T20 oaz.Environment.logEnv Client environment:java.vendor=Oracle Corporation
[junit4:junit4]   2> 130 T20 oaz.Environment.logEnv Client environment:java.home=/var/lib/jenkins/tools/java/32bit/jdk1.8.0-ea-b82/jre
[junit4:junit4]   2> 131 T20 oaz.Environment.logEnv Client environment:java.class.path=/mnt/ssd/jenkins/workspace/Lucene-Solr-4.x-Linux/solr/build/solr-core/classes/test:/mnt/ssd/jenkins/workspace/Lucene-Solr-4.x-Linux/solr/build/solr-test-framework/classes/java:/mnt/ssd/jenkins/workspace/Lucene-Solr-4.x-Linux/solr/build/solr-core/test-files:/mnt/ssd/jenkins/workspace/Lucene-Solr-4.x-Linux/lucene/build/test-framework/classes/java:/mnt/ssd/jenkins/workspace/Lucene-Solr-4.x-Linux/lucene/build/codecs/classes/java:/mnt/ssd/jenkins/workspace/Lucene-Solr-4.x-Linux/solr/build/solr-solrj/classes/java:/mnt/ssd/jenkins/workspace/Lucene-Solr-4.x-Linux/solr/build/solr-core/classes/java:/mnt/ssd/jenkins/workspace/Lucene-Solr-4.x-Linux/lucene/build/analysis/common/lucene-analyzers-common-4.3-SNAPSHOT.jar:/mnt/ssd/jenkins/workspace/Lucene-Solr-4.x-Linux/lucene/build/analysis/kuromoji/lucene-analyzers-kuromoji-4.3-SNAPSHOT.jar:/mnt/ssd/jenkins/workspace/Lucene-Solr-4.x-Linux/lucene/build/analysis/phonetic/lucene-analyzers-phonetic-4.3-SNAPSHOT.jar:/mnt/ssd/jenkins/workspace/Lucene-Solr-4.x-Linux/lucene/build/codecs/lucene-codecs-4.3-SNAPSHOT.jar:/mnt/ssd/jenkins/workspace/Lucene-Solr-4.x-Linux/lucene/build/highlighter/lucene-highlighter-4.3-SNAPSHOT.jar:/mnt/ssd/jenkins/workspace/Lucene-Solr-4.x-Linux/lucene/build/memory/lucene-memory-4.3-SNAPSHOT.jar:/mnt/ssd/jenkins/workspace/Lucene-Solr-4.x-Linux/lucene/build/misc/lucene-misc-4.3-SNAPSHOT.jar:/mnt/ssd/jenkins/workspace/Lucene-Solr-4.x-Linux/lucene/build/spatial/lucene-spatial-4.3-SNAPSHOT.jar:/mnt/ssd/jenkins/workspace/Lucene-Solr-4.x-Linux/lucene/build/suggest/lucene-suggest-4.3-SNAPSHOT.jar:/mnt/ssd/jenkins/workspace/Lucene-Solr-4.x-Linux/lucene/build/grouping/lucene-grouping-4.3-SNAPSHOT.jar:/mnt/ssd/jenkins/workspace/Lucene-Solr-4.x-Linux/lucene/build/queries/lucene-queries-4.3-SNAPSHOT.jar:/mnt/ssd/jenkins/workspace/Lucene-Solr-4.x-Linux/lucene/build/queryparser/lucene-queryparser-4.3-SNAPSHOT.jar:/mnt/ssd/jenkins/workspace/Lucene-Solr-4.x-Linux/solr/core/lib/cglib-nodep-2.2.jar:/mnt/ssd/jenkins/workspace/Lucene-Solr-4.x-Linux/solr/core/lib/commons-cli-1.2.jar:/mnt/ssd/jenkins/workspace/Lucene-Solr-4.x-Linux/solr/core/lib/commons-codec-1.7.jar:/mnt/ssd/jenkins/workspace/Lucene-Solr-4.x-Linux/solr/core/lib/commons-fileupload-1.2.1.jar:/mnt/ssd/jenkins/workspace/Lucene-Solr-4.x-Linux/solr/core/lib/commons-lang-2.6.jar:/mnt/ssd/jenkins/workspace/Lucene-Solr-4.x-Linux/solr/core/lib/easymock-3.0.jar:/mnt/ssd/jenkins/workspace/Lucene-Solr-4.x-Linux/solr/core/lib/guava-13.0.1.jar:/mnt/ssd/jenkins/workspace/Lucene-Solr-4.x-Linux/solr/core/lib/javax.servlet-api-3.0.1.jar:/mnt/ssd/jenkins/workspace/Lucene-Solr-4.x-Linux/solr/core/lib/objenesis-1.2.jar:/mnt/ssd/jenkins/workspace/Lucene-Solr-4.x-Linux/solr/core/lib/org.restlet-2.1.1.jar:/mnt/ssd/jenkins/workspace/Lucene-Solr-4.x-Linux/solr/core/lib/org.restlet.ext.servlet-2.1.1.jar:/mnt/ssd/jenkins/workspace/Lucene-Solr-4.x-Linux/solr/core/lib/spatial4j-0.3.jar:/mnt/ssd/jenkins/workspace/Lucene-Solr-4.x-Linux/solr/solrj/lib/commons-io-2.1.jar:/mnt/ssd/jenkins/workspace/Lucene-Solr-4.x-Linux/solr/solrj/lib/httpclient-4.2.3.jar:/mnt/ssd/jenkins/workspace/Lucene-Solr-4.x-Linux/solr/solrj/lib/httpcore-4.2.2.jar:/mnt/ssd/jenkins/workspace/Lucene-Solr-4.x-Linux/solr/solrj/lib/httpmime-4.2.3.jar:/mnt/ssd/jenkins/workspace/Lucene-Solr-4.x-Linux/solr/solrj/lib/jcl-over-slf4j-1.6.4.jar:/mnt/ssd/jenkins/workspace/Lucene-Solr-4.x-Linux/solr/solrj/lib/noggit-0.5.jar:/mnt/ssd/jenkins/workspace/Lucene-Solr-4.x-Linux/solr/solrj/lib/slf4j-api-1.6.4.jar:/mnt/ssd/jenkins/workspace/Lucene-Solr-4.x-Linux/solr/solrj/lib/slf4j-jdk14-1.6.4.jar:/mnt/ssd/jenkins/workspace/Lucene-Solr-4.x-Linux/solr/solrj/lib/wstx-asl-3.2.7.jar:/mnt/ssd/jenkins/workspace/Lucene-Solr-4.x-Linux/solr/solrj/lib/zookeeper-3.4.5.jar:/mnt/ssd/jenkins/workspace/Lucene-Solr-4.x-Linux/solr/example/lib/jetty-continuation-8.1.8.v20121106.jar:/mnt/ssd/jenkins/workspace/Lucene-Solr-4.x-Linux/solr/example/lib/jetty-deploy-8.1.8.v20121106.jar:/mnt/ssd/jenkins/workspace/Lucene-Solr-4.x-Linux/solr/example/lib/jetty-http-8.1.8.v20121106.jar:/mnt/ssd/jenkins/workspace/Lucene-Solr-4.x-Linux/solr/example/lib/jetty-io-8.1.8.v20121106.jar:/mnt/ssd/jenkins/workspace/Lucene-Solr-4.x-Linux/solr/example/lib/jetty-jmx-8.1.8.v20121106.jar:/mnt/ssd/jenkins/workspace/Lucene-Solr-4.x-Linux/solr/example/lib/jetty-security-8.1.8.v20121106.jar:/mnt/ssd/jenkins/workspace/Lucene-Solr-4.x-Linux/solr/example/lib/jetty-server-8.1.8.v20121106.jar:/mnt/ssd/jenkins/workspace/Lucene-Solr-4.x-Linux/solr/example/lib/jetty-servlet-8.1.8.v20121106.jar:/mnt/ssd/jenkins/workspace/Lucene-Solr-4.x-Linux/solr/example/lib/jetty-util-8.1.8.v20121106.jar:/mnt/ssd/jenkins/workspace/Lucene-Solr-4.x-Linux/solr/example/lib/jetty-webapp-8.1.8.v20121106.jar:/mnt/ssd/jenkins/workspace/Lucene-Solr-4.x-Linux/solr/example/lib/jetty-xml-8.1.8.v20121106.jar:/mnt/ssd/jenkins/workspace/Lucene-Solr-4.x-Linux/solr/example/lib/servlet-api-3.0.jar:/mnt/ssd/jenkins/workspace/Lucene-Solr-4.x-Linux/solr/example/example-DIH/solr/db/lib/derby-10.9.1.0.jar:/mnt/ssd/jenkins/workspace/Lucene-Solr-4.x-Linux/solr/example/example-DIH/solr/db/lib/hsqldb-1.8.0.10.jar:/mnt/ssd/jenkins/workspace/Lucene-Solr-4.x-Linux/lucene/build/core/classes/java:/mnt/ssd/jenkins/workspace/Lucene-Solr-4.x-Linux/lucene/test-framework/lib/junit-4.10.jar:/mnt/ssd/jenkins/workspace/Lucene-Solr-4.x-Linux/lucene/test-framework/lib/randomizedtesting-runner-2.0.8.jar:/var/lib/jenkins/tools/hudson.tasks.Ant_AntInstallation/ANT_1.8.2/lib/ant-launcher.jar:/var/lib/jenkins/.ant/lib/ivy-2.3.0.jar:/var/lib/jenkins/tools/hudson.tasks.Ant_AntInstallation/ANT_1.8.2/lib/ant-jai.jar:/var/lib/jenkins/tools/hudson.tasks.Ant_AntInstallation/ANT_1.8.2/lib/ant-swing.jar:/var/lib/jenkins/tools/hudson.tasks.Ant_AntInstallation/ANT_1.8.2/lib/ant-apache-oro.jar:/var/lib/jenkins/tools/hudson.tasks.Ant_AntInstallation/ANT_1.8.2/lib/ant-jmf.jar:/var/lib/jenkins/tools/hudson.tasks.Ant_AntInstallation/ANT_1.8.2/lib/ant-apache-xalan2.jar:/var/lib/jenkins/tools/hudson.tasks.Ant_AntInstallation/ANT_1.8.2/lib/ant-javamail.jar:/var/lib/jenkins/tools/hudson.tasks.Ant_AntInstallation/ANT_1.8.2/lib/ant-apache-resolver.jar:/var/lib/jenkins/tools/hudson.tasks.Ant_AntInstallation/ANT_1.8.2/lib/ant-testutil.jar:/var/lib/jenkins/tools/hudson.tasks.Ant_AntInstallation/ANT_1.8.2/lib/ant-commons-logging.jar:/var/lib/jenkins/tools/hudson.tasks.Ant_AntInstallation/ANT_1.8.2/lib/ant-apache-log4j.jar:/var/lib/jenkins/tools/hudson.tasks.Ant_AntInstallation/ANT_1.8.2/lib/ant-junit.jar:/var/lib/jenkins/tools/hudson.tasks.Ant_AntInstallation/ANT_1.8.2/lib/ant-jsch.jar:/var/lib/jenkins/tools/hudson.tasks.Ant_AntInstallation/ANT_1.8.2/lib/ant-commons-net.jar:/var/lib/jenkins/tools/hudson.tasks.Ant_AntInstallation/ANT_1.8.2/lib/ant-apache-bsf.jar:/var/lib/jenkins/tools/hudson.tasks.Ant_AntInstallation/ANT_1.8.2/lib/ant-jdepend.jar:/var/lib/jenkins/tools/hudson.tasks.Ant_AntInstallation/ANT_1.8.2/lib/ant-netrexx.jar:/var/lib/jenkins/tools/hudson.tasks.Ant_AntInstallation/ANT_1.8.2/lib/ant-apache-regexp.jar:/var/lib/jenkins/tools/hudson.tasks.Ant_AntInstallation/ANT_1.8.2/lib/ant-junit4.jar:/var/lib/jenkins/tools/hudson.tasks.Ant_AntInstallation/ANT_1.8.2/lib/ant.jar:/var/lib/jenkins/tools/hudson.tasks.Ant_AntInstallation/ANT_1.8.2/lib/ant-apache-bcel.jar:/var/lib/jenkins/tools/hudson.tasks.Ant_AntInstallation/ANT_1.8.2/lib/ant-antlr.jar:/var/lib/jenkins/tools/java/32bit/jdk1.8.0-ea-b82/lib/tools.jar:/var/lib/jenkins/.ivy2/cache/com.carrotsearch.randomizedtesting/junit4-ant/jars/junit4-ant-2.0.8.jar
[junit4:junit4]   2> 133 T20 oaz.Environment.logEnv Client environment:java.library.path=/usr/java/packages/lib/i386:/lib:/usr/lib
[junit4:junit4]   2> 133 T20 oaz.Environment.logEnv Client environment:java.io.tmpdir=.
[junit4:junit4]   2> 134 T20 oaz.Environment.logEnv Client environment:java.compiler=<NA>
[junit4:junit4]   2> 134 T20 oaz.Environment.logEnv Client environment:os.name=Linux
[junit4:junit4]   2> 135 T20 oaz.Environment.logEnv Client environment:os.arch=i386
[junit4:junit4]   2> 135 T20 oaz.Environment.logEnv Client environment:os.version=3.2.0-39-generic
[junit4:junit4]   2> 136 T20 oaz.Environment.logEnv Client environment:user.name=jenkins
[junit4:junit4]   2> 136 T20 oaz.Environment.logEnv Client environment:user.home=/var/lib/jenkins
[junit4:junit4]   2> 136 T20 oaz.Environment.logEnv Client environment:user.dir=/mnt/ssd/jenkins/workspace/Lucene-Solr-4.x-Linux/solr/build/solr-core/test/J0
[junit4:junit4]   2> 138 T20 oaz.ZooKeeper.<init> Initiating client connection, connectString=127.0.0.1:55277 sessionTimeout=10000 watcher=org.apache.solr.common.cloud.ConnectionManager@1ca332c
[junit4:junit4]   2> 161 T20 oascc.ConnectionManager.waitForConnected Waiting for client to connect to ZooKeeper
[junit4:junit4]   2> 164 T26 oaz.ClientCnxn$SendThread.logStartConnect Opening socket connection to server localhost.localdomain/127.0.0.1:55277. Will not attempt to authenticate using SASL (access denied ("javax.security.auth.AuthPermission" "getLoginConfiguration"))
[junit4:junit4]   2> 166 T26 oaz.ClientCnxn$SendThread.primeConnection Socket connection established to localhost.localdomain/127.0.0.1:55277, initiating session
[junit4:junit4]   2> 654 T22 oazs.NIOServerCnxnFactory.run Accepted socket connection from /127.0.0.1:40844
[junit4:junit4]   2> 662 T22 oazs.ZooKeeperServer.processConnectRequest Client attempting to establish new session at /127.0.0.1:40844
[junit4:junit4]   2> 666 T24 oazsp.FileTxnLog.append Creating new log file: log.1
[junit4:junit4]   2> 678 T24 oazs.ZooKeeperServer.finishSessionInit Established session 0x13d9a73b95e0000 with negotiated timeout 10000 for client /127.0.0.1:40844
[junit4:junit4]   2> 679 T26 oaz.ClientCnxn$SendThread.onConnected Session establishment complete on server localhost.localdomain/127.0.0.1:55277, sessionid = 0x13d9a73b95e0000, negotiated timeout = 10000
[junit4:junit4]   2> 681 T27 oascc.ConnectionManager.process Watcher org.apache.solr.common.cloud.ConnectionManager@1ca332c name:ZooKeeperConnection Watcher:127.0.0.1:55277 got event WatchedEvent state:SyncConnected type:None path:null path:null type:None
[junit4:junit4]   2> 681 T20 oascc.ConnectionManager.waitForConnected Client is connected to ZooKeeper
[junit4:junit4]   2> 683 T20 oascc.SolrZkClient.makePath makePath: /solr
[junit4:junit4]   2> 708 T25 oazs.PrepRequestProcessor.pRequest2Txn Processed session termination for sessionid: 0x13d9a73b95e0000
[junit4:junit4]   2> 709 T27 oaz.ClientCnxn$EventThread.run EventThread shut down
[junit4:junit4]   2> 709 T20 oaz.ZooKeeper.close Session: 0x13d9a73b95e0000 closed
[junit4:junit4]   2> 710 T22 oazs.NIOServerCnxn.closeSock Closed socket connection for client /127.0.0.1:40844 which had sessionid 0x13d9a73b95e0000
[junit4:junit4]   2> 710 T20 oaz.ZooKeeper.<init> Initiating client connection, connectString=127.0.0.1:55277/solr sessionTimeout=10000 watcher=org.apache.solr.common.cloud.ConnectionManager@15058c
[junit4:junit4]   2> 711 T20 oascc.ConnectionManager.waitForConnected Waiting for client to connect to ZooKeeper
[junit4:junit4]   2> 714 T28 oaz.ClientCnxn$SendThread.logStartConnect Opening socket connection to server localhost.localdomain/127.0.0.1:55277. Will not attempt to authenticate using SASL (access denied ("javax.security.auth.AuthPermission" "getLoginConfiguration"))
[junit4:junit4]   2> 714 T28 oaz.ClientCnxn$SendThread.primeConnection Socket connection established to localhost.localdomain/127.0.0.1:55277, initiating session
[junit4:junit4]   2> 715 T22 oazs.NIOServerCnxnFactory.run Accepted socket connection from /127.0.0.1:40845
[junit4:junit4]   2> 715 T22 oazs.ZooKeeperServer.processConnectRequest Client attempting to establish new session at /127.0.0.1:40845
[junit4:junit4]   2> 716 T24 oazs.ZooKeeperServer.finishSessionInit Established session 0x13d9a73b95e0001 with negotiated timeout 10000 for client /127.0.0.1:40845
[junit4:junit4]   2> 717 T28 oaz.ClientCnxn$SendThread.onConnected Session establishment complete on server localhost.localdomain/127.0.0.1:55277, sessionid = 0x13d9a73b95e0001, negotiated timeout = 10000
[junit4:junit4]   2> 717 T29 oascc.ConnectionManager.process Watcher org.apache.solr.common.cloud.ConnectionManager@15058c name:ZooKeeperConnection Watcher:127.0.0.1:55277/solr got event WatchedEvent state:SyncConnected type:None path:null path:null type:None
[junit4:junit4]   2> 717 T20 oascc.ConnectionManager.waitForConnected Client is connected to ZooKeeper
[junit4:junit4]   2> 718 T20 oascc.SolrZkClient.makePath makePath: /collections/collection1
[junit4:junit4]   2> 722 T20 oascc.SolrZkClient.makePath makePath: /collections/collection1/shards
[junit4:junit4]   2> 725 T20 oascc.SolrZkClient.makePath makePath: /collections/control_collection
[junit4:junit4]   2> 728 T20 oascc.SolrZkClient.makePath makePath: /collections/control_collection/shards
[junit4:junit4]   2> 732 T20 oasc.AbstractZkTestCase.putConfig put /mnt/ssd/jenkins/workspace/Lucene-Solr-4.x-Linux/solr/build/solr-core/test-files/solr/collection1/conf/solrconfig-tlog.xml to /configs/conf1/solrconfig.xml
[junit4:junit4]   2> 740 T20 oascc.SolrZkClient.makePath makePath: /configs/conf1/solrconfig.xml
[junit4:junit4]   2> 745 T20 oasc.AbstractZkTestCase.putConfig put /mnt/ssd/jenkins/workspace/Lucene-Solr-4.x-Linux/solr/build/solr-core/test-files/solr/collection1/conf/schema.xml to /configs/conf1/schema.xml
[junit4:junit4]   2> 746 T20 oascc.SolrZkClient.makePath makePath: /configs/conf1/schema.xml
[junit4:junit4]   2> 750 T20 oasc.AbstractZkTestCase.putConfig put /mnt/ssd/jenkins/workspace/Lucene-Solr-4.x-Linux/solr/build/solr-core/test-files/solr/collection1/conf/stopwords.txt to /configs/conf1/stopwords.txt
[junit4:junit4]   2> 751 T20 oascc.SolrZkClient.makePath makePath: /configs/conf1/stopwords.txt
[junit4:junit4]   2> 755 T20 oasc.AbstractZkTestCase.putConfig put /mnt/ssd/jenkins/workspace/Lucene-Solr-4.x-Linux/solr/build/solr-core/test-files/solr/collection1/conf/protwords.txt to /configs/conf1/protwords.txt
[junit4:junit4]   2> 755 T20 oascc.SolrZkClient.makePath makePath: /configs/conf1/protwords.txt
[junit4:junit4]   2> 759 T20 oasc.AbstractZkTestCase.putConfig put /mnt/ssd/jenkins/workspace/Lucene-Solr-4.x-Linux/solr/build/solr-core/test-files/solr/collection1/conf/currency.xml to /configs/conf1/currency.xml
[junit4:junit4]   2> 759 T20 oascc.SolrZkClient.makePath makePath: /configs/conf1/currency.xml
[junit4:junit4]   2> 762 T20 oasc.AbstractZkTestCase.putConfig put /mnt/ssd/jenkins/workspace/Lucene-Solr-4.x-Linux/solr/build/solr-core/test-files/solr/collection1/conf/open-exchange-rates.json to /configs/conf1/open-exchange-rates.json
[junit4:junit4]   2> 763 T20 oascc.SolrZkClient.makePath makePath: /configs/conf1/open-exchange-rates.json
[junit4:junit4]   2> 766 T20 oasc.AbstractZkTestCase.putConfig put /mnt/ssd/jenkins/workspace/Lucene-Solr-4.x-Linux/solr/build/solr-core/test-files/solr/collection1/conf/mapping-ISOLatin1Accent.txt to /configs/conf1/mapping-ISOLatin1Accent.txt
[junit4:junit4]   2> 767 T20 oascc.SolrZkClient.makePath makePath: /configs/conf1/mapping-ISOLatin1Accent.txt
[junit4:junit4]   2> 771 T20 oasc.AbstractZkTestCase.putConfig put /mnt/ssd/jenkins/workspace/Lucene-Solr-4.x-Linux/solr/build/solr-core/test-files/solr/collection1/conf/old_synonyms.txt to /configs/conf1/old_synonyms.txt
[junit4:junit4]   2> 772 T20 oascc.SolrZkClient.makePath makePath: /configs/conf1/old_synonyms.txt
[junit4:junit4]   2> 775 T20 oasc.AbstractZkTestCase.putConfig put /mnt/ssd/jenkins/workspace/Lucene-Solr-4.x-Linux/solr/build/solr-core/test-files/solr/collection1/conf/synonyms.txt to /configs/conf1/synonyms.txt
[junit4:junit4]   2> 776 T20 oascc.SolrZkClient.makePath makePath: /configs/conf1/synonyms.txt
[junit4:junit4]   2> 779 T25 oazs.PrepRequestProcessor.pRequest2Txn Processed session termination for sessionid: 0x13d9a73b95e0001
[junit4:junit4]   2> 780 T29 oaz.ClientCnxn$EventThread.run EventThread shut down
[junit4:junit4]   2> 780 T20 oaz.ZooKeeper.close Session: 0x13d9a73b95e0001 closed
[junit4:junit4]   2> 780 T22 oazs.NIOServerCnxn.closeSock Closed socket connection for client /127.0.0.1:40845 which had sessionid 0x13d9a73b95e0001
[junit4:junit4]   2> 988 T20 oejs.Server.doStart jetty-8.1.8.v20121106
[junit4:junit4]   2> 1078 T20 oejs.AbstractConnector.doStart Started SelectChannelConnector@127.0.0.1:60986
[junit4:junit4]   2> 1107 T20 oass.SolrDispatchFilter.init SolrDispatchFilter.init()
[junit4:junit4]   2> 1108 T20 oasc.SolrResourceLoader.locateSolrHome JNDI not configured for solr (NoInitialContextEx)
[junit4:junit4]   2> 1108 T20 oasc.SolrResourceLoader.locateSolrHome using system property solr.solr.home: /mnt/ssd/jenkins/workspace/Lucene-Solr-4.x-Linux/solr/build/solr-core/test/J0/./org.apache.solr.cloud.RecoveryZkTest-controljetty-1364095908875
[junit4:junit4]   2> 1108 T20 oasc.CoreContainer$Initializer.initialize looking for solr config file: /mnt/ssd/jenkins/workspace/Lucene-Solr-4.x-Linux/solr/build/solr-core/test/J0/./org.apache.solr.cloud.RecoveryZkTest-controljetty-1364095908875/solr.xml
[junit4:junit4]   2> 1109 T20 oasc.CoreContainer.<init> New CoreContainer 31682893
[junit4:junit4]   2> 1109 T20 oasc.CoreContainer.load Loading CoreContainer using Solr Home: '/mnt/ssd/jenkins/workspace/Lucene-Solr-4.x-Linux/solr/build/solr-core/test/J0/./org.apache.solr.cloud.RecoveryZkTest-controljetty-1364095908875/'
[junit4:junit4]   2> 1110 T20 oasc.SolrResourceLoader.<init> new SolrResourceLoader for directory: '/mnt/ssd/jenkins/workspace/Lucene-Solr-4.x-Linux/solr/build/solr-core/test/J0/./org.apache.solr.cloud.RecoveryZkTest-controljetty-1364095908875/'
[junit4:junit4]   2> 1152 T20 oashc.HttpShardHandlerFactory.getParameter Setting socketTimeout to: 120000
[junit4:junit4]   2> 1153 T20 oashc.HttpShardHandlerFactory.getParameter Setting urlScheme to: http://
[junit4:junit4]   2> 1153 T20 oashc.HttpShardHandlerFactory.getParameter Setting connTimeout to: 15000
[junit4:junit4]   2> 1154 T20 oashc.HttpShardHandlerFactory.getParameter Setting maxConnectionsPerHost to: 20
[junit4:junit4]   2> 1154 T20 oashc.HttpShardHandlerFactory.getParameter Setting corePoolSize to: 0
[junit4:junit4]   2> 1154 T20 oashc.HttpShardHandlerFactory.getParameter Setting maximumPoolSize to: 2147483647
[junit4:junit4]   2> 1155 T20 oashc.HttpShardHandlerFactory.getParameter Setting maxThreadIdleTime to: 5
[junit4:junit4]   2> 1155 T20 oashc.HttpShardHandlerFactory.getParameter Setting sizeOfQueue to: -1
[junit4:junit4]   2> 1155 T20 oashc.HttpShardHandlerFactory.getParameter Setting fairnessPolicy to: false
[junit4:junit4]   2> 1169 T20 oascsi.HttpClientUtil.createClient Creating new http client, config:maxConnectionsPerHost=20&maxConnections=10000&socketTimeout=120000&connTimeout=15000&retry=false
[junit4:junit4]   2> 1355 T20 oasc.CoreContainer.load Registering Log Listener
[junit4:junit4]   2> 1383 T20 oasc.CoreContainer.initZooKeeper Zookeeper client=127.0.0.1:55277/solr
[junit4:junit4]   2> 1402 T20 oasc.ZkController.checkChrootPath zkHost includes chroot
[junit4:junit4]   2> 1403 T20 oaz.ZooKeeper.<init> Initiating client connection, connectString=127.0.0.1:55277 sessionTimeout=60000 watcher=org.apache.solr.common.cloud.ConnectionManager@61b426
[junit4:junit4]   2> 1404 T20 oascc.ConnectionManager.waitForConnected Waiting for client to connect to ZooKeeper
[junit4:junit4]   2> 1405 T40 oaz.ClientCnxn$SendThread.logStartConnect Opening socket connection to server localhost.localdomain/127.0.0.1:55277. Will not attempt to authenticate using SASL (access denied ("javax.security.auth.AuthPermission" "getLoginConfiguration"))
[junit4:junit4]   2> 1406 T40 oaz.ClientCnxn$SendThread.primeConnection Socket connection established to localhost.localdomain/127.0.0.1:55277, initiating session
[junit4:junit4]   2> 1406 T22 oazs.NIOServerCnxnFactory.run Accepted socket connection from /127.0.0.1:40846
[junit4:junit4]   2> 1406 T22 oazs.ZooKeeperServer.processConnectRequest Client attempting to establish new session at /127.0.0.1:40846
[junit4:junit4]   2> 1408 T24 oazs.ZooKeeperServer.finishSessionInit Established session 0x13d9a73b95e0002 with negotiated timeout 20000 for client /127.0.0.1:40846
[junit4:junit4]   2> 1408 T40 oaz.ClientCnxn$SendThread.onConnected Session establishment complete on server localhost.localdomain/127.0.0.1:55277, sessionid = 0x13d9a73b95e0002, negotiated timeout = 20000
[junit4:junit4]   2> 1408 T41 oascc.ConnectionManager.process Watcher org.apache.solr.common.cloud.ConnectionManager@61b426 name:ZooKeeperConnection Watcher:127.0.0.1:55277 got event WatchedEvent state:SyncConnected type:None path:null path:null type:None
[junit4:junit4]   2> 1409 T20 oascc.ConnectionManager.waitForConnected Client is connected to ZooKeeper
[junit4:junit4]   2> 1411 T25 oazs.PrepRequestProcessor.pRequest2Txn Processed session termination for sessionid: 0x13d9a73b95e0002
[junit4:junit4]   2> 1411 T41 oaz.ClientCnxn$EventThread.run EventThread shut down
[junit4:junit4]   2> 1411 T22 oazs.NIOServerCnxn.closeSock Closed socket connection for client /127.0.0.1:40846 which had sessionid 0x13d9a73b95e0002
[junit4:junit4]   2> 1411 T20 oaz.ZooKeeper.close Session: 0x13d9a73b95e0002 closed
[junit4:junit4]   2> 1413 T20 oascsi.HttpClientUtil.createClient Creating new http client, config:maxConnections=500&maxConnectionsPerHost=16&socketTimeout=120000&connTimeout=15000
[junit4:junit4]   2> 1418 T20 oaz.ZooKeeper.<init> Initiating client connection, connectString=127.0.0.1:55277/solr sessionTimeout=30000 watcher=org.apache.solr.common.cloud.ConnectionManager@1c5f52c
[junit4:junit4]   2> 1419 T20 oascc.ConnectionManager.waitForConnected Waiting for client to connect to ZooKeeper
[junit4:junit4]   2> 1419 T42 oaz.ClientCnxn$SendThread.logStartConnect Opening socket connection to server localhost.localdomain/127.0.0.1:55277. Will not attempt to authenticate using SASL (access denied ("javax.security.auth.AuthPermission" "getLoginConfiguration"))
[junit4:junit4]   2> 1420 T42 oaz.ClientCnxn$SendThread.primeConnection Socket connection established to localhost.localdomain/127.0.0.1:55277, initiating session
[junit4:junit4]   2> 1420 T22 oazs.NIOServerCnxnFactory.run Accepted socket connection from /127.0.0.1:40847
[junit4:junit4]   2> 1421 T22 oazs.ZooKeeperServer.processConnectRequest Client attempting to establish new session at /127.0.0.1:40847
[junit4:junit4]   2> 1422 T24 oazs.ZooKeeperServer.finishSessionInit Established session 0x13d9a73b95e0003 with negotiated timeout 20000 for client /127.0.0.1:40847
[junit4:junit4]   2> 1422 T42 oaz.ClientCnxn$SendThread.onConnected Session establishment complete on server localhost.localdomain/127.0.0.1:55277, sessionid = 0x13d9a73b95e0003, negotiated timeout = 20000
[junit4:junit4]   2> 1422 T43 oascc.ConnectionManager.process Watcher org.apache.solr.common.cloud.ConnectionManager@1c5f52c name:ZooKeeperConnection Watcher:127.0.0.1:55277/solr got event WatchedEvent state:SyncConnected type:None path:null path:null type:None
[junit4:junit4]   2> 1422 T20 oascc.ConnectionManager.waitForConnected Client is connected to ZooKeeper
[junit4:junit4]   2> 1428 T20 oascc.SolrZkClient.makePath makePath: /overseer/queue
[junit4:junit4]   2> 1433 T25 oazs.PrepRequestProcessor.pRequest Got user-level KeeperException when processing sessionid:0x13d9a73b95e0003 type:create cxid:0x7 zxid:0x1b txntype:-1 reqpath:n/a Error Path:/solr/overseer Error:KeeperErrorCode = NodeExists for /solr/overseer
[junit4:junit4]   2> 1434 T20 oascc.SolrZkClient.makePath makePath: /overseer/collection-queue-work
[junit4:junit4]   2> 1441 T20 oascc.SolrZkClient.makePath makePath: /live_nodes
[junit4:junit4]   2> 1444 T20 oasc.ZkController.createEphemeralLiveNode Register node as live in ZooKeeper:/live_nodes/127.0.0.1:60986_zr_%2Fxh
[junit4:junit4]   2> 1446 T25 oazs.PrepRequestProcessor.pRequest Got user-level KeeperException when processing sessionid:0x13d9a73b95e0003 type:delete cxid:0x12 zxid:0x1e txntype:-1 reqpath:n/a Error Path:/solr/live_nodes/127.0.0.1:60986_zr_%2Fxh Error:KeeperErrorCode = NoNode for /solr/live_nodes/127.0.0.1:60986_zr_%2Fxh
[junit4:junit4]   2> 1447 T20 oascc.SolrZkClient.makePath makePath: /live_nodes/127.0.0.1:60986_zr_%2Fxh
[junit4:junit4]   2> 1451 T20 oascc.SolrZkClient.makePath makePath: /overseer_elect/election
[junit4:junit4]   2> 1461 T25 oazs.PrepRequestProcessor.pRequest Got user-level KeeperException when processing sessionid:0x13d9a73b95e0003 type:delete cxid:0x20 zxid:0x23 txntype:-1 reqpath:n/a Error Path:/solr/overseer_elect/leader Error:KeeperErrorCode = NoNode for /solr/overseer_elect/leader
[junit4:junit4]   2> 1462 T20 oascc.SolrZkClient.makePath makePath: /overseer_elect/leader
[junit4:junit4]   2> 1465 T20 oasc.Overseer.start Overseer (id=89397389439139843-127.0.0.1:60986_zr_%2Fxh-n_0000000000) starting
[junit4:junit4]   2> 1466 T25 oazs.PrepRequestProcessor.pRequest Got user-level KeeperException when processing sessionid:0x13d9a73b95e0003 type:create cxid:0x25 zxid:0x25 txntype:-1 reqpath:n/a Error Path:/solr/overseer Error:KeeperErrorCode = NodeExists for /solr/overseer
[junit4:junit4]   2> 1473 T25 oazs.PrepRequestProcessor.pRequest Got user-level KeeperException when processing sessionid:0x13d9a73b95e0003 type:create cxid:0x26 zxid:0x26 txntype:-1 reqpath:n/a Error Path:/solr/overseer Error:KeeperErrorCode = NodeExists for /solr/overseer
[junit4:junit4]   2> 1475 T25 oazs.PrepRequestProcessor.pRequest Got user-level KeeperException when processing sessionid:0x13d9a73b95e0003 type:create cxid:0x28 zxid:0x27 txntype:-1 reqpath:n/a Error Path:/solr/overseer Error:KeeperErrorCode = NodeExists for /solr/overseer
[junit4:junit4]   2> 1476 T20 oascc.SolrZkClient.makePath makePath: /overseer/queue-work
[junit4:junit4]   2> 1484 T25 oazs.PrepRequestProcessor.pRequest Got user-level KeeperException when processing sessionid:0x13d9a73b95e0003 type:create cxid:0x2e zxid:0x29 txntype:-1 reqpath:n/a Error Path:/solr/overseer Error:KeeperErrorCode = NodeExists for /solr/overseer
[junit4:junit4]   2> 1487 T45 oasc.OverseerCollectionProcessor.run Process current queue of collection creations
[junit4:junit4]   2> 1487 T20 oascc.SolrZkClient.makePath makePath: /clusterstate.json
[junit4:junit4]   2> 1490 T20 oascc.SolrZkClient.makePath makePath: /aliases.json
[junit4:junit4]   2> 1493 T20 oascc.ZkStateReader.createClusterStateWatchersAndUpdate Updating cluster state from ZooKeeper... 
[junit4:junit4]   2> 1499 T44 oasc.Overseer$ClusterStateUpdater.run Starting to work on the main queue
[junit4:junit4]   2> 1513 T46 oasc.CoreContainer.create Creating SolrCore 'collection1' using instanceDir: /mnt/ssd/jenkins/workspace/Lucene-Solr-4.x-Linux/solr/build/solr-core/test/J0/./org.apache.solr.cloud.RecoveryZkTest-controljetty-1364095908875/collection1
[junit4:junit4]   2> 1513 T46 oasc.ZkController.createCollectionZkNode Check for collection zkNode:control_collection
[junit4:junit4]   2> 1514 T46 oasc.ZkController.createCollectionZkNode Collection zkNode exists
[junit4:junit4]   2> 1514 T46 oasc.ZkController.readConfigName Load collection config from:/collections/control_collection
[junit4:junit4]   2> 1518 T46 oasc.SolrResourceLoader.<init> new SolrResourceLoader for directory: '/mnt/ssd/jenkins/workspace/Lucene-Solr-4.x-Linux/solr/build/solr-core/test/J0/./org.apache.solr.cloud.RecoveryZkTest-controljetty-1364095908875/collection1/'
[junit4:junit4]   2> 1519 T46 oasc.SolrResourceLoader.replaceClassLoader Adding 'file:/mnt/ssd/jenkins/workspace/Lucene-Solr-4.x-Linux/solr/build/solr-core/test/J0/org.apache.solr.cloud.RecoveryZkTest-controljetty-1364095908875/collection1/lib/README' to classloader
[junit4:junit4]   2> 1519 T46 oasc.SolrResourceLoader.replaceClassLoader Adding 'file:/mnt/ssd/jenkins/workspace/Lucene-Solr-4.x-Linux/solr/build/solr-core/test/J0/org.apache.solr.cloud.RecoveryZkTest-controljetty-1364095908875/collection1/lib/classes/' to classloader
[junit4:junit4]   2> 1558 T46 oasc.SolrConfig.<init> Using Lucene MatchVersion: LUCENE_43
[junit4:junit4]   2> 1606 T46 oasc.SolrConfig.<init> Loaded SolrConfig: solrconfig.xml
[junit4:junit4]   2> 1608 T46 oass.IndexSchema.readSchema Reading Solr Schema
[junit4:junit4]   2> 1622 T46 oass.IndexSchema.readSchema Schema name=test
[junit4:junit4]   2> 2163 T46 oass.OpenExchangeRatesOrgProvider.init Initialized with rates=open-exchange-rates.json, refreshInterval=1440.
[junit4:junit4]   2> 2171 T46 oass.IndexSchema.readSchema default search field in schema is text
[junit4:junit4]   2> 2176 T46 oass.IndexSchema.readSchema unique key field: id
[junit4:junit4]   2> 2199 T46 oass.FileExchangeRateProvider.reload Reloading exchange rates from file currency.xml
[junit4:junit4]   2> 2205 T46 oass.FileExchangeRateProvider.reload Reloading exchange rates from file currency.xml
[junit4:junit4]   2> 2210 T46 oass.OpenExchangeRatesOrgProvider.reload Reloading exchange rates from open-exchange-rates.json
[junit4:junit4]   2> 2211 T46 oass.OpenExchangeRatesOrgProvider$OpenExchangeRates.<init> WARNING Unknown key IMPORTANT NOTE
[junit4:junit4]   2> 2212 T46 oass.OpenExchangeRatesOrgProvider$OpenExchangeRates.<init> WARNING Expected key, got STRING
[junit4:junit4]   2> 2214 T46 oass.OpenExchangeRatesOrgProvider.reload Reloading exchange rates from open-exchange-rates.json
[junit4:junit4]   2> 2220 T46 oass.OpenExchangeRatesOrgProvider$OpenExchangeRates.<init> WARNING Unknown key IMPORTANT NOTE
[junit4:junit4]   2> 2221 T46 oass.OpenExchangeRatesOrgProvider$OpenExchangeRates.<init> WARNING Expected key, got STRING
[junit4:junit4]   2> 2221 T46 oasc.SolrCore.initDirectoryFactory org.apache.solr.core.MockDirectoryFactory
[junit4:junit4]   2> 2222 T46 oasc.SolrCore.<init> [collection1] Opening new SolrCore at /mnt/ssd/jenkins/workspace/Lucene-Solr-4.x-Linux/solr/build/solr-core/test/J0/./org.apache.solr.cloud.RecoveryZkTest-controljetty-1364095908875/collection1/, dataDir=./org.apache.solr.cloud.RecoveryZkTest-1364095908099/control/data/
[junit4:junit4]   2> 2228 T46 oasc.JmxMonitoredMap.<init> JMX monitoring is enabled. Adding Solr mbeans to JMX Server: com.sun.jmx.mbeanserver.JmxMBeanServer@313e2
[junit4:junit4]   2> 2231 T46 oasc.SolrCore.initDirectoryFactory org.apache.solr.core.MockDirectoryFactory
[junit4:junit4]   2> 2235 T46 oasc.CachingDirectoryFactory.get return new directory for ./org.apache.solr.cloud.RecoveryZkTest-1364095908099/control/data
[junit4:junit4]   2> 2235 T46 oasc.SolrCore.getNewIndexDir New index directory detected: old=null new=./org.apache.solr.cloud.RecoveryZkTest-1364095908099/control/data/index/
[junit4:junit4]   2> 2236 T46 oasc.SolrCore.initIndex WARNING [collection1] Solr index directory './org.apache.solr.cloud.RecoveryZkTest-1364095908099/control/data/index' doesn't exist. Creating new index...
[junit4:junit4]   2> 2236 T46 oasc.CachingDirectoryFactory.get return new directory for ./org.apache.solr.cloud.RecoveryZkTest-1364095908099/control/data/index
[junit4:junit4]   2> 2238 T46 oasc.SolrDeletionPolicy.onCommit SolrDeletionPolicy.onCommit: commits:num=1
[junit4:junit4]   2> 		commit{dir=MockDirWrapper(org.apache.lucene.store.RAMDirectory@15f8572 lockFactory=org.apache.lucene.store.NativeFSLockFactory@12a9572),segFN=segments_1,generation=1,filenames=[segments_1]
[junit4:junit4]   2> 2238 T46 oasc.SolrDeletionPolicy.updateCommits newest commit = 1[segments_1]
[junit4:junit4]   2> 2266 T46 oasup.UpdateRequestProcessorChain.init inserting DistributedUpdateProcessorFactory into updateRequestProcessorChain "dedupe"
[junit4:junit4]   2> 2266 T46 oasup.UpdateRequestProcessorChain.init inserting DistributedUpdateProcessorFactory into updateRequestProcessorChain "stored_sig"
[junit4:junit4]   2> 2297 T46 oasup.UpdateRequestProcessorChain.init inserting DistributedUpdateProcessorFactory into updateRequestProcessorChain "distrib-dup-test-chain-implicit"
[junit4:junit4]   2> 2299 T46 oasc.RequestHandlers.initHandlersFromConfig created standard: solr.StandardRequestHandler
[junit4:junit4]   2> 2304 T46 oasc.RequestHandlers.initHandlersFromConfig created /get: solr.RealTimeGetHandler
[junit4:junit4]   2> 2304 T46 oasc.RequestHandlers.initHandlersFromConfig adding lazy requestHandler: solr.ReplicationHandler
[junit4:junit4]   2> 2306 T46 oasc.RequestHandlers.initHandlersFromConfig created /replication: solr.ReplicationHandler
[junit4:junit4]   2> 2310 T46 oasc.RequestHandlers.initHandlersFromConfig created /update: solr.UpdateRequestHandler
[junit4:junit4]   2> 2311 T46 oasc.RequestHandlers.initHandlersFromConfig created /admin/: org.apache.solr.handler.admin.AdminHandlers
[junit4:junit4]   2> 2314 T46 oashl.XMLLoader.init xsltCacheLifetimeSeconds=60
[junit4:junit4]   2> 2317 T46 oass.SolrIndexSearcher.<init> Opening Searcher@11837d2 main
[junit4:junit4]   2> 2325 T46 oasu.UpdateHandler.clearLog Clearing tlog files, tlogDir=./org.apache.solr.cloud.RecoveryZkTest-1364095908099/control/data/tlog
[junit4:junit4]   2> 2332 T46 oasu.CommitTracker.<init> Hard AutoCommit: disabled
[junit4:junit4]   2> 2332 T46 oasu.CommitTracker.<init> Soft AutoCommit: disabled
[junit4:junit4]   2> 2355 T47 oasc.SolrCore.registerSearcher [collection1] Registered new searcher Searcher@11837d2 main{StandardDirectoryReader(segments_1:1)}
[junit4:junit4]   2> 2359 T46 oasc.ZkController.publish publishing core=collection1 state=down
[junit4:junit4]   2> 2359 T46 oasc.ZkController.publish numShards not found on descriptor - reading it from system property
[junit4:junit4]   2> 3004 T44 oascc.ZkStateReader.updateClusterState Updating cloud state from ZooKeeper... 
[junit4:junit4]   2> 3005 T44 oasc.Overseer$ClusterStateUpdater.updateState Update state numShards=1 message={
[junit4:junit4]   2> 	  "operation":"state",
[junit4:junit4]   2> 	  "collection":"control_collection",
[junit4:junit4]   2> 	  "numShards":"1",
[junit4:junit4]   2> 	  "core_node_name":"1",
[junit4:junit4]   2> 	  "state":"down",
[junit4:junit4]   2> 	  "shard":null,
[junit4:junit4]   2> 	  "node_name":"127.0.0.1:60986_zr_%2Fxh",
[junit4:junit4]   2> 	  "core":"collection1",
[junit4:junit4]   2> 	  "roles":null,
[junit4:junit4]   2> 	  "base_url":"http://127.0.0.1:60986/zr_/xh"}
[junit4:junit4]   2> 3006 T44 oasc.Overseer$ClusterStateUpdater.createCollection Create collection control_collection with numShards 1
[junit4:junit4]   2> 3009 T44 oasc.Overseer$ClusterStateUpdater.updateState Assigning new node to shard shard=shard1
[junit4:junit4]   2> 3018 T43 oascc.ZkStateReader$2.process A cluster state change: WatchedEvent state:SyncConnected type:NodeDataChanged path:/clusterstate.json, has occurred - updating... (live nodes size: 1)
[junit4:junit4]   2> 3361 T46 oasc.CoreContainer.registerCore registering core: collection1
[junit4:junit4]   2> 3361 T46 oasc.ZkController.register Register replica - core:collection1 address:http://127.0.0.1:60986/zr_/xh collection:control_collection shard:shard1
[junit4:junit4]   2> 3365 T46 oascsi.HttpClientUtil.createClient Creating new http client, config:maxConnections=10000&maxConnectionsPerHost=20&connTimeout=30000&socketTimeout=30000&retry=false
[junit4:junit4]   2> 3372 T46 oascc.SolrZkClient.makePath makePath: /collections/control_collection/leader_elect/shard1/election
[junit4:junit4]   2> 3379 T25 oazs.PrepRequestProcessor.pRequest Got user-level KeeperException when processing sessionid:0x13d9a73b95e0003 type:delete cxid:0x82 zxid:0x35 txntype:-1 reqpath:n/a Error Path:/solr/collections/control_collection/leaders Error:KeeperErrorCode = NoNode for /solr/collections/control_collection/leaders
[junit4:junit4]   2> 3380 T46 oasc.ShardLeaderElectionContext.runLeaderProcess Running the leader process.
[junit4:junit4]   2> 3381 T25 oazs.PrepRequestProcessor.pRequest Got user-level KeeperException when processing sessionid:0x13d9a73b95e0003 type:create cxid:0x83 zxid:0x36 txntype:-1 reqpath:n/a Error Path:/solr/overseer Error:KeeperErrorCode = NodeExists for /solr/overseer
[junit4:junit4]   2> 3383 T46 oasc.ShardLeaderElectionContext.waitForReplicasToComeUp Enough replicas found to continue.
[junit4:junit4]   2> 3383 T46 oasc.ShardLeaderElectionContext.runLeaderProcess I may be the new leader - try and sync
[junit4:junit4]   2> 3389 T46 oasc.SyncStrategy.sync Sync replicas to http://127.0.0.1:60986/zr_/xh/collection1/
[junit4:junit4]   2> 3390 T46 oasc.SyncStrategy.syncReplicas Sync Success - now sync replicas to me
[junit4:junit4]   2> 3390 T46 oasc.SyncStrategy.syncToMe http://127.0.0.1:60986/zr_/xh/collection1/ has no replicas
[junit4:junit4]   2> 3390 T46 oasc.ShardLeaderElectionContext.runLeaderProcess I am the new leader: http://127.0.0.1:60986/zr_/xh/collection1/
[junit4:junit4]   2> 3391 T46 oascc.SolrZkClient.makePath makePath: /collections/control_collection/leaders/shard1
[junit4:junit4]   2> 3395 T25 oazs.PrepRequestProcessor.pRequest Got user-level KeeperException when processing sessionid:0x13d9a73b95e0003 type:create cxid:0x8e zxid:0x3a txntype:-1 reqpath:n/a Error Path:/solr/overseer Error:KeeperErrorCode = NodeExists for /solr/overseer
[junit4:junit4]   2> 4523 T44 oascc.ZkStateReader.updateClusterState Updating cloud state from ZooKeeper... 
[junit4:junit4]   2> 4532 T43 oascc.ZkStateReader$2.process A cluster state change: WatchedEvent state:SyncConnected type:NodeDataChanged path:/clusterstate.json, has occurred - updating... (live nodes size: 1)
[junit4:junit4]   2> 4552 T46 oasc.ZkController.register We are http://127.0.0.1:60986/zr_/xh/collection1/ and leader is http://127.0.0.1:60986/zr_/xh/collection1/
[junit4:junit4]   2> 4553 T46 oasc.ZkController.register No LogReplay needed for core=collection1 baseURL=http://127.0.0.1:60986/zr_/xh
[junit4:junit4]   2> 4553 T46 oasc.ZkController.checkRecovery I am the leader, no recovery necessary
[junit4:junit4]   2> 4553 T46 oasc.ZkController.publish publishing core=collection1 state=active
[junit4:junit4]   2> 4554 T46 oasc.ZkController.publish numShards not found on descriptor - reading it from system property
[junit4:junit4]   2> 4556 T46 oascc.ZkStateReader.updateClusterState Updating cloud state from ZooKeeper... 
[junit4:junit4]   2> 4558 T20 oass.SolrDispatchFilter.init user.dir=/mnt/ssd/jenkins/workspace/Lucene-Solr-4.x-Linux/solr/build/solr-core/test/J0
[junit4:junit4]   2> 4559 T20 oass.SolrDispatchFilter.init SolrDispatchFilter.init() done
[junit4:junit4]   2> 4572 T20 oascsi.HttpClientUtil.createClient Creating new http client, config:maxConnections=128&maxConnectionsPerHost=32&followRedirects=false
[junit4:junit4]   2> 4578 T20 oascsi.HttpClientUtil.createClient Creating new http client, config:
[junit4:junit4]   2> 4579 T20 oaz.ZooKeeper.<init> Initiating client connection, connectString=127.0.0.1:55277/solr sessionTimeout=10000 watcher=org.apache.solr.common.cloud.ConnectionManager@834bb9
[junit4:junit4]   2> 4580 T20 oascc.ConnectionManager.waitForConnected Waiting for client to connect to ZooKeeper
[junit4:junit4]   2> 4581 T49 oaz.ClientCnxn$SendThread.logStartConnect Opening socket connection to server localhost.localdomain/127.0.0.1:55277. Will not attempt to authenticate using SASL (access denied ("javax.security.auth.AuthPermission" "getLoginConfiguration"))
[junit4:junit4]   2> 4581 T49 oaz.ClientCnxn$SendThread.primeConnection Socket connection established to localhost.localdomain/127.0.0.1:55277, initiating session
[junit4:junit4]   2> 4581 T22 oazs.NIOServerCnxnFactory.run Accepted socket connection from /127.0.0.1:40851
[junit4:junit4]   2> 4582 T22 oazs.ZooKeeperServer.processConnectRequest Client attempting to establish new session at /127.0.0.1:40851
[junit4:junit4]   2> 4583 T24 oazs.ZooKeeperServer.finishSessionInit Established session 0x13d9a73b95e0004 with negotiated timeout 10000 for client /127.0.0.1:40851
[junit4:junit4]   2> 4583 T49 oaz.ClientCnxn$SendThread.onConnected Session establishment complete on server localhost.localdomain/127.0.0.1:55277, sessionid = 0x13d9a73b95e0004, negotiated timeout = 10000
[junit4:junit4]   2> 4583 T50 oascc.ConnectionManager.process Watcher org.apache.solr.common.cloud.ConnectionManager@834bb9 name:ZooKeeperConnection Watcher:127.0.0.1:55277/solr got event WatchedEvent state:SyncConnected type:None path:null path:null type:None
[junit4:junit4]   2> 4584 T20 oascc.ConnectionManager.waitForConnected Client is connected to ZooKeeper
[junit4:junit4]   2> 4585 T20 oascc.ZkStateReader.createClusterStateWatchersAndUpdate Updating cluster state from ZooKeeper... 
[junit4:junit4]   2> 4589 T20 oasc.ChaosMonkey.monkeyLog monkey: init - expire sessions:true cause connection loss:true
[junit4:junit4]   2> 4651 T20 oejs.Server.doStart jetty-8.1.8.v20121106
[junit4:junit4]   2> 4653 T20 oejs.AbstractConnector.doStart Started SelectChannelConnector@127.0.0.1:46114
[junit4:junit4]   2> 4654 T20 oass.SolrDispatchFilter.init SolrDispatchFilter.init()
[junit4:junit4]   2> 4654 T20 oasc.SolrResourceLoader.locateSolrHome JNDI not configured for solr (NoInitialContextEx)
[junit4:junit4]   2> 4655 T20 oasc.SolrResourceLoader.locateSolrHome using system property solr.solr.home: /mnt/ssd/jenkins/workspace/Lucene-Solr-4.x-Linux/solr/build/solr-core/test/J0/./org.apache.solr.cloud.RecoveryZkTest-jetty1-1364095912684
[junit4:junit4]   2> 4655 T20 oasc.CoreContainer$Initializer.initialize looking for solr config file: /mnt/ssd/jenkins/workspace/Lucene-Solr-4.x-Linux/solr/build/solr-core/test/J0/./org.apache.solr.cloud.RecoveryZkTest-jetty1-1364095912684/solr.xml
[junit4:junit4]   2> 4655 T20 oasc.CoreContainer.<init> New CoreContainer 27837168
[junit4:junit4]   2> 4656 T20 oasc.CoreContainer.load Loading CoreContainer using Solr Home: '/mnt/ssd/jenkins/workspace/Lucene-Solr-4.x-Linux/solr/build/solr-core/test/J0/./org.apache.solr.cloud.RecoveryZkTest-jetty1-1364095912684/'
[junit4:junit4]   2> 4656 T20 oasc.SolrResourceLoader.<init> new SolrResourceLoader for directory: '/mnt/ssd/jenkins/workspace/Lucene-Solr-4.x-Linux/solr/build/solr-core/test/J0/./org.apache.solr.cloud.RecoveryZkTest-jetty1-1364095912684/'
[junit4:junit4]   2> 4681 T20 oashc.HttpShardHandlerFactory.getParameter Setting socketTimeout to: 120000
[junit4:junit4]   2> 4682 T20 oashc.HttpShardHandlerFactory.getParameter Setting urlScheme to: http://
[junit4:junit4]   2> 4682 T20 oashc.HttpShardHandlerFactory.getParameter Setting connTimeout to: 15000
[junit4:junit4]   2> 4682 T20 oashc.HttpShardHandlerFactory.getParameter Setting maxConnectionsPerHost to: 20
[junit4:junit4]   2> 4683 T20 oashc.HttpShardHandlerFactory.getParameter Setting corePoolSize to: 0
[junit4:junit4]   2> 4683 T20 oashc.HttpShardHandlerFactory.getParameter Setting maximumPoolSize to: 2147483647
[junit4:junit4]   2> 4683 T20 oashc.HttpShardHandlerFactory.getParameter Setting maxThreadIdleTime to: 5
[junit4:junit4]   2> 4684 T20 oashc.HttpShardHandlerFactory.getParameter Setting sizeOfQueue to: -1
[junit4:junit4]   2> 4684 T20 oashc.HttpShardHandlerFactory.getParameter Setting fairnessPolicy to: false
[junit4:junit4]   2> 4685 T20 oascsi.HttpClientUtil.createClient Creating new http client, config:maxConnectionsPerHost=20&maxConnections=10000&socketTimeout=120000&connTimeout=15000&retry=false
[junit4:junit4]   2> 4694 T20 oasc.CoreContainer.load Registering Log Listener
[junit4:junit4]   2> 4709 T20 oasc.CoreContainer.initZooKeeper Zookeeper client=127.0.0.1:55277/solr
[junit4:junit4]   2> 4710 T20 oasc.ZkController.checkChrootPath zkHost includes chroot
[junit4:junit4]   2> 4710 T20 oaz.ZooKeeper.<init> Initiating client connection, connectString=127.0.0.1:55277 sessionTimeout=60000 watcher=org.apache.solr.common.cloud.ConnectionManager@1a6e5e2
[junit4:junit4]   2> 4711 T20 oascc.ConnectionManager.waitForConnected Waiting for client to connect to ZooKeeper
[junit4:junit4]   2> 4711 T60 oaz.ClientCnxn$SendThread.logStartConnect Opening socket connection to server localhost.localdomain/127.0.0.1:55277. Will not attempt to authenticate using SASL (access denied ("javax.security.auth.AuthPermission" "getLoginConfiguration"))
[junit4:junit4]   2> 4712 T60 oaz.ClientCnxn$SendThread.primeConnection Socket connection established to localhost.localdomain/127.0.0.1:55277, initiating session
[junit4:junit4]   2> 4712 T22 oazs.NIOServerCnxnFactory.run Accepted socket connection from /127.0.0.1:40852
[junit4:junit4]   2> 4712 T22 oazs.ZooKeeperServer.processConnectRequest Client attempting to establish new session at /127.0.0.1:40852
[junit4:junit4]   2> 4713 T24 oazs.ZooKeeperServer.finishSessionInit Established session 0x13d9a73b95e0005 with negotiated timeout 20000 for client /127.0.0.1:40852
[junit4:junit4]   2> 4713 T60 oaz.ClientCnxn$SendThread.onConnected Session establishment complete on server localhost.localdomain/127.0.0.1:55277, sessionid = 0x13d9a73b95e0005, negotiated timeout = 20000
[junit4:junit4]   2> 4714 T61 oascc.ConnectionManager.process Watcher org.apache.solr.common.cloud.ConnectionManager@1a6e5e2 name:ZooKeeperConnection Watcher:127.0.0.1:55277 got event WatchedEvent state:SyncConnected type:None path:null path:null type:None
[junit4:junit4]   2> 4714 T20 oascc.ConnectionManager.waitForConnected Client is connected to ZooKeeper
[junit4:junit4]   2> 4715 T25 oazs.PrepRequestProcessor.pRequest2Txn Processed session termination for sessionid: 0x13d9a73b95e0005
[junit4:junit4]   2> 4716 T61 oaz.ClientCnxn$EventThread.run EventThread shut down
[junit4:junit4]   2> 4716 T20 oaz.ZooKeeper.close Session: 0x13d9a73b95e0005 closed
[junit4:junit4]   2> 4716 T22 oazs.NIOServerCnxn.closeSock Closed socket connection for client /127.0.0.1:40852 which had sessionid 0x13d9a73b95e0005
[junit4:junit4]   2> 4717 T20 oascsi.HttpClientUtil.createClient Creating new http client, config:maxConnections=500&maxConnectionsPerHost=16&socketTimeout=120000&connTimeout=15000
[junit4:junit4]   2> 4720 T20 oaz.ZooKeeper.<init> Initiating client connection, connectString=127.0.0.1:55277/solr sessionTimeout=30000 watcher=org.apache.solr.common.cloud.ConnectionManager@29070b
[junit4:junit4]   2> 4721 T20 oascc.ConnectionManager.waitForConnected Waiting for client to connect to ZooKeeper
[junit4:junit4]   2> 4721 T62 oaz.ClientCnxn$SendThread.logStartConnect Opening socket connection to server localhost.localdomain/127.0.0.1:55277. Will not attempt to authenticate using SASL (access denied ("javax.security.auth.AuthPermission" "getLoginConfiguration"))
[junit4:junit4]   2> 4722 T62 oaz.ClientCnxn$SendThread.primeConnection Socket connection established to localhost.localdomain/127.0.0.1:55277, initiating session
[junit4:junit4]   2> 4722 T22 oazs.NIOServerCnxnFactory.run Accepted socket connection from /127.0.0.1:40853
[junit4:junit4]   2> 4722 T22 oazs.ZooKeeperServer.processConnectRequest Client attempting to establish new session at /127.0.0.1:40853
[junit4:junit4]   2> 4723 T24 oazs.ZooKeeperServer.finishSessionInit Established session 0x13d9a73b95e0006 with negotiated timeout 20000 for client /127.0.0.1:40853
[junit4:junit4]   2> 4723 T62 oaz.ClientCnxn$SendThread.onConnected Session establishment complete on server localhost.localdomain/127.0.0.1:55277, sessionid = 0x13d9a73b95e0006, negotiated timeout = 20000
[junit4:junit4]   2> 4724 T63 oascc.ConnectionManager.process Watcher org.apache.solr.common.cloud.ConnectionManager@29070b name:ZooKeeperConnection Watcher:127.0.0.1:55277/solr got event WatchedEvent state:SyncConnected type:None path:null path:null type:None
[junit4:junit4]   2> 4724 T20 oascc.ConnectionManager.waitForConnected Client is connected to ZooKeeper
[junit4:junit4]   2> 4725 T25 oazs.PrepRequestProcessor.pRequest Got user-level KeeperException when processing sessionid:0x13d9a73b95e0006 type:create cxid:0x1 zxid:0x48 txntype:-1 reqpath:n/a Error Path:/solr/overseer Error:KeeperErrorCode = NodeExists for /solr/overseer
[junit4:junit4]   2> 4726 T25 oazs.PrepRequestProcessor.pRequest Got user-level KeeperException when processing sessionid:0x13d9a73b95e0006 type:create cxid:0x3 zxid:0x49 txntype:-1 reqpath:n/a Error Path:/solr/overseer Error:KeeperErrorCode = NodeExists for /solr/overseer
[junit4:junit4]   2> 4729 T20 oascc.ZkStateReader.createClusterStateWatchersAndUpdate Updating cluster state from ZooKeeper... 
[junit4:junit4]   2> 5732 T20 oasc.ZkController.createEphemeralLiveNode Register node as live in ZooKeeper:/live_nodes/127.0.0.1:46114_zr_%2Fxh
[junit4:junit4]   2> 5733 T25 oazs.PrepRequestProcessor.pRequest Got user-level KeeperException when processing sessionid:0x13d9a73b95e0006 type:delete cxid:0xd zxid:0x4a txntype:-1 reqpath:n/a Error Path:/solr/live_nodes/127.0.0.1:46114_zr_%2Fxh Error:KeeperErrorCode = NoNode for /solr/live_nodes/127.0.0.1:46114_zr_%2Fxh
[junit4:junit4]   2> 5734 T20 oascc.SolrZkClient.makePath makePath: /live_nodes/127.0.0.1:46114_zr_%2Fxh
[junit4:junit4]   2> 5737 T50 oascc.ZkStateReader$3.process Updating live nodes... (2)
[junit4:junit4]   2> 5737 T63 oascc.ZkStateReader$3.process Updating live nodes... (2)
[junit4:junit4]   2> 5737 T43 oascc.ZkStateReader$3.process Updating live nodes... (2)
[junit4:junit4]   2> 5738 T43 oascc.ZkStateReader$2.process A cluster state change: WatchedEvent state:SyncConnected type:NodeChildrenChanged path:/live_nodes, has occurred - updating... (live nodes size: 2)
[junit4:junit4]   2> 5744 T64 oasc.CoreContainer.create Creating SolrCore 'collection1' using instanceDir: /mnt/ssd/jenkins/workspace/Lucene-Solr-4.x-Linux/solr/build/solr-core/test/J0/./org.apache.solr.cloud.RecoveryZkTest-jetty1-1364095912684/collection1
[junit4:junit4]   2> 5744 T64 oasc.ZkController.createCollectionZkNode Check for collection zkNode:collection1
[junit4:junit4]   2> 5745 T64 oasc.ZkController.createCollectionZkNode Collection zkNode exists
[junit4:junit4]   2> 5745 T64 oasc.ZkController.readConfigName Load collection config from:/collections/collection1
[junit4:junit4]   2> 5746 T64 oasc.SolrResourceLoader.<init> new SolrResourceLoader for directory: '/mnt/ssd/jenkins/workspace/Lucene-Solr-4.x-Linux/solr/build/solr-core/test/J0/./org.apache.solr.cloud.RecoveryZkTest-jetty1-1364095912684/collection1/'
[junit4:junit4]   2> 5747 T64 oasc.SolrResourceLoader.replaceClassLoader Adding 'file:/mnt/ssd/jenkins/workspace/Lucene-Solr-4.x-Linux/solr/build/solr-core/test/J0/org.apache.solr.cloud.RecoveryZkTest-jetty1-1364095912684/collection1/lib/README' to classloader
[junit4:junit4]   2> 5747 T64 oasc.SolrResourceLoader.replaceClassLoader Adding 'file:/mnt/ssd/jenkins/workspace/Lucene-Solr-4.x-Linux/solr/build/solr-core/test/J0/org.apache.solr.cloud.RecoveryZkTest-jetty1-1364095912684/collection1/lib/classes/' to classloader
[junit4:junit4]   2> 5783 T64 oasc.SolrConfig.<init> Using Lucene MatchVersion: LUCENE_43
[junit4:junit4]   2> 5845 T64 oasc.SolrConfig.<init> Loaded SolrConfig: solrconfig.xml
[junit4:junit4]   2> 5846 T64 oass.IndexSchema.readSchema Reading Solr Schema
[junit4:junit4]   2> 5860 T64 oass.IndexSchema.readSchema Schema name=test
[junit4:junit4]   2> 6039 T44 oascc.ZkStateReader.updateClusterState Updating cloud state from ZooKeeper... 
[junit4:junit4]   2> 6040 T44 oasc.Overseer$ClusterStateUpdater.updateState Update state numShards=1 message={
[junit4:junit4]   2> 	  "operation":"state",
[junit4:junit4]   2> 	  "collection":"control_collection",
[junit4:junit4]   2> 	  "numShards":"1",
[junit4:junit4]   2> 	  "core_node_name":"1",
[junit4:junit4]   2> 	  "state":"active",
[junit4:junit4]   2> 	  "shard":"shard1",
[junit4:junit4]   2> 	  "node_name":"127.0.0.1:60986_zr_%2Fxh",
[junit4:junit4]   2> 	  "core":"collection1",
[junit4:junit4]   2> 	  "roles":null,
[junit4:junit4]   2> 	  "base_url":"http://127.0.0.1:60986/zr_/xh"}
[junit4:junit4]   2> 6052 T50 oascc.ZkStateReader$2.process A cluster state change: WatchedEvent state:SyncConnected type:NodeDataChanged path:/clusterstate.json, has occurred - updating... (live nodes size: 2)
[junit4:junit4]   2> 6053 T43 oascc.ZkStateReader$2.process A cluster state change: WatchedEvent state:SyncConnected type:NodeDataChanged path:/clusterstate.json, has occurred - updating... (live nodes size: 2)
[junit4:junit4]   2> 6053 T63 oascc.ZkStateReader$2.process A cluster state change: WatchedEvent state:SyncConnected type:NodeDataChanged path:/clusterstate.json, has occurred - updating... (live nodes size: 2)
[junit4:junit4]   2> 6452 T64 oass.OpenExchangeRatesOrgProvider.init Initialized with rates=open-exchange-rates.json, refreshInterval=1440.
[junit4:junit4]   2> 6461 T64 oass.IndexSchema.readSchema default search field in schema is text
[junit4:junit4]   2> 6464 T64 oass.IndexSchema.readSchema unique key field: id
[junit4:junit4]   2> 6484 T64 oass.FileExchangeRateProvider.reload Reloading exchange rates from file currency.xml
[junit4:junit4]   2> 6493 T64 oass.FileExchangeRateProvider.reload Reloading exchange rates from file currency.xml
[junit4:junit4]   2> 6497 T64 oass.OpenExchangeRatesOrgProvider.reload Reloading exchange rates from open-exchange-rates.json
[junit4:junit4]   2> 6498 T64 oass.OpenExchangeRatesOrgProvider$OpenExchangeRates.<init> WARNING Unknown key IMPORTANT NOTE
[junit4:junit4]   2> 6498 T64 oass.OpenExchangeRatesOrgProvider$OpenExchangeRates.<init> WARNING Expected key, got STRING
[junit4:junit4]   2> 6499 T64 oass.OpenExchangeRatesOrgProvider.reload Reloading exchange rates from open-exchange-rates.json
[junit4:junit4]   2> 6500 T64 oass.OpenExchangeRatesOrgProvider$OpenExchangeRates.<init> WARNING Unknown key IMPORTANT NOTE
[junit4:junit4]   2> 6500 T64 oass.OpenExchangeRatesOrgProvider$OpenExchangeRates.<init> WARNING Expected key, got STRING
[junit4:junit4]   2> 6500 T64 oasc.SolrCore.initDirectoryFactory org.apache.solr.core.MockDirectoryFactory
[junit4:junit4]   2> 6500 T64 oasc.SolrCore.<init> [collection1] Opening new SolrCore at /mnt/ssd/jenkins/workspace/Lucene-Solr-4.x-Linux/solr/build/solr-core/test/J0/./org.apache.solr.cloud.RecoveryZkTest-jetty1-1364095912684/collection1/, dataDir=./org.apache.solr.cloud.RecoveryZkTest-1364095908099/jetty1/
[junit4:junit4]   2> 6501 T64 oasc.JmxMonitoredMap.<init> JMX monitoring is enabled. Adding Solr mbeans to JMX Server: com.sun.jmx.mbeanserver.JmxMBeanServer@313e2
[junit4:junit4]   2> 6501 T64 oasc.SolrCore.initDirectoryFactory org.apache.solr.core.MockDirectoryFactory
[junit4:junit4]   2> 6502 T64 oasc.CachingDirectoryFactory.get return new directory for ./org.apache.solr.cloud.RecoveryZkTest-1364095908099/jetty1
[junit4:junit4]   2> 6502 T64 oasc.SolrCore.getNewIndexDir New index directory detected: old=null new=./org.apache.solr.cloud.RecoveryZkTest-1364095908099/jetty1/index/
[junit4:junit4]   2> 6502 T64 oasc.SolrCore.initIndex WARNING [collection1] Solr index directory './org.apache.solr.cloud.RecoveryZkTest-1364095908099/jetty1/index' doesn't exist. Creating new index...
[junit4:junit4]   2> 6502 T64 oasc.CachingDirectoryFactory.get return new directory for ./org.apache.solr.cloud.RecoveryZkTest-1364095908099/jetty1/index
[junit4:junit4]   2> 6504 T64 oasc.SolrDeletionPolicy.onCommit SolrDeletionPolicy.onCommit: commits:num=1
[junit4:junit4]   2> 		commit{dir=MockDirWrapper(org.apache.lucene.store.RAMDirectory@efa86c lockFactory=org.apache.lucene.store.NativeFSLockFactory@d04473),segFN=segments_1,generation=1,filenames=[segments_1]
[junit4:junit4]   2> 6504 T64 oasc.SolrDeletionPolicy.updateCommits newest commit = 1[segments_1]
[junit4:junit4]   2> 6507 T64 oasup.UpdateRequestProcessorChain.init inserting DistributedUpdateProcessorFactory into updateRequestProcessorChain "dedupe"
[junit4:junit4]   2> 6507 T64 oasup.UpdateRequestProcessorChain.init inserting DistributedUpdateProcessorFactory into updateRequestProcessorChain "stored_sig"
[junit4:junit4]   2> 6507 T64 oasup.UpdateRequestProcessorChain.init inserting DistributedUpdateProcessorFactory into updateRequestProcessorChain "distrib-dup-test-chain-implicit"
[junit4:junit4]   2> 6508 T64 oasc.RequestHandlers.initHandlersFromConfig created standard: solr.StandardRequestHandler
[junit4:junit4]   2> 6509 T64 oasc.RequestHandlers.initHandlersFromConfig created /get: solr.RealTimeGetHandler
[junit4:junit4]   2> 6509 T64 oasc.RequestHandlers.initHandlersFromConfig adding lazy requestHandler: solr.ReplicationHandler
[junit4:junit4]   2> 6510 T64 oasc.RequestHandlers.initHandlersFromConfig created /replication: solr.ReplicationHandler
[junit4:junit4]   2> 6511 T64 oasc.RequestHandlers.initHandlersFromConfig created /update: solr.UpdateRequestHandler
[junit4:junit4]   2> 6511 T64 oasc.RequestHandlers.initHandlersFromConfig created /admin/: org.apache.solr.handler.admin.AdminHandlers
[junit4:junit4]   2> 6514 T64 oashl.XMLLoader.init xsltCacheLifetimeSeconds=60
[junit4:junit4]   2> 6516 T64 oass.SolrIndexSearcher.<init> Opening Searcher@10683c8 main
[junit4:junit4]   2> 6516 T64 oasu.UpdateHandler.clearLog Clearing tlog files, tlogDir=./org.apache.solr.cloud.RecoveryZkTest-1364095908099/jetty1/tlog
[junit4:junit4]   2> 6517 T64 oasu.CommitTracker.<init> Hard AutoCommit: disabled
[junit4:junit4]   2> 6517 T64 oasu.CommitTracker.<init> Soft AutoCommit: disabled
[junit4:junit4]   2> 6528 T65 oasc.SolrCore.registerSearcher [collection1] Registered new searcher Searcher@10683c8 main{StandardDirectoryReader(segments_1:1)}
[junit4:junit4]   2> 6533 T64 oasc.ZkController.publish publishing core=collection1 state=down
[junit4:junit4]   2> 6533 T64 oasc.ZkController.publish numShards not found on descriptor - reading it from system property
[junit4:junit4]   2> 7558 T44 oascc.ZkStateReader.updateClusterState Updating cloud state from ZooKeeper... 
[junit4:junit4]   2> 7559 T44 oasc.Overseer$ClusterStateUpdater.updateState Update state numShards=1 message={
[junit4:junit4]   2> 	  "operation":"state",
[junit4:junit4]   2> 	  "collection":"collection1",
[junit4:junit4]   2> 	  "numShards":"1",
[junit4:junit4]   2> 	  "core_node_name":"2",
[junit4:junit4]   2> 	  "state":"down",
[junit4:junit4]   2> 	  "shard":null,
[junit4:junit4]   2> 	  "node_name":"127.0.0.1:46114_zr_%2Fxh",
[junit4:junit4]   2> 	  "core":"collection1",
[junit4:junit4]   2> 	  "roles":null,
[junit4:junit4]   2> 	  "base_url":"http://127.0.0.1:46114/zr_/xh"}
[junit4:junit4]   2> 7559 T44 oasc.Overseer$ClusterStateUpdater.createCollection Create collection collection1 with numShards 1
[junit4:junit4]   2> 7559 T44 oasc.Overseer$ClusterStateUpdater.updateState Assigning new node to shard shard=shard1
[junit4:junit4]   2> 7565 T50 oascc.ZkStateReader$2.process A cluster state change: WatchedEvent state:SyncConnected type:NodeDataChanged path:/clusterstate.json, has occurred - updating... (live nodes size: 2)
[junit4:junit4]   2> 7565 T43 oascc.ZkStateReader$2.process A cluster state change: WatchedEvent state:SyncConnected type:NodeDataChanged path:/clusterstate.json, has occurred - updating... (live nodes size: 2)
[junit4:junit4]   2> 7565 T63 oascc.ZkStateReader$2.process A cluster state change: WatchedEvent state:SyncConnected type:NodeDataChanged path:/clusterstate.json, has occurred - updating... (live nodes size: 2)
[junit4:junit4]   2> 8535 T64 oasc.CoreContainer.registerCore registering core: collection1
[junit4:junit4]   2> 8535 T64 oasc.ZkController.register Register replica - core:collection1 address:http://127.0.0.1:46114/zr_/xh collection:collection1 shard:shard1
[junit4:junit4]   2> 8536 T64 oascc.SolrZkClient.makePath makePath: /collections/collection1/leader_elect/shard1/election
[junit4:junit4]   2> 8544 T25 oazs.PrepRequestProcessor.pRequest Got user-level KeeperException when processing sessionid:0x13d9a73b95e0006 type:delete cxid:0x4a zxid:0x5a txntype:-1 reqpath:n/a Error Path:/solr/collections/collection1/leaders Error:KeeperErrorCode = NoNode for /solr/collections/collection1/leaders
[junit4:junit4]   2> 8544 T64 oasc.ShardLeaderElectionContext.runLeaderProcess Running the leader process.
[junit4:junit4]   2> 8545 T25 oazs.PrepRequestProcessor.pRequest Got user-level KeeperException when processing sessionid:0x13d9a73b95e0006 type:create cxid:0x4b zxid:0x5b txntype:-1 reqpath:n/a Error Path:/solr/overseer Error:KeeperErrorCode = NodeExists for /solr/overseer
[junit4:junit4]   2> 8547 T64 oasc.ShardLeaderElectionContext.waitForReplicasToComeUp Enough replicas found to continue.
[junit4:junit4]   2> 8547 T64 oasc.ShardLeaderElectionContext.runLeaderProcess I may be the new leader - try and sync
[junit4:junit4]   2> 8547 T64 oasc.SyncStrategy.sync Sync replicas to http://127.0.0.1:46114/zr_/xh/collection1/
[junit4:junit4]   2> 8547 T64 oasc.SyncStrategy.syncReplicas Sync Success - now sync replicas to me
[junit4:junit4]   2> 8547 T64 oasc.SyncStrategy.syncToMe http://127.0.0.1:46114/zr_/xh/collection1/ has no replicas
[junit4:junit4]   2> 8548 T64 oasc.ShardLeaderElectionContext.runLeaderProcess I am the new leader: http://127.0.0.1:46114/zr_/xh/collection1/
[junit4:junit4]   2> 8548 T64 oascc.SolrZkClient.makePath makePath: /collections/collection1/leaders/shard1
[junit4:junit4]   2> 8574 T25 oazs.PrepRequestProcessor.pRequest Got user-level KeeperException when processing sessionid:0x13d9a73b95e0006 type:create cxid:0x56 zxid:0x5f txntype:-1 reqpath:n/a Error Path:/solr/overseer Error:KeeperErrorCode = NodeExists for /solr/overseer
[junit4:junit4]   2> 9071 T44 oascc.ZkStateReader.updateClusterState Updating cloud state from ZooKeeper... 
[junit4:junit4]   2> 9082 T63 oascc.ZkStateReader$2.process A cluster state change: WatchedEvent state:SyncConnected type:NodeDataChanged path:/clusterstate.json, has occurred - updating... (live nodes size: 2)
[junit4:junit4]   2> 9082 T43 oascc.ZkStateReader$2.process A cluster state change: WatchedEvent state:SyncConnected type:NodeDataChanged path:/clusterstate.json, has occurred - updating... (live nodes size: 2)
[junit4:junit4]   2> 9082 T50 oascc.ZkStateReader$2.process A cluster state change: WatchedEvent state:SyncConnected type:NodeDataChanged path:/clusterstate.json, has occurred - updating... (live nodes size: 2)
[junit4:junit4]   2> 9085 T64 oasc.ZkController.register We are http://127.0.0.1:46114/zr_/xh/collection1/ and leader is http://127.0.0.1:46114/zr_/xh/collection1/
[junit4:junit4]   2> 9085 T64 oasc.ZkController.register No LogReplay needed for core=collection1 baseURL=http://127.0.0.1:46114/zr_/xh
[junit4:junit4]   2> 9085 T64 oasc.ZkController.checkRecovery I am the leader, no recovery necessary
[junit4:junit4]   2> 9085 T64 oasc.ZkController.publish publishing core=collection1 state=active
[junit4:junit4]   2> 9086 T64 oasc.ZkController.publish numShards not found on descriptor - reading it from system property
[junit4:junit4]   2> 9087 T64 oascc.ZkStateReader.updateClusterState Updating cloud state from ZooKeeper... 
[junit4:junit4]   2> 9088 T20 oass.SolrDispatchFilter.init user.dir=/mnt/ssd/jenkins/workspace/Lucene-Solr-4.x-Linux/solr/build/solr-core/test/J0
[junit4:junit4]   2> 9089 T20 oass.SolrDispatchFilter.init SolrDispatchFilter.init() done
[junit4:junit4]   2> 9089 T20 oascsi.HttpClientUtil.createClient Creating new http client, config:maxConnections=128&maxConnectionsPerHost=32&followRedirects=false
[junit4:junit4]   2> 9155 T20 oejs.Server.doStart jetty-8.1.8.v20121106
[junit4:junit4]   2> 9158 T20 oejs.AbstractConnector.doStart Started SelectChannelConnector@127.0.0.1:34223
[junit4:junit4]   2> 9158 T20 oass.SolrDispatchFilter.init SolrDispatchFilter.init()
[junit4:junit4]   2> 9159 T20 oasc.SolrResourceLoader.locateSolrHome JNDI not configured for solr (NoInitialContextEx)
[junit4:junit4]   2> 9159 T20 oasc.SolrResourceLoader.locateSolrHome using system property solr.solr.home: /mnt/ssd/jenkins/workspace/Lucene-Solr-4.x-Linux/solr/build/solr-core/test/J0/./org.apache.solr.cloud.RecoveryZkTest-jetty2-1364095917190
[junit4:junit4]   2> 9160 T20 oasc.CoreContainer$Initializer.initialize looking for solr config file: /mnt/ssd/jenkins/workspace/Lucene-Solr-4.x-Linux/solr/build/solr-core/test/J0/./org.apache.solr.cloud.RecoveryZkTest-jetty2-1364095917190/solr.xml
[junit4:junit4]   2> 9160 T20 oasc.CoreContainer.<init> New CoreContainer 18630141
[junit4:junit4]   2> 9161 T20 oasc.CoreContainer.load Loading CoreContainer using Solr Home: '/mnt/ssd/jenkins/workspace/Lucene-Solr-4.x-Linux/solr/build/solr-core/test/J0/./org.apache.solr.cloud.RecoveryZkTest-jetty2-1364095917190/'
[junit4:junit4]   2> 9161 T20 oasc.SolrResourceLoader.<init> new SolrResourceLoader for directory: '/mnt/ssd/jenkins/workspace/Lucene-Solr-4.x-Linux/solr/build/solr-core/test/J0/./org.apache.solr.cloud.RecoveryZkTest-jetty2-1364095917190/'
[junit4:junit4]   2> 9184 T20 oashc.HttpShardHandlerFactory.getParameter Setting socketTimeout to: 120000
[junit4:junit4]   2> 9184 T20 oashc.HttpShardHandlerFactory.getParameter Setting urlScheme to: http://
[junit4:junit4]   2> 9184 T20 oashc.HttpShardHandlerFactory.getParameter Setting connTimeout to: 15000
[junit4:junit4]   2> 9185 T20 oashc.HttpShardHandlerFactory.getParameter Setting maxConnectionsPerHost to: 20
[junit4:junit4]   2> 9185 T20 oashc.HttpShardHandlerFactory.getParameter Setting corePoolSize to: 0
[junit4:junit4]   2> 9185 T20 oashc.HttpShardHandlerFactory.getParameter Setting maximumPoolSize to: 2147483647
[junit4:junit4]   2> 9186 T20 oashc.HttpShardHandlerFactory.getParameter Setting maxThreadIdleTime to: 5
[junit4:junit4]   2> 9186 T20 oashc.HttpShardHandlerFactory.getParameter Setting sizeOfQueue to: -1
[junit4:junit4]   2> 9186 T20 oashc.HttpShardHandlerFactory.getParameter Setting fairnessPolicy to: false
[junit4:junit4]   2> 9187 T20 oascsi.HttpClientUtil.createClient Creating new http client, config:maxConnectionsPerHost=20&maxConnections=10000&socketTimeout=120000&connTimeout=15000&retry=false
[junit4:junit4]   2> 9197 T20 oasc.CoreContainer.load Registering Log Listener
[junit4:junit4]   2> 9213 T20 oasc.CoreContainer.initZooKeeper Zookeeper client=127.0.0.1:55277/solr
[junit4:junit4]   2> 9214 T20 oasc.ZkController.checkChrootPath zkHost includes chroot
[junit4:junit4]   2> 9214 T20 oaz.ZooKeeper.<init> Initiating client connection, connectString=127.0.0.1:55277 sessionTimeout=60000 watcher=org.apache.solr.common.cloud.ConnectionManager@cdc2bd
[junit4:junit4]   2> 9215 T20 oascc.ConnectionManager.waitForConnected Waiting for client to connect to ZooKeeper
[junit4:junit4]   2> 9216 T76 oaz.ClientCnxn$SendThread.logStartConnect Opening socket connection to server localhost.localdomain/127.0.0.1:55277. Will not attempt to authenticate using SASL (access denied ("javax.security.auth.AuthPermission" "getLoginConfiguration"))
[junit4:junit4]   2> 9216 T76 oaz.ClientCnxn$SendThread.primeConnection Socket connection established to localhost.localdomain/127.0.0.1:55277, initiating session
[junit4:junit4]   2> 9217 T22 oazs.NIOServerCnxnFactory.run Accepted socket connection from /127.0.0.1:40856
[junit4:junit4]   2> 9217 T22 oazs.ZooKeeperServer.processConnectRequest Client attempting to establish new session at /127.0.0.1:40856
[junit4:junit4]   2> 9218 T24 oazs.ZooKeeperServer.finishSessionInit Established session 0x13d9a73b95e0007 with negotiated timeout 20000 for client /127.0.0.1:40856
[junit4:junit4]   2> 9218 T76 oaz.ClientCnxn$SendThread.onConnected Session establishment complete on server localhost.localdomain/127.0.0.1:55277, sessionid = 0x13d9a73b95e0007, negotiated timeout = 20000
[junit4:junit4]   2> 9220 T77 oascc.ConnectionManager.process Watcher org.apache.solr.common.cloud.ConnectionManager@cdc2bd name:ZooKeeperConnection Watcher:127.0.0.1:55277 got event WatchedEvent state:SyncConnected type:None path:null path:null type:None
[junit4:junit4]   2> 9220 T20 oascc.ConnectionManager.waitForConnected Client is connected to ZooKeeper
[junit4:junit4]   2> 9222 T25 oazs.PrepRequestProcessor.pRequest2Txn Processed session termination for sessionid: 0x13d9a73b95e0007
[junit4:junit4]   2> 9223 T77 oaz.ClientCnxn$EventThread.run EventThread shut down
[junit4:junit4]   2> 9223 T22 oazs.NIOServerCnxn.closeSock Closed socket connection for client /127.0.0.1:40856 which had sessionid 0x13d9a73b95e0007
[junit4:junit4]   2> 9222 T20 oaz.ZooKeeper.close Session: 0x13d9a73b95e0007 closed
[junit4:junit4]   2> 9223 T20 oascsi.HttpClientUtil.createClient Creating new http client, config:maxConnections=500&maxConnectionsPerHost=16&socketTimeout=120000&connTimeout=15000
[junit4:junit4]   2> 9226 T20 oaz.ZooKeeper.<init> Initiating client connection, connectString=127.0.0.1:55277/solr sessionTimeout=30000 watcher=org.apache.solr.common.cloud.ConnectionManager@b4c526
[junit4:junit4]   2> 9227 T20 oascc.ConnectionManager.waitForConnected Waiting for client to connect to ZooKeeper
[junit4:junit4]   2> 9228 T78 oaz.ClientCnxn$SendThread.logStartConnect Opening socket connection to server localhost.localdomain/127.0.0.1:55277. Will not attempt to authenticate using SASL (access denied ("javax.security.auth.AuthPermission" "getLoginConfiguration"))
[junit4:junit4]   2> 9228 T78 oaz.ClientCnxn$SendThread.primeConnection Socket connection established to localhost.localdomain/127.0.0.1:55277, initiating session
[junit4:junit4]   2> 9228 T22 oazs.NIOServerCnxnFactory.run Accepted socket connection from /127.0.0.1:40857
[junit4:junit4]   2> 9229 T22 oazs.ZooKeeperServer.processConnectRequest Client attempting to establish new session at /127.0.0.1:40857
[junit4:junit4]   2> 9230 T24 oazs.ZooKeeperServer.finishSessionInit Established session 0x13d9a73b95e0008 with negotiated timeout 20000 for client /127.0.0.1:40857
[junit4:junit4]   2> 9230 T78 oaz.ClientCnxn$SendThread.onConnected Session establishment complete on server localhost.localdomain/127.0.0.1:55277, sessionid = 0x13d9a73b95e0008, negotiated timeout = 20000
[junit4:junit4]   2> 9230 T79 oascc.ConnectionManager.process Watcher org.apache.solr.common.cloud.ConnectionManager@b4c526 name:ZooKeeperConnection Watcher:127.0.0.1:55277/solr got event WatchedEvent state:SyncConnected type:None path:null path:null type:None
[junit4:junit4]   2> 9230 T20 oascc.ConnectionManager.waitForConnected Client is connected to ZooKeeper
[junit4:junit4]   2> 9231 T25 oazs.PrepRequestProcessor.pRequest Got user-level KeeperException when processing sessionid:0x13d9a73b95e0008 type:create cxid:0x1 zxid:0x6c txntype:-1 reqpath:n/a Error Path:/solr/overseer Error:KeeperErrorCode = NodeExists for /solr/overseer
[junit4:junit4]   2> 9233 T25 oazs.PrepRequestProcessor.pRequest Got user-level KeeperException when processing sessionid:0x13d9a73b95e0008 type:create cxid:0x3 zxid:0x6d txntype:-1 reqpath:n/a Error Path:/solr/overseer Error:KeeperErrorCode = NodeExists for /solr/overseer
[junit4:junit4]   2> 9235 T20 oascc.ZkStateReader.createClusterStateWatchersAndUpdate Updating cluster state from ZooKeeper... 
[junit4:junit4]   2> 10238 T20 oasc.ZkController.createEphemeralLiveNode Register node as live in ZooKeeper:/live_nodes/127.0.0.1:34223_zr_%2Fxh
[junit4:junit4]   2> 10238 T25 oazs.PrepRequestProcessor.pRequest Got user-level KeeperException when processing sessionid:0x13d9a73b95e0008 type:delete cxid:0xd zxid:0x6e txntype:-1 reqpath:n/a Error Path:/solr/live_nodes/127.0.0.1:34223_zr_%2Fxh Error:KeeperErrorCode = NoNode for /solr/live_nodes/127.0.0.1:34223_zr_%2Fxh
[junit4:junit4]   2> 10240 T20 oascc.SolrZkClient.makePath makePath: /live_nodes/127.0.0.1:34223_zr_%2Fxh
[junit4:junit4]   2> 10242 T43 oascc.ZkStateReader$2.process A cluster state change: WatchedEvent state:SyncConnected type:NodeChildrenChanged path:/live_nodes, has occurred - updating... (live nodes size: 2)
[junit4:junit4]   2> 10242 T50 oascc.ZkStateReader$2.process A cluster state change: WatchedEvent state:SyncConnected type:NodeChildrenChanged path:/live_nodes, has occurred - updating... (live nodes size: 2)
[junit4:junit4]   2> 10244 T63 oascc.ZkStateReader$3.process Updating live nodes... (3)
[junit4:junit4]   2> 10244 T63 oascc.ZkStateReader$2.process A cluster state change: WatchedEvent state:SyncConnected type:NodeChildrenChanged path:/live_nodes, has occurred - updating... (live nodes size: 3)
[junit4:junit4]   2> 10244 T79 oascc.ZkStateReader$3.process Updating live nodes... (3)
[junit4:junit4]   2> 10245 T50 oascc.ZkStateReader$3.process Updating live nodes... (3)
[junit4:junit4]   2> 10246 T43 oascc.ZkStateReader$3.process Updating live nodes... (3)
[junit4:junit4]   2> 10254 T80 oasc.CoreContainer.create Creating SolrCore 'collection1' using instanceDir: /mnt/ssd/jenkins/workspace/Lucene-Solr-4.x-Linux/solr/build/solr-core/test/J0/./org.apache.solr.cloud.RecoveryZkTest-jetty2-1364095917190/collection1
[junit4:junit4]   2> 10254 T80 oasc.ZkController.createCollectionZkNode Check for collection zkNode:collection1
[junit4:junit4]   2> 10255 T80 oasc.ZkController.createCollectionZkNode Collection zkNode exists
[junit4:junit4]   2> 10255 T80 oasc.ZkController.readConfigName Load collection config from:/collections/collection1
[junit4:junit4]   2> 10256 T80 oasc.SolrResourceLoader.<init> new SolrResourceLoader for directory: '/mnt/ssd/jenkins/workspace/Lucene-Solr-4.x-Linux/solr/build/solr-core/test/J0/./org.apache.solr.cloud.RecoveryZkTest-jetty2-1364095917190/collection1/'
[junit4:junit4]   2> 10257 T80 oasc.SolrResourceLoader.replaceClassLoader Adding 'file:/mnt/ssd/jenkins/workspace/Lucene-Solr-4.x-Linux/solr/build/solr-core/test/J0/org.apache.solr.cloud.RecoveryZkTest-jetty2-1364095917190/collection1/lib/README' to classloader
[junit4:junit4]   2> 10257 T80 oasc.SolrResourceLoader.replaceClassLoader Adding 'file:/mnt/ssd/jenkins/workspace/Lucene-Solr-4.x-Linux/solr/build/solr-core/test/J0/org.apache.solr.cloud.RecoveryZkTest-jetty2-1364095917190/collection1/lib/classes/' to classloader
[junit4:junit4]   2> 10293 T80 oasc.SolrConfig.<init> Using Lucene MatchVersion: LUCENE_43
[junit4:junit4]   2> 10337 T80 oasc.SolrConfig.<init> Loaded SolrConfig: solrconfig.xml
[junit4:junit4]   2> 10341 T80 oass.IndexSchema.readSchema Reading Solr Schema
[junit4:junit4]   2> 10346 T80 oass.IndexSchema.readSchema Schema name=test
[junit4:junit4]   2> 10596 T44 oascc.ZkStateReader.updateClusterState Updating cloud state from ZooKeeper... 
[junit4:junit4]   2> 10597 T44 oasc.Overseer$ClusterStateUpdater.updateState Update state numShards=1 message={
[junit4:junit4]   2> 	  "operation":"state",
[junit4:junit4]   2> 	  "collection":"collection1",
[junit4:junit4]   2> 	  "numShards":"1",
[junit4:junit4]   2> 	  "core_node_name":"2",
[junit4:junit4]   2> 	  "state":"active",
[junit4:junit4]   2> 	  "shard":"shard1",
[junit4:junit4]   2> 	  "node_name":"127.0.0.1:46114_zr_%2Fxh",
[junit4:junit4]   2> 	  "core":"collection1",
[junit4:junit4]   2> 	  "roles":null,
[junit4:junit4]   2> 	  "base_url":"http://127.0.0.1:46114/zr_/xh"}
[junit4:junit4]   2> 10601 T50 oascc.ZkStateReader$2.process A cluster state change: WatchedEvent state:SyncConnected type:NodeDataChanged path:/clusterstate.json, has occurred - updating... (live nodes size: 3)
[junit4:junit4]   2> 10601 T63 oascc.ZkStateReader$2.process A cluster state change: WatchedEvent state:SyncConnected type:NodeDataChanged path:/clusterstate.json, has occurred - updating... (live nodes size: 3)
[junit4:junit4]   2> 10601 T43 oascc.ZkStateReader$2.process A cluster state change: WatchedEvent state:SyncConnected type:NodeDataChanged path:/clusterstate.json, has occurred - updating... (live nodes size: 3)
[junit4:junit4]   2> 10601 T79 oascc.ZkStateReader$2.process A cluster state change: WatchedEvent state:SyncConnected type:NodeDataChanged path:/clusterstate.json, has occurred - updating... (live nodes size: 3)
[junit4:junit4]   2> 10989 T80 oass.OpenExchangeRatesOrgProvider.init Initialized with rates=open-exchange-rates.json, refreshInterval=1440.
[junit4:junit4]   2> 10998 T80 oass.IndexSchema.readSchema default search field in schema is text
[junit4:junit4]   2> 11001 T80 oass.IndexSchema.readSchema unique key field: id
[junit4:junit4]   2> 11025 T80 oass.FileExchangeRateProvider.reload Reloading exchange rates from file currency.xml
[junit4:junit4]   2> 11029 T80 oass.FileExchangeRateProvider.reload Reloading exchange rates from file currency.xml
[junit4:junit4]   2> 11033 T80 oass.OpenExchangeRatesOrgProvider.reload Reloading exchange rates from open-exchange-rates.json
[junit4:junit4]   2> 11034 T80 oass.OpenExchangeRatesOrgProvider$OpenExchangeRates.<init> WARNING Unknown key IMPORTANT NOTE
[junit4:junit4]   2> 11034 T80 oass.OpenExchangeRatesOrgProvider$OpenExchangeRates.<init> WARNING Expected key, got STRING
[junit4:junit4]   2> 11034 T80 oass.OpenExchangeRatesOrgProvider.reload Reloading exchange rates from open-exchange-rates.json
[junit4:junit4]   2> 11035 T80 oass.OpenExchangeRatesOrgProvider$OpenExchangeRates.<init> WARNING Unknown key IMPORTANT NOTE
[junit4:junit4]   2> 11036 T80 oass.OpenExchangeRatesOrgProvider$OpenExchangeRates.<init> WARNING Expected key, got STRING
[junit4:junit4]   2> 11036 T80 oasc.SolrCore.initDirectoryFactory org.apache.solr.core.MockDirectoryFactory
[junit4:junit4]   2> 11036 T80 oasc.SolrCore.<init> [collection1] Opening new SolrCore at /mnt/ssd/jenkins/workspace/Lucene-Solr-4.x-Linux/solr/build/solr-core/test/J0/./org.apache.solr.cloud.RecoveryZkTest-jetty2-1364095917190/collection1/, dataDir=./org.apache.solr.cloud.RecoveryZkTest-1364095908099/jetty2/
[junit4:junit4]   2> 11036 T80 oasc.JmxMonitoredMap.<init> JMX monitoring is enabled. Adding Solr mbeans to JMX Server: com.sun.jmx.mbeanserver.JmxMBeanServer@313e2
[junit4:junit4]   2> 11037 T80 oasc.SolrCore.initDirectoryFactory org.apache.solr.core.MockDirectoryFactory
[junit4:junit4]   2> 11038 T80 oasc.CachingDirectoryFactory.get return new directory for ./org.apache.solr.cloud.RecoveryZkTest-1364095908099/jetty2
[junit4:junit4]   2> 11038 T80 oasc.SolrCore.getNewIndexDir New index directory detected: old=null new=./org.apache.solr.cloud.RecoveryZkTest-1364095908099/jetty2/index/
[junit4:junit4]   2> 11038 T80 oasc.SolrCore.initIndex WARNING [collection1] Solr index directory './org.apache.solr.cloud.RecoveryZkTest-1364095908099/jetty2/index' doesn't exist. Creating new index...
[junit4:junit4]   2> 11038 T80 oasc.CachingDirectoryFactory.get return new directory for ./org.apache.solr.cloud.RecoveryZkTest-1364095908099/jetty2/index
[junit4:junit4]   2> 11040 T80 oasc.SolrDeletionPolicy.onCommit SolrDeletionPolicy.onCommit: commits:num=1
[junit4:junit4]   2> 		commit{dir=MockDirWrapper(org.apache.lucene.store.RAMDirectory@875033 lockFactory=org.apache.lucene.store.NativeFSLockFactory@498300),segFN=segments_1,generation=1,filenames=[segments_1]
[junit4:junit4]   2> 11040 T80 oasc.SolrDeletionPolicy.updateCommits newest commit = 1[segments_1]
[junit4:junit4]   2> 11042 T80 oasup.UpdateRequestProcessorChain.init inserting DistributedUpdateProcessorFactory into updateRequestProcessorChain "dedupe"
[junit4:junit4]   2> 11042 T80 oasup.UpdateRequestProcessorChain.init inserting DistributedUpdateProcessorFactory into updateRequestProcessorChain "stored_sig"
[junit4:junit4]   2> 11043 T80 oasup.UpdateRequestProcessorChain.init inserting DistributedUpdateProcessorFactory into updateRequestProcessorChain "distrib-dup-test-chain-implicit"
[junit4:junit4]   2> 11044 T80 oasc.RequestHandlers.initHandlersFromConfig created standard: solr.StandardRequestHandler
[junit4:junit4]   2> 11044 T80 oasc.RequestHandlers.initHandlersFromConfig created /get: solr.RealTimeGetHandler
[junit4:junit4]   2> 11045 T80 oasc.RequestHandlers.initHandlersFromConfig adding lazy requestHandler: solr.ReplicationHandler
[junit4:junit4]   2> 11045 T80 oasc.RequestHandlers.initHandlersFromConfig created /replication: solr.ReplicationHandler
[junit4:junit4]   2> 11046 T80 oasc.RequestHandlers.initHandlersFromConfig created /update: solr.UpdateRequestHandler
[junit4:junit4]   2> 11046 T80 oasc.RequestHandlers.initHandlersFromConfig created /admin/: org.apache.solr.handler.admin.AdminHandlers
[junit4:junit4]   2> 11049 T80 oashl.XMLLoader.init xsltCacheLifetimeSeconds=60
[junit4:junit4]   2> 11053 T80 oass.SolrIndexSearcher.<init> Opening Searcher@10306db main
[junit4:junit4]   2> 11054 T80 oasu.UpdateHandler.clearLog Clearing tlog files, tlogDir=./org.apache.solr.cloud.RecoveryZkTest-1364095908099/jetty2/tlog
[junit4:junit4]   2> 11054 T80 oasu.CommitTracker.<init> Hard AutoCommit: disabled
[junit4:junit4]   2> 11054 T80 oasu.CommitTracker.<init> Soft AutoCommit: disabled
[junit4:junit4]   2> 11061 T81 oasc.SolrCore.registerSearcher [collection1] Registered new searcher Searcher@10306db main{StandardDirectoryReader(segments_1:1)}
[junit4:junit4]   2> 11063 T80 oasc.ZkController.publish publishing core=collection1 state=down
[junit4:junit4]   2> 11064 T80 oasc.ZkController.publish numShards not found on descriptor - reading it from system property
[junit4:junit4]   2> 12132 T44 oascc.ZkStateReader.updateClusterState Updating cloud state from ZooKeeper... 
[junit4:junit4]   2> 12133 T44 oasc.Overseer$ClusterStateUpdater.updateState Update state numShards=1 message={
[junit4:junit4]   2> 	  "operation":"state",
[junit4:junit4]   2> 	  "collection":"collection1",
[junit4:junit4]   2> 	  "numShards":"1",
[junit4:junit4]   2> 	  "core_node_name":"3",
[junit4:junit4]   2> 	  "state":"down",
[junit4:junit4]   2> 	  "shard":null,
[junit4:junit4]   2> 	  "node_name":"127.0.0.1:34223_zr_%2Fxh",
[junit4:junit4]   2> 	  "core":"collection1",
[junit4:junit4]   2> 	  "roles":null,
[junit4:junit4]   2> 	  "base_url":"http://127.0.0.1:34223/zr_/xh"}
[junit4:junit4]   2> 12134 T44 oasc.Overseer$ClusterStateUpdater.updateState Collection already exists with numShards=1
[junit4:junit4]   2> 12134 T44 oasc.Overseer$ClusterStateUpdater.updateState Assigning new node to shard shard=shard1
[junit4:junit4]   2> 12139 T50 oascc.ZkStateReader$2.process A cluster state change: WatchedEvent state:SyncConnected type:NodeDataChanged path:/clusterstate.json, has occurred - updating... (live nodes size: 3)
[junit4:junit4]   2> 12139 T43 oascc.ZkStateReader$2.process A cluster state change: WatchedEvent state:SyncConnected type:NodeDataChanged path:/clusterstate.json, has occurred - updating... (live nodes size: 3)
[junit4:junit4]   2> 12139 T63 oascc.ZkStateReader$2.process A cluster state change: WatchedEvent state:SyncConnected type:NodeDataChanged path:/clusterstate.json, has occurred - updating... (live nodes size: 3)
[junit4:junit4]   2> 12139 T79 oascc.ZkStateReader$2.process A cluster state change: WatchedEvent state:SyncConnected type:NodeDataChanged path:/clusterstate.json, has occurred - updating... (live nodes size: 3)
[junit4:junit4]   2> 13065 T80 oasc.CoreContainer.registerCore registering core: collection1
[junit4:junit4]   2> 13066 T80 oasc.ZkController.register Register replica - core:collection1 address:http://127.0.0.1:34223/zr_/xh collection:collection1 shard:shard1
[junit4:junit4]   2> 13070 T80 oasc.ZkController.register We are http://127.0.0.1:34223/zr_/xh/collection1/ and leader is http://127.0.0.1:46114/zr_/xh/collection1/
[junit4:junit4]   2> 13070 T80 oasc.ZkController.register No LogReplay needed for core=collection1 baseURL=http://127.0.0.1:34223/zr_/xh
[junit4:junit4]   2> 13070 T80 oasc.ZkController.checkRecovery Core needs to recover:collection1
[junit4:junit4]   2> 13071 T80 oasu.DefaultSolrCoreState.doRecovery Running recovery - first canceling any ongoing recovery
[junit4:junit4]   2> ASYNC  NEW_CORE C2 name=collection1 org.apache.solr.core.SolrCore@c6e780 url=http://127.0.0.1:34223/zr_/xh/collection1 node=127.0.0.1:34223_zr_%2Fxh C2_STATE=coll:collection1 core:collection1 props:{collection=collection1, state=down, node_name=127.0.0.1:34223_zr_%2Fxh, core=collection1, base_url=http://127.0.0.1:34223/zr_/xh}
[junit4:junit4]   2> 13074 T82 C2 P34223 oasc.RecoveryStrategy.run Starting recovery process.  core=collection1 recoveringAfterStartup=true
[junit4:junit4]   2> 13074 T80 oascc.ZkStateReader.updateClusterState Updating cloud state from ZooKeeper... 
[junit4:junit4]   2> 13075 T82 C2 P34223 oasc.RecoveryStrategy.doRecovery ###### startupVersions=[]
[junit4:junit4]   2> 13075 T82 C2 P34223 oasc.ZkController.publish publishing core=collection1 state=recovering
[junit4:junit4]   2> 13075 T82 C2 P34223 oasc.ZkController.publish numShards not found on descriptor - reading it from system property
[junit4:junit4]   2> 13076 T20 oass.SolrDispatchFilter.init user.dir=/mnt/ssd/jenkins/workspace/Lucene-Solr-4.x-Linux/solr/build/solr-core/test/J0
[junit4:junit4]   2> 13076 T20 oass.SolrDispatchFilter.init SolrDispatchFilter.init() done
[junit4:junit4]   2> 13076 T82 C2 P34223 oascsi.HttpClientUtil.createClient Creating new http client, config:maxConnections=128&maxConnectionsPerHost=32&followRedirects=false
[junit4:junit4]   2> 13076 T20 oascsi.HttpClientUtil.createClient Creating new http client, config:maxConnections=128&maxConnectionsPerHost=32&followRedirects=false
[junit4:junit4]   2> 13084 T20 oascc.ZkStateReader.updateClusterState Updating cloud state from ZooKeeper... 
[junit4:junit4]   2> ASYNC  NEW_CORE C3 name=collection1 org.apache.solr.core.SolrCore@3897ea url=http://127.0.0.1:60986/zr_/xh/collection1 node=127.0.0.1:60986_zr_%2Fxh C3_STATE=coll:control_collection core:collection1 props:{collection=control_collection, state=active, shard=shard1, node_name=127.0.0.1:60986_zr_%2Fxh, core=collection1, base_url=http://127.0.0.1:60986/zr_/xh, leader=true}
[junit4:junit4]   2> 13407 T39 C3 P60986 oasc.SolrDeletionPolicy.onInit SolrDeletionPolicy.onInit: commits:num=1
[junit4:junit4]   2> 		commit{dir=MockDirWrapper(org.apache.lucene.store.RAMDirectory@15f8572 lockFactory=org.apache.lucene.store.NativeFSLockFactory@12a9572),segFN=segments_1,generation=1,filenames=[segments_1]
[junit4:junit4]   2> 13408 T39 C3 P60986 oasc.SolrDeletionPolicy.updateCommits newest commit = 1[segments_1]
[junit4:junit4]   2> 13442 T39 C3 P60986 /update {version=2&wt=javabin} {add=[1 (1430358244982784000)]} 0 52
[junit4:junit4]   2> 13442 T38 C3 P60986 /update {version=2&wt=javabin} {add=[10001 (1430358244982784001)]} 0 52
[junit4:junit4]   2> ASYNC  NEW_CORE C4 name=collection1 org.apache.solr.core.SolrCore@17fe935 url=http://127.0.0.1:46114/zr_/xh/collection1 node=127.0.0.1:46114_zr_%2Fxh C4_STATE=coll:collection1 core:collection1 props:{collection=collection1, state=active, shard=shard1, node_name=127.0.0.1:46114_zr_%2Fxh, core=collection1, base_url=http://127.0.0.1:46114/zr_/xh, leader=true}
[junit4:junit4]   2> 13483 T56 C4 P46114 oasc.SolrDeletionPolicy.onInit SolrDeletionPolicy.onInit: commits:num=1
[junit4:junit4]   2> 		commit{dir=MockDirWrapper(org.apache.lucene.store.RAMDirectory@efa86c lockFactory=org.apache.lucene.store.NativeFSLockFactory@d04473),segFN=segments_1,generation=1,filenames=[segments_1]
[junit4:junit4]   2> 13483 T56 C4 P46114 oasc.SolrDeletionPolicy.updateCommits newest commit = 1[segments_1]
[junit4:junit4]   2> 13487 T56 C4 P46114 /update {version=2&wt=javabin} {add=[1 (1430358245062475776)]} 0 6
[junit4:junit4]   2> 13489 T58 C4 P46114 /update {version=2&wt=javabin} {add=[10001 (1430358245064572928)]} 0 6
[junit4:junit4]   2> 13525 T37 C3 P60986 /update {version=2&wt=javabin} {delete=[1 (-1430358245107564544)]} 0 1
[junit4:junit4]   2> 13526 T39 C3 P60986 /update {version=2&wt=javabin} {delete=[10001 (-1430358245108613120)]} 0 1
[junit4:junit4]   2> 13530 T59 C4 P46114 /update {version=2&wt=javabin} {delete=[1 (-1430358245112807424)]} 0 1
[junit4:junit4]   2> 13530 T56 C4 P46114 /update {version=2&wt=javabin} {delete=[10001 (-1430358245113856000)]} 0 1
[junit4:junit4]   2> 13535 T36 C3 P60986 /update {version=2&wt=javabin} {add=[2 (1430358245117001728)]} 0 2
[junit4:junit4]   2> 13536 T38 C3 P60986 /update {version=2&wt=javabin} {add=[10002 (1430358245117001729)]} 0 3
[junit4:junit4]   2> 13542 T58 C4 P46114 /update {version=2&wt=javabin} {add=[2 (1430358245124341760)]} 0 2
[junit4:junit4]   2> 13543 T59 C4 P46114 /update {version=2&wt=javabin} {add=[10002 (1430358245125390336)]} 0 2
[junit4:junit4]   2> 13627 T39 C3 P60986 /update {version=2&wt=javabin} {add=[10003 (1430358245213470720)]} 0 2
[junit4:junit4]   2> 13628 T37 C3 P60986 /update {version=2&wt=javabin} {add=[3 (1430358245213470721)]} 0 3
[junit4:junit4]   2> 13631 T56 C4 P46114 /update {version=2&wt=javabin} {add=[10003 (1430358245218713600)]} 0 2
[junit4:junit4]   2> 13632 T58 C4 P46114 /update {version=2&wt=javabin} {add=[3 (1430358245218713601)]} 0 2
[junit4:junit4]   2> 13644 T44 oascc.ZkStateReader.updateClusterState Updating cloud state from ZooKeeper... 
[junit4:junit4]   2> 13645 T44 oasc.Overseer$ClusterStateUpdater.updateState Update state numShards=1 message={
[junit4:junit4]   2> 	  "operation":"state",
[junit4:junit4]   2> 	  "collection":"collection1",
[junit4:junit4]   2> 	  "numShards":"1",
[junit4:junit4]   2> 	  "core_node_name":"3",
[junit4:junit4]   2> 	  "state":"recovering",
[junit4:junit4]   2> 	  "shard":"shard1",
[junit4:junit4]   2> 	  "node_name":"127.0.0.1:34223_zr_%2Fxh",
[junit4:junit4]   2> 	  "core":"collection1",
[junit4:junit4]   2> 	  "roles":null,
[junit4:junit4]   2> 	  "base_url":"http://127.0.0.1:34223/zr_/xh"}
[junit4:junit4]   2> 13650 T36 C3 P60986 /update {version=2&wt=javabin} {add=[10004 (1430358245237587968)]} 0 2
[junit4:junit4]   2> 13651 T38 C3 P60986 /update {version=2&wt=javabin} {add=[4 (1430358245238636544)]} 0 2
[junit4:junit4]   2> 13654 T59 C4 P46114 /update {version=2&wt=javabin} {add=[10004 (1430358245242830848)]} 0 1
[junit4:junit4]   2> 13655 T56 C4 P46114 /update {version=2&wt=javabin} {add=[4 (1430358245243879424)]} 0 2
[junit4:junit4]   2> 13702 T79 oascc.ZkStateReader$2.process A cluster state change: WatchedEvent state:SyncConnected type:NodeDataChanged path:/clusterstate.json, has occurred - updating... (live nodes size: 3)
[junit4:junit4]   2> 13702 T43 oascc.ZkStateReader$2.process A cluster state change: WatchedEvent state:SyncConnected type:NodeDataChanged path:/clusterstate.json, has occurred - updating... (live nodes size: 3)
[junit4:junit4]   2> 13703 T63 oascc.ZkStateReader$2.process A cluster state change: WatchedEvent state:SyncConnected type:NodeDataChanged path:/clusterstate.json, has occurred - updating... (live nodes size: 3)
[junit4:junit4]   2> 13703 T50 oascc.ZkStateReader$2.process A cluster state change: WatchedEvent state:SyncConnected type:NodeDataChanged path:/clusterstate.json, has occurred - updating... (live nodes size: 3)
[junit4:junit4]   2> 13719 T39 C3 P60986 /update {version=2&wt=javabin} {delete=[10004 (-1430358245312036864)]} 0 1
[junit4:junit4]   2> 13720 T37 C3 P60986 /update {version=2&wt=javabin} {delete=[4 (-1430358245313085440)]} 0 1
[junit4:junit4]   2>  C2_STATE=coll:collection1 core:collection1 props:{collection=collection1, state=recovering, shard=shard1, node_name=127.0.0.1:34223_zr_%2Fxh, core=collection1, base_url=http://127.0.0.1:34223/zr_/xh}
[junit4:junit4]   2> 13753 T74 C2 P34223 oasc.SolrDeletionPolicy.onInit SolrDeletionPolicy.onInit: commits:num=1
[junit4:junit4]   2> 		commit{dir=MockDirWrapper(org.apache.lucene.store.RAMDirectory@875033 lockFactory=org.apache.lucene.store.NativeFSLockFactory@498300),segFN=segments_1,generation=1,filenames=[segments_1]
[junit4:junit4]   2> 13753 T74 C2 P34223 oasc.SolrDeletionPolicy.updateCommits newest commit = 1[segments_1]
[junit4:junit4]   2> 13755 T75 C2 P34223 /update {version=2&wt=javabin&update.distrib=FROMLEADER&distrib.from=http://127.0.0.1:46114/zr_/xh/collection1/} {delete=[4 (-1430358245317279745)]} 0 4
[junit4:junit4]   2> 13755 T74 C2 P34223 /update {version=2&wt=javabin&update.distrib=FROMLEADER&distrib.from=http://127.0.0.1:46114/zr_/xh/collection1/} {delete=[10004 (-1430358245317279744)]} 0 4
[junit4:junit4]   2> 13756 T59 C4 P46114 /update {version=2&wt=javabin} {delete=[10004 (-1430358245317279744)]} 0 34
[junit4:junit4]   2> 13756 T58 C4 P46114 /update {version=2&wt=javabin} {delete=[4 (-1430358245317279745)]} 0 34
[junit4:junit4]   2> 13760 T38 C3 P60986 /update {version=2&wt=javabin} {add=[5 (1430358245353979904)]} 0 1
[junit4:junit4]   2> 13761 T36 C3 P60986 /update {version=2&wt=javabin} {add=[10005 (1430358245353979905)]} 0 2
[junit4:junit4]   2> 13779 T72 C2 P34223 /update {version=2&wt=javabin&update.distrib=FROMLEADER&distrib.from=http://127.0.0.1:46114/zr_/xh/collection1/} {add=[10005 (1430358245359222784)]} 0 3
[junit4:junit4]   2> 13780 T59 C4 P46114 /update {version=2&wt=javabin} {add=[10005 (1430358245359222784)]} 0 16
[junit4:junit4]   2> 13780 T73 C2 P34223 /update {version=2&wt=javabin&update.distrib=FROMLEADER&distrib.from=http://127.0.0.1:46114/zr_/xh/collection1/} {add=[5 (1430358245358174208)]} 0 4
[junit4:junit4]   2> 13781 T56 C4 P46114 /update {version=2&wt=javabin} {add=[5 (1430358245358174208)]} 0 18
[junit4:junit4]   2> 13870 T39 C3 P60986 /update {version=2&wt=javabin} {add=[10006 (1430358245468274688)]} 0 2
[junit4:junit4]   2> 13870 T37 C3 P60986 /update {version=2&wt=javabin} {add=[6 (1430358245469323264)]} 0 2
[junit4:junit4]   2> 13878 T75 C2 P34223 /update {version=2&wt=javabin&update.distrib=FROMLEADER&distrib.from=http://127.0.0.1:46114/zr_/xh/collection1/} {add=[10006 (1430358245473517568)]} 0 2
[junit4:junit4]   2> 13879 T58 C4 P46114 /update {version=2&wt=javabin} {add=[10006 (1430358245473517568)]} 0 7
[junit4:junit4]   2> 13879 T74 C2 P34223 /update {version=2&wt=javabin&update.distrib=FROMLEADER&distrib.from=http://127.0.0.1:46114/zr_/xh/collection1/} {add=[6 (1430358245473517569)]} 0 2
[junit4:junit4]   2> 13880 T59 C4 P46114 /update {version=2&wt=javabin} {add=[6 (1430358245473517569)]} 0 7
[junit4:junit4]   2> 13914 T38 C3 P60986 /update {version=2&wt=javabin} {delete=[10006 (-1430358245516509184)]} 0 0
[junit4:junit4]   2> 13915 T36 C3 P60986 /update {version=2&wt=javabin} {delete=[6 (-1430358245517557760)]} 0 1
[junit4:junit4]   2> 13920 T72 C2 P34223 /update {version=2&wt=javabin&update.distrib=FROMLEADER&distrib.from=http://127.0.0.1:46114/zr_/xh/collection1/} {delete=[10006 (-1430358245519654912)]} 0 0
[junit4:junit4]   2> 13921 T73 C2 P34223 /update {version=2&wt=javabin&update.distrib=FROMLEADER&distrib.from=http://127.0.0.1:46114/zr_/xh/collection1/} {delete=[6 (-1430358245520703488)]} 0 1
[junit4:junit4]   2> 13921 T56 C4 P46114 /update {version=2&wt=javabin} {delete=[10006 (-1430358245519654912)]} 0 4
[junit4:junit4]   2> 13921 T59 C4 P46114 /update {version=2&wt=javabin} {delete=[6 (-1430358245520703488)]} 0 3
[junit4:junit4]   2> 13925 T39 C3 P60986 /update {version=2&wt=javabin} {add=[10007 (1430358245526994944)]} 0 1
[junit4:junit4]   2> 13926 T38 C3 P60986 /update {version=2&wt=javabin} {add=[7 (1430358245526994945)]} 0 2
[junit4:junit4]   2> 13935 T75 C2 P34223 /update {version=2&wt=javabin&update.distrib=FROMLEADER&distrib.from=http://127.0.0.1:46114/zr_/xh/collection1/} {add=[10007 (1430358245533286400)]} 0 2
[junit4:junit4]   2> 13935 T58 C4 P46114 /update {version=2&wt=javabin} {add=[10007 (1430358245533286400)]} 0 5
[junit4:junit4]   2> 13938 T74 C2 P34223 /update {version=2&wt=javabin&update.distrib=FROMLEADER&distrib.from=http://127.0.0.1:46114/zr_/xh/collection1/} {add=[7 (1430358245535383552)]} 0 2
[junit4:junit4]   2> 13939 T56 C4 P46114 /update {version=2&wt=javabin} {add=[7 (1430358245535383552)]} 0 8
[junit4:junit4]   2> 13997 T37 C3 P60986 /update {version=2&wt=javabin} {delete=[10007 (-1430358245603540992)]} 0 0
[junit4:junit4]   2> 14000 T39 C3 P60986 /update {version=2&wt=javabin} {delete=[7 (-1430358245606686720)]} 0 1
[junit4:junit4]   2> 14003 T72 C2 P34223 /update {version=2&wt=javabin&update.distrib=FROMLEADER&distrib.from=http://127.0.0.1:46114/zr_/xh/collection1/} {delete=[10007 (-1430358245606686720)]} 0 1
[junit4:junit4]   2> 14003 T59 C4 P46114 /update {version=2&wt=javabin} {delete=[10007 (-1430358245606686720)]} 0 3
[junit4:junit4]   2> 14005 T75 C2 P34223 /update {version=2&wt=javabin&update.distrib=FROMLEADER&distrib.from=http://127.0.0.1:46114/zr_/xh/collection1/} {delete=[7 (-1430358245608783872)]} 0 1
[junit4:junit4]   2> 14006 T58 C4 P46114 /update {version=2&wt=javabin} {delete=[7 (-1430358245608783872)]} 0 4
[junit4:junit4]   2> 14007 T38 C3 P60986 /update {version=2&wt=javabin} {add=[10008 (1430358245612978176)]} 0 1
[junit4:junit4]   2> 14009 T36 C3 P60986 /update {version=2&wt=javabin} {add=[8 (1430358245615075328)]} 0 1
[junit4:junit4]   2> 14014 T73 C2 P34223 /update {version=2&wt=javabin&update.distrib=FROMLEADER&distrib.from=http://127.0.0.1:46114/zr_/xh/collection1/} {add=[10008 (1430358245617172480)]} 0 1
[junit4:junit4]   2> 14014 T56 C4 P46114 /update {version=2&wt=javabin} {add=[10008 (1430358245617172480)]} 0 4
[junit4:junit4]   2> 14016 T72 C2 P34223 /update {version=2&wt=javabin&update.distrib=FROMLEADER&distrib.from=http://127.0.0.1:46114/zr_/xh/collection1/} {add=[8 (1430358245619269632)]} 0 1
[junit4:junit4]   2> 14017 T59 C4 P46114 /update {version=2&wt=javabin} {add=[8 (1430358245619269632)]} 0 6
[junit4:junit4]   2> 14085 T37 C3 P60986 /update {version=2&wt=javabin} {delete=[10008 (-1430358245695815680)]} 0 1
[junit4:junit4]   2> 14086 T39 C3 P60986 /update {version=2&wt=javabin} {delete=[8 (-1430358245696864256)]} 0 0
[junit4:junit4]   2> 14090 T74 C2 P34223 /update {version=2&wt=javabin&update.distrib=FROMLEADER&distrib.from=http://127.0.0.1:46114/zr_/xh/collection1/} {delete=[10008 (-1430358245698961408)]} 0 0
[junit4:junit4]   2> 14091 T58 C4 P46114 /update {version=2&wt=javabin} {delete=[10008 (-1430358245698961408)]} 0 4
[junit4:junit4]   2> 14091 T75 C2 P34223 /update {version=2&wt=javabin&update.distrib=FROMLEADER&distrib.from=http://127.0.0.1:46114/zr_/xh/collection1/} {delete=[8 (-1430358245700009984)]} 0 0
[junit4:junit4]   2> 14092 T56 C4 P46114 /update {version=2&wt=javabin} {delete=[8 (-1430358245700009984)]} 0 3
[junit4:junit4]   2> 14095 T38 C3 P60986 /update {version=2&wt=javabin} {add=[10009 (1430358245704204288)]} 0 2
[junit4:junit4]   2> 14095 T36 C3 P60986 /update {version=2&wt=javabin} {add=[9 (1430358245705252864)]} 0 1
[junit4:junit4]   2> 14102 T73 C2 P34223 /update {version=2&wt=javabin&update.distrib=FROMLEADER&distrib.from=http://127.0.0.1:46114/zr_/xh/collection1/} {add=[10009 (1430358245709447168)]} 0 1
[junit4:junit4]   2> 14103 T72 C2 P34223 /update {version=2&wt=javabin&update.distrib=FROMLEADER&distrib.from=http://127.0.0.1:46114/zr_/xh/collection1/} {add=[9 (1430358245709447169)]} 0 1
[junit4:junit4]   2> 14103 T59 C4 P46114 /update {version=2&wt=javabin} {add=[10009 (1430358245709447168)]} 0 6
[junit4:junit4]   2> 14103 T58 C4 P46114 /update {version=2&wt=javabin} {add=[9 (1430358245709447169)]} 0 5
[junit4:junit4]   2> 14117 T39 C3 P60986 /update {version=2&wt=javabin} {add=[10 (1430358245728321537)]} 0 1
[junit4:junit4]   2> 14118 T37 C3 P60986 /update {version=2&wt=javabin} {add=[10010 (1430358245728321536)]} 0 2
[junit4:junit4]   2> 14126 T74 C2 P34223 /update {version=2&wt=javabin&update.distrib=FROMLEADER&distrib.from=http://127.0.0.1:46114/zr_/xh/collection1/} {add=[10010 (1430358245733564416)]} 0 2
[junit4:junit4]   2> 14127 T75 C2 P34223 /update {version=2&wt=javabin&update.distrib=FROMLEADER&distrib.from=http://127.0.0.1:46114/zr_/xh/collection1/} {add=[10 (1430358245733564417)]} 0 2
[junit4:junit4]   2> 14127 T59 C4 P46114 /update {version=2&wt=javabin} {add=[10010 (1430358245733564416)]} 0 7
[junit4:junit4]   2> 14127 T56 C4 P46114 /update {version=2&wt=javabin} {add=[10 (1430358245733564417)]} 0 6
[junit4:junit4]   2> 14142 T38 C3 P60986 /update {version=2&wt=javabin} {delete=[10010 (-1430358245755584513)]} 0 0
[junit4:junit4]   2> 14142 T36 C3 P60986 /update {version=2&wt=javabin} {delete=[10 (-1430358245755584512)]} 0 0
[junit4:junit4]   2> 14148 T73 C2 P34223 /update {version=2&wt=javabin&update.distrib=FROMLEADER&distrib.from=http://127.0.0.1:46114/zr_/xh/collection1/} {delete=[10010 (-1430358245758730241)]} 0 1
[junit4:junit4]   2> 14148 T72 C2 P34223 /update {version=2&wt=javabin&update.distrib=FROMLEADER&distrib.from=http://127.0.0.1:46114/zr_/xh/collection1/} {delete=[10 (-1430358245758730240)]} 0 1
[junit4:junit4]   2> 14149 T59 C4 P46114 /update {version=2&wt=javabin} {delete=[10 (-1430358245758730240)]} 0 4
[junit4:junit4]   2> 14149 T58 C4 P46114 /update {version=2&wt=javabin} {delete=[10010 (-1430358245758730241)]} 0 4
[junit4:junit4]   2> 14152 T39 C3 P60986 /update {version=2&wt=javabin} {add=[10011 (1430358245765021696)]} 0 1
[junit4:junit4]   2> 14153 T37 C3 P60986 /update {version=2&wt=javabin} {add=[11 (1430358245765021697)]} 0 2
[junit4:junit4]   2> 14159 T74 C2 P34223 /update {version=2&wt=javabin&update.distrib=FROMLEADER&distrib.from=http://127.0.0.1:46114/zr_/xh/collection1/} {add=[10011 (1430358245769216000)]} 0 1
[junit4:junit4]   2> 14159 T56 C4 P46114 /update {version=2&wt=javabin} {add=[10011 (1430358245769216000)]} 0 4
[junit4:junit4]   2> 14160 T75 C2 P34223 /update {version=2&wt=javabin&update.distrib=FROMLEADER&distrib.from=http://127.0.0.1:46114/zr_/xh/collection1/} {add=[11 (1430358245770264576)]} 0 1
[junit4:junit4]   2> 14160 T58 C4 P46114 /update {version=2&wt=javabin} {add=[11 (1430358245770264576)]} 0 5
[junit4:junit4]   2> 14207 T38 C3 P60986 /update {version=2&wt=javabin} {delete=[10011 (-1430358245823741952)]} 0 1
[junit4:junit4]   2> 14207 T36 C3 P60986 /update {version=2&wt=javabin} {delete=[11 (-1430358245823741953)]} 0 0
[junit4:junit4]   2> 14213 T72 C2 P34223 /update {version=2&wt=javabin&update.distrib=FROMLEADER&distrib.from=http://127.0.0.1:46114/zr_/xh/collection1/} {delete=[10011 (-1430358245826887680)]} 0 1
[junit4:junit4]   2> 14213 T73 C2 P34223 /update {version=2&wt=javabin&update.distrib=FROMLEADER&distrib.from=http://127.0.0.1:46114/zr_/xh/collection1/} {delete=[11 (-1430358245826887681)]} 0 1
[junit4:junit4]   2> 14217 T56 C4 P46114 /update {version=2&wt=javabin} {delete=[11 (-1430358245826887681)]} 0 7
[junit4:junit4]   2> 14218 T59 C4 P46114 /update {version=2&wt=javabin} {delete=[10011 (-1430358245826887680)]} 0 8
[junit4:junit4]   2> 14221 T39 C3 P60986 /update {version=2&wt=javabin} {add=[12 (1430358245837373441)]} 0 1
[junit4:junit4]   2> 14222 T37 C3 P60986 /update {version=2&wt=javabin} {add=[10012 (1430358245837373440)]} 0 2
[junit4:junit4]   2> 14228 T74 C2 P34223 /update {version=2&wt=javabin&update.distrib=FROMLEADER&distrib.from=http://127.0.0.1:46114/zr_/xh/collection1/} {add=[12 (1430358245841567744)]} 0 1
[junit4:junit4]   2> 14229 T75 C2 P34223 /update {version=2&wt=javabin&update.distrib=FROMLEADER&distrib.from=http://127.0.0.1:46114/zr_/xh/collection1/} {add=[10012 (1430358245841567745)]} 0 2
[junit4:junit4]   2> 14229 T58 C4 P46114 /update {version=2&wt=javabin} {add=[12 (1430358245841567744)]} 0 5
[junit4:junit4]   2> 14229 T56 C4 P46114 /update {version=2&wt=javabin} {add=[10012 (1430358245841567745)]} 0 5
[junit4:junit4]   2> 14322 T38 C3 P60986 /update {version=2&wt=javabin} {delete=[12 (-1430358245944328192)]} 0 0
[junit4:junit4]   2> 14322 T36 C3 P60986 /update {version=2&wt=javabin} {delete=[10012 (-1430358245944328193)]} 0 0
[junit4:junit4]   2> 14328 T72 C2 P34223 /update {version=2&wt=javabin&update.distrib=FROMLEADER&distrib.from=http://127.0.0.1:46114/zr_/xh/collection1/} {delete=[12 (-1430358245947473920)]} 0 1
[junit4:junit4]   2> 14328 T73 C2 P34223 /update {version=2&wt=javabin&update.distrib=FROMLEADER&distrib.from=http://127.0.0.1:46114/zr_/xh/collection1/} {delete=[10012 (-1430358245947473921)]} 0 1
[junit4:junit4]   2> 14329 T59 C4 P46114 /update {version=2&wt=javabin} {delete=[12 (-1430358245947473920)]} 0 4
[junit4:junit4]   2> 14329 T58 C4 P46114 /update {version=2&wt=javabin} {delete=[10012 (-1430358245947473921)]} 0 4
[junit4:junit4]   2> 14332 T39 C3 P60986 /update {version=2&wt=javabin} {add=[10013 (1430358245953765376)]} 0 1
[junit4:junit4]   2> 14333 T36 C3 P60986 /update {version=2&wt=javabin} {add=[13 (1430358245953765377)]} 0 2
[junit4:junit4]   2> 14339 T74 C2 P34223 /update {version=2&wt=javabin&update.distrib=FROMLEADER&distrib.from=http://127.0.0.1:46114/zr_/xh/collection1/} {add=[10013 (1430358245957959680)]} 0 1
[junit4:junit4]   2> 14340 T56 C4 P46114 /update {version=2&wt=javabin} {add=[10013 (1430358245957959680)]} 0 5
[junit4:junit4]   2> 14340 T75 C2 P34223 /update {version=2&wt=javabin&update.distrib=FROMLEADER&distrib.from=http://127.0.0.1:46114/zr_/xh/collection1/} {add=[13 (1430358245957959681)]} 0 1
[junit4:junit4]   2> 14340 T59 C4 P46114 /update {version=2&wt=javabin} {add=[13 (1430358245957959681)]} 0 5
[junit4:junit4]   2> 14366 T37 C3 P60986 /update {version=2&wt=javabin} {add=[10014 (1430358245989416960)]} 0 1
[junit4:junit4]   2> 14368 T38 C3 P60986 /update {version=2&wt=javabin} {add=[14 (1430358245991514112)]} 0 1
[junit4:junit4]   2> 14369 T57 oass.SolrDispatchFilter.handleAdminRequest /admin/cores {version=2&checkLive=true&wt=javabin&onlyIfLeader=true&state=recovering&coreNodeName=3&action=PREPRECOVERY&core=collection1&nodeName=127.0.0.1:34223_zr_%252Fxh} status=0 QTime=1001 
[junit4:junit4]   2> 14372 T72 C2 P34223 /update {version=2&wt=javabin&update.distrib=FROMLEADER&distrib.from=http://127.0.0.1:46114/zr_/xh/collection1/} {add=[10014 (1430358245993611264)]} 0 1
[junit4:junit4]   2> 14373 T58 C4 P46114 /update {version=2&wt=javabin} {add=[10014 (1430358245993611264)]} 0 5
[junit4:junit4]   2> 14375 T73 C2 P34223 /update {version=2&wt=javabin&update.distrib=FROMLEADER&distrib.from=http://127.0.0.1:46114/zr_/xh/collection1/} {add=[14 (1430358245995708416)]} 0 1
[junit4:junit4]   2> 14375 T59 C4 P46114 /update {version=2&wt=javabin} {add=[14 (1430358245995708416)]} 0 4
[junit4:junit4]   2> 14403 T39 C3 P60986 /update {version=2&wt=javabin} {add=[10015 (1430358246028214272)]} 0 1
[junit4:junit4]   2> 14405 T36 C3 P60986 /update {version=2&wt=javabin} {add=[15 (1430358246030311424)]} 0 1
[junit4:junit4]   2> 14410 T74 C2 P34223 /update {version=2&wt=javabin&update.distrib=FROMLEADER&distrib.from=http://127.0.0.1:46114/zr_/xh/collection1/} {add=[10015 (1430358246032408576)]} 0 1
[junit4:junit4]   2> 14411 T57 C4 P46114 /update {version=2&wt=javabin} {add=[10015 (1430358246032408576)]} 0 5
[junit4:junit4]   2> 14411 T72 C2 P34223 /update {version=2&wt=javabin&update.distrib=FROMLEADER&distrib.from=http://127.0.0.1:46114/zr_/xh/collection1/} {add=[15 (1430358246034505728)]} 0 1
[junit4:junit4]   2> 14412 T56 C4 P46114 /update {version=2&wt=javabin} {add=[15 (1430358246034505728)]} 0 5
[junit4:junit4]   2> 14471 T37 C3 P60986 /update {version=2&wt=javabin} {add=[10016 (1430358246099517440)]} 0 2
[junit4:junit4]   2> 14472 T38 C3 P60986 /update {version=2&wt=javabin} {add=[16 (1430358246100566016)]} 0 2
[junit4:junit4]   2> 14478 T75 C2 P34223 /update {version=2&wt=javabin&update.distrib=FROMLEADER&distrib.from=http://127.0.0.1:46114/zr_/xh/collection1/} {add=[10016 (1430358246103711744)]} 0 1
[junit4:junit4]   2> 14478 T73 C2 P34223 /update {version=2&wt=javabin&update.distrib=FROMLEADER&distrib.from=http://127.0.0.1:46114/zr_/xh/collection1/} {add=[16 (1430358246103711745)]} 0 1
[junit4:junit4]   2> 14479 T58 C4 P46114 /update {version=2&wt=javabin} {add=[10016 (1430358246103711744)]} 0 5
[junit4:junit4]   2> 14479 T59 C4 P46114 /update {version=2&wt=javabin} {add=[16 (1430358246103711745)]} 0 5
[junit4:junit4]   2> 14497 T36 C3 P60986 /update {version=2&wt=javabin} {add=[17 (1430358246126780416)]} 0 2
[junit4:junit4]   2> 14497 T39 C3 P60986 /update {version=2&wt=javabin} {add=[10017 (1430358246126780417)]} 0 2
[junit4:junit4]   2> 14503 T74 C2 P34223 /update {version=2&wt=javabin&update.distrib=FROMLEADER&distrib.from=http://127.0.0.1:46114/zr_/xh/collection1/} {add=[17 (1430358246129926144)]} 0 1
[junit4:junit4]   2> 14503 T57 C4 P46114 /update {version=2&wt=javabin} {add=[17 (1430358246129926144)]} 0 4
[junit4:junit4]   2> 14504 T72 C2 P34223 /update {version=2&wt=javabin&update.distrib=FROMLEADER&distrib.from=http://127.0.0.1:46114/zr_/xh/collection1/} {add=[10017 (1430358246130974720)]} 0 1
[junit4:junit4]   2> 14504 T56 C4 P46114 /update {version=2&wt=javabin} {add=[10017 (1430358246130974720)]} 0 4
[junit4:junit4]   2> 14578 T37 C3 P60986 /update {version=2&wt=javabin} {add=[18 (1430358246211715072)]} 0 1
[junit4:junit4]   2> 14579 T38 C3 P60986 /update {version=2&wt=javabin} {add=[10018 (1430358246212763648)]} 0 1
[junit4:junit4]   2> 14587 T75 C2 P34223 /update {version=2&wt=javabin&update.distrib=FROMLEADER&distrib.from=http://127.0.0.1:46114/zr_/xh/collection1/} {add=[18 (1430358246218006528)]} 0 1
[junit4:junit4]   2> 14587 T73 C2 P34223 /update {version=2&wt=javabin&update.distrib=FROMLEADER&distrib.from=http://127.0.0.1:46114/zr_/xh/collection1/} {add=[10018 (1430358246218006529)]} 0 1
[junit4:junit4]   2> 14588 T58 C4 P46114 /update {version=2&wt=javabin} {add=[18 (1430358246218006528)]} 0 5
[junit4:junit4]   2> 14588 T59 C4 P46114 /update {version=2&wt=javabin} {add=[10018 (1430358246218006529)]} 0 5
[junit4:junit4]   2> 14670 T39 C3 P60986 /update {version=2&wt=javabin} {delete=[10018 (-1430358246309232641)]} 0 0
[junit4:junit4]   2> 14670 T36 C3 P60986 /update {version=2&wt=javabin} {delete=[18 (-1430358246309232640)]} 0 0
[junit4:junit4]   2> 14675 T72 C2 P34223 /update {version=2&wt=javabin&update.distrib=FROMLEADER&distrib.from=http://127.0.0.1:46114/zr_/xh/collection1/} {delete=[10018 (-1430358246312378369)]} 0 0
[junit4:junit4]   2> 14675 T74 C2 P34223 /update {version=2&wt=javabin&update.distrib=FROMLEADER&distrib.from=http://127.0.0.1:46114/zr_/xh/collection1/} {delete=[18 (-1430358246312378368)]} 0 0
[junit4:junit4]   2> 14676 T57 C4 P46114 /update {version=2&wt=javabin} {delete=[18 (-1430358246312378368)]} 0 3
[junit4:junit4]   2> 14676 T56 C4 P46114 /update {version=2&wt=javabin} {delete=[10018 (-1430358246312378369)]} 0 3
[junit4:junit4]   2> 14679 T37 C3 P60986 /update {version=2&wt=javabin} {add=[10019 (1430358246317621248)]} 0 1
[junit4:junit4]   2> 14680 T38 C3 P60986 /update {version=2&wt=javabin} {add=[19 (1430358246317621249)]} 0 2
[junit4:junit4]   2> 14686 T75 C2 P34223 /update {version=2&wt=javabin&update.distrib=FROMLEADER&distrib.from=http://127.0.0.1:46114/zr_/xh/collection1/} {add=[10019 (1430358246321815552)]} 0 1
[junit4:junit4]   2> 14686 T73 C2 P34223 /update {version=2&wt=javabin&update.distrib=FROMLEADER&distrib.from=http://127.0.0.1:46114/zr_/xh/collection1/} {add=[19 (1430358246321815553)]} 0 1
[junit4:junit4]   2> 14686 T58 C4 P46114 /update {version=2&wt=javabin} {add=[10019 (1430358246321815552)]} 0 4
[junit4:junit4]   2> 14687 T59 C4 P46114 /update {version=2&wt=javabin} {add=[19 (1430358246321815553)]} 0 5
[junit4:junit4]   2> 14706 T39 C3 P60986 /update {version=2&wt=javabin} {add=[20 (1430358246345932800)]} 0 1
[junit4:junit4]   2> 14707 T36 C3 P60986 /update {version=2&wt=javabin} {add=[10020 (1430358246345932801)]} 0 2
[junit4:junit4]   2> 14713 T72 C2 P34223 /update {version=2&wt=javabin&update.distrib=FROMLEADER&distrib.from=http://127.0.0.1:46114/zr_/xh/collection1/} {add=[20 (1430358246350127104)]} 0 2
[junit4:junit4]   2> 14713 T74 C2 P34223 /update {version=2&wt=javabin&update.distrib=FROMLEADER&distrib.from=http://127.0.0.1:46114/zr_/xh/collection1/} {add=[10020 (1430358246350127105)]} 0 1
[junit4:junit4]   2> 14714 T57 C4 P46114 /update {version=2&wt=javabin} {add=[20 (1430358246350127104)]} 0 5
[junit4:junit4]   2> 14714 T56 C4 P46114 /update {version=2&wt=javabin} {add=[10020 (1430358246350127105)]} 0 5
[junit4:junit4]   2> 14736 T37 C3 P60986 /update {version=2&wt=javabin} {delete=[20 (-1430358246378438656)]} 0 0
[junit4:junit4]   2> 14736 T39 C3 P60986 /update {version=2&wt=javabin} {delete=[10020 (-1430358246378438657)]} 0 0
[junit4:junit4]   2> 14741 T75 C2 P34223 /update {version=2&wt=javabin&update.distrib=FROMLEADER&distrib.from=http://127.0.0.1:46114/zr_/xh/collection1/} {delete=[20 (-1430358246381584384)]} 0 0
[junit4:junit4]   2> 14741 T73 C2 P34223 /update {version=2&wt=javabin&update.distrib=FROMLEADER&distrib.from=http://127.0.0.1:46114/zr_/xh/collection1/} {delete=[10020 (-1430358246381584385)]} 0 0
[junit4:junit4]   2> 14742 T58 C4 P46114 /update {version=2&wt=javabin} {delete=[20 (-1430358246381584384)]} 0 4
[junit4:junit4]   2> 14742 T59 C4 P46114 /update {version=2&wt=javabin} {delete=[10020 (-1430358246381584385)]} 0 4
[junit4:junit4]   2> 14745 T36 C3 P60986 /update {version=2&wt=javabin} {add=[10021 (1430358246386827264)]} 0 1
[junit4:junit4]   2> 14746 T38 C3 P60986 /update {version=2&wt=javabin} {add=[21 (1430358246386827265)]} 0 2
[junit4:junit4]   2> 14751 T72 C2 P34223 /update {version=2&wt=javabin&update.distrib=FROMLEADER&distrib.from=http://127.0.0.1:46114/zr_/xh/collection1/} {add=[10021 (1430358246391021568)]} 0 0
[junit4:junit4]   2> 14752 T57 C4 P46114 /update {version=2&wt=javabin} {add=[10021 (1430358246391021568)]} 0 4
[junit4:junit4]   2> 14752 T74 C2 P34223 /update {version=2&wt=javabin&update.distrib=FROMLEADER&distrib.from=http://127.0.0.1:46114/zr_/xh/collection1/} {add=[21 (1430358246391021569)]} 0 1
[junit4:junit4]   2> 14753 T56 C4 P46114 /update {version=2&wt=javabin} {add=[21 (1430358246391021569)]} 0 5
[junit4:junit4]   2> 14780 T39 C3 P60986 /update {version=2&wt=javabin} {add=[10022 (1430358246423527424)]} 0 1
[junit4:junit4]   2> 14780 T37 C3 P60986 /update {version=2&wt=javabin} {add=[22 (1430358246423527425)]} 0 1
[junit4:junit4]   2> 14786 T75 C2 P34223 /update {version=2&wt=javabin&update.distrib=FROMLEADER&distrib.from=http://127.0.0.1:46114/zr_/xh/collection1/} {add=[10022 (1430358246426673152)]} 0 1
[junit4:junit4]   2> 14786 T58 C4 P46114 /update {version=2&wt=javabin} {add=[10022 (1430358246426673152)]} 0 4
[junit4:junit4]   2> 14787 T73 C2 P34223 /update {version=2&wt=javabin&update.distrib=FROMLEADER&distrib.from=http://127.0.0.1:46114/zr_/xh/collection1/} {add=[22 (1430358246427721728)]} 0 1
[junit4:junit4]   2> 14787 T59 C4 P46114 /update {version=2&wt=javabin} {add=[22 (1430358246427721728)]} 0 4
[junit4:junit4]   2> 14813 T36 C3 P60986 /update {version=2&wt=javabin} {add=[10023 (1430358246458130432)]} 0 2
[junit4:junit4]   2> 14816 T38 C3 P60986 /update {version=2&wt=javabin} {add=[23 (1430358246459179008)]} 0 3
[junit4:junit4]   2> 14820 T72 C2 P34223 /update {version=2&wt=javabin&update.distrib=FROMLEADER&distrib.from=http://127.0.0.1:46114/zr_/xh/collection1/} {add=[10023 (1430358246462324736)]} 0 2
[junit4:junit4]   2> 14821 T57 C4 P46114 /update {version=2&wt=javabin} {add=[10023 (1430358246462324736)]} 0 6
[junit4:junit4]   2> 14822 T75 C2 P34223 /update {version=2&wt=javabin&update.distrib=FROMLEADER&distrib.from=http://127.0.0.1:46114/zr_/xh/collection1/} {add=[23 (1430358246465470464)]} 0 1
[junit4:junit4]   2> 14823 T56 C4 P46114 /update {version=2&wt=javabin} {add=[23 (1430358246465470464)]} 0 4
[junit4:junit4]   2> 14833 T39 C3 P60986 /update {version=2&wt=javabin} {add=[10024 (1430358246480150528)]} 0 1
[junit4:junit4]   2> 14835 T37 C3 P60986 /update {version=2&wt=javabin} {add=[24 (1430358246482247680)]} 0 1
[junit4:junit4]   2> 14850 T74 C2 P34223 /update {version=2&wt=javabin&update.distrib=FROMLEADER&distrib.from=http://127.0.0.1:46114/zr_/xh/collection1/} {add=[10024 (1430358246493782016)]} 0 1
[junit4:junit4]   2> 14850 T58 C4 P46114 /update {version=2&wt=javabin} {add=[10024 (1430358246493782016)]} 0 4
[junit4:junit4]   2> 14851 T72 C2 P34223 /update {version=2&wt=javabin&update.distrib=FROMLEADER&distrib.from=http://127.0.0.1:46114/zr_/xh/collection1/} {add=[24 (1430358246495879168)]} 0 1
[junit4:junit4]   2> 14851 T59 C4 P46114 /update {version=2&wt=javabin} {add=[24 (1430358246495879168)]} 0 4
[junit4:junit4]   2> 14885 T36 C3 P60986 /update {version=2&wt=javabin} {delete=[10023 (-1430358246534676480)]} 0 0
[junit4:junit4]   2> 14886 T38 C3 P60986 /update {version=2&wt=javabin} {delete=[23 (-1430358246535725056)]} 0 0
[junit4:junit4]   2> 14890 T73 C2 P34223 /update {version=2&wt=javabin&update.distrib=FROMLEADER&distrib.from=http://127.0.0.1:46114/zr_/xh/collection1/} {delete=[10023 (-1430358246537822208)]} 0 0
[junit4:junit4]   2> 14890 T75 C2 P34223 /update {version=2&wt=javabin&update.distrib=FROMLEADER&distrib.from=http://127.0.0.1:46114/zr_/xh/collection1/} {delete=[23 (-1430358246537822209)]} 0 0
[junit4:junit4]   2> 14891 T57 C4 P46114 /update {version=2&wt=javabin} {delete=[10023 (-1430358246537822208)]} 0 3
[junit4:junit4]   2> 14891 T56 C4 P46114 /update {version=2&wt=javabin} {delete=[23 (-1430358246537822209)]} 0 3
[junit4:junit4]   2> 14894 T39 C3 P60986 /update {version=2&wt=javabin} {add=[10025 (1430358246543065088)]} 0 1
[junit4:junit4]   2> 14894 T37 C3 P60986 /update {version=2&wt=javabin} {add=[25 (1430358246543065089)]} 0 1
[junit4:junit4]   2> 14900 T74 C2 P34223 /update {version=2&wt=javabin&update.distrib=FROMLEADER&distrib.from=http://127.0.0.1:46114/zr_/xh/collection1/} {add=[10025 (1430358246546210816)]} 0 1
[junit4:junit4]   2> 14900 T72 C2 P34223 /update {version=2&wt=javabin&update.distrib=FROMLEADER&distrib.from=http://127.0.0.1:46114/zr_/xh/collection1/} {add=[25 (1430358246547259392)]} 0 1
[junit4:junit4]   2> 14900 T58 C4 P46114 /update {version=2&wt=javabin} {add=[10025 (1430358246546210816)]} 0 4
[junit4:junit4]   2> 14901 T59 C4 P46114 /update {version=2&wt=javabin} {add=[25 (1430358246547259392)]} 0 5
[junit4:junit4]   2> 14952 T36 C3 P60986 /update {version=2&wt=javabin} {add=[10026 (1430358246603882497)]} 0 1
[junit4:junit4]   2> 14952 T38 C3 P60986 /update {version=2&wt=javabin} {add=[26 (1430358246603882496)]} 0 1
[junit4:junit4]   2> 14958 T73 C2 P34223 /update {version=2&wt=javabin&update.distrib=FROMLEADER&distrib.from=http://127.0.0.1:46114/zr_/xh/collection1/} {add=[10026 (1430358246608076800)]} 0 1
[junit4:junit4]   2> 14959 T75 C2 P34223 /update {version=2&wt=javabin&update.distrib=FROMLEADER&distrib.from=http://127.0.0.1:46114/zr_/xh/collection1/} {add=[26 (1430358246608076801)]} 0 1
[junit4:junit4]   2> 14959 T57 C4 P46114 /update {version=2&wt=javabin} {add=[10026 (1430358246608076800)]} 0 4
[junit4:junit4]   2> 14959 T56 C4 P46114 /update {version=2&wt=javabin} {add=[26 (1430358246608076801)]} 0 4
[junit4:junit4]   2> 15039 T37 C3 P60986 /update {version=2&wt=javabin} {delete=[10024 (-1430358246696157184)]} 0 0
[junit4:junit4]   2> 15039 T39 C3 P60986 /update {version=2&wt=javabin} {delete=[24 (-1430358246696157185)]} 0 0
[junit4:junit4]   2> 15044 T74 C2 P34223 /update {version=2&wt=javabin&update.distrib=FROMLEADER&distrib.from=http://127.0.0.1:46114/zr_/xh/collection1/} {delete=[10024 (-1430358246699302912)]} 0 0
[junit4:junit4]   2> 15044 T72 C2 P34223 /update {version=2&wt=javabin&update.distrib=FROMLEADER&distrib.from=http://127.0.0.1:46114/zr_/xh/collection1/} {delete=[24 (-1430358246699302913)]} 0 0
[junit4:junit4]   2> 15045 T58 C4 P46114 /update {version=2&wt=javabin} {delete=[10024 (-1430358246699302912)]} 0 4
[junit4:junit4]   2> 15045 T59 C4 P46114 /update {version=2&wt=javabin} {delete=[24 (-1430358246699302913)]} 0 3
[junit4:junit4]   2> 15048 T36 C3 P60986 /update {version=2&wt=javabin} {add=[10027 (1430358246704545792)]} 0 1
[junit4:junit4]   2> 15049 T38 C3 P60986 /update {version=2&wt=javabin} {add=[27 (1430358246704545793)]} 0 2
[junit4:junit4]   2> 15054 T73 C2 P34223 /update {version=2&wt=javabin&update.distrib=FROMLEADER&distrib.from=http://127.0.0.1:46114/zr_/xh/collection1/} {add=[10027 (1430358246708740096)]} 0 1
[junit4:junit4]   2> 15055 T75 C2 P34223 /update {version=2&wt=javabin&update.distrib=FROMLEADER&distrib.from=http://127.0.0.1:46114/zr_/xh/collection1/} {add=[27 (1430358246708740097)]} 0 1
[junit4:junit4]   2> 15055 T57 C4 P46114 /update {version=2&wt=javabin} {add=[10027 (1430358246708740096)]} 0 5
[junit4:junit4]   2> 15056 T56 C4 P46114 /update {version=2&wt=javabin} {add=[27 (1430358246708740097)]} 0 5
[junit4:junit4]   2> 15088 T20 oasc.ChaosMonkey.monkeyLog monkey: stop shard! 34223
[junit4:junit4]   2> 15088 T20 oasc.CoreContainer.shutdown Shutting down CoreContainer instance=18630141
[junit4:junit4]   2> 15145 T37 C3 P60986 /update {version=2&wt=javabin} {delete=[10026 (-1430358246807306240)]} 0 0
[junit4:junit4]   2> 15145 T36 C3 P60986 /update {version=2&wt=javabin} {delete=[26 (-1430358246807306241)]} 0 0
[junit4:junit4]   2> 15150 T72 C2 P34223 /update {version=2&wt=javabin&update.distrib=FROMLEADER&distrib.from=http://127.0.0.1:46114/zr_/xh/collection1/} {delete=[10026 (-1430358246810451968)]} 0 0
[junit4:junit4]   2> 15150 T74 C2 P34223 /update {version=2&wt=javabin&update.distrib=FROMLEADER&distrib.from=http://127.0.0.1:46114/zr_/xh/collection1/} {delete=[26 (-1430358246810451969)]} 0 0
[junit4:junit4]   2> 15151 T59 C4 P46114 /update {version=2&wt=javabin} {delete=[10026 (-1430358246810451968)]} 0 3
[junit4:junit4]   2> 15151 T58 C4 P46114 /update {version=2&wt=javabin} {delete=[26 (-1430358246810451969)]} 0 3
[junit4:junit4]   2> 15154 T39 C3 P60986 /update {version=2&wt=javabin} {add=[28 (1430358246815694848)]} 0 1
[junit4:junit4]   2> 15154 T38 C3 P60986 /update {version=2&wt=javabin} {add=[10028 (1430358246815694849)]} 0 1
[junit4:junit4]   2> 15159 T73 C2 P34223 /update {version=2&wt=javabin&update.distrib=FROMLEADER&distrib.from=http://127.0.0.1:46114/zr_/xh/collection1/} {add=[28 (1430358246818840576)]} 0 0
[junit4:junit4]   2> 15160 T57 C4 P46114 /update {version=2&wt=javabin} {add=[28 (1430358246818840576)]} 0 4
[junit4:junit4]   2> 15160 T75 C2 P34223 /update {version=2&wt=javabin&update.distrib=FROMLEADER&distrib.from=http://127.0.0.1:46114/zr_/xh/collection1/} {add=[10028 (1430358246818840577)]} 0 1
[junit4:junit4]   2> 15161 T56 C4 P46114 /update {version=2&wt=javabin} {add=[10028 (1430358246818840577)]} 0 5
[junit4:junit4]   2> 15207 T44 oascc.ZkStateReader.updateClusterState Updating cloud state from ZooKeeper... 
[junit4:junit4]   2> 15208 T44 oasc.Overseer$ClusterStateUpdater.updateState Update state numShards=null message={
[junit4:junit4]   2> 	  "operation":"state",
[junit4:junit4]   2> 	  "collection":"collection1",
[junit4:junit4]   2> 	  "core_node_name":"3",
[junit4:junit4]   2> 	  "state":"down",
[junit4:junit4]   2> 	  "shard":"shard1",
[junit4:junit4]   2> 	  "node_name":"127.0.0.1:34223_zr_%2Fxh",
[junit4:junit4]   2> 	  "core":"collection1",
[junit4:junit4]   2> 	  "roles":null,
[junit4:junit4]   2> 	  "base_url":"http://127.0.0.1:34223/zr_/xh"}
[junit4:junit4]   2> 15217 T50 oascc.ZkStateReader$2.process A cluster state change: WatchedEvent state:SyncConnected type:NodeDataChanged path:/clusterstate.json, has occurred - updating... (live nodes size: 3)
[junit4:junit4]   2> 15217 T79 oascc.ZkStateReader$2.process A cluster state change: WatchedEvent state:SyncConnected type:NodeDataChanged path:/clusterstate.json, has occurred - updating... (live nodes size: 3)
[junit4:junit4]   2> 15217 T43 oascc.ZkStateReader$2.process A cluster state change: WatchedEvent state:SyncConnected type:NodeDataChanged path:/clusterstate.json, has occurred - updating... (live nodes size: 3)
[junit4:junit4]   2> 15217 T63 oascc.ZkStateReader$2.process A cluster state change: WatchedEvent state:SyncConnected type:NodeDataChanged path:/clusterstate.json, has occurred - updating... (live nodes size: 3)
[junit4:junit4]   2> 15233 T37 C3 P60986 /update {version=2&wt=javabin} {add=[29 (1430358246898532352)]} 0 1
[junit4:junit4]   2> 15233 T36 C3 P60986 /update {version=2&wt=javabin} {add=[10029 (1430358246899580928)]} 0 1
[junit4:junit4]   2> 15236 T59 C4 P46114 /update {version=2&wt=javabin} {add=[29 (1430358246901678080)]} 0 1
[junit4:junit4]   2> 15236 T58 C4 P46114 /update {version=2&wt=javabin} {add=[10029 (1430358246902726656)]} 0 1
[junit4:junit4]   2> 15270 T39 C3 P60986 /update {version=2&wt=javabin} {delete=[10027 (-1430358246938378240)]} 0 0
[junit4:junit4]   2> 15270 T38 C3 P60986 /update {version=2&wt=javabin} {delete=[27 (-1430358246938378241)]} 0 0
[junit4:junit4]   2> 15273 T57 C4 P46114 /update {version=2&wt=javabin} {delete=[10027 (-1430358246941523968)]} 0 0
[junit4:junit4]   2> 15273 T56 C4 P46114 /update {version=2&wt=javabin} {delete=[27 (-1430358246941523969)]} 0 0
[junit4:junit4]   2> 15276 T37 C3 P60986 /update {version=2&wt=javabin} {add=[10030 (1430358246943621120)]} 0 1
[junit4:junit4]   2> 15277 T36 C3 P60986 /update {version=2&wt=javabin} {add=[30 (1430358246944669696)]} 0 2
[junit4:junit4]   2> 15280 T59 C4 P46114 /update {version=2&wt=javabin} {add=[10030 (1430358246947815424)]} 0 1
[junit4:junit4]   2> 15280 T58 C4 P46114 /update {version=2&wt=javabin} {add=[30 (1430358246947815425)]} 0 1
[junit4:junit4]   2> 15305 T39 C3 P60986 /update {version=2&wt=javabin} {delete=[29 (-1430358246975078401)]} 0 0
[junit4:junit4]   2> 15305 T38 C3 P60986 /update {version=2&wt=javabin} {delete=[10029 (-1430358246975078400)]} 0 0
[junit4:junit4]   2> 15308 T57 C4 P46114 /update {version=2&wt=javabin} {delete=[29 (-1430358246978224128)]} 0 0
[junit4:junit4]   2> 15308 T56 C4 P46114 /update {version=2&wt=javabin} {delete=[10029 (-1430358246978224129)]} 0 0
[junit4:junit4]   2> 15311 T37 C3 P60986 /update {version=2&wt=javabin} {add=[31 (1430358246981369856)]} 0 0
[junit4:junit4]   2> 15312 T36 C3 P60986 /update {version=2&wt=javabin} {add=[10031 (1430358246981369857)]} 0 1
[junit4:junit4]   2> 15315 T59 C4 P46114 /update {version=2&wt=javabin} {add=[31 (1430358246984515584)]} 0 1
[junit4:junit4]   2> 15315 T58 C4 P46114 /update {version=2&wt=javabin} {add=[10031 (1430358246984515585)]} 0 1
[junit4:junit4]   2> 15384 T38 C3 P60986 /update {version=2&wt=javabin} {delete=[10031 (-1430358247057915904)]} 0 1
[junit4:junit4]   2> 15384 T39 C3 P60986 /update {version=2&wt=javabin} {delete=[31 (-1430358247057915905)]} 0 1
[junit4:junit4]   2> 15387 T57 C4 P46114 /update {version=2&wt=javabin} {delete=[10031 (-1430358247061061632)]} 0 0
[junit4:junit4]   2> 15387 T56 C4 P46114 /update {version=2&wt=javabin} {delete=[31 (-1430358247061061633)]} 0 0
[junit4:junit4]   2> 15390 T37 C3 P60986 /update {version=2&wt=javabin} {add=[10032 (1430358247063158784)]} 0 1
[junit4:junit4]   2> 15391 T36 C3 P60986 /update {version=2&wt=javabin} {add=[32 (1430358247063158785)]} 0 1
[junit4:junit4]   2> 15393 T59 C4 P46114 /update {version=2&wt=javabin} {add=[10032 (1430358247066304512)]} 0 1
[junit4:junit4]   2> 15393 T58 C4 P46114 /update {version=2&wt=javabin} {add=[32 (1430358247067353088)]} 0 0
[junit4:junit4]   2> 15431 T38 C3 P60986 /update {version=2&wt=javabin} {delete=[10032 (-1430358247107198977)]} 0 1
[junit4:junit4]   2> 15431 T39 C3 P60986 /update {version=2&wt=javabin} {delete=[32 (-1430358247107198976)]} 0 1
[junit4:junit4]   2> 15434 T57 C4 P46114 /update {version=2&wt=javabin} {delete=[32 (-1430358247109296128)]} 0 0
[junit4:junit4]   2> 15434 T56 C4 P46114 /update {version=2&wt=javabin} {delete=[10032 (-1430358247109296129)]} 0 1
[junit4:junit4]   2> 15437 T37 C3 P60986 /update {version=2&wt=javabin} {add=[33 (1430358247112441856)]} 0 1
[junit4:junit4]   2> 15437 T36 C3 P60986 /update {version=2&wt=javabin} {add=[10033 (1430358247112441857)]} 0 1
[junit4:junit4]   2> 15440 T59 C4 P46114 /update {version=2&wt=javabin} {add=[33 (1430358247115587584)]} 0 1
[junit4:junit4]   2> 15441 T58 C4 P46114 /update {version=2&wt=javabin} {add=[10033 (1430358247115587585)]} 0 2
[junit4:junit4]   2> 15537 T39 C3 P60986 /update {version=2&wt=javabin} {add=[10034 (1430358247217299457)]} 0 1
[junit4:junit4]   2> 15537 T38 C3 P60986 /update {version=2&wt=javabin} {add=[34 (1430358247217299456)]} 0 1
[junit4:junit4]   2> 15540 T57 C4 P46114 /update {version=2&wt=javabin} {add=[10034 (1430358247220445184)]} 0 1
[junit4:junit4]   2> 15541 T56 C4 P46114 /update {version=2&wt=javabin} {add=[34 (1430358247221493760)]} 0 2
[junit4:junit4]   2> 15599 T37 C3 P60986 /update {version=2&wt=javabin} {add=[10035 (1430358247282311168)]} 0 1
[junit4:junit4]   2> 15599 T39 C3 P60986 /update {version=2&wt=javabin} {add=[35 (1430358247282311169)]} 0 1
[junit4:junit4]   2> 15602 T59 C4 P46114 /update {version=2&wt=javabin} {add=[10035 (1430358247285456896)]} 0 1
[junit4:junit4]   2> 15602 T57 C4 P46114 /update {version=2&wt=javabin} {add=[35 (1430358247285456897)]} 0 1
[junit4:junit4]   2> 15694 T38 C3 P60986 /update {version=2&wt=javabin} {delete=[34 (-1430358247382974465)]} 0 0
[junit4:junit4]   2> 15694 T36 C3 P60986 /update {version=2&wt=javabin} {delete=[10034 (-1430358247382974464)]} 0 1
[junit4:junit4]   2> 15697 T56 C4 P46114 /update {version=2&wt=javabin} {delete=[10034 (-1430358247386120193)]} 0 0
[junit4:junit4]   2> 15697 T58 C4 P46114 /update {version=2&wt=javabin} {delete=[34 (-1430358247386120192)]} 0 0
[junit4:junit4]   2> 15701 T39 C3 P60986 /update {version=2&wt=javabin} {add=[36 (1430358247389265920)]} 0 0
[junit4:junit4]   2> 15709 T37 C3 P60986 /update {version=2&wt=javabin} {add=[10036 (1430358247389265921)]} 0 9
[junit4:junit4]   2> 15712 T59 C4 P46114 /update {version=2&wt=javabin} {add=[36 (1430358247400800257)]} 0 1
[junit4:junit4]   2> 15712 T57 C4 P46114 /update {version=2&wt=javabin} {add=[10036 (1430358247400800256)]} 0 1
[junit4:junit4]   2> 15787 T36 C3 P60986 /update {version=2&wt=javabin} {delete=[10036 (-1430358247480492033)]} 0 0
[junit4:junit4]   2> 15787 T38 C3 P60986 /update {version=2&wt=javabin} {delete=[36 (-1430358247480492032)]} 0 0
[junit4:junit4]   2> 15790 T58 C4 P46114 /update {version=2&wt=javabin} {delete=[10036 (-1430358247483637761)]} 0 0
[junit4:junit4]   2> 15790 T56 C4 P46114 /update {version=2&wt=javabin} {delete=[36 (-1430358247483637760)]} 0 0
[junit4:junit4]   2> 15794 T39 C3 P60986 /update {version=2&wt=javabin} {add=[10037 (1430358247486783488)]} 0 1
[junit4:junit4]   2> 15796 T39 C3 P60986 /update {version=2&wt=javabin} {add=[37 (1430358247488880640)]} 0 1
[junit4:junit4]   2> 15798 T59 C4 P46114 /update {version=2&wt=javabin} {add=[10037 (1430358247490977792)]} 0 1
[junit4:junit4]   2> 15800 T57 C4 P46114 /update {version=2&wt=javabin} {add=[37 (1430358247493074944)]} 0 1
[junit4:junit4]   2> 15819 T38 C3 P60986 /update {version=2&wt=javabin} {add=[10038 (1430358247512997888)]} 0 1
[junit4:junit4]   2> 15820 T36 C3 P60986 /update {version=2&wt=javabin} {add=[38 (1430358247514046464)]} 0 1
[junit4:junit4]   2> 15823 T58 C4 P46114 /update {version=2&wt=javabin} {add=[10038 (1430358247517192192)]} 0 1
[junit4:junit4]   2> 15823 T56 C4 P46114 /update {version=2&wt=javabin} {add=[38 (1430358247517192193)]} 0 1
[junit4:junit4]   2> 15853 T39 C3 P60986 /update {version=2&wt=javabin} {add=[39 (1430358247548649472)]} 0 1
[junit4:junit4]   2> 15853 T37 C3 P60986 /update {version=2&wt=javabin} {add=[10039 (1430358247548649473)]} 0 1
[junit4:junit4]   2> 15856 T59 C4 P46114 /update {version=2&wt=javabin} {add=[39 (1430358247551795200)]} 0 1
[junit4:junit4]   2> 15856 T57 C4 P46114 /update {version=2&wt=javabin} {add=[10039 (1430358247552843776)]} 0 0
[junit4:junit4]   2> 15932 T36 C3 P60986 /update {version=2&wt=javabin} {delete=[10038 (-1430358247632535552)]} 0 0
[junit4:junit4]   2> 15932 T38 C3 P60986 /update {version=2&wt=javabin} {delete=[38 (-1430358247632535553)]} 0 0
[junit4:junit4]   2> 15935 T58 C4 P46114 /update {version=2&wt=javabin} {delete=[10038 (-1430358247635681280)]} 0 0
[junit4:junit4]   2> 15935 T56 C4 P46114 /update {version=2&wt=javabin} {delete=[38 (-1430358247635681281)]} 0 0
[junit4:junit4]   2> 15938 T37 C3 P60986 /update {version=2&wt=javabin} {add=[10040 (1430358247637778433)]} 0 1
[junit4:junit4]   2> 15938 T39 C3 P60986 /update {version=2&wt=javabin} {add=[40 (1430358247637778432)]} 0 1
[junit4:junit4]   2> 15941 T57 C4 P46114 /update {version=2&wt=javabin} {add=[40 (1430358247640924161)]} 0 1
[junit4:junit4]   2> 15941 T59 C4 P46114 /update {version=2&wt=javabin} {add=[10040 (1430358247640924160)]} 0 1
[junit4:junit4]   2> 15971 T36 C3 P60986 /update {version=2&wt=javabin} {add=[41 (1430358247672381440)]} 0 1
[junit4:junit4]   2> 15971 T38 C3 P60986 /update {version=2&wt=javabin} {add=[10041 (1430358247672381441)]} 0 1
[junit4:junit4]   2> 15974 T58 C4 P46114 /update {version=2&wt=javabin} {add=[10041 (1430358247675527168)]} 0 1
[junit4:junit4]   2> 15974 T56 C4 P46114 /update {version=2&wt=javabin} {add=[41 (1430358247675527169)]} 0 1
[junit4:junit4]   2> 16045 T39 C3 P60986 /update {version=2&wt=javabin} {delete=[10039 (-1430358247751024641)]} 0 0
[junit4:junit4]   2> 16045 T37 C3 P60986 /update {version=2&wt=javabin} {delete=[39 (-1430358247751024640)]} 0 0
[junit4:junit4]   2> 16048 T59 C4 P46114 /update {version=2&wt=javabin} {delete=[10039 (-1430358247754170368)]} 0 0
[junit4:junit4]   2> 16048 T57 C4 P46114 /update {version=2&wt=javabin} {delete=[39 (-1430358247754170369)]} 0 0
[junit4:junit4]   2> 16051 T36 C3 P60986 /update {version=2&wt=javabin} {add=[10042 (1430358247757316096)]} 0 1
[junit4:junit4]   2> 16052 T38 C3 P60986 /update {version=2&wt=javabin} {add=[42 (1430358247757316097)]} 0 1
[junit4:junit4]   2> 16054 T58 C4 P46114 /update {version=2&wt=javabin} {add=[10042 (1430358247760461824)]} 0 0
[junit4:junit4]   2> 16055 T56 C4 P46114 /update {version=2&wt=javabin} {add=[42 (1430358247760461825)]} 0 1
[junit4:junit4]   2> 16060 T37 C3 P60986 /update {version=2&wt=javabin} {add=[10043 (1430358247765704704)]} 0 1
[junit4:junit4]   2> 16060 T39 C3 P60986 /update {version=2&wt=javabin} {add=[43 (1430358247765704705)]} 0 1
[junit4:junit4]   2> 16063 T59 C4 P46114 /update {version=2&wt=javabin} {add=[10043 (1430358247768850432)]} 0 1
[junit4:junit4]   2> 16063 T57 C4 P46114 /update {version=2&wt=javabin} {add=[43 (1430358247768850433)]} 0 1
[junit4:junit4]   2> 16074 T36 C3 P60986 /update {version=2&wt=javabin} {add=[10044 (1430358247780384768)]} 0 1
[junit4:junit4]   2> 16074 T38 C3 P60986 /update {version=2&wt=javabin} {add=[44 (1430358247780384769)]} 0 1
[junit4:junit4]   2> 16077 T58 C4 P46114 /update {version=2&wt=javabin} {add=[10044 (1430358247783530496)]} 0 1
[junit4:junit4]   2> 16077 T56 C4 P46114 /update {version=2&wt=javabin} {add=[44 (1430358247784579072)]} 0 1
[junit4:junit4]   2> 16108 T37 C3 P60986 /update {version=2&wt=javabin} {add=[10045 (1430358247816036352)]} 0 1
[junit4:junit4]   2> 16109 T39 C3 P60986 /update {version=2&wt=javabin} {add=[45 (1430358247817084928)]} 0 2
[junit4:junit4]   2> 16111 T59 C4 P46114 /update {version=2&wt=javabin} {add=[10045 (1430358247819182080)]} 0 1
[junit4:junit4]   2> 16111 T57 C4 P46114 /update {version=2&wt=javabin} {add=[45 (1430358247820230656)]} 0 0
[junit4:junit4]   2> 16205 T36 C3 P60986 /update {version=2&wt=javabin} {add=[10046 (1430358247917748224)]} 0 3
[junit4:junit4]   2> 16206 T38 C3 P60986 /update {version=2&wt=javabin} {add=[46 (1430358247917748225)]} 0 4
[junit4:junit4]   2> 16209 T56 C4 P46114 /update {version=2&wt=javabin} {add=[46 (1430358247921942528)]} 0 0
[junit4:junit4]   2> 16209 T58 C4 P46114 /update {version=2&wt=javabin} {add=[10046 (1430358247921942529)]} 0 1
[junit4:junit4]   2> 16229 T39 C3 P60986 /update {version=2&wt=javabin} {delete=[10043 (-1430358247943962624)]} 0 0
[junit4:junit4]   2> 16229 T37 C3 P60986 /update {version=2&wt=javabin} {delete=[43 (-1430358247943962625)]} 0 0
[junit4:junit4]   2> 16232 T57 C4 P46114 /update {version=2&wt=javabin} {delete=[43 (-1430358247947108352)]} 0 0
[junit4:junit4]   2> 16232 T59 C4 P46114 /update {version=2&wt=javabin} {delete=[10043 (-1430358247947108353)]} 0 0
[junit4:junit4]   2> 16235 T38 C3 P60986 /update {version=2&wt=javabin} {add=[10047 (1430358247949205505)]} 0 1
[junit4:junit4]   2> 16235 T36 C3 P60986 /update {version=2&wt=javabin} {add=[47 (1430358247949205504)]} 0 1
[junit4:junit4]   2> 16238 T56 C4 P46114 /update {version=2&wt=javabin} {add=[10047 (1430358247952351232)]} 0 1
[junit4:junit4]   2> 16238 T58 C4 P46114 /update {version=2&wt=javabin} {add=[47 (1430358247952351233)]} 0 1
[junit4:junit4]   2> 16317 T39 C3 P60986 /update {version=2&wt=javabin} {add=[10048 (1430358248035188737)]} 0 1
[junit4:junit4]   2> 16317 T37 C3 P60986 /update {version=2&wt=javabin} {add=[48 (1430358248035188736)]} 0 1
[junit4:junit4]   2> 16320 T57 C4 P46114 /update {version=2&wt=javabin} {add=[10048 (1430358248038334464)]} 0 1
[junit4:junit4]   2> 16320 T59 C4 P46114 /update {version=2&wt=javabin} {add=[48 (1430358248038334465)]} 0 1
[junit4:junit4]   2> 16355 T36 C3 P60986 /update {version=2&wt=javabin} {add=[10049 (1430358248076083200)]} 0 1
[junit4:junit4]   2> 16356 T38 C3 P60986 /update {version=2&wt=javabin} {add=[49 (1430358248076083201)]} 0 2
[junit4:junit4]   2> 16359 T56 C4 P46114 /update {version=2&wt=javabin} {add=[10049 (1430358248079228928)]} 0 1
[junit4:junit4]   2> 16359 T58 C4 P46114 /update {version=2&wt=javabin} {add=[49 (1430358248079228929)]} 0 1
[junit4:junit4]   2>  C2_STATE=coll:collection1 core:collection1 props:{collection=collection1, state=down, shard=shard1, node_name=127.0.0.1:34223_zr_%2Fxh, core=collection1, base_url=http://127.0.0.1:34223/zr_/xh}
[junit4:junit4]   2> 16370 T82 C2 P34223 oasc.RecoveryStrategy.doRecovery Attempting to PeerSync from http://127.0.0.1:46114/zr_/xh/collection1/ core=collection1 - recoveringAfterStartup=true
[junit4:junit4]   2> 16374 T82 C2 P34223 oascsi.HttpClientUtil.createClient Creating new http client, config:maxConnectionsPerHost=20&maxConnections=10000&connTimeout=30000&socketTimeout=30000&retry=false
[junit4:junit4]   2> 16377 T37 C3 P60986 /update {version=2&wt=javabin} {delete=[49 (-1430358248099151872)]} 0 0
[junit4:junit4]   2> 16377 T39 C3 P60986 /update {version=2&wt=javabin} {delete=[10049 (-1430358248099151873)]} 0 0
[junit4:junit4]   2> 16379 T82 C2 P34223 oasu.PeerSync.sync PeerSync: core=collection1 url=http://127.0.0.1:34223/zr_/xh START replicas=[http://127.0.0.1:46114/zr_/xh/collection1/] nUpdates=100
[junit4:junit4]   2> 16380 T59 C4 P46114 /update {version=2&wt=javabin} {delete=[10049 (-1430358248102297601)]} 0 0
[junit4:junit4]   2> 16380 T57 C4 P46114 /update {version=2&wt=javabin} {delete=[49 (-1430358248102297600)]} 0 0
[junit4:junit4]   2> 16384 T36 C3 P60986 /update {version=2&wt=javabin} {add=[50 (1430358248105443328)]} 0 2
[junit4:junit4]   2> 16385 T38 C3 P60986 /update {version=2&wt=javabin} {add=[10050 (1430358248105443329)]} 0 3
[junit4:junit4]   2> 16386 T82 C2 P34223 oasu.PeerSync.sync WARNING no frame of reference to tell of we've missed updates
[junit4:junit4]   2> 16386 T82 C2 P34223 oasc.RecoveryStrategy.doRecovery PeerSync Recovery was not successful - trying replication. core=collection1
[junit4:junit4]   2> 16386 T82 C2 P34223 oasc.RecoveryStrategy.doRecovery Starting Replication Recovery. core=collection1
[junit4:junit4]   2> 16387 T82 C2 P34223 oasc.RecoveryStrategy.doRecovery Begin buffering updates. core=collection1
[junit4:junit4]   2> 16387 T82 C2 P34223 oasu.UpdateLog.bufferUpdates Starting to buffer updates. FSUpdateLog{state=ACTIVE, tlog=tlog{file=./org.apache.solr.cloud.RecoveryZkTest-1364095908099/jetty2/tlog/tlog.0000000000000000000 refcount=1}}
[junit4:junit4]   2> 16388 T82 C2 P34223 oasc.RecoveryStrategy.replicate Attempting to replicate from http://127.0.0.1:46114/zr_/xh/collection1/. core=collection1
[junit4:junit4]   2> 16388 T56 C4 P46114 /update {version=2&wt=javabin} {add=[10050 (1430358248109637633)]} 0 1
[junit4:junit4]   2> 16388 T82 C2 P34223 oascsi.HttpClientUtil.createClient Creating new http client, config:maxConnections=128&maxConnectionsPerHost=32&followRedirects=false
[junit4:junit4]   2> 16388 T58 C4 P46114 /update {version=2&wt=javabin} {add=[50 (1430358248109637632)]} 0 1
[junit4:junit4]   2> 16395 T59 C4 P46114 REQ /get {version=2&getVersions=100&wt=javabin&distrib=false&qt=/get} status=0 QTime=0 
[junit4:junit4]   2> 16397 T57 C4 P46114 oasu.DirectUpdateHandler2.commit start commit{,optimize=false,openSearcher=false,waitSearcher=true,expungeDeletes=false,softCommit=false,prepareCommit=false}
[junit4:junit4]   2> 16446 T57 C4 P46114 oasc.SolrDeletionPolicy.onCommit SolrDeletionPolicy.onCommit: commits:num=2
[junit4:junit4]   2> 		commit{dir=MockDirWrapper(org.apache.lucene.store.RAMDirectory@efa86c lockFactory=org.apache.lucene.store.NativeFSLockFactory@d04473),segFN=segments_1,generation=1,filenames=[segments_1]
[junit4:junit4]   2> 		commit{dir=MockDirWrapper(org.apache.lucene.store.RAMDirectory@efa86c lockFactory=org.apache.lucene.store.NativeFSLockFactory@d04473),segFN=segments_2,generation=2,filenames=[_0.si, _0_Lucene40_0.frq, _0_nrm.cfe, _0.fnm, _0_1.del, _0_Lucene40_0.prx, _0_Lucene40_0.tip, _0.fdx, _0_nrm.cfs, _0_Lucene40_0.tim, segments_2, _0.fdt]
[junit4:junit4]   2> 16447 T57 C4 P46114 oasc.SolrDeletionPolicy.updateCommits newest commit = 2[_0.si, _0_Lucene40_0.frq, _0_nrm.cfe, _0.fnm, _0_1.del, _0_Lucene40_0.prx, _0_Lucene40_0.tip, _0.fdx, _0_nrm.cfs, _0_Lucene40_0.tim, segments_2, _0.fdt]
[junit4:junit4]   2> 16477 T57 C4 P46114 oass.SolrIndexSearcher.<init> Opening Searcher@199cc realtime
[junit4:junit4]   2> 16478 T57 C4 P46114 oasu.DirectUpdateHandler2.commit end_commit_flush
[junit4:junit4]   2> 16478 T57 C4 P46114 /update {version=2&openSearcher=false&wt=javabin&commit_end_point=true&waitSearcher=true&commit=true&softCommit=false} {commit=} 0 81
[junit4:junit4]   2> 16483 T36 C3 P60986 /update {version=2&wt=javabin} {add=[51 (1430358248209252352)]} 0 1
[junit4:junit4]   2> 16483 T37 C3 P60986 /update {version=2&wt=javabin} {add=[10051 (1430358248209252353)]} 0 1
[junit4:junit4]   2> 16487 T57 C4 P46114 /update {version=2&wt=javabin} {add=[10051 (1430358248213446656)]} 0 1
[junit4:junit4]   2> 16487 T59 C4 P46114 /update {version=2&wt=javabin} {add=[51 (1430358248212398080)]} 0 2
[junit4:junit4]   2> 16497 T82 C2 P34223 oash.ReplicationHandler.inform Commits will be reserved for  10000
[junit4:junit4]   2> 16498 T82 C2 P34223 oascsi.HttpClientUtil.createClient Creating new http client, config:connTimeout=5000&socketTimeout=20000&allowCompression=false&maxConnections=10000&maxConnectionsPerHost=10000
[junit4:junit4]   2> 16502 T82 C2 P34223 oash.SnapPuller.<init>  No value set for 'pollInterval'. Timer Task not started.
[junit4:junit4]   2> 16519 T58 C4 P46114 oash.ReplicationHandler.inform Commits will be reserved for  10000
[junit4:junit4]   2> 16519 T58 C4 P46114 REQ /replication {version=2&command=indexversion&wt=javabin&qt=/replication} status=0 QTime=15 
[junit4:junit4]   2> 16520 T82 C2 P34223 oash.SnapPuller.fetchLatestIndex Master's generation: 2
[junit4:junit4]   2> 16520 T82 C2 P34223 oash.SnapPuller.fetchLatestIndex Slave's generation: 1
[junit4:junit4]   2> 16520 T82 C2 P34223 oash.SnapPuller.fetchLatestIndex Starting replication process
[junit4:junit4]   2> 16524 T56 C4 P46114 REQ /replication {version=2&command=filelist&generation=2&wt=javabin&qt=/replication} status=0 QTime=2 
[junit4:junit4]   2> 16525 T82 C2 P34223 oash.SnapPuller.fetchLatestIndex Number of files in latest index in master: 12
[junit4:junit4]   2> 16525 T82 C2 P34223 oasc.CachingDirectoryFactory.get return new directory for ./org.apache.solr.cloud.RecoveryZkTest-1364095908099/jetty2/index.20130323203204620
[junit4:junit4]   2> 16526 T82 C2 P34223 oash.SnapPuller.fetchLatestIndex Starting download to MockDirWrapper(RateLimitedDirectoryWrapper(org.apache.lucene.store.RAMDirectory@2118fe lockFactory=org.apache.lucene.store.NativeFSLockFactory@cc9ace)) fullCopy=true
[junit4:junit4]   2> 16531 T57 C4 P46114 REQ /replication {command=filecontent&generation=2&wt=filestream&checksum=true&file=_0.fnm&qt=/replication} status=0 QTime=2 
[junit4:junit4]   2> 16543 T59 C4 P46114 REQ /replication {command=filecontent&generation=2&wt=filestream&checksum=true&file=_0_Lucene40_0.frq&qt=/replication} status=0 QTime=0 
[junit4:junit4]   2> 16546 T58 C4 P46114 REQ /replication {command=filecontent&generation=2&wt=filestream&checksum=true&file=_0_Lucene40_0.prx&qt=/replication} status=0 QTime=0 
[junit4:junit4]   2> 16553 T56 C4 P46114 REQ /replication {command=filecontent&generation=2&wt=filestream&checksum=true&file=_0_nrm.cfs&qt=/replication} status=0 QTime=0 
[junit4:junit4]   2> 16556 T57 C4 P46114 REQ /replication {command=filecontent&generation=2&wt=filestream&checksum=true&file=_0.fdx&qt=/replication} status=0 QTime=0 
[junit4:junit4]   2> 16579 T59 C4 P46114 REQ /replication {command=filecontent&generation=2&wt=filestream&checksum=true&file=segments_2&qt=/replication} status=0 QTime=17 
[junit4:junit4]   2> 16582 T39 C3 P60986 /update {version=2&wt=javabin} {add=[10052 (1430358248313061376)]} 0 1
[junit4:junit4]   2> 16582 T38 C3 P60986 /update {version=2&wt=javabin} {add=[52 (1430358248313061377)]} 0 1
[junit4:junit4]   2> 16583 T58 C4 P46114 REQ /replication {command=filecontent&generation=2&wt=filestream&checksum=true&file=_0_nrm.cfe&qt=/replication} status=0 QTime=0 
[junit4:junit4]   2> 16592 T56 C4 P46114 /update {version=2&wt=javabin} {add=[52 (1430358248322498560)]} 0 2
[junit4:junit4]   2> 16593 T57 C4 P46114 /update {version=2&wt=javabin} {add=[10052 (1430358248324595712)]} 0 1
[junit4:junit4]   2> 16594 T59 C4 P46114 REQ /replication {command=filecontent&generation=2&wt=filestream&checksum=true&file=_0.si&qt=/replication} status=0 QTime=0 
[junit4:junit4]   2> 16598 T58 C4 P46114 REQ /replication {command=filecontent&generation=2&wt=filestream&checksum=true&file=_0_1.del&qt=/replication} status=0 QTime=0 
[junit4:junit4]   2> 16605 T56 C4 P46114 REQ /replication {command=filecontent&generation=2&wt=filestream&checksum=true&file=_0_Lucene40_0.tip&qt=/replication} status=0 QTime=0 
[junit4:junit4]   2> 16609 T57 C4 P46114 REQ /replication {command=filecontent&generation=2&wt=filestream&checksum=true&file=_0_Lucene40_0.tim&qt=/replication} status=0 QTime=0 
[junit4:junit4]   2> 16615 T59 C4 P46114 REQ /replication {command=filecontent&generation=2&wt=filestream&checksum=true&file=_0.fdt&qt=/replication} status=0 QTime=0 
[junit4:junit4]   2> 16617 T82 C2 P34223 oash.SnapPuller.fetchLatestIndex Total time taken for download : 0 secs
[junit4:junit4]   2> 16617 T82 C2 P34223 oash.SnapPuller.modifyIndexProps New index installed. Updating index properties... index=index.20130323203204620
[junit4:junit4]   2> 16629 T82 C2 P34223 oasu.DefaultSolrCoreState.newIndexWriter Creating new IndexWriter...
[junit4:junit4]   2> 16629 T82 C2 P34223 oasu.DefaultSolrCoreState.newIndexWriter Waiting until IndexWriter is unused... core=collection1
[junit4:junit4]   2> 16630 T82 C2 P34223 oasu.DefaultSolrCoreState.newIndexWriter Rollback old IndexWriter... core=collection1
[junit4:junit4]   2> 16631 T82 C2 P34223 oasc.SolrCore.getNewIndexDir New index directory detected: old=./org.apache.solr.cloud.RecoveryZkTest-1364095908099/jetty2/index/ new=./org.apache.solr.cloud.RecoveryZkTest-1364095908099/jetty2/index.20130323203204620
[junit4:junit4]   2> 16634 T82 C2 P34223 oasc.SolrDeletionPolicy.onInit SolrDeletionPolicy.onInit: commits:num=1
[junit4:junit4]   2> 		commit{dir=MockDirWrapper(RateLimitedDirectoryWrapper(org.apache.lucene.store.RAMDirectory@2118fe lockFactory=org.apache.lucene.store.NativeFSLockFactory@cc9ace)),segFN=segments_2,generation=2,filenames=[_0.fnm, _0_nrm.cfe, _0_Lucene40_0.frq, _0.si, _0_1.del, _0_Lucene40_0.tip, _0_Lucene40_0.prx, _0_nrm.cfs, _0.fdx, _0_Lucene40_0.tim, segments_2, _0.fdt]
[junit4:junit4]   2> 16635 T82 C2 P34223 oasc.SolrDeletionPolicy.updateCommits newest commit = 2[_0.fnm, _0_nrm.cfe, _0_Lucene40_0.frq, _0.si, _0_1.del, _0_Lucene40_0.tip, _0_Lucene40_0.prx, _0_nrm.cfs, _0.fdx, _0_Lucene40_0.tim, segments_2, _0.fdt]
[junit4:junit4]   2> 16635 T82 C2 P34223 oasu.DefaultSolrCoreState.newIndexWriter New IndexWriter is ready to be used.
[junit4:junit4]   2> 16637 T82 C2 P34223 oass.SolrIndexSearcher.<init> Opening Searcher@1210707 main
[junit4:junit4]   2> 16644 T81 oasc.SolrCore.registerSearcher [collection1] Registered new searcher Searcher@1210707 main{StandardDirectoryReader(segments_2:3:nrt _0(4.3):C100/46)}
[junit4:junit4]   2> 16645 T82 C2 P34223 oash.SnapPuller$2.preClose removing old index files MockDirWrapper(org.apache.lucene.store.RAMDirectory@875033 lockFactory=org.apache.lucene.store.NativeFSLockFactory@498300)
[junit4:junit4]   2> 16645 T82 C2 P34223 oasc.CachingDirectoryFactory.closeDirectory Closing directory: ./org.apache.solr.cloud.RecoveryZkTest-1364095908099/jetty2/index
[junit4:junit4]   2> 16645 T82 C2 P34223 oash.SnapPuller$2.postClose removing old index directory MockDirWrapper(org.apache.lucene.store.RAMDirectory@875033 lockFactory=org.apache.lucene.store.NativeFSLockFactory@498300)
[junit4:junit4]   2> 16649 T82 C2 P34223 oasc.RecoveryStrategy.replay Replaying buffered documents. core=collection1
[junit4:junit4]   2> 16649 T90 C2 P34223 oasu.UpdateLog$LogReplayer.doReplay WARNING Starting log replay tlog{file=./org.apache.solr.cloud.RecoveryZkTest-1364095908099/jetty2/tlog/tlog.0000000000000000000 refcount=2} active=true starting pos=6982
[junit4:junit4]   2> 16650 T90 C2 P34223 oasu.DirectUpdateHandler2.commit start commit{flags=2,optimize=false,openSearcher=true,waitSearcher=true,expungeDeletes=false,softCommit=false,prepareCommit=false}
[junit4:junit4]   2> 16652 T90 C2 P34223 oasc.SolrDeletionPolicy.onCommit SolrDeletionPolicy.onCommit: commits:num=2
[junit4:junit4]   2> 		commit{dir=MockDirWrapper(RateLimitedDirectoryWrapper(org.apache.lucene.store.RAMDirectory@2118fe lockFactory=org.apache.lucene.store.NativeFSLockFactory@cc9ace)),segFN=segments_2,generation=2,filenames=[_0.fnm, _0_nrm.cfe, _0_Lucene40_0.frq, _0.si, _0_1.del, _0_Lucene40_0.tip, _0_Lucene40_0.prx, _0_nrm.cfs, _0.fdx, _0_Lucene40_0.tim, segments_2, _0.fdt]
[junit4:junit4]   2> 		commit{dir=MockDirWrapper(RateLimitedDirectoryWrapper(org.apache.lucene.store.RAMDirectory@2118fe lockFactory=org.apache.lucene.store.NativeFSLockFactory@cc9ace)),segFN=segments_3,generation=3,filenames=[_0.fnm, _0_nrm.cfe, _0_Lucene40_0.frq, _0.si, _0_1.del, _0_Lucene40_0.tip, _0_Lucene40_0.prx, segments_3, _0_nrm.cfs, _0.fdx, _0_Lucene40_0.tim, _0.fdt]
[junit4:junit4]   2> 16652 T90 C2 P34223 oasc.SolrDeletionPolicy.updateCommits newest commit = 3[_0.fnm, _0_nrm.cfe, _0_Lucene40_0.frq, _0.si, _0_1.del, _0_Lucene40_0.tip, _0_Lucene40_0.prx, segments_3, _0_nrm.cfs, _0.fdx, _0_Lucene40_0.tim, _0.fdt]
[junit4:junit4]   2> 16653 T90 C2 P34223 oass.SolrIndexSearcher.<init> Opening Searcher@1f9c0c main
[junit4:junit4]   2> 16654 T90 C2 P34223 oasu.DirectUpdateHandler2.commit end_commit_flush
[junit4:junit4]   2> 16655 T81 oasc.SolrCore.registerSearcher [collection1] Registered new searcher Searcher@1f9c0c main{StandardDirectoryReader(segments_2:3:nrt _0(4.3):C100/46)}
[junit4:junit4]   2> 16655 T90 C2 P34223 [collection1] {} 0 6
[junit4:junit4]   2> 16656 T90 C2 P34223 oasu.UpdateLog$LogReplayer.run WARNING Log replay finished. recoveryInfo=RecoveryInfo{adds=0 deletes=0 deleteByQuery=0 errors=0 positionOfStart=6982}
[junit4:junit4]   2> 16656 T82 C2 P34223 oasc.RecoveryStrategy.doRecovery Replication Recovery was successful - registering as Active. core=collection1
[junit4:junit4]   2> 16656 T82 C2 P34223 oasc.ZkController.publish publishing core=collection1 state=active
[junit4:junit4]   2> 16656 T82 C2 P34223 oasc.ZkController.publish numShards not found on descriptor - reading it from system property
[junit4:junit4]   2> 16658 T82 C2 P34223 oasc.RecoveryStrategy.doRecovery Finished recovery process. core=collection1
[junit4:junit4]   2> 16668 T36 C3 P60986 /update {version=2&wt=javabin} {delete=[51 (-1430358248404287488)]} 0 1
[junit4:junit4]   2> 16668 T37 C3 P60986 /update {version=2&wt=javabin} {delete=[10051 (-1430358248404287489)]} 0 0
[junit4:junit4]   2> 16670 T58 C4 P46114 /update {version=2&wt=javabin} {delete=[51 (-1430358248406384640)]} 0 0
[junit4:junit4]   2> 16671 T56 C4 P46114 /update {version=2&wt=javabin} {delete=[10051 (-1430358248406384641)]} 0 1
[junit4:junit4]   2> 16673 T39 C3 P60986 /update {version=2&wt=javabin} {add=[53 (1430358248408481792)]} 0 1
[junit4:junit4]   2> 16673 T38 C3 P60986 /update {version=2&wt=javabin} {add=[10053 (1430358248409530368)]} 0 0
[junit4:junit4]   2> 16676 T57 C4 P46114 /update {version=2&wt=javabin} {add=[53 (1430358248411627520)]} 0 1
[junit4:junit4]   2> 16676 T59 C4 P46114 /update {version=2&wt=javabin} {add=[10053 (1430358248412676096)]} 0 1
[junit4:junit4]   2> 16722 T44 oascc.ZkStateReader.updateClusterState Updating cloud state from ZooKeeper... 
[junit4:junit4]   2> 16723 T44 oasc.Overseer$ClusterStateUpdater.updateState Update state numShards=1 message={
[junit4:junit4]   2> 	  "operation":"state",
[junit4:junit4]   2> 	  "collection":"collection1",
[junit4:junit4]   2> 	  "numShards":"1",
[junit4:junit4]   2> 	  "core_node_name":"3",
[junit4:junit4]   2> 	  "state":"active",
[junit4:junit4]   2> 	  "shard":"shard1",
[junit4:junit4]   2> 	  "node_name":"127.0.0.1:34223_zr_%2Fxh",
[junit4:junit4]   2> 	  "core":"collection1",
[junit4:junit4]   2> 	  "roles":null,
[junit4:junit4]   2> 	  "base_url":"http://127.0.0.1:34223/zr_/xh"}
[junit4:junit4]   2> 16726 T79 oascc.ZkStateReader$2.process A cluster state change: WatchedEvent state:SyncConnected type:NodeDataChanged path:/clusterstate.json, has occurred - updating... (live nodes size: 3)
[junit4:junit4]   2> 16726 T43 oascc.ZkStateReader$2.process A cluster state change: WatchedEvent state:SyncConnected type:NodeDataChanged path:/clusterstate.json, has occurred - updating... (live nodes size: 3)
[junit4:junit4]   2> 16726 T63 oascc.ZkStateReader$2.process A cluster state change: WatchedEvent state:SyncConnected type:NodeDataChanged path:/clusterstate.json, has occurred - updating... (live nodes size: 3)
[junit4:junit4]   2> 16726 T50 oascc.ZkStateReader$2.process A cluster state change: WatchedEvent state:SyncConnected type:NodeDataChanged path:/clusterstate.json, has occurred - updating... (live nodes size: 3)
[junit4:junit4]   2> 16748 T36 C3 P60986 /update {version=2&wt=javabin} {delete=[52 (-1430358248488173568)]} 0 1
[junit4:junit4]   2> 16748 T37 C3 P60986 /update {version=2&wt=javabin} {delete=[10052 (-1430358248488173569)]} 0 1
[junit4:junit4]   2>  C2_STATE=coll:collection1 core:collection1 props:{collection=collection1, state=active, shard=shard1, node_name=127.0.0.1:34223_zr_%2Fxh, core=collection1, base_url=http://127.0.0.1:34223/zr_/xh}
[junit4:junit4]   2> 16753 T72 C2 P34223 /update {version=2&wt=javabin&update.distrib=FROMLEADER&distrib.from=http://127.0.0.1:46114/zr_/xh/collection1/} {delete=[10052 (-1430358248490270720)]} 0 1
[junit4:junit4]   2> 16753 T73 C2 P34223 /update {version=2&wt=javabin&update.distrib=FROMLEADER&distrib.from=http://127.0.0.1:46114/zr_/xh/collection1/} {delete=[52 (-1430358248490270721)]} 0 1
[junit4:junit4]   2> 16754 T56 C4 P46114 /update {version=2&wt=javabin} {delete=[52 (-1430358248490270721)]} 0 4
[junit4:junit4]   2> 16754 T58 C4 P46114 /update {version=2&wt=javabin} {delete=[10052 (-1430358248490270720)]} 0 4
[junit4:junit4]   2> 16757 T38 C3 P60986 /update {version=2&wt=javabin} {add=[54 (1430358248496562177)]} 0 1
[junit4:junit4]   2> 16757 T39 C3 P60986 /update {version=2&wt=javabin} {add=[10054 (1430358248496562176)]} 0 1
[junit4:junit4]   2> 16763 T74 C2 P34223 /update {version=2&wt=javabin&update.distrib=FROMLEADER&distrib.from=http://127.0.0.1:46114/zr_/xh/collection1/} {add=[54 (1430358248499707904)]} 0 2
[junit4:junit4]   2> 16763 T75 C2 P34223 /update {version=2&wt=javabin&update.distrib=FROMLEADER&distrib.from=http://127.0.0.1:46114/zr_/xh/collection1/} {add=[10054 (1430358248499707905)]} 0 1
[junit4:junit4]   2> 16764 T57 C4 P46114 /update {version=2&wt=javabin} {add=[54 (1430358248499707904)]} 0 5
[junit4:junit4]   2> 16764 T59 C4 P46114 /update {version=2&wt=javabin} {add=[10054 (1430358248499707905)]} 0 5
[junit4:junit4]   2> 16784 T37 C3 P60986 /update {version=2&wt=javabin} {delete=[53 (-1430358248524873728)]} 0 1
[junit4:junit4]   2> 16784 T36 C3 P60986 /update {version=2&wt=javabin} {delete=[10053 (-1430358248524873729)]} 0 1
[junit4:junit4]   2> 16788 T73 C2 P34223 /update {version=2&wt=javabin&update.distrib=FROMLEADER&distrib.from=http://127.0.0.1:46114/zr_/xh/collection1/} {delete=[53 (-1430358248528019456)]} 0 0
[junit4:junit4]   2> 16788 T72 C2 P34223 /update {version=2&wt=javabin&update.distrib=FROMLEADER&distrib.from=http://127.0.0.1:46114/zr_/xh/collection1/} {delete=[10053 (-1430358248528019457)]} 0 0
[junit4:junit4]   2> 16789 T56 C4 P46114 /update {version=2&wt=javabin} {delete=[53 (-1430358248528019456)]} 0 3
[junit4:junit4]   2> 16793 T58 C4 P46114 /update {version=2&wt=javabin} {delete=[10053 (-1430358248528019457)]} 0 7
[junit4:junit4]   2> 16796 T38 C3 P60986 /update {version=2&wt=javabin} {add=[55 (1430358248537456640)]} 0 1
[junit4:junit4]   2> 16796 T39 C3 P60986 /update {version=2&wt=javabin} {add=[10055 (1430358248537456641)]} 0 1
[junit4:junit4]   2> 16801 T74 C2 P34223 /update {version=2&wt=javabin&update.distrib=FROMLEADER&distrib.from=http://127.0.0.1:46114/zr_/xh/collection1/} {add=[55 (1430358248540602368)]} 0 1
[junit4:junit4]   2> 16802 T57 C4 P46114 /update {version=2&wt=javabin} {add=[55 (1430358248540602368)]} 0 4
[junit4:junit4]   2> 16802 T75 C2 P34223 /update {version=2&wt=javabin&update.distrib=FROMLEADER&distrib.from=http://127.0.0.1:46114/zr_/xh/collection1/} {add=[10055 (1430358248541650944)]} 0 1
[junit4:junit4]   2> 16802 T59 C4 P46114 /update {version=2&wt=javabin} {add=[10055 (1430358248541650944)]} 0 3
[junit4:junit4]   2> 16815 T37 C3 P60986 /update {version=2&wt=javabin} {add=[56 (1430358248557379584)]} 0 1
[junit4:junit4]   2> 16815 T36 C3 P60986 /update {version=2&wt=javabin} {add=[10056 (1430358248558428160)]} 0 0
[junit4:junit4]   2> 16821 T73 C2 P34223 /update {version=2&wt=javabin&update.distrib=FROMLEADER&distrib.from=http://127.0.0.1:46114/zr_/xh/collection1/} {add=[56 (1430358248560525312)]} 0 1
[junit4:junit4]   2> 16821 T72 C2 P34223 /update {version=2&wt=javabin&update.distrib=FROMLEADER&distrib.from=http://127.0.0.1:46114/zr_/xh/collection1/} {add=[10056 (1430358248560525313)]} 0 1
[junit4:junit4]   2> 16822 T56 C4 P46114 /update {version=2&wt=javabin} {add=[56 (1430358248560525312)]} 0 5
[junit4:junit4]   2> 16822 T58 C4 P46114 /update {version=2&wt=javabin} {add=[10056 (1430358248560525313)]} 0 5
[junit4:junit4]   2> 16911 T39 C3 P60986 /update {version=2&wt=javabin} {delete=[10054 (-1430358248659091456)]} 0 0
[junit4:junit4]   2> 16911 T38 C3 P60986 /update {version=2&wt=javabin} {delete=[54 (-1430358248659091457)]} 0 0
[junit4:junit4]   2> 16916 T74 C2 P34223 /update {version=2&wt=javabin&update.distrib=FROMLEADER&distrib.from=http://127.0.0.1:46114/zr_/xh/collection1/} {delete=[54 (-1430358248662237184)]} 0 0
[junit4:junit4]   2> 16916 T75 C2 P34223 /update {version=2&wt=javabin&update.distrib=FROMLEADER&distrib.from=http://127.0.0.1:46114/zr_/xh/collection1/} {delete=[10054 (-1430358248662237185)]} 0 0
[junit4:junit4]   2> 16917 T57 C4 P46114 /update {version=2&wt=javabin} {delete=[54 (-1430358248662237184)]} 0 3
[junit4:junit4]   2> 16918 T56 C4 P46114 /update {version=2&wt=javabin} {delete=[10054 (-1430358248662237185)]} 0 4
[junit4:junit4]   2> 16920 T36 C3 P60986 /update {version=2&wt=javabin} {add=[57 (1430358248668528640)]} 0 1
[junit4:junit4]   2> 16921 T36 C3 P60986 /update {version=2&wt=javabin} {add=[10057 (1430358248669577216)]} 0 0
[junit4:junit4]   2> 16925 T73 C2 P34223 /update {version=2&wt=javabin&update.distrib=FROMLEADER&distrib.from=http://127.0.0.1:46114/zr_/xh/collection1/} {add=[57 (1430358248670625792)]} 0 0
[junit4:junit4]   2> 16926 T59 C4 P46114 /update {version=2&wt=javabin} {add=[57 (1430358248670625792)]} 0 4
[junit4:junit4]   2> 16926 T72 C2 P34223 /update {version=2&wt=javabin&update.distrib=FROMLEADER&distrib.from=http://127.0.0.1:46114/zr_/xh/collection1/} {add=[10057 (1430358248672722944)]} 0 0
[junit4:junit4]   2> 16927 T58 C4 P46114 /update {version=2&wt=javabin} {add=[10057 (1430358248672722944)]} 0 3
[junit4:junit4]   2> 17019 T38 C3 P60986 /update {version=2&wt=javabin} {add=[58 (1430358248772337664)]} 0 1
[junit4:junit4]   2> 17020 T39 C3 P60986 /update {version=2&wt=javabin} {add=[10058 (1430358248772337665)]} 0 1
[junit4:junit4]   2> 17026 T74 C2 P34223 /update {version=2&wt=javabin&update.distrib=FROMLEADER&distrib.from=http://127.0.0.1:46114/zr_/xh/collection1/} {add=[58 (1430358248775483392)]} 0 1
[junit4:junit4]   2> 17027 T75 C2 P34223 /update {version=2&wt=javabin&update.distrib=FROMLEADER&distrib.from=http://127.0.0.1:46114/zr_/xh/collection1/} {add=[10058 (1430358248776531968)]} 0 1
[junit4:junit4]   2> 17027 T57 C4 P46114 /update {version=2&wt=javabin} {add=[58 (1430358248775483392)]} 0 5
[junit4:junit4]   2> 17027 T56 C4 P46114 /update {version=2&wt=javabin} {add=[10058 (1430358248776531968)]} 0 4
[junit4:junit4]   2> 17031 T37 C3 P60986 /update {version=2&wt=javabin} {add=[59 (1430358248783872000)]} 0 1
[junit4:junit4]   2> 17031 T36 C3 P60986 /update {version=2&wt=javabin} {add=[10059 (1430358248783872001)]} 0 1
[junit4:junit4]   2> 17037 T73 C2 P34223 /update {version=2&wt=javabin&update.distrib=FROMLEADER&distrib.from=http://127.0.0.1:46114/zr_/xh/collection1/} {add=[59 (1430358248788066305)]} 0 1
[junit4:junit4]   2> 17038 T72 C2 P34223 /update {version=2&wt=javabin&update.distrib=FROMLEADER&distrib.from=http://127.0.0.1:46114/zr_/xh/collection1/} {add=[10059 (1430358248788066304)]} 0 1
[junit4:junit4]   2> 17038 T59 C4 P46114 /update {version=2&wt=javabin} {add=[59 (1430358248788066305)]} 0 5
[junit4:junit4]   2> 17039 T58 C4 P46114 /update {version=2&wt=javabin} {add=[10059 (1430358248788066304)]} 0 6
[junit4:junit4]   2> 17090 T20 oasc.ZkController.publish publishing core=collection1 state=down
[junit4:junit4]   2> 17091 T20 oasc.ZkController.publish numShards not found on descriptor - reading it from system property
[junit4:junit4]   2> 17094 T20 oasc.SolrCore.close [collection1]  CLOSING SolrCore org.apache.solr.core.SolrCore@c6e780
[junit4:junit4]   2> 17108 T39 C3 P60986 /update {version=2&wt=javabin} {delete=[10057 (-1430358248865660929)]} 0 0
[junit4:junit4]   2> 17108 T38 C3 P60986 /update {version=2&wt=javabin} {delete=[57 (-1430358248865660928)]} 0 0
[junit4:junit4]   2> 17113 T75 C2 P34223 /update {version=2&wt=javabin&update.distrib=FROMLEADER&distrib.from=http://127.0.0.1:46114/zr_/xh/collection1/} {delete=[10057 (-1430358248868806656)]} 0 0
[junit4:junit4]   2> 17113 T74 C2 P34223 /update {version=2&wt=javabin&update.distrib=FROMLEADER&distrib.from=http://127.0.0.1:46114/zr_/xh/collection1/} {delete=[57 (-1430358248868806657)]} 0 0
[junit4:junit4]   2> 17113 T74 C2 P34223 oasc.SolrCore.close [collection1]  CLOSING SolrCore org.apache.solr.core.SolrCore@c6e780
[junit4:junit4]   2> 17114 T57 C4 P46114 /update {version=2&wt=javabin} {delete=[10057 (-1430358248868806656)]} 0 3
[junit4:junit4]   2> 17117 T74 C2 P34223 oasc.SolrException.log SEVERE org.apache.solr.common.SolrException: Failed to unregister info bean: org.apache.solr.handler.StandardRequestHandler
[junit4:junit4]   2> 		at org.apache.solr.core.JmxMonitoredMap.unregister(JmxMonitoredMap.java:178)
[junit4:junit4]   2> 		at org.apache.solr.core.JmxMonitoredMap.clear(JmxMonitoredMap.java:116)
[junit4:junit4]   2> 		at org.apache.solr.core.SolrCore.close(SolrCore.java:972)
[junit4:junit4]   2> 		at org.apache.solr.servlet.SolrDispatchFilter.doFilter(SolrDispatchFilter.java:374)
[junit4:junit4]   2> 		at org.apache.solr.servlet.SolrDispatchFilter.doFilter(SolrDispatchFilter.java:141)
[junit4:junit4]   2> 		at org.eclipse.jetty.servlet.ServletHandler$CachedChain.doFilter(ServletHandler.java:1307)
[junit4:junit4]   2> 		at org.apache.solr.client.solrj.embedded.JettySolrRunner$DebugFilter.doFilter(JettySolrRunner.java:135)
[junit4:junit4]   2> 		at org.eclipse.jetty.servlet.ServletHandler$CachedChain.doFilter(ServletHandler.java:1307)
[junit4:junit4]   2> 		at org.eclipse.jetty.servlet.ServletHandler.doHandle(ServletHandler.java:453)
[junit4:junit4]   2> 		at org.eclipse.jetty.server.session.SessionHandler.doHandle(SessionHandler.java:229)
[junit4:junit4]   2> 		at org.eclipse.jetty.server.handler.ScopedHandler.handle(ScopedHandler.java:137)
[junit4:junit4]   2> 		at org.eclipse.jetty.server.handler.GzipHandler.handle(GzipHandler.java:275)
[junit4:junit4]   2> 		at org.eclipse.jetty.server.handler.ContextHandler.doHandle(ContextHandler.java:1074)
[junit4:junit4]   2> 		at org.eclipse.jetty.servlet.ServletHandler.doScope(ServletHandler.java:382)
[junit4:junit4]   2> 		at org.eclipse.jetty.server.session.SessionHandler.doScope(SessionHandler.java:193)
[junit4:junit4]   2> 		at org.eclipse.jetty.server.handler.ContextHandler.doScope(ContextHandler.java:1006)
[junit4:junit4]   2> 		at org.eclipse.jetty.server.handler.ScopedHandler.handle(ScopedHandler.java:135)
[junit4:junit4]   2> 		at org.eclipse.jetty.server.handler.HandlerWrapper.handle(HandlerWrapper.java:116)
[junit4:junit4]   2> 		at org.eclipse.jetty.server.Server.handle(Server.java:365)
[junit4:junit4]   2> 		at org.eclipse.jetty.server.AbstractHttpConnection.handleRequest(AbstractHttpConnection.java:485)
[junit4:junit4]   2> 		at org.eclipse.jetty.server.AbstractHttpConnection.content(AbstractHttpConnection.java:937)
[junit4:junit4]   2> 		at org.eclipse.jetty.server.AbstractHttpConnection$RequestHandler.content(AbstractHttpConnection.java:998)
[junit4:junit4]   2> 		at org.eclipse.jetty.http.HttpParser.parseNext(HttpParser.java:948)
[junit4:junit4]   2> 		at org.eclipse.jetty.http.HttpParser.parseAvailable(HttpParser.java:240)
[junit4:junit4]   2> 		at org.eclipse.jetty.server.AsyncHttpConnection.handle(AsyncHttpConnection.java:82)
[junit4:junit4]   2> 		at org.eclipse.jetty.io.nio.SelectChannelEndPoint.handle(SelectChannelEndPoint.java:628)
[junit4:junit4]   2> 		at org.eclipse.jetty.io.nio.SelectChannelEndPoint$1.run(SelectChannelEndPoint.java:52)
[junit4:junit4]   2> 		at org.eclipse.jetty.util.thread.QueuedThreadPool.runJob(QueuedThreadPool.java:608)
[junit4:junit4]   2> 		at org.eclipse.jetty.util.thread.QueuedThreadPool$3.run(QueuedThreadPool.java:543)
[junit4:junit4]   2> 		at java.lang.Thread.run(Thread.java:722)
[junit4:junit4]   2> 	Caused by: javax.management.InstanceNotFoundException: solr/collection1:id=org.apache.solr.handler.StandardRequestHandler,type=org.apache.solr.handler.StandardRequestHandler
[junit4:junit4]   2> 		at com.sun.jmx.interceptor.DefaultMBeanServerInterceptor.getMBean(DefaultMBeanServerInterceptor.java:1095)
[junit4:junit4]   2> 		at com.sun.jmx.interceptor.DefaultMBeanServerInterceptor.exclusiveUnregisterMBean(DefaultMBeanServerInterceptor.java:427)
[junit4:junit4]   2> 		at com.sun.jmx.interceptor.DefaultMBeanServerInterceptor.unregisterMBean(DefaultMBeanServerInterceptor.java:415)
[junit4:junit4]   2> 		at com.sun.jmx.mbeanserver.JmxMBeanServer.unregisterMBean(JmxMBeanServer.java:537)
[junit4:junit4]   2> 		at org.apache.solr.core.JmxMonitoredMap.unregister(JmxMonitoredMap.java:175)
[junit4:junit4]   2> 		... 29 more
[junit4:junit4]   2> 	
[junit4:junit4]   2> 17118 T74 C2 P34223 oasu.DirectUpdateHandler2.close closing DirectUpdateHandler2{commits=1,autocommits=0,soft autocommits=0,optimizes=0,rollbacks=0,expungeDeletes=0,docsPending=12,adds=12,deletesById=8,deletesByQuery=0,errors=0,cumulative_adds=60,cumulative_deletesById=32,cumulative_deletesByQuery=0,cumulative_errors=0}
[junit4:junit4]   2> 17121 T74 C2 P34223 oasu.SolrCoreState.decrefSolrCoreState Closing SolrCoreState
[junit4:junit4]   2> 17121 T37 C3 P60986 /update {version=2&wt=javabin} {add=[10060 (1430358248876146688)]} 0 4
[junit4:junit4]   2> 17121 T74 C2 P34223 oasu.DefaultSolrCoreState.closeIndexWriter SolrCoreState ref count has reached 0 - closing IndexWriter
[junit4:junit4]   2> 17124 T74 C2 P34223 oasu.DefaultSolrCoreState.closeIndexWriter closing IndexWriter with IndexWriterCloser
[junit4:junit4]   2> 17130 T20 oasu.DirectUpdateHandler2.close closing DirectUpdateHandler2{commits=1,autocommits=0,soft autocommits=0,optimizes=0,rollbacks=0,expungeDeletes=0,docsPending=0,adds=12,deletesById=8,deletesByQuery=0,errors=0,cumulative_adds=60,cumulative_deletesById=32,cumulative_deletesByQuery=0,cumulative_errors=0}
[junit4:junit4]   2> 17133 T73 C2 P34223 /update {version=2&wt=javabin&update.distrib=FROMLEADER&distrib.from=http://127.0.0.1:46114/zr_/xh/collection1/} {} 0 1
[junit4:junit4]   2> 17134 T73 C2 P34223 oasc.SolrException.log SEVERE org.apache.solr.common.SolrException: SolrCoreState already closed
[junit4:junit4]   2> 		at org.apache.solr.update.DefaultSolrCoreState.getIndexWriter(DefaultSolrCoreState.java:85)
[junit4:junit

[...truncated too long message...]

e.solr.client.solrj.impl.HttpSolrServer.request(HttpSolrServer.java:375)
[junit4:junit4]    > 	at org.apache.solr.client.solrj.impl.HttpSolrServer.request(HttpSolrServer.java:181)
[junit4:junit4]    > 	at org.apache.solr.client.solrj.request.AbstractUpdateRequest.process(AbstractUpdateRequest.java:117)
[junit4:junit4]    > 	at org.apache.solr.client.solrj.SolrServer.add(SolrServer.java:116)
[junit4:junit4]    > 	at org.apache.solr.client.solrj.SolrServer.add(SolrServer.java:102)
[junit4:junit4]    > 	at org.apache.solr.cloud.BasicDistributedZk2Test.testNodeWithoutCollectionForwarding(BasicDistributedZk2Test.java:197)
[junit4:junit4]    > 	at org.apache.solr.cloud.BasicDistributedZk2Test.doTest(BasicDistributedZk2Test.java:89)
[junit4:junit4]    > 	at org.apache.solr.BaseDistributedSearchTestCase.testDistribSearch(BaseDistributedSearchTestCase.java:806)
[junit4:junit4]    > 	at sun.reflect.NativeMethodAccessorImpl.invoke0(Native Method)
[junit4:junit4]    > 	at sun.reflect.NativeMethodAccessorImpl.invoke(NativeMethodAccessorImpl.java:57)
[junit4:junit4]    > 	at sun.reflect.DelegatingMethodAccessorImpl.invoke(DelegatingMethodAccessorImpl.java:43)
[junit4:junit4]    > 	at java.lang.reflect.Method.invoke(Method.java:487)
[junit4:junit4]    > 	at com.carrotsearch.randomizedtesting.RandomizedRunner.invoke(RandomizedRunner.java:1559)
[junit4:junit4]    > 	at com.carrotsearch.randomizedtesting.RandomizedRunner.access$600(RandomizedRunner.java:79)
[junit4:junit4]    > 	at com.carrotsearch.randomizedtesting.RandomizedRunner$6.evaluate(RandomizedRunner.java:737)
[junit4:junit4]    > 	at com.carrotsearch.randomizedtesting.RandomizedRunner$7.evaluate(RandomizedRunner.java:773)
[junit4:junit4]    > 	at com.carrotsearch.randomizedtesting.RandomizedRunner$8.evaluate(RandomizedRunner.java:787)
[junit4:junit4]    > 	at com.carrotsearch.randomizedtesting.rules.SystemPropertiesRestoreRule$1.evaluate(SystemPropertiesRestoreRule.java:53)
[junit4:junit4]    > 	at org.apache.lucene.util.TestRuleSetupTeardownChained$1.evaluate(TestRuleSetupTeardownChained.java:50)
[junit4:junit4]    > 	at org.apache.lucene.util.TestRuleFieldCacheSanity$1.evaluate(TestRuleFieldCacheSanity.java:51)
[junit4:junit4]    > 	at org.apache.lucene.util.AbstractBeforeAfterRule$1.evaluate(AbstractBeforeAfterRule.java:46)
[junit4:junit4]    > 	at com.carrotsearch.randomizedtesting.rules.SystemPropertiesInvariantRule$1.evaluate(SystemPropertiesInvariantRule.java:55)
[junit4:junit4]    > 	at org.apache.lucene.util.TestRuleThreadAndTestName$1.evaluate(TestRuleThreadAndTestName.java:49)
[junit4:junit4]    > 	at org.apache.lucene.util.TestRuleIgnoreAfterMaxFailures$1.evaluate(TestRuleIgnoreAfterMaxFailures.java:70)
[junit4:junit4]    > 	at org.apache.lucene.util.TestRuleMarkFailure$1.evaluate(TestRuleMarkFailure.java:48)
[junit4:junit4]    > 	at com.carrotsearch.randomizedtesting.rules.StatementAdapter.evaluate(StatementAdapter.java:36)
[junit4:junit4]    > 	at com.carrotsearch.randomizedtesting.ThreadLeakControl$StatementRunner.run(ThreadLeakControl.java:358)
[junit4:junit4]    > 	at com.carrotsearch.randomizedtesting.ThreadLeakControl.forkTimeoutingTask(ThreadLeakControl.java:782)
[junit4:junit4]    > 	at com.carrotsearch.randomizedtesting.ThreadLeakControl$3.evaluate(ThreadLeakControl.java:442)
[junit4:junit4]    > 	at com.carrotsearch.randomizedtesting.RandomizedRunner.runSingleTest(RandomizedRunner.java:746)
[junit4:junit4]    > 	at com.carrotsearch.randomizedtesting.RandomizedRunner$3.evaluate(RandomizedRunner.java:648)
[junit4:junit4]    > 	at com.carrotsearch.randomizedtesting.RandomizedRunner$4.evaluate(RandomizedRunner.java:682)
[junit4:junit4]    > 	at com.carrotsearch.randomizedtesting.RandomizedRunner$5.evaluate(RandomizedRunner.java:693)
[junit4:junit4]    > 	at com.carrotsearch.randomizedtesting.rules.StatementAdapter.evaluate(StatementAdapter.java:36)
[junit4:junit4]    > 	at com.carrotsearch.randomizedtesting.rules.SystemPropertiesRestoreRule$1.evaluate(SystemPropertiesRestoreRule.java:53)
[junit4:junit4]    > 	at org.apache.lucene.util.AbstractBeforeAfterRule$1.evaluate(AbstractBeforeAfterRule.java:46)
[junit4:junit4]    > 	at org.apache.lucene.util.TestRuleStoreClassName$1.evaluate(TestRuleStoreClassName.java:42)
[junit4:junit4]    > 	at com.carrotsearch.randomizedtesting.rules.SystemPropertiesInvariantRule$1.evaluate(SystemPropertiesInvariantRule.java:55)
[junit4:junit4]    > 	at com.carrotsearch.randomizedtesting.rules.NoShadowingOrOverridesOnMethodsRule$1.evaluate(NoShadowingOrOverridesOnMethodsRule.java:39)
[junit4:junit4]    > 	at com.carrotsearch.randomizedtesting.rules.NoShadowingOrOverridesOnMethodsRule$1.evaluate(NoShadowingOrOverridesOnMethodsRule.java:39)
[junit4:junit4]    > 	at com.carrotsearch.randomizedtesting.rules.StatementAdapter.evaluate(StatementAdapter.java:36)
[junit4:junit4]    > 	at org.apache.lucene.util.TestRuleAssertionsRequired$1.evaluate(TestRuleAssertionsRequired.java:43)
[junit4:junit4]    > 	at org.apache.lucene.util.TestRuleMarkFailure$1.evaluate(TestRuleMarkFailure.java:48)
[junit4:junit4]    > 	at org.apache.lucene.util.TestRuleIgnoreAfterMaxFailures$1.evaluate(TestRuleIgnoreAfterMaxFailures.java:70)
[junit4:junit4]    > 	at org.apache.lucene.util.TestRuleIgnoreTestSuites$1.evaluate(TestRuleIgnoreTestSuites.java:55)
[junit4:junit4]    > 	at com.carrotsearch.randomizedtesting.rules.StatementAdapter.evaluate(StatementAdapter.java:36)
[junit4:junit4]    > 	at com.carrotsearch.randomizedtesting.ThreadLeakControl$StatementRunner.run(ThreadLeakControl.java:358)
[junit4:junit4]    > 	at java.lang.Thread.run(Thread.java:722)
[junit4:junit4]   2> 32642 T1409 oas.SolrTestCaseJ4.deleteCore ###deleteCore
[junit4:junit4]   2> 32647 T1408 ccr.ThreadLeakControl.checkThreadLeaks WARNING Will linger awaiting termination of 3 leaked thread(s).
[junit4:junit4]   2> 32711 T1483 oascc.ZkStateReader$3.process WARNING ZooKeeper watch triggered, but Solr cannot talk to ZK
[junit4:junit4]   2> 32711 T1483 oascc.ZkStateReader$2.process A cluster state change: WatchedEvent state:SyncConnected type:NodeChildrenChanged path:/live_nodes, has occurred - updating... (live nodes size: 2)
[junit4:junit4]   2> 32712 T1483 oascc.ZkStateReader$2.process WARNING ZooKeeper watch triggered, but Solr cannot talk to ZK
[junit4:junit4]   2> 32712 T1483 oaz.ClientCnxn$EventThread.run EventThread shut down
[junit4:junit4]   2> 33289 T1412 oazs.SessionTrackerImpl.run SessionTrackerImpl exited loop!
[junit4:junit4]   2> 33816 T1500 oascc.ZkStateReader$2.process WARNING ZooKeeper watch triggered, but Solr cannot talk to ZK
[junit4:junit4]   2> 33817 T1500 oascc.ZkStateReader$3.process WARNING ZooKeeper watch triggered, but Solr cannot talk to ZK
[junit4:junit4]   2> 33817 T1500 oaz.ClientCnxn$EventThread.run EventThread shut down
[junit4:junit4]   2> NOTE: test params are: codec=Lucene40, sim=RandomSimilarityProvider(queryNorm=true,coord=yes): {}, locale=ar_OM, timezone=Etc/GMT-1
[junit4:junit4]   2> NOTE: Linux 3.2.0-39-generic i386/Oracle Corporation 1.8.0-ea (32-bit)/cpus=8,threads=1,free=34975512,total=105934848
[junit4:junit4]   2> NOTE: All tests run in this JVM: [SliceStateTest, LegacyHTMLStripCharFilterTest, TestSolrDeletionPolicy2, DocValuesTest, RecoveryZkTest, ResponseLogComponentTest, AlternateDirectoryTest, TestStressVersions, TestPHPSerializedResponseWriter, TestFaceting, StatelessScriptUpdateProcessorFactoryTest, DocumentBuilderTest, DirectUpdateHandlerOptimizeTest, BadComponentTest, ExternalFileFieldSortTest, LoggingHandlerTest, TestValueSourceCache, FieldMutatingUpdateProcessorTest, ShardRoutingTest, DistributedQueryElevationComponentTest, TestQuerySenderListener, TestPropInjectDefaults, TestReversedWildcardFilterFactory, DirectSolrConnectionTest, TestConfig, PrimitiveFieldTypeTest, RAMDirectoryFactoryTest, TestJoin, CacheHeaderTest, TestPhraseSuggestions, TestXIncludeConfig, TestTrie, SOLR749Test, ClusterStateUpdateTest, DateFieldTest, PrimUtilsTest, TestStressRecovery, TestGroupingSearch, SystemInfoHandlerTest, UpdateRequestProcessorFactoryTest, AutoCommitTest, TestBadConfig, ZkControllerTest, TestSolrCoreProperties, UUIDFieldTest, BasicFunctionalityTest, TestFunctionQuery, TestSearchPerf, TestCharFilters, TestSolrQueryParser, SoftAutoCommitTest, ScriptEngineTest, DistributedTermsComponentTest, TestFieldCollectionResource, AliasIntegrationTest, ResourceLoaderTest, SuggesterFSTTest, TestQueryUtils, TestPluginEnable, UnloadDistributedZkTest, TestSurroundQueryParser, FileBasedSpellCheckerTest, QueryEqualityTest, TestFieldTypeResource, TestLMDirichletSimilarityFactory, MinimalSchemaTest, SchemaVersionSpecificBehaviorTest, BasicDistributedZk2Test]
[junit4:junit4] Completed on J0 in 33.93s, 1 test, 1 error <<< FAILURES!

[...truncated 430 lines...]
BUILD FAILED
/mnt/ssd/jenkins/workspace/Lucene-Solr-4.x-Linux/build.xml:381: The following error occurred while executing this line:
/mnt/ssd/jenkins/workspace/Lucene-Solr-4.x-Linux/build.xml:361: The following error occurred while executing this line:
/mnt/ssd/jenkins/workspace/Lucene-Solr-4.x-Linux/build.xml:39: The following error occurred while executing this line:
/mnt/ssd/jenkins/workspace/Lucene-Solr-4.x-Linux/solr/build.xml:183: The following error occurred while executing this line:
/mnt/ssd/jenkins/workspace/Lucene-Solr-4.x-Linux/solr/common-build.xml:449: The following error occurred while executing this line:
/mnt/ssd/jenkins/workspace/Lucene-Solr-4.x-Linux/lucene/common-build.xml:1212: The following error occurred while executing this line:
/mnt/ssd/jenkins/workspace/Lucene-Solr-4.x-Linux/lucene/common-build.xml:876: There were test failures: 273 suites, 1149 tests, 2 suite-level errors, 1 error, 13 ignored (7 assumptions)

Total time: 42 minutes 14 seconds
Build step 'Invoke Ant' marked build as failure
Archiving artifacts
Recording test results
Description set: Java: 32bit/jdk1.8.0-ea-b82 -client -XX:+UseConcMarkSweepGC
Email was triggered for: Failure
Sending email for trigger: Failure



Mime
View raw message